lucene-dev mailing list archives

Site index · List index
Message view « Date » · « Thread »
Top « Date » · « Thread »
From Policeman Jenkins Server <jenk...@thetaphi.de>
Subject [JENKINS-EA] Lucene-Solr-master-Linux (32bit/jdk-9-ea+129) - Build # 17408 - Unstable!
Date Sat, 30 Jul 2016 05:12:01 GMT
Build: http://jenkins.thetaphi.de/job/Lucene-Solr-master-Linux/17408/
Java: 32bit/jdk-9-ea+129 -client -XX:+UseConcMarkSweepGC

2 tests failed.
FAILED:  org.apache.solr.cloud.LeaderFailoverAfterPartitionTest.test

Error Message:
org.apache.solr.client.solrj.SolrServerException: No live SolrServers available to handle this request:[http://127.0.0.1:44470/qh_gui/mc/c8n_1x3_lf_shard1_replica2]

Stack Trace:
org.apache.solr.client.solrj.SolrServerException: org.apache.solr.client.solrj.SolrServerException: No live SolrServers available to handle this request:[http://127.0.0.1:44470/qh_gui/mc/c8n_1x3_lf_shard1_replica2]
	at __randomizedtesting.SeedInfo.seed([700C38506C6A777C:F858078AC2961A84]:0)
	at org.apache.solr.client.solrj.impl.CloudSolrClient.directUpdate(CloudSolrClient.java:774)
	at org.apache.solr.client.solrj.impl.CloudSolrClient.sendRequest(CloudSolrClient.java:1172)
	at org.apache.solr.client.solrj.impl.CloudSolrClient.requestWithRetryOnStaleState(CloudSolrClient.java:1061)
	at org.apache.solr.client.solrj.impl.CloudSolrClient.request(CloudSolrClient.java:997)
	at org.apache.solr.cloud.AbstractFullDistribZkTestBase.sendDocsWithRetry(AbstractFullDistribZkTestBase.java:753)
	at org.apache.solr.cloud.AbstractFullDistribZkTestBase.sendDocsWithRetry(AbstractFullDistribZkTestBase.java:741)
	at org.apache.solr.cloud.LeaderFailoverAfterPartitionTest.testRf3WithLeaderFailover(LeaderFailoverAfterPartitionTest.java:178)
	at org.apache.solr.cloud.LeaderFailoverAfterPartitionTest.test(LeaderFailoverAfterPartitionTest.java:57)
	at jdk.internal.reflect.NativeMethodAccessorImpl.invoke0(java.base@9-ea/Native Method)
	at jdk.internal.reflect.NativeMethodAccessorImpl.invoke(java.base@9-ea/NativeMethodAccessorImpl.java:62)
	at jdk.internal.reflect.DelegatingMethodAccessorImpl.invoke(java.base@9-ea/DelegatingMethodAccessorImpl.java:43)
	at java.lang.reflect.Method.invoke(java.base@9-ea/Method.java:533)
	at com.carrotsearch.randomizedtesting.RandomizedRunner.invoke(RandomizedRunner.java:1764)
	at com.carrotsearch.randomizedtesting.RandomizedRunner$8.evaluate(RandomizedRunner.java:871)
	at com.carrotsearch.randomizedtesting.RandomizedRunner$9.evaluate(RandomizedRunner.java:907)
	at com.carrotsearch.randomizedtesting.RandomizedRunner$10.evaluate(RandomizedRunner.java:921)
	at org.apache.solr.BaseDistributedSearchTestCase$ShardsRepeatRule$ShardsFixedStatement.callStatement(BaseDistributedSearchTestCase.java:985)
	at org.apache.solr.BaseDistributedSearchTestCase$ShardsRepeatRule$ShardsStatement.evaluate(BaseDistributedSearchTestCase.java:960)
	at com.carrotsearch.randomizedtesting.rules.SystemPropertiesRestoreRule$1.evaluate(SystemPropertiesRestoreRule.java:57)
	at org.apache.lucene.util.TestRuleSetupTeardownChained$1.evaluate(TestRuleSetupTeardownChained.java:49)
	at org.apache.lucene.util.AbstractBeforeAfterRule$1.evaluate(AbstractBeforeAfterRule.java:45)
	at org.apache.lucene.util.TestRuleThreadAndTestName$1.evaluate(TestRuleThreadAndTestName.java:48)
	at org.apache.lucene.util.TestRuleIgnoreAfterMaxFailures$1.evaluate(TestRuleIgnoreAfterMaxFailures.java:64)
	at org.apache.lucene.util.TestRuleMarkFailure$1.evaluate(TestRuleMarkFailure.java:47)
	at com.carrotsearch.randomizedtesting.rules.StatementAdapter.evaluate(StatementAdapter.java:36)
	at com.carrotsearch.randomizedtesting.ThreadLeakControl$StatementRunner.run(ThreadLeakControl.java:367)
	at com.carrotsearch.randomizedtesting.ThreadLeakControl.forkTimeoutingTask(ThreadLeakControl.java:809)
	at com.carrotsearch.randomizedtesting.ThreadLeakControl$3.evaluate(ThreadLeakControl.java:460)
	at com.carrotsearch.randomizedtesting.RandomizedRunner.runSingleTest(RandomizedRunner.java:880)
	at com.carrotsearch.randomizedtesting.RandomizedRunner$5.evaluate(RandomizedRunner.java:781)
	at com.carrotsearch.randomizedtesting.RandomizedRunner$6.evaluate(RandomizedRunner.java:816)
	at com.carrotsearch.randomizedtesting.RandomizedRunner$7.evaluate(RandomizedRunner.java:827)
	at com.carrotsearch.randomizedtesting.rules.StatementAdapter.evaluate(StatementAdapter.java:36)
	at com.carrotsearch.randomizedtesting.rules.SystemPropertiesRestoreRule$1.evaluate(SystemPropertiesRestoreRule.java:57)
	at org.apache.lucene.util.AbstractBeforeAfterRule$1.evaluate(AbstractBeforeAfterRule.java:45)
	at com.carrotsearch.randomizedtesting.rules.StatementAdapter.evaluate(StatementAdapter.java:36)
	at org.apache.lucene.util.TestRuleStoreClassName$1.evaluate(TestRuleStoreClassName.java:41)
	at com.carrotsearch.randomizedtesting.rules.NoShadowingOrOverridesOnMethodsRule$1.evaluate(NoShadowingOrOverridesOnMethodsRule.java:40)
	at com.carrotsearch.randomizedtesting.rules.NoShadowingOrOverridesOnMethodsRule$1.evaluate(NoShadowingOrOverridesOnMethodsRule.java:40)
	at com.carrotsearch.randomizedtesting.rules.StatementAdapter.evaluate(StatementAdapter.java:36)
	at com.carrotsearch.randomizedtesting.rules.StatementAdapter.evaluate(StatementAdapter.java:36)
	at com.carrotsearch.randomizedtesting.rules.StatementAdapter.evaluate(StatementAdapter.java:36)
	at org.apache.lucene.util.TestRuleAssertionsRequired$1.evaluate(TestRuleAssertionsRequired.java:53)
	at org.apache.lucene.util.TestRuleMarkFailure$1.evaluate(TestRuleMarkFailure.java:47)
	at org.apache.lucene.util.TestRuleIgnoreAfterMaxFailures$1.evaluate(TestRuleIgnoreAfterMaxFailures.java:64)
	at org.apache.lucene.util.TestRuleIgnoreTestSuites$1.evaluate(TestRuleIgnoreTestSuites.java:54)
	at com.carrotsearch.randomizedtesting.rules.StatementAdapter.evaluate(StatementAdapter.java:36)
	at com.carrotsearch.randomizedtesting.ThreadLeakControl$StatementRunner.run(ThreadLeakControl.java:367)
	at java.lang.Thread.run(java.base@9-ea/Thread.java:843)
Caused by: org.apache.solr.client.solrj.SolrServerException: No live SolrServers available to handle this request:[http://127.0.0.1:44470/qh_gui/mc/c8n_1x3_lf_shard1_replica2]
	at org.apache.solr.client.solrj.impl.LBHttpSolrClient.request(LBHttpSolrClient.java:393)
	at org.apache.solr.client.solrj.impl.CloudSolrClient.directUpdate(CloudSolrClient.java:768)
	... 48 more
Caused by: org.apache.solr.client.solrj.SolrServerException: Server refused connection at: http://127.0.0.1:44470/qh_gui/mc/c8n_1x3_lf_shard1_replica2
	at org.apache.solr.client.solrj.impl.HttpSolrClient.executeMethod(HttpSolrClient.java:615)
	at org.apache.solr.client.solrj.impl.HttpSolrClient.request(HttpSolrClient.java:261)
	at org.apache.solr.client.solrj.impl.HttpSolrClient.request(HttpSolrClient.java:250)
	at org.apache.solr.client.solrj.impl.LBHttpSolrClient.doRequest(LBHttpSolrClient.java:413)
	at org.apache.solr.client.solrj.impl.LBHttpSolrClient.request(LBHttpSolrClient.java:382)
	... 49 more
Caused by: org.apache.http.conn.HttpHostConnectException: Connect to 127.0.0.1:44470 [/127.0.0.1] failed: Connection refused
	at org.apache.http.impl.conn.DefaultHttpClientConnectionOperator.connect(DefaultHttpClientConnectionOperator.java:151)
	at org.apache.http.impl.conn.PoolingHttpClientConnectionManager.connect(PoolingHttpClientConnectionManager.java:353)
	at org.apache.http.impl.execchain.MainClientExec.establishRoute(MainClientExec.java:380)
	at org.apache.http.impl.execchain.MainClientExec.execute(MainClientExec.java:236)
	at org.apache.http.impl.execchain.ProtocolExec.execute(ProtocolExec.java:184)
	at org.apache.http.impl.execchain.RetryExec.execute(RetryExec.java:88)
	at org.apache.http.impl.execchain.RedirectExec.execute(RedirectExec.java:110)
	at org.apache.http.impl.client.InternalHttpClient.doExecute(InternalHttpClient.java:184)
	at org.apache.http.impl.client.CloseableHttpClient.execute(CloseableHttpClient.java:82)
	at org.apache.http.impl.client.CloseableHttpClient.execute(CloseableHttpClient.java:55)
	at org.apache.solr.client.solrj.impl.HttpSolrClient.executeMethod(HttpSolrClient.java:513)
	... 53 more
Caused by: java.net.ConnectException: Connection refused
	at java.net.PlainSocketImpl.socketConnect(java.base@9-ea/Native Method)
	at java.net.AbstractPlainSocketImpl.doConnect(java.base@9-ea/AbstractPlainSocketImpl.java:400)
	at java.net.AbstractPlainSocketImpl.connectToAddress(java.base@9-ea/AbstractPlainSocketImpl.java:243)
	at java.net.AbstractPlainSocketImpl.connect(java.base@9-ea/AbstractPlainSocketImpl.java:225)
	at java.net.SocksSocketImpl.connect(java.base@9-ea/SocksSocketImpl.java:402)
	at java.net.Socket.connect(java.base@9-ea/Socket.java:591)
	at org.apache.http.conn.socket.PlainConnectionSocketFactory.connectSocket(PlainConnectionSocketFactory.java:74)
	at org.apache.http.impl.conn.DefaultHttpClientConnectionOperator.connect(DefaultHttpClientConnectionOperator.java:134)
	... 63 more


FAILED:  org.apache.solr.common.cloud.TestCollectionStateWatchers.testSimpleCollectionWatch

Error Message:
CollectionStateWatcher wasn't cleared after completion

Stack Trace:
java.lang.AssertionError: CollectionStateWatcher wasn't cleared after completion
	at __randomizedtesting.SeedInfo.seed([8EED38F54B5D2658:D3D6F7850C50B966]:0)
	at org.junit.Assert.fail(Assert.java:93)
	at org.junit.Assert.assertTrue(Assert.java:43)
	at org.apache.solr.common.cloud.TestCollectionStateWatchers.testSimpleCollectionWatch(TestCollectionStateWatchers.java:117)
	at jdk.internal.reflect.NativeMethodAccessorImpl.invoke0(java.base@9-ea/Native Method)
	at jdk.internal.reflect.NativeMethodAccessorImpl.invoke(java.base@9-ea/NativeMethodAccessorImpl.java:62)
	at jdk.internal.reflect.DelegatingMethodAccessorImpl.invoke(java.base@9-ea/DelegatingMethodAccessorImpl.java:43)
	at java.lang.reflect.Method.invoke(java.base@9-ea/Method.java:533)
	at com.carrotsearch.randomizedtesting.RandomizedRunner.invoke(RandomizedRunner.java:1764)
	at com.carrotsearch.randomizedtesting.RandomizedRunner$8.evaluate(RandomizedRunner.java:871)
	at com.carrotsearch.randomizedtesting.RandomizedRunner$9.evaluate(RandomizedRunner.java:907)
	at com.carrotsearch.randomizedtesting.RandomizedRunner$10.evaluate(RandomizedRunner.java:921)
	at com.carrotsearch.randomizedtesting.rules.SystemPropertiesRestoreRule$1.evaluate(SystemPropertiesRestoreRule.java:57)
	at org.apache.lucene.util.TestRuleSetupTeardownChained$1.evaluate(TestRuleSetupTeardownChained.java:49)
	at org.apache.lucene.util.AbstractBeforeAfterRule$1.evaluate(AbstractBeforeAfterRule.java:45)
	at org.apache.lucene.util.TestRuleThreadAndTestName$1.evaluate(TestRuleThreadAndTestName.java:48)
	at org.apache.lucene.util.TestRuleIgnoreAfterMaxFailures$1.evaluate(TestRuleIgnoreAfterMaxFailures.java:64)
	at org.apache.lucene.util.TestRuleMarkFailure$1.evaluate(TestRuleMarkFailure.java:47)
	at com.carrotsearch.randomizedtesting.rules.StatementAdapter.evaluate(StatementAdapter.java:36)
	at com.carrotsearch.randomizedtesting.ThreadLeakControl$StatementRunner.run(ThreadLeakControl.java:367)
	at com.carrotsearch.randomizedtesting.ThreadLeakControl.forkTimeoutingTask(ThreadLeakControl.java:809)
	at com.carrotsearch.randomizedtesting.ThreadLeakControl$3.evaluate(ThreadLeakControl.java:460)
	at com.carrotsearch.randomizedtesting.RandomizedRunner.runSingleTest(RandomizedRunner.java:880)
	at com.carrotsearch.randomizedtesting.RandomizedRunner$5.evaluate(RandomizedRunner.java:781)
	at com.carrotsearch.randomizedtesting.RandomizedRunner$6.evaluate(RandomizedRunner.java:816)
	at com.carrotsearch.randomizedtesting.RandomizedRunner$7.evaluate(RandomizedRunner.java:827)
	at com.carrotsearch.randomizedtesting.rules.StatementAdapter.evaluate(StatementAdapter.java:36)
	at com.carrotsearch.randomizedtesting.rules.SystemPropertiesRestoreRule$1.evaluate(SystemPropertiesRestoreRule.java:57)
	at org.apache.lucene.util.AbstractBeforeAfterRule$1.evaluate(AbstractBeforeAfterRule.java:45)
	at com.carrotsearch.randomizedtesting.rules.StatementAdapter.evaluate(StatementAdapter.java:36)
	at org.apache.lucene.util.TestRuleStoreClassName$1.evaluate(TestRuleStoreClassName.java:41)
	at com.carrotsearch.randomizedtesting.rules.NoShadowingOrOverridesOnMethodsRule$1.evaluate(NoShadowingOrOverridesOnMethodsRule.java:40)
	at com.carrotsearch.randomizedtesting.rules.NoShadowingOrOverridesOnMethodsRule$1.evaluate(NoShadowingOrOverridesOnMethodsRule.java:40)
	at com.carrotsearch.randomizedtesting.rules.StatementAdapter.evaluate(StatementAdapter.java:36)
	at com.carrotsearch.randomizedtesting.rules.StatementAdapter.evaluate(StatementAdapter.java:36)
	at com.carrotsearch.randomizedtesting.rules.StatementAdapter.evaluate(StatementAdapter.java:36)
	at org.apache.lucene.util.TestRuleAssertionsRequired$1.evaluate(TestRuleAssertionsRequired.java:53)
	at org.apache.lucene.util.TestRuleMarkFailure$1.evaluate(TestRuleMarkFailure.java:47)
	at org.apache.lucene.util.TestRuleIgnoreAfterMaxFailures$1.evaluate(TestRuleIgnoreAfterMaxFailures.java:64)
	at org.apache.lucene.util.TestRuleIgnoreTestSuites$1.evaluate(TestRuleIgnoreTestSuites.java:54)
	at com.carrotsearch.randomizedtesting.rules.StatementAdapter.evaluate(StatementAdapter.java:36)
	at com.carrotsearch.randomizedtesting.ThreadLeakControl$StatementRunner.run(ThreadLeakControl.java:367)
	at java.lang.Thread.run(java.base@9-ea/Thread.java:843)




Build Log:
Started by upstream project "Lucene-Solr-6.x-Linux" build number 1314

originally caused by:

 Started by upstream project "Lucene-Solr-master-Linux" build number 17407

 originally caused by:

  Started by upstream project "Lucene-Solr-6.x-Linux" build number 1313

  originally caused by:

   Started by upstream project "Lucene-Solr-master-Linux" build number 17406

   originally caused by:

    Started by upstream project "Lucene-Solr-6.x-Linux" build number 1312

    originally caused by:

     Started by upstream project "Lucene-Solr-master-Linux" build number 17405

     originally caused by:

      Started by upstream project "Lucene-Solr-6.x-Linux" build number 1311

      originally caused by:

       Started by user Uwe Schindler

[EnvInject] - Loading node environment variables.

[EnvInject] - Preparing an environment for the build.

[EnvInject] - Keeping Jenkins system variables.

[EnvInject] - Keeping Jenkins build variables.

[EnvInject] - Evaluation the following Groovy script content: 

return evaluate(new java.io.File(JENKINS_HOME, "scripts/linux-random-java8.groovy"))


Using Java: 32bit/jdk-9-ea+129 -client -XX:+UseConcMarkSweepGC

[EnvInject] - Injecting contributions.

Building on master in workspace /var/lib/jenkins/workspace/Lucene-Solr-master-Linux

Fetching changes from the remote Git repository

Cleaning workspace

Checking out Revision 9554719f12080e233dbfe634f4a7066e138033ed (refs/remotes/origin/master)

No emails were triggered.

[description-setter] Description set: Java: 32bit/jdk-9-ea+129 -client -XX:+UseConcMarkSweepGC

[Lucene-Solr-master-Linux] $ /var/lib/jenkins/tools/hudson.tasks.Ant_AntInstallation/ANT_1.8.2/bin/ant "-Dargs=-client -XX:+UseConcMarkSweepGC" jenkins-hourly

Buildfile: /home/jenkins/workspace/Lucene-Solr-master-Linux/build.xml


jenkins-hourly:


-print-java-info:

[java-info] java version "9-ea"

[java-info] Java(TM) SE Runtime Environment (9-ea+129, Oracle Corporation)

[java-info] Java HotSpot(TM) Server VM (9-ea+129, Oracle Corporation)

[java-info] Test args: [-client -XX:+UseConcMarkSweepGC]


clean:


clean:


clean:


ivy-availability-check:


ivy-fail:


ivy-configure:

[ivy:configure] :: Apache Ivy 2.3.0 - 20130110142753 :: http://ant.apache.org/ivy/ ::

[ivy:configure] :: loading settings :: file = /home/jenkins/workspace/Lucene-Solr-master-Linux/lucene/top-level-ivy-settings.xml


resolve-groovy:

[ivy:cachepath] :: resolving dependencies :: org.codehaus.groovy#groovy-all-caller;working

[ivy:cachepath] 	confs: [default]

[ivy:cachepath] 	found org.codehaus.groovy#groovy-all;2.4.6 in public

[ivy:cachepath] :: resolution report :: resolve 131ms :: artifacts dl 1ms

	---------------------------------------------------------------------

	|                  |            modules            ||   artifacts   |

	|       conf       | number| search|dwnlded|evicted|| number|dwnlded|

	---------------------------------------------------------------------

	|      default     |   1   |   0   |   0   |   0   ||   1   |   0   |

	---------------------------------------------------------------------


-test-with-heapdumps-enabled:

     [echo] Java HotSpot(TM) Server VM: Enabling heap dumps on OutOfMemoryError to dir '/home/jenkins/workspace/Lucene-Solr-master-Linux/heapdumps'.

    [mkdir] Created dir: /home/jenkins/workspace/Lucene-Solr-master-Linux/heapdumps


ivy-availability-check:


ivy-fail:


ivy-configure:

[ivy:configure] :: loading settings :: file = /home/jenkins/workspace/Lucene-Solr-master-Linux/lucene/top-level-ivy-settings.xml


resolve-groovy:


test:


ivy-availability-check:


ivy-fail:


ivy-configure:

[ivy:configure] :: loading settings :: file = /home/jenkins/workspace/Lucene-Solr-master-Linux/lucene/top-level-ivy-settings.xml


-clover.load:


resolve-groovy:


-init-totals:


test-core:


-clover.disable:


ivy-availability-check:


ivy-fail:


ivy-configure:

[ivy:configure] :: loading settings :: file = /home/jenkins/workspace/Lucene-Solr-master-Linux/lucene/top-level-ivy-settings.xml


-clover.load:


-clover.classpath:


-clover.setup:


clover:


-check-git-state:


-git-cleanroot:


-copy-git-state:

     [copy] Copying 1 file to /home/jenkins/workspace/Lucene-Solr-master-Linux/lucene/build


git-autoclean:


resolve:


init:


compile-core:

    [mkdir] Created dir: /home/jenkins/workspace/Lucene-Solr-master-Linux/lucene/build/core/classes/java

    [javac] Compiling 779 source files to /home/jenkins/workspace/Lucene-Solr-master-Linux/lucene/build/core/classes/java

    [javac] Note: Some input files use or override a deprecated API.

    [javac] Note: Recompile with -Xlint:deprecation for details.

    [javac] Creating empty /home/jenkins/workspace/Lucene-Solr-master-Linux/lucene/build/core/classes/java/org/apache/lucene/document/package-info.class

    [javac] Creating empty /home/jenkins/workspace/Lucene-Solr-master-Linux/lucene/build/core/classes/java/org/apache/lucene/package-info.class

    [javac] Creating empty /home/jenkins/workspace/Lucene-Solr-master-Linux/lucene/build/core/classes/java/org/apache/lucene/util/bkd/package-info.class

    [javac] Creating empty /home/jenkins/workspace/Lucene-Solr-master-Linux/lucene/build/core/classes/java/org/apache/lucene/codecs/compressing/package-info.class

    [javac] Creating empty /home/jenkins/workspace/Lucene-Solr-master-Linux/lucene/build/core/classes/java/org/apache/lucene/codecs/lucene60/package-info.class

    [javac] Creating empty /home/jenkins/workspace/Lucene-Solr-master-Linux/lucene/build/core/classes/java/org/apache/lucene/codecs/package-info.class

    [javac] Creating empty /home/jenkins/workspace/Lucene-Solr-master-Linux/lucene/build/core/classes/java/org/apache/lucene/util/package-info.class

    [javac] Creating empty /home/jenkins/workspace/Lucene-Solr-master-Linux/lucene/build/core/classes/java/org/apache/lucene/index/package-info.class

    [javac] Creating empty /home/jenkins/workspace/Lucene-Solr-master-Linux/lucene/build/core/classes/java/org/apache/lucene/util/fst/package-info.class

    [javac] Creating empty /home/jenkins/workspace/Lucene-Solr-master-Linux/lucene/build/core/classes/java/org/apache/lucene/analysis/tokenattributes/package-info.class

    [javac] Creating empty /home/jenkins/workspace/Lucene-Solr-master-Linux/lucene/build/core/classes/java/org/apache/lucene/search/package-info.class

    [javac] Creating empty /home/jenkins/workspace/Lucene-Solr-master-Linux/lucene/build/core/classes/java/org/apache/lucene/codecs/lucene62/package-info.class

    [javac] Creating empty /home/jenkins/workspace/Lucene-Solr-master-Linux/lucene/build/core/classes/java/org/apache/lucene/util/packed/package-info.class

    [javac] Creating empty /home/jenkins/workspace/Lucene-Solr-master-Linux/lucene/build/core/classes/java/org/apache/lucene/util/mutable/package-info.class

    [javac] Creating empty /home/jenkins/workspace/Lucene-Solr-master-Linux/lucene/build/core/classes/java/org/apache/lucene/codecs/perfield/package-info.class

    [javac] Creating empty /home/jenkins/workspace/Lucene-Solr-master-Linux/lucene/build/core/classes/java/org/apache/lucene/analysis/package-info.class

    [javac] Creating empty /home/jenkins/workspace/Lucene-Solr-master-Linux/lucene/build/core/classes/java/org/apache/lucene/analysis/standard/package-info.class

    [javac] Creating empty /home/jenkins/workspace/Lucene-Solr-master-Linux/lucene/build/core/classes/java/org/apache/lucene/store/package-info.class

    [javac] Creating empty /home/jenkins/workspace/Lucene-Solr-master-Linux/lucene/build/core/classes/java/org/apache/lucene/codecs/blocktree/package-info.class

    [javac] Creating empty /home/jenkins/workspace/Lucene-Solr-master-Linux/lucene/build/core/classes/java/org/apache/lucene/search/spans/package-info.class

    [javac] Creating empty /home/jenkins/workspace/Lucene-Solr-master-Linux/lucene/build/core/classes/java/org/apache/lucene/codecs/lucene54/package-info.class

    [javac] Creating empty /home/jenkins/workspace/Lucene-Solr-master-Linux/lucene/build/core/classes/java/org/apache/lucene/search/similarities/package-info.class

    [javac] Creating empty /home/jenkins/workspace/Lucene-Solr-master-Linux/lucene/build/core/classes/java/org/apache/lucene/util/automaton/package-info.class

    [javac] Creating empty /home/jenkins/workspace/Lucene-Solr-master-Linux/lucene/build/core/classes/java/org/apache/lucene/codecs/lucene53/package-info.class

    [javac] Creating empty /home/jenkins/workspace/Lucene-Solr-master-Linux/lucene/build/core/classes/java/org/apache/lucene/codecs/lucene50/package-info.class

    [javac] Creating empty /home/jenkins/workspace/Lucene-Solr-master-Linux/lucene/build/core/classes/java/org/apache/lucene/geo/package-info.class

     [copy] Copying 3 files to /home/jenkins/workspace/Lucene-Solr-master-Linux/lucene/build/core/classes/java


compile-test-framework:


-check-git-state:


-git-cleanroot:


-copy-git-state:


git-autoclean:


ivy-availability-check:


ivy-fail:


ivy-configure:

[ivy:configure] :: loading settings :: file = /home/jenkins/workspace/Lucene-Solr-master-Linux/lucene/top-level-ivy-settings.xml


resolve:


init:


compile-lucene-core:


-check-git-state:


-git-cleanroot:


-copy-git-state:


git-autoclean:


ivy-availability-check:


ivy-fail:


ivy-configure:

[ivy:configure] :: loading settings :: file = /home/jenkins/workspace/Lucene-Solr-master-Linux/lucene/top-level-ivy-settings.xml


resolve:


init:


-clover.disable:


-clover.load:


-clover.classpath:


-clover.setup:


clover:


compile-core:


compile-codecs:


-check-git-state:


-git-cleanroot:


-copy-git-state:


git-autoclean:


ivy-availability-check:


ivy-fail:


ivy-configure:

[ivy:configure] :: loading settings :: file = /home/jenkins/workspace/Lucene-Solr-master-Linux/lucene/top-level-ivy-settings.xml


resolve:


common.init:


compile-lucene-core:


init:


-clover.disable:


-clover.load:


-clover.classpath:


-clover.setup:


clover:


compile-core:

    [mkdir] Created dir: /home/jenkins/workspace/Lucene-Solr-master-Linux/lucene/build/codecs/classes/java

    [javac] Compiling 66 source files to /home/jenkins/workspace/Lucene-Solr-master-Linux/lucene/build/codecs/classes/java

    [javac] Creating empty /home/jenkins/workspace/Lucene-Solr-master-Linux/lucene/build/codecs/classes/java/org/apache/lucene/codecs/bloom/package-info.class

    [javac] Creating empty /home/jenkins/workspace/Lucene-Solr-master-Linux/lucene/build/codecs/classes/java/org/apache/lucene/codecs/memory/package-info.class

    [javac] Creating empty /home/jenkins/workspace/Lucene-Solr-master-Linux/lucene/build/codecs/classes/java/org/apache/lucene/codecs/simpletext/package-info.class

    [javac] Creating empty /home/jenkins/workspace/Lucene-Solr-master-Linux/lucene/build/codecs/classes/java/org/apache/lucene/codecs/blockterms/package-info.class

    [javac] Creating empty /home/jenkins/workspace/Lucene-Solr-master-Linux/lucene/build/codecs/classes/java/org/apache/lucene/codecs/blocktreeords/package-info.class

     [copy] Copying 3 files to /home/jenkins/workspace/Lucene-Solr-master-Linux/lucene/build/codecs/classes/java


-clover.disable:


-clover.load:


-clover.classpath:


-clover.setup:


clover:


common.compile-core:

    [mkdir] Created dir: /home/jenkins/workspace/Lucene-Solr-master-Linux/lucene/build/test-framework/classes/java

    [javac] Compiling 185 source files to /home/jenkins/workspace/Lucene-Solr-master-Linux/lucene/build/test-framework/classes/java

    [javac] Note: Some input files use or override a deprecated API.

    [javac] Note: Recompile with -Xlint:deprecation for details.

    [javac] Creating empty /home/jenkins/workspace/Lucene-Solr-master-Linux/lucene/build/test-framework/classes/java/org/apache/lucene/codecs/asserting/package-info.class

    [javac] Creating empty /home/jenkins/workspace/Lucene-Solr-master-Linux/lucene/build/test-framework/classes/java/org/apache/lucene/codecs/ramonly/package-info.class

    [javac] Creating empty /home/jenkins/workspace/Lucene-Solr-master-Linux/lucene/build/test-framework/classes/java/org/apache/lucene/mockfile/package-info.class

    [javac] Creating empty /home/jenkins/workspace/Lucene-Solr-master-Linux/lucene/build/test-framework/classes/java/org/apache/lucene/codecs/cheapbastard/package-info.class

    [javac] Creating empty /home/jenkins/workspace/Lucene-Solr-master-Linux/lucene/build/test-framework/classes/java/org/apache/lucene/codecs/mockrandom/package-info.class

    [javac] Creating empty /home/jenkins/workspace/Lucene-Solr-master-Linux/lucene/build/test-framework/classes/java/org/apache/lucene/codecs/cranky/package-info.class

    [javac] Creating empty /home/jenkins/workspace/Lucene-Solr-master-Linux/lucene/build/test-framework/classes/java/org/apache/lucene/codecs/compressing/dummy/package-info.class

     [copy] Copying 4 files to /home/jenkins/workspace/Lucene-Solr-master-Linux/lucene/build/test-framework/classes/java


compile-core:


compile-test:

    [mkdir] Created dir: /home/jenkins/workspace/Lucene-Solr-master-Linux/lucene/build/core/classes/test

    [javac] Compiling 444 source files to /home/jenkins/workspace/Lucene-Solr-master-Linux/lucene/build/core/classes/test

    [javac] Note: Some input files use or override a deprecated API.

    [javac] Note: Recompile with -Xlint:deprecation for details.

     [copy] Copying 3 files to /home/jenkins/workspace/Lucene-Solr-master-Linux/lucene/build/core/classes/test


install-junit4-taskdef:


validate:


resolve-groovy:


-init-totals:


-test:

    [mkdir] Created dir: /home/jenkins/workspace/Lucene-Solr-master-Linux/lucene/build/core/test

[loadresource] Do not set property tests.explicitclass as its length is 0.

    [mkdir] Created dir: /home/jenkins/workspace/Lucene-Solr-master-Linux/lucene/build/core/test/temp

    [mkdir] Created dir: /home/jenkins/workspace/Lucene-Solr-master-Linux/.caches/test-stats/core

   [junit4] <JUnit4> says olá! Master seed: E51098C3E550B11

   [junit4] Executing 437 suites with 3 JVMs.

   [junit4] 

   [junit4] Started J0 PID(10233@localhost).

   [junit4] Started J1 PID(10229@localhost).

   [junit4] Started J2 PID(10230@localhost).

   [junit4] Suite: org.apache.lucene.util.Test2BPagedBytes

   [junit4] IGNOR/A 0.01s J0 | Test2BPagedBytes.test

   [junit4]    > Assumption #1: 'monster' test group is disabled (@Monster(value=You must increase heap to > 2 G to run this))

   [junit4] Completed [1/437] on J0 in 0.16s, 1 test, 1 skipped

   [junit4] 

   [junit4] Suite: org.apache.lucene.index.TestNoDeletionPolicy

   [junit4] Completed [2/437] on J0 in 0.71s, 4 tests

   [junit4] 

   [junit4] Suite: org.apache.lucene.document.TestFieldType

   [junit4] Completed [3/437] on J0 in 0.02s, 3 tests

   [junit4] 

   [junit4] Suite: org.apache.lucene.search.TestQueryRescorer

   [junit4] Completed [4/437] on J0 in 0.70s, 6 tests

   [junit4] 

   [junit4] Suite: org.apache.lucene.codecs.compressing.TestFastCompressionMode

   [junit4] Completed [5/437] on J1 in 1.98s, 11 tests

   [junit4] 

   [junit4] Suite: org.apache.lucene.search.spans.TestSpanMultiTermQueryWrapper

   [junit4] Completed [6/437] on J0 in 0.16s, 9 tests

   [junit4] 

   [junit4] Suite: org.apache.lucene.search.TestSortRescorer

   [junit4] Completed [7/437] on J0 in 0.63s, 2 tests

   [junit4] 

   [junit4] Suite: org.apache.lucene.util.TestRecyclingIntBlockAllocator

   [junit4] Completed [8/437] on J0 in 0.05s, 3 tests

   [junit4] 

   [junit4] Suite: org.apache.lucene.index.Test2BTerms

   [junit4] IGNOR/A 0.00s J0 | Test2BTerms.test2BTerms

   [junit4]    > Assumption #1: 'monster' test group is disabled (@Monster(value=very slow, use 5g minimum heap))

   [junit4] Completed [9/437] on J0 in 0.00s, 1 test, 1 skipped

   [junit4] 

   [junit4] Suite: org.apache.lucene.search.spans.TestNearSpansOrdered

   [junit4] Completed [10/437] on J0 in 0.40s, 19 tests

   [junit4] 

   [junit4] Suite: org.apache.lucene.index.TestSizeBoundedForceMerge

   [junit4] Completed [11/437] on J0 in 0.12s, 11 tests

   [junit4] 

   [junit4] Suite: org.apache.lucene.index.TestIndexWriterOnJRECrash

   [junit4] IGNOR/A 0.00s J0 | TestIndexWriterOnJRECrash.testNRTThreads

   [junit4]    > Assumption #1: 'nightly' test group is disabled (@Nightly())

   [junit4] Completed [12/437] on J0 in 0.00s, 1 test, 1 skipped

   [junit4] 

   [junit4] Suite: org.apache.lucene.index.TestExitableDirectoryReader

   [junit4] Completed [13/437] on J0 in 0.35s, 1 test

   [junit4] 

   [junit4] Suite: org.apache.lucene.index.TestFieldsReader

   [junit4] Completed [14/437] on J0 in 0.73s, 2 tests

   [junit4] 

   [junit4] Suite: org.apache.lucene.search.TestCachingCollector

   [junit4] Completed [15/437] on J0 in 0.02s, 4 tests

   [junit4] 

   [junit4] Suite: org.apache.lucene.util.TestCloseableThreadLocal

   [junit4] Completed [16/437] on J0 in 0.01s, 3 tests

   [junit4] 

   [junit4] Suite: org.apache.lucene.index.TestTermVectorsReader

   [junit4] Completed [17/437] on J0 in 0.23s, 13 tests

   [junit4] 

   [junit4] Suite: org.apache.lucene.util.TestIntArrayDocIdSet

   [junit4] Completed [18/437] on J0 in 0.65s, 5 tests

   [junit4] 

   [junit4] Suite: org.apache.lucene.store.TestMultiMMap

   [junit4] Completed [19/437] on J2 in 5.00s, 56 tests

   [junit4] 

   [junit4] Suite: org.apache.lucene.index.TestLazyProxSkipping

   [junit4] Completed [20/437] on J2 in 0.78s, 2 tests

   [junit4] 

   [junit4] Suite: org.apache.lucene.document.TestField

   [junit4] Completed [21/437] on J2 in 0.09s, 27 tests

   [junit4] 

   [junit4] Suite: org.apache.lucene.search.TestMultiPhraseEnum

   [junit4] Completed [22/437] on J2 in 0.03s, 2 tests

   [junit4] 

   [junit4] Suite: org.apache.lucene.search.TestWildcard

   [junit4] Completed [23/437] on J2 in 0.23s, 8 tests

   [junit4] 

   [junit4] Suite: org.apache.lucene.search.TestPhrasePrefixQuery

   [junit4] Completed [24/437] on J2 in 0.03s, 1 test

   [junit4] 

   [junit4] Suite: org.apache.lucene.util.TestQueryBuilder

   [junit4] Completed [25/437] on J2 in 0.05s, 21 tests

   [junit4] 

   [junit4] Suite: org.apache.lucene.index.Test4GBStoredFields

   [junit4] IGNOR/A 0.01s J2 | Test4GBStoredFields.test

   [junit4]    > Assumption #1: 'nightly' test group is disabled (@Nightly())

   [junit4] Completed [26/437] on J2 in 0.01s, 1 test, 1 skipped

   [junit4] 

   [junit4] Suite: org.apache.lucene.search.TestSubScorerFreqs

   [junit4] Completed [27/437] on J2 in 0.07s, 3 tests

   [junit4] 

   [junit4] Suite: org.apache.lucene.index.TestOmitPositions

   [junit4] Completed [28/437] on J2 in 0.31s, 4 tests

   [junit4] 

   [junit4] Suite: org.apache.lucene.index.TestForTooMuchCloning

   [junit4] Completed [29/437] on J2 in 0.11s, 1 test

   [junit4] 

   [junit4] Suite: org.apache.lucene.index.TestDocInverterPerFieldErrorInfo

   [junit4] Completed [30/437] on J2 in 0.05s, 2 tests

   [junit4] 

   [junit4] Suite: org.apache.lucene.index.TestDocumentWriter

   [junit4] Completed [31/437] on J2 in 0.37s, 6 tests

   [junit4] 

   [junit4] Suite: org.apache.lucene.index.TestSumDocFreq

   [junit4] Completed [32/437] on J2 in 0.28s, 1 test

   [junit4] 

   [junit4] Suite: org.apache.lucene.index.TestIndexWriterUnicode

   [junit4] Completed [33/437] on J1 in 6.42s, 5 tests

   [junit4] 

   [junit4] Suite: org.apache.lucene.search.spans.TestSpanSearchEquivalence

   [junit4] Completed [34/437] on J0 in 3.56s, 33 tests

   [junit4] 

   [junit4] Suite: org.apache.lucene.document.TestDocument

   [junit4] Completed [35/437] on J1 in 0.16s, 12 tests

   [junit4] 

   [junit4] Suite: org.apache.lucene.util.TestVersion

   [junit4] Completed [36/437] on J1 in 0.07s, 11 tests

   [junit4] 

   [junit4] Suite: org.apache.lucene.index.TestTermdocPerf

   [junit4] Completed [37/437] on J1 in 0.02s, 1 test

   [junit4] 

   [junit4] Suite: org.apache.lucene.util.TestRadixSelector

   [junit4] Completed [38/437] on J0 in 0.75s, 1 test

   [junit4] 

   [junit4] Suite: org.apache.lucene.util.TestNamedSPILoader

   [junit4] Completed [39/437] on J0 in 0.02s, 3 tests

   [junit4] 

   [junit4] Suite: org.apache.lucene.index.TestIndexWriterCommit

   [junit4] IGNOR/A 0.01s J1 | TestIndexWriterCommit.testCommitOnCloseDiskUsage

   [junit4]    > Assumption #1: This test cannot run with Memory codec

   [junit4] Completed [40/437] on J1 in 1.28s, 14 tests, 1 skipped

   [junit4] 

   [junit4] Suite: org.apache.lucene.util.TestRamUsageEstimator

   [junit4] IGNOR/A 0.00s J1 | TestRamUsageEstimator.testHotspotBean

   [junit4]    > Assumption #1: testHotspotBean only works on 64bit JVMs.

   [junit4] IGNOR/A 0.00s J1 | TestRamUsageEstimator.testPrintValues

   [junit4]    > Assumption #1: Specify -Dtests.verbose=true to print constants of RamUsageEstimator.

   [junit4] Completed [41/437] on J1 in 0.02s, 5 tests, 2 skipped

   [junit4] 

   [junit4] Suite: org.apache.lucene.util.automaton.FiniteStringsIteratorTest

   [junit4] Completed [42/437] on J1 in 4.13s, 7 tests

   [junit4] 

   [junit4] Suite: org.apache.lucene.util.TestArrayUtil

   [junit4] Completed [43/437] on J0 in 5.30s, 14 tests

   [junit4] 

   [junit4] Suite: org.apache.lucene.index.TestTermVectors

   [junit4] Completed [44/437] on J1 in 0.79s, 3 tests

   [junit4] 

   [junit4] Suite: org.apache.lucene.index.TestTwoPhaseCommitTool

   [junit4] Completed [45/437] on J1 in 0.02s, 3 tests

   [junit4] 

   [junit4] Suite: org.apache.lucene.index.TestPrefixCodedTerms

   [junit4] Completed [46/437] on J0 in 0.29s, 5 tests

   [junit4] 

   [junit4] Suite: org.apache.lucene.search.spans.TestSpans

   [junit4] Completed [47/437] on J1 in 0.61s, 26 tests

   [junit4] 

   [junit4] Suite: org.apache.lucene.TestMergeSchedulerExternal

   [junit4] Completed [48/437] on J1 in 0.84s, 2 tests

   [junit4] 

   [junit4] Suite: org.apache.lucene.util.TestCollectionUtil

   [junit4] Completed [49/437] on J2 in 9.62s, 4 tests

   [junit4] 

   [junit4] Suite: org.apache.lucene.store.TestSleepingLockWrapper

   [junit4] Completed [50/437] on J0 in 2.22s, 6 tests

   [junit4] 

   [junit4] Suite: org.apache.lucene.index.TestPayloads

   [junit4] Completed [51/437] on J2 in 0.28s, 7 tests

   [junit4] 

   [junit4] Suite: org.apache.lucene.util.TestIOUtils

   [junit4] Completed [52/437] on J2 in 0.21s, 18 tests

   [junit4] 

   [junit4] Suite: org.apache.lucene.search.similarities.TestClassicSimilarity

   [junit4] Completed [53/437] on J2 in 0.14s, 11 tests

   [junit4] 

   [junit4] Suite: org.apache.lucene.util.TestPriorityQueue

   [junit4] Completed [54/437] on J2 in 0.38s, 9 tests

   [junit4] 

   [junit4] Suite: org.apache.lucene.search.TestBooleanScorer

   [junit4] Completed [55/437] on J0 in 5.25s, 5 tests

   [junit4] 

   [junit4] Suite: org.apache.lucene.index.TestDocCount

   [junit4] Completed [56/437] on J0 in 0.10s, 1 test

   [junit4] 

   [junit4] Suite: org.apache.lucene.search.TestSearchWithThreads

   [junit4] Completed [57/437] on J1 in 6.45s, 1 test

   [junit4] 

   [junit4] Suite: org.apache.lucene.util.TestMSBRadixSorter

   [junit4] Completed [58/437] on J2 in 5.02s, 7 tests

   [junit4] 

   [junit4] Suite: org.apache.lucene.codecs.lucene50.TestBlockPostingsFormat3

   [junit4] Completed [59/437] on J1 in 1.49s, 1 test

   [junit4] 

   [junit4] Suite: org.apache.lucene.index.TestTryDelete

   [junit4] Completed [60/437] on J1 in 0.03s, 3 tests

   [junit4] 

   [junit4] Suite: org.apache.lucene.store.TestNRTCachingDirectory

   [junit4] IGNOR/A 0.00s J2 | TestNRTCachingDirectory.testPendingDeletions

   [junit4]    > Assumption #1: we can only install VirusCheckingFS on an FSDirectory

   [junit4] IGNOR/A 0.00s J2 | TestNRTCachingDirectory.testFsyncDoesntCreateNewFiles

   [junit4]    > Assumption #1: test only works for FSDirectory subclasses

   [junit4] Completed [61/437] on J2 in 2.10s, 46 tests, 2 skipped

   [junit4] 

   [junit4] Suite: org.apache.lucene.index.TestMultiFields

   [junit4] Completed [62/437] on J2 in 1.65s, 3 tests

   [junit4] 

   [junit4] Suite: org.apache.lucene.util.automaton.TestAutomaton

   [junit4] Completed [63/437] on J0 in 6.02s, 56 tests

   [junit4] 

   [junit4] Suite: org.apache.lucene.store.TestMmapDirectory

   [junit4] Completed [64/437] on J2 in 1.86s, 44 tests

   [junit4] 

   [junit4] Suite: org.apache.lucene.index.TestIntBlockPool

   [junit4] Completed [65/437] on J0 in 0.85s, 2 tests

   [junit4] 

   [junit4] Suite: org.apache.lucene.index.TestStressIndexing2

   [junit4] Completed [66/437] on J2 in 0.86s, 3 tests

   [junit4] 

   [junit4] Suite: org.apache.lucene.index.TestCodecs

   [junit4] Completed [67/437] on J2 in 0.43s, 3 tests

   [junit4] 

   [junit4] Suite: org.apache.lucene.util.automaton.LimitedFiniteStringsIteratorTest

   [junit4] Completed [68/437] on J2 in 0.29s, 6 tests

   [junit4] 

   [junit4] Suite: org.apache.lucene.index.TestIndexWriterDeleteByQuery

   [junit4] Completed [69/437] on J2 in 0.03s, 1 test

   [junit4] 

   [junit4] Suite: org.apache.lucene.search.spans.TestSpanNotQuery

   [junit4] Completed [70/437] on J2 in 0.06s, 3 tests

   [junit4] 

   [junit4] Suite: org.apache.lucene.search.TestTermQuery

   [junit4] Completed [71/437] on J2 in 0.03s, 2 tests

   [junit4] 

   [junit4] Suite: org.apache.lucene.search.TestSort

   [junit4] Completed [72/437] on J2 in 0.20s, 25 tests

   [junit4] 

   [junit4] Suite: org.apache.lucene.index.TestUpgradeIndexMergePolicy

   [junit4] Completed [73/437] on J2 in 0.05s, 1 test

   [junit4] 

   [junit4] Suite: org.apache.lucene.search.TestSortedSetSelector

   [junit4] Completed [74/437] on J2 in 0.12s, 15 tests

   [junit4] 

   [junit4] Suite: org.apache.lucene.index.TestOrdinalMap

   [junit4] Completed [75/437] on J2 in 0.08s, 1 test

   [junit4] 

   [junit4] Suite: org.apache.lucene.store.TestHugeRamFile

   [junit4] Completed [76/437] on J0 in 2.15s, 1 test

   [junit4] 

   [junit4] Suite: org.apache.lucene.search.spans.TestSpanContainQuery

   [junit4] Completed [77/437] on J0 in 0.09s, 4 tests

   [junit4] 

   [junit4] Suite: org.apache.lucene.search.similarities.TestSimilarity2

   [junit4] Completed [78/437] on J0 in 0.27s, 8 tests

   [junit4] 

   [junit4] Suite: org.apache.lucene.index.TestIndexWriterForceMerge

   [junit4] Completed [79/437] on J2 in 1.49s, 4 tests

   [junit4] 

   [junit4] Suite: org.apache.lucene.index.TestNumericDocValuesUpdates

   [junit4] IGNOR/A 0.00s J1 | TestNumericDocValuesUpdates.testTonsOfUpdates

   [junit4]    > Assumption #1: 'nightly' test group is disabled (@Nightly())

   [junit4] Completed [80/437] on J1 in 10.18s, 31 tests, 1 skipped

   [junit4] 

   [junit4] Suite: org.apache.lucene.search.TestFieldCacheRewriteMethod

   [junit4] Completed [81/437] on J0 in 3.25s, 2 tests

   [junit4] 

   [junit4] Suite: org.apache.lucene.search.spans.TestFilterSpans

   [junit4] Completed [82/437] on J0 in 0.01s, 1 test

   [junit4] 

   [junit4] Suite: org.apache.lucene.index.TestStressNRT

   [junit4] Completed [83/437] on J0 in 1.48s, 1 test

   [junit4] 

   [junit4] Suite: org.apache.lucene.index.TestIsCurrent

   [junit4] Completed [84/437] on J0 in 0.02s, 2 tests

   [junit4] 

   [junit4] Suite: org.apache.lucene.index.TestIndexReaderClose

   [junit4] Completed [85/437] on J0 in 0.35s, 2 tests

   [junit4] 

   [junit4] Suite: org.apache.lucene.index.TestCustomNorms

   [junit4] Completed [86/437] on J0 in 1.99s, 1 test

   [junit4] 

   [junit4] Suite: org.apache.lucene.util.TestNumericUtils

   [junit4] Completed [87/437] on J0 in 2.02s, 24 tests

   [junit4] 

   [junit4] Suite: org.apache.lucene.search.TestDisjunctionMaxQuery

   [junit4] Completed [88/437] on J0 in 0.23s, 11 tests

   [junit4] 

   [junit4] Suite: org.apache.lucene.index.TestCrashCausesCorruptIndex

   [junit4] Completed [89/437] on J0 in 0.06s, 1 test

   [junit4] 

   [junit4] Suite: org.apache.lucene.search.TestUsageTrackingFilterCachingPolicy

   [junit4] Completed [90/437] on J0 in 0.01s, 2 tests

   [junit4] 

   [junit4] Suite: org.apache.lucene.util.fst.TestFSTs

   [junit4] IGNOR/A 0.00s J1 | TestFSTs.testBigSet

   [junit4]    > Assumption #1: 'nightly' test group is disabled (@Nightly())

   [junit4] Completed [91/437] on J1 in 7.65s, 20 tests, 1 skipped

   [junit4] 

   [junit4] Suite: org.apache.lucene.search.TestSimpleExplanations

   [junit4] Completed [92/437] on J0 in 1.03s, 70 tests

   [junit4] 

   [junit4] Suite: org.apache.lucene.index.TestMergeRateLimiter

   [junit4] Completed [93/437] on J0 in 0.03s, 1 test

   [junit4] 

   [junit4] Suite: org.apache.lucene.search.TestPrefixInBooleanQuery

   [junit4] Completed [94/437] on J0 in 0.60s, 4 tests

   [junit4] 

   [junit4] Suite: org.apache.lucene.analysis.tokenattributes.TestCharTermAttributeImpl

   [junit4] Completed [95/437] on J0 in 0.45s, 12 tests

   [junit4] 

   [junit4] Suite: org.apache.lucene.codecs.perfield.TestPerFieldPostingsFormat2

   [junit4] Completed [96/437] on J1 in 2.02s, 5 tests

   [junit4] 

   [junit4] Suite: org.apache.lucene.index.TestMaxPosition

   [junit4] Completed [97/437] on J1 in 0.08s, 2 tests

   [junit4] 

   [junit4] Suite: org.apache.lucene.search.TestSortedNumericSortField

   [junit4] Completed [98/437] on J1 in 0.12s, 9 tests

   [junit4] 

   [junit4] Suite: org.apache.lucene.index.TestManyFields

   [junit4] Completed [99/437] on J0 in 1.22s, 3 tests

   [junit4] 

   [junit4] Suite: org.apache.lucene.index.TestDeletionPolicy

   [junit4] Completed [100/437] on J0 in 4.04s, 6 tests

   [junit4] 

   [junit4] Suite: org.apache.lucene.util.packed.TestPackedInts

   [junit4] IGNOR/A 0.00s J1 | TestPackedInts.testBlockReaderOverflow

   [junit4]    > Assumption #1: 'nightly' test group is disabled (@Nightly())

   [junit4] Completed [101/437] on J1 in 15.79s, 28 tests, 3 skipped

   [junit4] 

   [junit4] Suite: org.apache.lucene.analysis.standard.TestStandardAnalyzer

   [junit4] Completed [102/437] on J0 in 12.76s, 34 tests

   [junit4] 

   [junit4] Suite: org.apache.lucene.index.TestTragicIndexWriterDeadlock

   [junit4] Completed [103/437] on J0 in 0.04s, 1 test

   [junit4] 

   [junit4] Suite: org.apache.lucene.index.TestIndexWriterOnVMError

   [junit4] IGNOR/A 0.00s J0 | TestIndexWriterOnVMError.testCheckpoint

   [junit4]    > Assumption #1: 'nightly' test group is disabled (@Nightly())

   [junit4] Completed [104/437] on J0 in 0.66s, 3 tests, 1 skipped

   [junit4] 

   [junit4] Suite: org.apache.lucene.index.TestIndexWriterMergePolicy

   [junit4] Completed [105/437] on J0 in 2.18s, 7 tests

   [junit4] 

   [junit4] Suite: org.apache.lucene.index.TestMultiLevelSkipList

   [junit4] Completed [106/437] on J0 in 0.21s, 1 test

   [junit4] 

   [junit4] Suite: org.apache.lucene.search.TestNGramPhraseQuery

   [junit4] Completed [107/437] on J0 in 0.02s, 1 test

   [junit4] 

   [junit4] Suite: org.apache.lucene.index.Test2BPositions

   [junit4] IGNOR/A 0.00s J0 | Test2BPositions.test

   [junit4]    > Assumption #1: 'monster' test group is disabled (@Monster(value=uses lots of space and takes a few minutes))

   [junit4] Completed [108/437] on J0 in 0.00s, 1 test, 1 skipped

   [junit4] 

   [junit4] Suite: org.apache.lucene.search.TestDateSort

   [junit4] Completed [109/437] on J0 in 0.02s, 1 test

   [junit4] 

   [junit4] Suite: org.apache.lucene.search.spans.TestSpanOrQuery

   [junit4] Completed [110/437] on J0 in 0.01s, 3 tests

   [junit4] 

   [junit4] Suite: org.apache.lucene.search.FuzzyTermOnShortTermsTest

   [junit4] Completed [111/437] on J0 in 0.06s, 1 test

   [junit4] 

   [junit4] Suite: org.apache.lucene.index.TestIndexWriter

   [junit4] Completed [112/437] on J0 in 7.01s, 71 tests

   [junit4] 

   [junit4] Suite: org.apache.lucene.index.TestDuelingCodecs

   [junit4] Completed [113/437] on J1 in 16.61s, 2 tests

   [junit4] 

   [junit4] Suite: org.apache.lucene.index.TestIndexWriterLockRelease

   [junit4] Completed [114/437] on J1 in 0.01s, 1 test

   [junit4] 

   [junit4] Suite: org.apache.lucene.util.TestRollingBuffer

   [junit4] Completed [115/437] on J1 in 0.62s, 1 test

   [junit4] 

   [junit4] Suite: org.apache.lucene.search.TestPrefixRandom

   [junit4] Completed [116/437] on J1 in 0.84s, 1 test

   [junit4] 

   [junit4] Suite: org.apache.lucene.index.Test2BSortedDocValuesOrds

   [junit4] IGNOR/A 0.00s J1 | Test2BSortedDocValuesOrds.test2BOrds

   [junit4]    > Assumption #1: 'monster' test group is disabled (@Monster(value=Takes ~ 6 hours if the heap is 5gb))

   [junit4] Completed [117/437] on J1 in 0.00s, 1 test, 1 skipped

   [junit4] 

   [junit4] Suite: org.apache.lucene.index.TestDoc

   [junit4] Completed [118/437] on J1 in 0.12s, 1 test

   [junit4] 

   [junit4] Suite: org.apache.lucene.search.TestNumericRangeQuery64

   [junit4] Completed [119/437] on J0 in 6.96s, 29 tests

   [junit4] 

   [junit4] Suite: org.apache.lucene.util.TestMathUtil

   [junit4] Completed [120/437] on J0 in 0.02s, 5 tests

   [junit4] 

   [junit4] Suite: org.apache.lucene.index.TestCrash

   [junit4] Completed [121/437] on J0 in 0.30s, 5 tests

   [junit4] 

   [junit4] Suite: org.apache.lucene.analysis.TestCharArrayMap

   [junit4] Completed [122/437] on J0 in 0.15s, 4 tests

   [junit4] 

   [junit4] Suite: org.apache.lucene.util.TestLSBRadixSorter

   [junit4] Completed [123/437] on J0 in 0.11s, 6 tests

   [junit4] 

   [junit4] Suite: org.apache.lucene.document.TestDateTools

   [junit4] Completed [124/437] on J0 in 0.04s, 5 tests

   [junit4] 

   [junit4] Suite: org.apache.lucene.util.TestFixedBitSet

   [junit4] Completed [125/437] on J1 in 2.52s, 19 tests

   [junit4] 

   [junit4] Suite: org.apache.lucene.search.similarities.TestBM25Similarity

   [junit4] Completed [126/437] on J1 in 0.06s, 3 tests

   [junit4] 

   [junit4] Suite: org.apache.lucene.search.TestAutomatonQuery

   [junit4] Completed [127/437] on J0 in 1.89s, 8 tests

   [junit4] 

   [junit4] Suite: org.apache.lucene.store.TestNIOFSDirectory

   [junit4] Completed [128/437] on J0 in 1.34s, 44 tests

   [junit4] 

   [junit4] Suite: org.apache.lucene.search.TestLiveFieldValues

   [junit4] Completed [129/437] on J0 in 0.13s, 1 test

   [junit4] 

   [junit4] Suite: org.apache.lucene.search.TestPhraseQuery

   [junit4] Completed [130/437] on J0 in 1.21s, 21 tests

   [junit4] 

   [junit4] Suite: org.apache.lucene.index.TestRollback

   [junit4] Completed [131/437] on J0 in 0.01s, 1 test

   [junit4] 

   [junit4] Suite: org.apache.lucene.search.TestTermScorer

   [junit4] Completed [132/437] on J0 in 0.04s, 4 tests

   [junit4] 

   [junit4] Suite: org.apache.lucene.util.TestSloppyMath

   [junit4] Completed [133/437] on J0 in 1.92s, 8 tests

   [junit4] 

   [junit4] Suite: org.apache.lucene.index.TestSegmentTermDocs

   [junit4] Completed [134/437] on J0 in 0.30s, 4 tests

   [junit4] 

   [junit4] Suite: org.apache.lucene.search.TestMultiPhraseQuery

   [junit4] Completed [135/437] on J0 in 0.12s, 16 tests, 1 skipped

   [junit4] 

   [junit4] Suite: org.apache.lucene.index.TestNRTReaderCleanup

   [junit4] Completed [136/437] on J0 in 0.02s, 1 test

   [junit4] 

   [junit4] Suite: org.apache.lucene.index.TestDocumentsWriterStallControl

   [junit4] Completed [137/437] on J2 in 54.87s, 3 tests

   [junit4] 

   [junit4] Suite: org.apache.lucene.index.TestBagOfPostings

   [junit4] Completed [138/437] on J2 in 1.65s, 1 test

   [junit4] 

   [junit4] Suite: org.apache.lucene.util.TestNotDocIdSet

   [junit4] Completed [139/437] on J2 in 1.83s, 6 tests

   [junit4] 

   [junit4] Suite: org.apache.lucene.index.TestTransactionRollback

   [junit4] Completed [140/437] on J2 in 0.16s, 2 tests

   [junit4] 

   [junit4] Suite: org.apache.lucene.index.TestMixedDocValuesUpdates

   [junit4] IGNOR/A 0.00s J1 | TestMixedDocValuesUpdates.testTonsOfUpdates

   [junit4]    > Assumption #1: 'nightly' test group is disabled (@Nightly())

   [junit4] Completed [141/437] on J1 in 11.44s, 4 tests, 1 skipped

   [junit4] 

   [junit4] Suite: org.apache.lucene.TestAssertions

   [junit4] Completed [142/437] on J1 in 0.01s, 1 test

   [junit4] 

   [junit4] Suite: org.apache.lucene.index.TestBagOfPositions

   [junit4] Completed [143/437] on J2 in 2.05s, 1 test

   [junit4] 

   [junit4] Suite: org.apache.lucene.search.TestSloppyPhraseQuery

   [junit4] Completed [144/437] on J2 in 1.10s, 9 tests

   [junit4] 

   [junit4] Suite: org.apache.lucene.index.TestByteSlices

   [junit4] Completed [145/437] on J1 in 7.19s, 1 test

   [junit4] 

   [junit4] Suite: org.apache.lucene.search.TestNumericRangeQuery32

   [junit4] Completed [146/437] on J2 in 6.48s, 23 tests

   [junit4] 

   [junit4] Suite: org.apache.lucene.index.TestIndexWriterMerging

   [junit4] Completed [147/437] on J2 in 5.55s, 6 tests

   [junit4] 

   [junit4] Suite: org.apache.lucene.search.TestFilterWeight

   [junit4] Completed [148/437] on J2 in 0.01s, 1 test

   [junit4] 

   [junit4] Suite: org.apache.lucene.analysis.TestWordlistLoader

   [junit4] Completed [149/437] on J2 in 0.02s, 3 tests

   [junit4] 

   [junit4] Suite: org.apache.lucene.util.bkd.TestBKD

   [junit4] IGNOR/A 0.00s J1 | TestBKD.testRandomBinaryBig

   [junit4]    > Assumption #1: 'nightly' test group is disabled (@Nightly())

   [junit4] Completed [150/437] on J1 in 7.98s, 16 tests, 1 skipped

   [junit4] 

   [junit4] Suite: org.apache.lucene.index.TestTermVectorsWriter

   [junit4] Completed [151/437] on J1 in 0.26s, 15 tests

   [junit4] 

   [junit4] Suite: org.apache.lucene.util.TestRoaringDocIdSet

   [junit4] Completed [152/437] on J1 in 0.70s, 5 tests

   [junit4] 

   [junit4] Suite: org.apache.lucene.search.TestRegexpQuery

   [junit4] Completed [153/437] on J1 in 0.10s, 7 tests

   [junit4] 

   [junit4] Suite: org.apache.lucene.search.TestPositiveScoresOnlyCollector

   [junit4] Completed [154/437] on J1 in 0.04s, 1 test

   [junit4] 

   [junit4] Suite: org.apache.lucene.TestSearchForDuplicates

   [junit4] Completed [155/437] on J1 in 0.10s, 1 test

   [junit4] 

   [junit4] Suite: org.apache.lucene.search.TestConstantScoreQuery

   [junit4] Completed [156/437] on J1 in 0.03s, 5 tests

   [junit4] 

   [junit4] Suite: org.apache.lucene.index.TestSameTokenSamePosition

   [junit4] Completed [157/437] on J1 in 0.03s, 2 tests

   [junit4] 

   [junit4] Suite: org.apache.lucene.util.TestSetOnce

   [junit4] Completed [158/437] on J1 in 0.05s, 4 tests

   [junit4] 

   [junit4] Suite: org.apache.lucene.index.TestIndexWriterMaxDocs

   [junit4] IGNOR/A 0.00s J2 | TestIndexWriterMaxDocs.testExactlyAtTrueLimit

   [junit4]    > Assumption #1: 'monster' test group is disabled (@Monster(value=takes over two hours))

   [junit4] Completed [159/437] on J2 in 3.21s, 21 tests, 1 skipped

   [junit4] 

   [junit4] Suite: org.apache.lucene.index.TestSegmentReader

   [junit4] Completed [160/437] on J1 in 1.02s, 7 tests

   [junit4] 

   [junit4] Suite: org.apache.lucene.search.TestSimpleSearchEquivalence

   [junit4] Completed [161/437] on J1 in 1.79s, 17 tests

   [junit4] 

   [junit4] Suite: org.apache.lucene.search.TestSynonymQuery

   [junit4] Completed [162/437] on J1 in 0.02s, 4 tests

   [junit4] 

   [junit4] Suite: org.apache.lucene.index.TestBinaryDocValuesUpdates

   [junit4] IGNOR/A 0.00s J2 | TestBinaryDocValuesUpdates.testTonsOfUpdates

   [junit4]    > Assumption #1: 'nightly' test group is disabled (@Nightly())

   [junit4] Completed [163/437] on J2 in 10.30s, 28 tests, 1 skipped

   [junit4] 

   [junit4] Suite: org.apache.lucene.analysis.TestCharacterUtils

   [junit4] Completed [164/437] on J2 in 0.03s, 4 tests

   [junit4] 

   [junit4] Suite: org.apache.lucene.index.TestReaderWrapperDVTypeCheck

   [junit4] Completed [165/437] on J2 in 0.05s, 1 test

   [junit4] 

   [junit4] Suite: org.apache.lucene.codecs.perfield.TestPerFieldPostingsFormat

   [junit4] IGNOR/A 0.00s J1 | TestPerFieldPostingsFormat.testMergeStability

   [junit4]    > Assumption #1: The MockRandom PF randomizes content on the fly, so we can't check it

   [junit4] IGNOR/A 0.00s J1 | TestPerFieldPostingsFormat.testPostingsEnumReuse

   [junit4]    > Assumption #1: The MockRandom PF randomizes content on the fly, so we can't check it

   [junit4] Completed [166/437] on J1 in 8.87s, 24 tests, 2 skipped

   [junit4] 

   [junit4] Suite: org.apache.lucene.index.TestForceMergeForever

   [junit4] Completed [167/437] on J2 in 1.41s, 1 test

   [junit4] 

   [junit4] Suite: org.apache.lucene.index.TestFlex

   [junit4] Completed [168/437] on J2 in 0.14s, 2 tests

   [junit4] 

   [junit4] Suite: org.apache.lucene.index.TestIndexWriterOnDiskFull

   [junit4] Completed [169/437] on J2 in 0.52s, 4 tests

   [junit4] 

   [junit4] Suite: org.apache.lucene.search.TestDocBoost

   [junit4] Completed [170/437] on J2 in 0.05s, 1 test

   [junit4] 

   [junit4] Suite: org.apache.lucene.index.Test2BBinaryDocValues

   [junit4] IGNOR/A 0.00s J2 | Test2BBinaryDocValues.testFixedBinary

   [junit4]    > Assumption #1: 'monster' test group is disabled (@Monster(value=takes ~ 6 hours if the heap is 5gb))

   [junit4] IGNOR/A 0.00s J2 | Test2BBinaryDocValues.testVariableBinary

   [junit4]    > Assumption #1: 'monster' test group is disabled (@Monster(value=takes ~ 6 hours if the heap is 5gb))

   [junit4] Completed [171/437] on J2 in 0.01s, 2 tests, 2 skipped

   [junit4] 

   [junit4] Suite: org.apache.lucene.search.spans.TestBasics

   [junit4] Completed [172/437] on J1 in 3.04s, 25 tests

   [junit4] 

   [junit4] Suite: org.apache.lucene.analysis.tokenattributes.TestPackedTokenAttributeImpl

   [junit4] Completed [173/437] on J1 in 0.02s, 4 tests

   [junit4] 

   [junit4] Suite: org.apache.lucene.search.TestRegexpRandom

   [junit4] Completed [174/437] on J1 in 0.25s, 1 test

   [junit4] 

   [junit4] Suite: org.apache.lucene.index.TestIndexWriterOutOfFileDescriptors

   [junit4] Completed [175/437] on J1 in 3.68s, 1 test

   [junit4] 

   [junit4] Suite: org.apache.lucene.index.TestTieredMergePolicy

   [junit4] Completed [176/437] on J2 in 5.89s, 6 tests

   [junit4] 

   [junit4] Suite: org.apache.lucene.search.TestWildcardRandom

   [junit4] Completed [177/437] on J2 in 0.16s, 1 test

   [junit4] 

   [junit4] Suite: org.apache.lucene.index.TestRollingUpdates

   [junit4] Completed [178/437] on J2 in 1.62s, 2 tests

   [junit4] 

   [junit4] Suite: org.apache.lucene.index.TestExceedMaxTermLength

   [junit4] Completed [179/437] on J2 in 0.02s, 1 test

   [junit4] 

   [junit4] Suite: org.apache.lucene.index.TestTransactions

   [junit4] Completed [180/437] on J1 in 1.92s, 1 test

   [junit4] 

   [junit4] Suite: org.apache.lucene.search.TestSloppyPhraseQuery2

   [junit4] Completed [181/437] on J1 in 0.91s, 9 tests

   [junit4] 

   [junit4] Suite: org.apache.lucene.search.spans.TestFieldMaskingSpanQuery

   [junit4] IGNOR/A 0.00s J1 | TestFieldMaskingSpanQuery.testSpans2

   [junit4]    > Assumption #1: Broken scoring: LUCENE-3723

   [junit4] IGNOR/A 0.00s J1 | TestFieldMaskingSpanQuery.testSimple2

   [junit4]    > Assumption #1: Broken scoring: LUCENE-3723

   [junit4] Completed [182/437] on J1 in 0.12s, 11 tests, 2 skipped

   [junit4] 

   [junit4] Suite: org.apache.lucene.search.TestBoostQuery

   [junit4] Completed [183/437] on J1 in 0.01s, 3 tests

   [junit4] 

   [junit4] Suite: org.apache.lucene.index.TestDuelingCodecsAtNight

   [junit4] IGNOR/A 0.00s J1 | TestDuelingCodecsAtNight.testCrazyReaderEquals

   [junit4]    > Assumption #1: 'nightly' test group is disabled (@Nightly())

   [junit4] IGNOR/A 0.00s J1 | TestDuelingCodecsAtNight.testBigEquals

   [junit4]    > Assumption #1: 'nightly' test group is disabled (@Nightly())

   [junit4] IGNOR/A 0.00s J1 | TestDuelingCodecsAtNight.testEquals

   [junit4]    > Assumption #1: 'nightly' test group is disabled (@Nightly())

   [junit4] Completed [184/437] on J1 in 0.00s, 3 tests, 3 skipped

   [junit4] 

   [junit4] Suite: org.apache.lucene.index.TestIndexWriterConfig

   [junit4] Completed [185/437] on J1 in 0.03s, 8 tests

   [junit4] 

   [junit4] Suite: org.apache.lucene.index.TestFieldReuse

   [junit4] Completed [186/437] on J1 in 0.02s, 3 tests

   [junit4] 

   [junit4] Suite: org.apache.lucene.search.TestTopDocsCollector

   [junit4] Completed [187/437] on J1 in 0.06s, 8 tests

   [junit4] 

   [junit4] Suite: org.apache.lucene.codecs.perfield.TestPerFieldDocValuesFormat

   [junit4] Completed [188/437] on J0 in 44.53s, 96 tests

   [junit4] 

   [junit4] Suite: org.apache.lucene.util.TestIntroSelector

   [junit4] Completed [189/437] on J1 in 0.92s, 2 tests

   [junit4] 

   [junit4] Suite: org.apache.lucene.util.fst.TestBytesStore

   [junit4] Completed [190/437] on J0 in 1.20s, 1 test

   [junit4] 

   [junit4] Suite: org.apache.lucene.util.automaton.TestDeterminism

   [junit4] Completed [191/437] on J1 in 0.93s, 2 tests

   [junit4] 

   [junit4] Suite: org.apache.lucene.index.TestIndexWriterWithThreads

   [junit4] IGNOR/A 0.01s J0 | TestIndexWriterWithThreads.testOpenTwoIndexWritersOnDifferentThreads

   [junit4]    > Assumption #1: aborting test: timeout obtaining lock

   [junit4] Completed [192/437] on J0 in 2.53s, 12 tests, 1 skipped

   [junit4] 

   [junit4] Suite: org.apache.lucene.index.TestAddIndexes

   [junit4] Completed [193/437] on J0 in 1.48s, 25 tests

   [junit4] 

   [junit4] Suite: org.apache.lucene.search.TestScorerPerf

   [junit4] Completed [194/437] on J1 in 6.20s, 1 test

   [junit4] 

   [junit4] Suite: org.apache.lucene.search.TestSameScoresWithThreads

   [junit4] Completed [195/437] on J1 in 1.46s, 1 test

   [junit4] 

   [junit4] Suite: org.apache.lucene.search.TestDocValuesScoring

   [junit4] Completed [196/437] on J1 in 0.04s, 1 test

   [junit4] 

   [junit4] Suite: org.apache.lucene.search.TestEarlyTerminatingSortingCollector

   [junit4] Completed [197/437] on J2 in 11.06s, 4 tests

   [junit4] 

   [junit4] Suite: org.apache.lucene.util.TestIntsRef

   [junit4] Completed [198/437] on J2 in 0.03s, 2 tests

   [junit4] 

   [junit4] Suite: org.apache.lucene.index.TestAtomicUpdate

   [junit4] Completed [199/437] on J2 in 5.30s, 1 test

   [junit4] 

   [junit4] Suite: org.apache.lucene.TestExternalCodecs

   [junit4] Completed [200/437] on J2 in 0.52s, 1 test

   [junit4] 

   [junit4] Suite: org.apache.lucene.util.TestInPlaceMergeSorter

   [junit4] Completed [201/437] on J2 in 0.11s, 9 tests

   [junit4] 

   [junit4] Suite: org.apache.lucene.codecs.lucene62.TestLucene62SegmentInfoFormat

   [junit4] Completed [202/437] on J2 in 0.46s, 16 tests

   [junit4] 

   [junit4] Suite: org.apache.lucene.index.TestSegmentTermEnum

   [junit4] Completed [203/437] on J2 in 0.06s, 2 tests

   [junit4] 

   [junit4] Suite: org.apache.lucene.search.spans.TestSpansEnum

   [junit4] Completed [204/437] on J2 in 0.17s, 7 tests

   [junit4] 

   [junit4] Suite: org.apache.lucene.search.TestBlendedTermQuery

   [junit4] Completed [205/437] on J2 in 0.04s, 3 tests

   [junit4] 

   [junit4] Suite: org.apache.lucene.search.TestElevationComparator

   [junit4] Completed [206/437] on J2 in 0.07s, 1 test

   [junit4] 

   [junit4] Suite: org.apache.lucene.search.TestShardSearching

   [junit4] Completed [207/437] on J0 in 12.65s, 1 test

   [junit4] 

   [junit4] Suite: org.apache.lucene.index.TestNRTThreads

   [junit4] Completed [208/437] on J2 in 7.25s, 1 test

   [junit4] 

   [junit4] Suite: org.apache.lucene.search.TestSimilarityProvider

   [junit4] Completed [209/437] on J2 in 0.02s, 1 test

   [junit4] 

   [junit4] Suite: org.apache.lucene.util.TestSPIClassIterator

   [junit4] Completed [210/437] on J2 in 0.02s, 1 test

   [junit4] 

   [junit4] Suite: org.apache.lucene.index.TestNorms

   [junit4] Completed [211/437] on J2 in 1.15s, 2 tests

   [junit4] 

   [junit4] Suite: org.apache.lucene.index.TestIndexWriterExceptions

   [junit4] IGNOR/A 0.00s J0 | TestIndexWriterExceptions.testTooManyTokens

   [junit4]    > Assumption #1: 'nightly' test group is disabled (@Nightly())

   [junit4] Completed [212/437] on J0 in 15.59s, 36 tests, 1 skipped

   [junit4] 

   [junit4] Suite: org.apache.lucene.search.TestConjunctionDISI

   [junit4] Completed [213/437] on J2 in 10.03s, 5 tests

   [junit4] 

   [junit4] Suite: org.apache.lucene.index.TestIndexWriterReader

   [junit4] IGNOR/A 0.00s J2 | TestIndexWriterReader.testDuringAddIndexes

   [junit4]    > Assumption #1: 'nightly' test group is disabled (@Nightly())

   [junit4] Completed [214/437] on J2 in 5.71s, 23 tests, 1 skipped

   [junit4] 

   [junit4] Suite: org.apache.lucene.search.TestSearcherManager

   [junit4] Completed [215/437] on J0 in 8.02s, 10 tests

   [junit4] 

   [junit4] Suite: org.apache.lucene.index.TestIndexWriterDelete

   [junit4] IGNOR/A 0.00s J0 | TestIndexWriterDelete.testApplyDeletesOnFlush

   [junit4]    > Assumption #1: 'nightly' test group is disabled (@Nightly())

   [junit4] IGNOR/A 0.00s J0 | TestIndexWriterDelete.testIndexingThenDeleting

   [junit4]    > Assumption #1: This test cannot run with Direct codec

   [junit4] Completed [216/437] on J0 in 2.50s, 27 tests, 2 skipped

   [junit4] 

   [junit4] Suite: org.apache.lucene.search.TestBooleanOr

   [junit4] Completed [217/437] on J2 in 4.63s, 7 tests

   [junit4] 

   [junit4] Suite: org.apache.lucene.index.TestPersistentSnapshotDeletionPolicy

   [junit4] Completed [218/437] on J0 in 1.32s, 13 tests

   [junit4] 

   [junit4] Suite: org.apache.lucene.index.TestStressAdvance

   [junit4] Completed [219/437] on J2 in 2.06s, 1 test

   [junit4] 

   [junit4] Suite: org.apache.lucene.index.TestDirectoryReaderReopen

   [junit4] Completed [220/437] on J0 in 1.37s, 14 tests

   [junit4] 

   [junit4] Suite: org.apache.lucene.search.TestSearchAfter

   [junit4] Completed [221/437] on J0 in 0.42s, 1 test

   [junit4] 

   [junit4] Suite: org.apache.lucene.search.TestTimeLimitingCollector

   [junit4] Completed [222/437] on J2 in 2.16s, 7 tests

   [junit4] 

   [junit4] Suite: org.apache.lucene.index.TestConcurrentMergeScheduler

   [junit4] Completed [223/437] on J0 in 2.54s, 16 tests

   [junit4] 

   [junit4] Suite: org.apache.lucene.codecs.compressing.TestHighCompressionMode

   [junit4] Completed [224/437] on J2 in 1.71s, 7 tests

   [junit4] 

   [junit4] Suite: org.apache.lucene.search.TestTopDocsMerge

   [junit4] Completed [225/437] on J2 in 1.72s, 2 tests

   [junit4] 

   [junit4] Suite: org.apache.lucene.index.TestNeverDelete

   [junit4] Completed [226/437] on J0 in 3.53s, 1 test

   [junit4] 

   [junit4] Suite: org.apache.lucene.index.TestStressIndexing

   [junit4] Completed [227/437] on J0 in 4.30s, 1 test

   [junit4] 

   [junit4] Suite: org.apache.lucene.index.TestLongPostings

   [junit4] Completed [228/437] on J2 in 5.92s, 2 tests

   [junit4] 

   [junit4] Suite: org.apache.lucene.index.TestNRTReaderWithThreads

   [junit4] Completed [229/437] on J2 in 1.49s, 1 test

   [junit4] 

   [junit4] Suite: org.apache.lucene.util.automaton.TestMinimize

   [junit4] Completed [230/437] on J0 in 2.68s, 3 tests

   [junit4] 

   [junit4] Suite: org.apache.lucene.store.TestBufferedIndexInput

   [junit4] Completed [231/437] on J0 in 0.42s, 4 tests

   [junit4] 

   [junit4] Suite: org.apache.lucene.index.TestIndexSorting

   [junit4] Completed [232/437] on J1 in 53.60s, 27 tests

   [junit4] 

   [junit4] Suite: org.apache.lucene.util.automaton.TestLevenshteinAutomata

   [junit4] Completed [233/437] on J2 in 1.94s, 4 tests

   [junit4] 

   [junit4] Suite: org.apache.lucene.util.TestFrequencyTrackingRingBuffer

   [junit4] Completed [234/437] on J1 in 0.44s, 2 tests

   [junit4] 

   [junit4] Suite: org.apache.lucene.util.TestLongBitSet

   [junit4] IGNOR/A 0.00s J1 | TestLongBitSet.testHugeCapacity

   [junit4]    > Assumption #1: 'nightly' test group is disabled (@Nightly())

   [junit4] Completed [235/437] on J1 in 0.52s, 9 tests, 1 skipped

   [junit4] 

   [junit4] Suite: org.apache.lucene.index.TestAllFilesHaveCodecHeader

   [junit4] Completed [236/437] on J1 in 0.36s, 1 test

   [junit4] 

   [junit4] Suite: org.apache.lucene.index.TestConsistentFieldNumbers

   [junit4] Completed [237/437] on J2 in 1.08s, 4 tests

   [junit4] 

   [junit4] Suite: org.apache.lucene.index.TestSnapshotDeletionPolicy

   [junit4] Completed [238/437] on J1 in 1.37s, 7 tests

   [junit4] 

   [junit4] Suite: org.apache.lucene.index.TestInfoStream

   [junit4] Completed [239/437] on J1 in 0.07s, 2 tests

   [junit4] 

   [junit4] Suite: org.apache.lucene.index.TestDocIDMerger

   [junit4] Completed [240/437] on J1 in 0.07s, 2 tests

   [junit4] 

   [junit4] Suite: org.apache.lucene.util.TestWeakIdentityMap

   [junit4] Completed [241/437] on J2 in 6.42s, 2 tests

   [junit4] 

   [junit4] Suite: org.apache.lucene.index.TestDirectoryReader

   [junit4] Completed [242/437] on J2 in 2.16s, 24 tests

   [junit4] 

   [junit4] Suite: org.apache.lucene.index.TestSegmentMerger

   [junit4] Completed [243/437] on J2 in 0.70s, 3 tests

   [junit4] 

   [junit4] Suite: org.apache.lucene.index.TestOmitNorms

   [junit4] Completed [244/437] on J2 in 0.41s, 5 tests

   [junit4] 

   [junit4] Suite: org.apache.lucene.search.TestComplexExplanations

   [junit4] Completed [245/437] on J2 in 0.89s, 21 tests

   [junit4] 

   [junit4] Suite: org.apache.lucene.search.TestRegexpRandom2

   [junit4] Completed [246/437] on J2 in 6.08s, 1 test

   [junit4] 

   [junit4] Suite: org.apache.lucene.codecs.compressing.TestFastDecompressionMode

   [junit4] Completed [247/437] on J2 in 2.36s, 11 tests

   [junit4] 

   [junit4] Suite: org.apache.lucene.index.TestParallelCompositeReader

   [junit4] Completed [248/437] on J2 in 0.21s, 15 tests

   [junit4] 

   [junit4] Suite: org.apache.lucene.index.TestIndexWriterNRTIsCurrent

   [junit4] Completed [249/437] on J2 in 3.93s, 1 test

   [junit4] 

   [junit4] Suite: org.apache.lucene.util.TestPagedBytes

   [junit4] Completed [250/437] on J2 in 6.66s, 4 tests, 1 skipped

   [junit4] 

   [junit4] Suite: org.apache.lucene.search.TestBoolean2

   [junit4] Completed [251/437] on J1 in 30.49s, 10 tests

   [junit4] 

   [junit4] Suite: org.apache.lucene.store.TestLockFactory

   [junit4] Completed [252/437] on J1 in 0.02s, 2 tests

   [junit4] 

   [junit4] Suite: org.apache.lucene.index.TestFlushByRamOrCountsPolicy

   [junit4] Completed [253/437] on J1 in 2.28s, 5 tests

   [junit4] 

   [junit4] Suite: org.apache.lucene.search.spans.TestSpanExplanations

   [junit4] Completed [254/437] on J1 in 0.33s, 30 tests

   [junit4] 

   [junit4] Suite: org.apache.lucene.search.TestMultiThreadTermVectors

   [junit4] Completed [255/437] on J2 in 3.62s, 1 test

   [junit4] 

   [junit4] Suite: org.apache.lucene.index.TestMultiDocValues

   [junit4] Completed [256/437] on J1 in 0.17s, 8 tests

   [junit4] 

   [junit4] Suite: org.apache.lucene.analysis.TestToken

   [junit4] Completed [257/437] on J2 in 0.01s, 5 tests

   [junit4] 

   [junit4] Suite: org.apache.lucene.index.TestDocValuesIndexing

   [junit4] Completed [258/437] on J2 in 0.18s, 34 tests

   [junit4] 

   [junit4] Suite: org.apache.lucene.search.TestCustomSearcherSort

   [junit4] Completed [259/437] on J1 in 0.70s, 2 tests

   [junit4] 

   [junit4] Suite: org.apache.lucene.search.similarities.TestSimilarityBase

   [junit4] Completed [260/437] on J2 in 1.35s, 32 tests

   [junit4] 

   [junit4] Suite: org.apache.lucene.search.TestBooleanMinShouldMatch

   [junit4] Completed [261/437] on J1 in 1.42s, 17 tests

   [junit4] 

   [junit4] Suite: org.apache.lucene.index.TestTermsEnum2

   [junit4] Completed [262/437] on J2 in 1.06s, 4 tests

   [junit4] 

   [junit4] Suite: org.apache.lucene.util.automaton.TestDeterminizeLexicon

   [junit4] Completed [263/437] on J2 in 1.65s, 1 test

   [junit4] 

   [junit4] Suite: org.apache.lucene.util.TestLegacyNumericUtils

   [junit4] Completed [264/437] on J1 in 3.31s, 12 tests

   [junit4] 

   [junit4] Suite: org.apache.lucene.index.TestPostingsOffsets

   [junit4] Completed [265/437] on J2 in 1.03s, 13 tests

   [junit4] 

   [junit4] Suite: org.apache.lucene.index.TestMixedCodecs

   [junit4] Completed [266/437] on J1 in 1.29s, 1 test

   [junit4] 

   [junit4] Suite: org.apache.lucene.store.TestRAMDirectory

   [junit4] IGNOR/A 0.00s J1 | TestRAMDirectory.testPendingDeletions

   [junit4]    > Assumption #1: we can only install VirusCheckingFS on an FSDirectory

   [junit4] IGNOR/A 0.00s J1 | TestRAMDirectory.testFsyncDoesntCreateNewFiles

   [junit4]    > Assumption #1: test only works for FSDirectory subclasses

   [junit4] Completed [267/437] on J1 in 0.66s, 48 tests, 2 skipped

   [junit4] 

   [junit4] Suite: org.apache.lucene.index.TestDocsAndPositions

   [junit4] Completed [268/437] on J1 in 0.29s, 6 tests

   [junit4] 

   [junit4] Suite: org.apache.lucene.index.TestParallelLeafReader

   [junit4] Completed [269/437] on J1 in 0.08s, 9 tests

   [junit4] 

   [junit4] Suite: org.apache.lucene.util.automaton.TestUTF32ToUTF8

   [junit4] Completed [270/437] on J2 in 3.48s, 6 tests

   [junit4] 

   [junit4] Suite: org.apache.lucene.index.TestThreadedForceMerge

   [junit4] Completed [271/437] on J2 in 0.19s, 1 test

   [junit4] 

   [junit4] Suite: org.apache.lucene.index.TestIndexInput

   [junit4] Completed [272/437] on J2 in 1.10s, 2 tests

   [junit4] 

   [junit4] Suite: org.apache.lucene.index.TestOmitTf

   [junit4] Completed [273/437] on J2 in 0.14s, 6 tests

   [junit4] 

   [junit4] Suite: org.apache.lucene.util.TestBytesRefHash

   [junit4] Completed [274/437] on J1 in 2.42s, 8 tests

   [junit4] 

   [junit4] Suite: org.apache.lucene.search.TestTermRangeQuery

   [junit4] Completed [275/437] on J2 in 0.06s, 7 tests

   [junit4] 

   [junit4] Suite: org.apache.lucene.index.TestDocumentsWriterDeleteQueue

   [junit4] Completed [276/437] on J1 in 0.07s, 5 tests

   [junit4] 

   [junit4] Suite: org.apache.lucene.search.TestFuzzyQuery

   [junit4] Completed [277/437] on J1 in 0.09s, 10 tests

   [junit4] 

   [junit4] Suite: org.apache.lucene.search.TestSimpleExplanationsOfNonMatches

   [junit4] Completed [278/437] on J1 in 0.07s, 70 tests

   [junit4] 

   [junit4] Suite: org.apache.lucene.search.TestMultiTermConstantScore

   [junit4] Completed [279/437] on J2 in 0.54s, 7 tests

   [junit4] 

   [junit4] Suite: org.apache.lucene.index.TestPerSegmentDeletes

   [junit4] Completed [280/437] on J1 in 0.04s, 1 test

   [junit4] 

   [junit4] Suite: org.apache.lucene.index.TestUniqueTermCount

   [junit4] Completed [281/437] on J1 in 0.03s, 1 test

   [junit4] 

   [junit4] Suite: org.apache.lucene.search.TestBooleanQuery

   [junit4] Completed [282/437] on J1 in 0.27s, 22 tests

   [junit4] 

   [junit4] Suite: org.apache.lucene.search.TestMultiValuedNumericRangeQuery

   [junit4] Completed [283/437] on J2 in 0.85s, 1 test

   [junit4] 

   [junit4] Suite: org.apache.lucene.search.TestComplexExplanationsOfNonMatches

   [junit4] Completed [284/437] on J1 in 0.05s, 21 tests

   [junit4] 

   [junit4] Suite: org.apache.lucene.search.TestSortRandom

   [junit4] Completed [285/437] on J1 in 0.36s, 2 tests

   [junit4] 

   [junit4] Suite: org.apache.lucene.index.TestParallelReaderEmptyIndex

   [junit4] Completed [286/437] on J1 in 0.02s, 2 tests

   [junit4] 

   [junit4] Suite: org.apache.lucene.util.TestUnicodeUtil

   [junit4] Completed [287/437] on J2 in 0.81s, 5 tests

   [junit4] 

   [junit4] Suite: org.apache.lucene.index.TestMaxTermFrequency

   [junit4] Completed [288/437] on J1 in 0.14s, 1 test

   [junit4] 

   [junit4] Suite: org.apache.lucene.search.TestTopFieldCollector

   [junit4] Completed [289/437] on J2 in 0.11s, 7 tests

   [junit4] 

   [junit4] Suite: org.apache.lucene.index.TestIndexableField

   [junit4] Completed [290/437] on J2 in 0.74s, 2 tests

   [junit4] 

   [junit4] Suite: org.apache.lucene.util.TestSentinelIntSet

   [junit4] Completed [291/437] on J2 in 0.17s, 2 tests

   [junit4] 

   [junit4] Suite: org.apache.lucene.store.TestFileSwitchDirectory

   [junit4] IGNOR/A 0.00s J1 | TestFileSwitchDirectory.testFsyncDoesntCreateNewFiles

   [junit4]    > Assumption #1: test only works for FSDirectory subclasses

   [junit4] IGNOR/A 0.01s J1 | TestFileSwitchDirectory.testPendingDeletions

   [junit4]    > Assumption #1: we can only install VirusCheckingFS on an FSDirectory

   [junit4] Completed [292/437] on J1 in 1.23s, 45 tests, 2 skipped

   [junit4] 

   [junit4] Suite: org.apache.lucene.index.TestCheckIndex

   [junit4] Completed [293/437] on J1 in 0.36s, 5 tests

   [junit4] 

   [junit4] Suite: org.apache.lucene.index.TestPayloadsOnVectors

   [junit4] Completed [294/437] on J1 in 0.03s, 3 tests

   [junit4] 

   [junit4] Suite: org.apache.lucene.search.TestBooleanQueryVisitSubscorers

   [junit4] Completed [295/437] on J1 in 0.03s, 5 tests

   [junit4] 

   [junit4] Suite: org.apache.lucene.store.TestDirectory

   [junit4] Completed [296/437] on J2 in 1.12s, 3 tests

   [junit4] 

   [junit4] Suite: org.apache.lucene.util.automaton.TestCompiledAutomaton

   [junit4] Completed [297/437] on J2 in 0.22s, 6 tests

   [junit4] 

   [junit4] Suite: org.apache.lucene.search.TestMatchAllDocsQuery

   [junit4] Completed [298/437] on J2 in 0.01s, 2 tests

   [junit4] 

   [junit4] Suite: org.apache.lucene.index.TestIndexFileDeleter

   [junit4] Completed [299/437] on J1 in 0.90s, 10 tests

   [junit4] 

   [junit4] Suite: org.apache.lucene.index.TestParallelTermEnum

   [junit4] Completed [300/437] on J1 in 0.01s, 1 test

   [junit4] 

   [junit4] Suite: org.apache.lucene.index.TestBinaryTerms

   [junit4] Completed [301/437] on J1 in 0.09s, 2 tests

   [junit4] 

   [junit4] Suite: org.apache.lucene.search.TestConjunctions

   [junit4] Completed [302/437] on J1 in 0.01s, 1 test

   [junit4] 

   [junit4] Suite: org.apache.lucene.search.TestMultiTermQueryRewrites

   [junit4] Completed [303/437] on J1 in 0.02s, 3 tests

   [junit4] 

   [junit4] Suite: org.apache.lucene.search.TestPositionIncrement

   [junit4] Completed [304/437] on J1 in 0.02s, 2 tests

   [junit4] 

   [junit4] Suite: org.apache.lucene.search.TestSimilarity

   [junit4] Completed [305/437] on J1 in 0.02s, 1 test

   [junit4] 

   [junit4] Suite: org.apache.lucene.search.TestPrefixQuery

   [junit4] Completed [306/437] on J2 in 1.90s, 3 tests

   [junit4] 

   [junit4] Suite: org.apache.lucene.util.TestVirtualMethod

   [junit4] Completed [307/437] on J2 in 0.01s, 2 tests

   [junit4] 

   [junit4] Suite: org.apache.lucene.search.spans.TestSpanExplanationsOfNonMatches

   [junit4] Completed [308/437] on J1 in 0.03s, 30 tests

   [junit4] 

   [junit4] Suite: org.apache.lucene.util.TestSmallFloat

   [junit4] Completed [309/437] on J2 in 0.14s, 2 tests

   [junit4] 

   [junit4] Suite: org.apache.lucene.analysis.TestNumericTokenStream

   [junit4] Completed [310/437] on J1 in 0.02s, 6 tests

   [junit4] 

   [junit4] Suite: org.apache.lucene.index.TestFilterLeafReader

   [junit4] Completed [311/437] on J2 in 0.02s, 3 tests

   [junit4] 

   [junit4] Suite: org.apache.lucene.TestSearch

   [junit4] Completed [312/437] on J1 in 0.02s, 2 tests

   [junit4] 

   [junit4] Suite: org.apache.lucene.analysis.TestCachingTokenFilter

   [junit4] Completed [313/437] on J2 in 0.02s, 2 tests

   [junit4] 

   [junit4] Suite: org.apache.lucene.util.TestFilterIterator

   [junit4] Completed [314/437] on J1 in 0.02s, 8 tests

   [junit4] 

   [junit4] Suite: org.apache.lucene.util.TestCharsRef

   [junit4] Completed [315/437] on J2 in 0.03s, 5 tests

   [junit4] 

   [junit4] Suite: org.apache.lucene.index.Test2BPostings

   [junit4] IGNOR/A 0.00s J1 | Test2BPostings.test

   [junit4]    > Assumption #1: 'nightly' test group is disabled (@Nightly())

   [junit4] Completed [316/437] on J1 in 0.00s, 1 test, 1 skipped

   [junit4] 

   [junit4] Suite: org.apache.lucene.document.TestBinaryDocument

   [junit4] Completed [317/437] on J2 in 0.01s, 1 test

   [junit4] 

   [junit4] Suite: org.apache.lucene.search.TestAutomatonQueryUnicode

   [junit4] Completed [318/437] on J1 in 0.01s, 1 test

   [junit4] 

   [junit4] Suite: org.apache.lucene.util.TestAttributeSource

   [junit4] Completed [319/437] on J2 in 0.01s, 7 tests

   [junit4] 

   [junit4] Suite: org.apache.lucene.search.TestTotalHitCountCollector

   [junit4] Completed [320/437] on J1 in 0.01s, 1 test

   [junit4] 

   [junit4] Suite: org.apache.lucene.util.TestRecyclingByteBlockAllocator

   [junit4] Completed [321/437] on J2 in 0.02s, 3 tests

   [junit4] 

   [junit4] Suite: org.apache.lucene.search.spans.TestSpanFirstQuery

   [junit4] Completed [322/437] on J1 in 0.01s, 1 test

   [junit4] 

   [junit4] Suite: org.apache.lucene.index.TestNoMergePolicy

   [junit4] Completed [323/437] on J2 in 0.02s, 4 tests

   [junit4] 

   [junit4] Suite: org.apache.lucene.index.TestNoMergeScheduler

   [junit4] Completed [324/437] on J1 in 0.01s, 3 tests

   [junit4] 

   [junit4] Suite: org.apache.lucene.util.TestByteBlockPool

   [junit4] Completed [325/437] on J2 in 0.07s, 1 test

   [junit4] 

   [junit4] Suite: org.apache.lucene.util.TestBytesRef

   [junit4] Completed [326/437] on J1 in 0.01s, 3 tests

   [junit4] 

   [junit4] Suite: org.apache.lucene.TestDemo

   [junit4] Completed [327/437] on J2 in 0.01s, 1 test

   [junit4] 

   [junit4] Suite: org.apache.lucene.analysis.TestCharFilter

   [junit4] Completed [328/437] on J1 in 0.01s, 4 tests

   [junit4] 

   [junit4] Suite: org.apache.lucene.search.TestNot

   [junit4] Completed [329/437] on J2 in 0.01s, 1 test

   [junit4] 

   [junit4] Suite: org.apache.lucene.index.TestCodecHoldsOpenFiles

   [junit4] Completed [330/437] on J1 in 0.02s, 1 test

   [junit4] 

   [junit4] Suite: org.apache.lucene.index.TestReaderClosed

   [junit4] Completed [331/437] on J2 in 0.03s, 2 tests

   [junit4] 

   [junit4] Suite: org.apache.lucene.search.MultiCollectorTest

   [junit4] Completed [332/437] on J1 in 0.01s, 4 tests

   [junit4] 

   [junit4] Suite: org.apache.lucene.search.TestScoreCachingWrappingScorer

   [junit4] Completed [333/437] on J2 in 0.01s, 1 test

   [junit4] 

   [junit4] Suite: org.apache.lucene.analysis.tokenattributes.TestSimpleAttributeImpl

   [junit4] Completed [334/437] on J1 in 0.01s, 1 test

   [junit4] 

   [junit4] Suite: org.apache.lucene.index.TestIndexCommit

   [junit4] Completed [335/437] on J2 in 0.01s, 1 test

   [junit4] 

   [junit4] Suite: org.apache.lucene.index.TestTerm

   [junit4] Completed [336/437] on J1 in 0.01s, 1 test

   [junit4] 

   [junit4] Suite: org.apache.lucene.index.Test2BPostingsBytes

   [junit4] IGNOR/A 0.00s J2 | Test2BPostingsBytes.test

   [junit4]    > Assumption #1: 'monster' test group is disabled (@Monster(value=takes ~20GB-30GB of space and 10 minutes))

   [junit4] Completed [337/437] on J2 in 0.00s, 1 test, 1 skipped

   [junit4] 

   [junit4] Suite: org.apache.lucene.index.TestNewestSegment

   [junit4] Completed [338/437] on J1 in 0.01s, 1 test

   [junit4] 

   [junit4] Suite: org.apache.lucene.store.TestByteArrayDataInput

   [junit4] Completed [339/437] on J2 in 0.01s, 1 test

   [junit4] 

   [junit4] Suite: org.apache.lucene.index.Test2BNumericDocValues

   [junit4] IGNOR/A 0.00s J1 | Test2BNumericDocValues.testNumerics

   [junit4]    > Assumption #1: 'monster' test group is disabled (@Monster(value=takes ~ 2 hours if the heap is 5gb))

   [junit4] Completed [340/437] on J1 in 0.00s, 1 test, 1 skipped

   [junit4] 

   [junit4] Suite: org.apache.lucene.analysis.TestCharArraySet

   [junit4] Completed [342/437] on J1 in 0.02s, 15 tests

   [junit4] 

   [junit4] Suite: org.apache.lucene.analysis.TestReusableStringReader

   [junit4] Completed [343/437] on J2 in 0.01s, 1 test

   [junit4] 

   [junit4] Suite: org.apache.lucene.analysis.TestStopFilter

   [junit4] Completed [344/437] on J1 in 0.01s, 4 tests

   [junit4] 

   [junit4] Suite: org.apache.lucene.analysis.tokenattributes.TestBytesRefAttImpl

   [junit4] Completed [345/437] on J2 in 0.01s, 1 test

   [junit4] 

   [junit4] Suite: org.apache.lucene.codecs.TestCodecUtil

   [junit4] Completed [346/437] on J2 in 0.03s, 15 tests

   [junit4] 

   [junit4] Suite: org.apache.lucene.codecs.TestCodecLoadingDeadlock

   [junit4] Completed [347/437] on J1 in 0.29s, 1 test

   [junit4] 

   [junit4] Suite: org.apache.lucene.codecs.lucene50.TestBlockPostingsFormat

   [junit4] Completed [348/437] on J1 in 6.39s, 26 tests

   [junit4] 

   [junit4] Suite: org.apache.lucene.codecs.lucene50.TestBlockPostingsFormat2

   [junit4] Completed [349/437] on J1 in 1.33s, 4 tests

   [junit4] 

   [junit4] Suite: org.apache.lucene.codecs.lucene50.TestForUtil

   [junit4] Completed [350/437] on J1 in 0.09s, 1 test

   [junit4] 

   [junit4] Suite: org.apache.lucene.index.TestTermsEnum

   [junit4] Completed [351/437] on J0 in 70.72s, 11 tests

   [junit4] 

   [junit4] Suite: org.apache.lucene.codecs.lucene50.TestLucene50FieldInfoFormat

   [junit4] Completed [352/437] on J0 in 5.30s, 11 tests

   [junit4] 

   [junit4] Suite: org.apache.lucene.codecs.lucene50.TestLucene50StoredFieldsFormat

   [junit4] IGNOR/A 0.00s J0 | TestLucene50StoredFieldsFormat.testBigDocuments

   [junit4]    > Assumption #1: 'nightly' test group is disabled (@Nightly())

   [junit4] Completed [353/437] on J0 in 1.40s, 17 tests, 1 skipped

   [junit4] 

   [junit4] Suite: org.apache.lucene.codecs.lucene50.TestLucene50CompoundFormat

   [junit4] Completed [354/437] on J1 in 10.51s, 26 tests

   [junit4] 

   [junit4] Suite: org.apache.lucene.codecs.lucene50.TestLucene50StoredFieldsFormatHighCompression

   [junit4] IGNOR/A 0.00s J0 | TestLucene50StoredFieldsFormatHighCompression.testBigDocuments

   [junit4]    > Assumption #1: 'nightly' test group is disabled (@Nightly())

   [junit4] Completed [355/437] on J0 in 6.05s, 19 tests, 1 skipped

   [junit4] 

   [junit4] Suite: org.apache.lucene.codecs.lucene53.TestLucene53NormsFormat

   [junit4] IGNOR/A 0.01s J0 | TestLucene53NormsFormat.testMergeStability

   [junit4]    > Assumption #1: The MockRandom PF randomizes content on the fly, so we can't check it

   [junit4] IGNOR/A 0.00s J0 | TestLucene53NormsFormat.testNCommonBig

   [junit4]    > Assumption #1: 'nightly' test group is disabled (@Nightly())

   [junit4] Completed [356/437] on J0 in 6.60s, 17 tests, 2 skipped

   [junit4] 

   [junit4] Suite: org.apache.lucene.codecs.lucene50.TestLucene50TermVectorsFormat

   [junit4] Completed [357/437] on J1 in 18.47s, 17 tests

   [junit4] 

   [junit4] Suite: org.apache.lucene.codecs.lucene60.TestLucene60PointsFormat

   [junit4] IGNOR/A 0.00s J1 | TestLucene60PointsFormat.testRandomBinaryBig

   [junit4]    > Assumption #1: 'nightly' test group is disabled (@Nightly())

   [junit4] IGNOR/A 0.00s J1 | TestLucene60PointsFormat.testMergeStability

   [junit4]    > Assumption #1: merge is not stable

   [junit4] Completed [358/437] on J1 in 5.22s, 17 tests, 2 skipped

   [junit4] 

   [junit4] Suite: org.apache.lucene.geo.TestGeoEncodingUtils

   [junit4] Completed [359/437] on J1 in 0.89s, 3 tests

   [junit4] 

   [junit4] HEARTBEAT J2 PID(10230@localhost): 2016-07-30T04:13:51, stalled for 67.9s at: TestGrowableByteArrayDataOutput.testWriteLargeStrings

   [junit4] Suite: org.apache.lucene.geo.TestGeoUtils

   [junit4] Completed [360/437] on J1 in 28.67s, 6 tests

   [junit4] 

   [junit4] Suite: org.apache.lucene.geo.TestPolygon

   [junit4] Completed [361/437] on J1 in 0.03s, 15 tests

   [junit4] 

   [junit4] Suite: org.apache.lucene.codecs.compressing.TestGrowableByteArrayDataOutput

   [junit4] Completed [362/437] on J2 in 96.31s, 2 tests

   [junit4] 

   [junit4] Suite: org.apache.lucene.index.Test2BPoints

   [junit4] IGNOR/A 0.00s J2 | Test2BPoints.test1D

   [junit4]    > Assumption #1: 'monster' test group is disabled (@Monster(value=takes at least 4 hours and consumes many GB of temp disk space))

   [junit4] IGNOR/A 0.00s J2 | Test2BPoints.test2D

   [junit4]    > Assumption #1: 'monster' test group is disabled (@Monster(value=takes at least 4 hours and consumes many GB of temp disk space))

   [junit4] Completed [363/437] on J2 in 0.00s, 2 tests, 2 skipped

   [junit4] 

   [junit4] Suite: org.apache.lucene.index.Test2BSortedDocValuesFixedSorted

   [junit4] IGNOR/A 0.00s J2 | Test2BSortedDocValuesFixedSorted.testFixedSorted

   [junit4]    > Assumption #1: 'monster' test group is disabled (@Monster(value=Takes ~ 6 hours if the heap is 5gb))

   [junit4] Completed [364/437] on J2 in 0.00s, 1 test, 1 skipped

   [junit4] 

   [junit4] Suite: org.apache.lucene.index.TestAllFilesCheckIndexHeader

   [junit4] Completed [365/437] on J2 in 0.30s, 1 test

   [junit4] 

   [junit4] Suite: org.apache.lucene.index.TestAllFilesDetectTruncation

   [junit4] Completed [366/437] on J2 in 0.25s, 1 test

   [junit4] 

   [junit4] Suite: org.apache.lucene.index.TestAllFilesHaveChecksumFooter

   [junit4] Completed [367/437] on J2 in 0.19s, 1 test

   [junit4] 

   [junit4] Suite: org.apache.lucene.index.TestDemoParallelLeafReader

   [junit4] Completed [368/437] on J2 in 4.48s, 5 tests

   [junit4] 

   [junit4] Suite: org.apache.lucene.geo.TestPolygon2D

   [junit4] Completed [369/437] on J1 in 29.78s, 10 tests

   [junit4] 

   [junit4] Suite: org.apache.lucene.index.TestDocValues

   [junit4] Completed [370/437] on J2 in 0.04s, 7 tests

   [junit4] 

   [junit4] Suite: org.apache.lucene.index.TestFilterDirectoryReader

   [junit4] Completed [371/437] on J1 in 0.02s, 1 test

   [junit4] 

   [junit4] Suite: org.apache.lucene.index.TestIndexWriterFromReader

   [junit4] Completed [372/437] on J1 in 0.18s, 12 tests

   [junit4] 

   [junit4] Suite: org.apache.lucene.index.TestIndexWriterThreadsToSegments

   [junit4] Completed [373/437] on J1 in 0.98s, 4 tests

   [junit4] 

   [junit4] Suite: org.apache.lucene.index.TestIndexWriterExceptions2

   [junit4] Completed [374/437] on J2 in 10.62s, 1 test

   [junit4] 

   [junit4] Suite: org.apache.lucene.index.TestLogMergePolicy

   [junit4] Completed [375/437] on J2 in 0.02s, 2 tests

   [junit4] 

   [junit4] Suite: org.apache.lucene.index.TestMergePolicyWrapper

   [junit4] Completed [376/437] on J2 in 0.01s, 1 test

   [junit4] 

   [junit4] Suite: org.apache.lucene.index.TestMultiTermsEnum

   [junit4] Completed [377/437] on J2 in 0.01s, 1 test

   [junit4] 

   [junit4] Suite: org.apache.lucene.index.TestPointValues

   [junit4] Completed [378/437] on J2 in 3.19s, 32 tests

   [junit4] 

   [junit4] Suite: org.apache.lucene.index.TestReadOnlyIndex

   [junit4] Completed [379/437] on J2 in 0.26s, 1 test

   [junit4] 

   [junit4] Suite: org.apache.lucene.index.TestSegmentInfos

   [junit4] Completed [380/437] on J2 in 0.01s, 3 tests

   [junit4] 

   [junit4] Suite: org.apache.lucene.index.TestSortedSetDocValues

   [junit4] Completed [381/437] on J2 in 0.02s, 1 test

   [junit4] 

   [junit4] Suite: org.apache.lucene.index.TestStressDeletes

   [junit4] Completed [382/437] on J2 in 0.44s, 1 test

   [junit4] 

   [junit4] Suite: org.apache.lucene.index.TestSwappedIndexFiles

   [junit4] Completed [383/437] on J2 in 0.13s, 1 test

   [junit4] 

   [junit4] Suite: org.apache.lucene.index.TestTerms

   [junit4] Completed [384/437] on J2 in 0.44s, 8 tests

   [junit4] 

   [junit4] Suite: org.apache.lucene.search.TestApproximationSearchEquivalence

   [junit4] Completed [385/437] on J2 in 0.44s, 10 tests

   [junit4] 

   [junit4] Suite: org.apache.lucene.search.TestBooleanRewrites

   [junit4] Completed [386/437] on J2 in 0.21s, 7 tests

   [junit4] 

   [junit4] Suite: org.apache.lucene.search.TestControlledRealTimeReopenThread

   [junit4] IGNOR/A 0.00s J2 | TestControlledRealTimeReopenThread.testCRTReopen

   [junit4]    > Assumption #1: 'awaitsfix' test group is disabled (@AwaitsFix(bugUrl=https://issues.apache.org/jira/browse/LUCENE-5737))

   [junit4] Completed [387/437] on J2 in 4.43s, 6 tests, 1 skipped

   [junit4] 

   [junit4] Suite: org.apache.lucene.search.TestDocValuesRewriteMethod

   [junit4] Completed [388/437] on J2 in 2.89s, 2 tests

   [junit4] 

   [junit4] Suite: org.apache.lucene.search.TestEarlyTermination

   [junit4] Completed [389/437] on J2 in 0.02s, 1 test

   [junit4] 

   [junit4] Suite: org.apache.lucene.search.TestFieldValueQuery

   [junit4] Completed [390/437] on J2 in 2.20s, 6 tests

   [junit4] 

   [junit4] Suite: org.apache.lucene.search.TestIndexSearcher

   [junit4] Completed [391/437] on J2 in 0.08s, 5 tests

   [junit4] 

   [junit4] Suite: org.apache.lucene.search.TestLRUQueryCache

   [junit4] Completed [392/437] on J2 in 4.29s, 18 tests

   [junit4] 

   [junit4] Suite: org.apache.lucene.search.TestMatchNoDocsQuery

   [junit4] Completed [393/437] on J2 in 0.02s, 3 tests

   [junit4] 

   [junit4] Suite: org.apache.lucene.search.TestMinShouldMatch2

   [junit4] Completed [394/437] on J2 in 6.72s, 6 tests

   [junit4] 

   [junit4] Suite: org.apache.lucene.sea

[...truncated too long message...]

ome/jenkins/workspace/Lucene-Solr-master-Linux/lucene/top-level-ivy-settings.xml


resolve:


ivy-availability-check:


ivy-fail:


ivy-configure:

[ivy:configure] :: loading settings :: file = /home/jenkins/workspace/Lucene-Solr-master-Linux/lucene/top-level-ivy-settings.xml


resolve:


ivy-availability-check:


ivy-fail:


ivy-configure:

[ivy:configure] :: loading settings :: file = /home/jenkins/workspace/Lucene-Solr-master-Linux/lucene/top-level-ivy-settings.xml


resolve:


ivy-availability-check:


ivy-fail:


ivy-configure:

[ivy:configure] :: loading settings :: file = /home/jenkins/workspace/Lucene-Solr-master-Linux/lucene/top-level-ivy-settings.xml


resolve:


ivy-availability-check:


ivy-fail:


ivy-configure:

[ivy:configure] :: loading settings :: file = /home/jenkins/workspace/Lucene-Solr-master-Linux/lucene/top-level-ivy-settings.xml


resolve:


ivy-availability-check:


ivy-fail:


ivy-configure:

[ivy:configure] :: loading settings :: file = /home/jenkins/workspace/Lucene-Solr-master-Linux/lucene/top-level-ivy-settings.xml


resolve:


ivy-availability-check:


ivy-fail:


ivy-configure:

[ivy:configure] :: loading settings :: file = /home/jenkins/workspace/Lucene-Solr-master-Linux/lucene/top-level-ivy-settings.xml


resolve:


ivy-availability-check:


ivy-fail:


ivy-configure:

[ivy:configure] :: loading settings :: file = /home/jenkins/workspace/Lucene-Solr-master-Linux/lucene/top-level-ivy-settings.xml


resolve:


ivy-availability-check:


ivy-fail:


ivy-configure:

[ivy:configure] :: loading settings :: file = /home/jenkins/workspace/Lucene-Solr-master-Linux/lucene/top-level-ivy-settings.xml


resolve:


ivy-availability-check:


ivy-fail:


ivy-configure:

[ivy:configure] :: loading settings :: file = /home/jenkins/workspace/Lucene-Solr-master-Linux/lucene/top-level-ivy-settings.xml


resolve:


ivy-availability-check:


ivy-fail:


ivy-configure:

[ivy:configure] :: loading settings :: file = /home/jenkins/workspace/Lucene-Solr-master-Linux/lucene/top-level-ivy-settings.xml


resolve:


ivy-availability-check:


ivy-fail:


ivy-configure:

[ivy:configure] :: loading settings :: file = /home/jenkins/workspace/Lucene-Solr-master-Linux/lucene/top-level-ivy-settings.xml


resolve:


ivy-availability-check:


ivy-fail:


ivy-configure:

[ivy:configure] :: loading settings :: file = /home/jenkins/workspace/Lucene-Solr-master-Linux/lucene/top-level-ivy-settings.xml


resolve:


ivy-availability-check:


ivy-fail:


ivy-configure:

[ivy:configure] :: loading settings :: file = /home/jenkins/workspace/Lucene-Solr-master-Linux/lucene/top-level-ivy-settings.xml


common.resolve:


resolve:


ivy-availability-check:


ivy-fail:


ivy-configure:

[ivy:configure] :: loading settings :: file = /home/jenkins/workspace/Lucene-Solr-master-Linux/lucene/top-level-ivy-settings.xml


resolve:


ivy-availability-check:


ivy-fail:


ivy-configure:

[ivy:configure] :: loading settings :: file = /home/jenkins/workspace/Lucene-Solr-master-Linux/lucene/top-level-ivy-settings.xml


resolve:


ivy-availability-check:


ivy-fail:


ivy-configure:

[ivy:configure] :: loading settings :: file = /home/jenkins/workspace/Lucene-Solr-master-Linux/lucene/top-level-ivy-settings.xml


resolve:


ivy-availability-check:


ivy-fail:


ivy-configure:

[ivy:configure] :: loading settings :: file = /home/jenkins/workspace/Lucene-Solr-master-Linux/lucene/top-level-ivy-settings.xml


resolve:


ivy-availability-check:


ivy-fail:


ivy-configure:

[ivy:configure] :: loading settings :: file = /home/jenkins/workspace/Lucene-Solr-master-Linux/lucene/top-level-ivy-settings.xml


resolve:


jar-checksums:

    [mkdir] Created dir: /home/jenkins/workspace/Lucene-Solr-master-Linux/lucene/null338908867

     [copy] Copying 34 files to /home/jenkins/workspace/Lucene-Solr-master-Linux/lucene/null338908867

   [delete] Deleting directory /home/jenkins/workspace/Lucene-Solr-master-Linux/lucene/null338908867


resolve-example:


ivy-availability-check:


ivy-fail:


ivy-configure:

[ivy:configure] :: loading settings :: file = /home/jenkins/workspace/Lucene-Solr-master-Linux/lucene/top-level-ivy-settings.xml


resolve:


resolve-server:


ivy-availability-check:


ivy-fail:


ivy-fail:


ivy-configure:

[ivy:configure] :: loading settings :: file = /home/jenkins/workspace/Lucene-Solr-master-Linux/lucene/top-level-ivy-settings.xml


resolve:


resolve:


ivy-availability-check:


ivy-fail:


ivy-fail:


ivy-configure:

[ivy:configure] :: loading settings :: file = /home/jenkins/workspace/Lucene-Solr-master-Linux/lucene/top-level-ivy-settings.xml


resolve:


ivy-availability-check:


ivy-fail:


ivy-fail:


ivy-configure:

[ivy:configure] :: loading settings :: file = /home/jenkins/workspace/Lucene-Solr-master-Linux/lucene/top-level-ivy-settings.xml


resolve:


ivy-availability-check:


ivy-fail:


ivy-configure:

[ivy:configure] :: loading settings :: file = /home/jenkins/workspace/Lucene-Solr-master-Linux/lucene/top-level-ivy-settings.xml


resolve:


ivy-availability-check:


ivy-fail:


ivy-fail:


ivy-configure:

[ivy:configure] :: loading settings :: file = /home/jenkins/workspace/Lucene-Solr-master-Linux/lucene/top-level-ivy-settings.xml


resolve:


ivy-availability-check:


ivy-fail:


ivy-fail:


ivy-configure:

[ivy:configure] :: loading settings :: file = /home/jenkins/workspace/Lucene-Solr-master-Linux/lucene/top-level-ivy-settings.xml


resolve:


ivy-availability-check:


ivy-fail:


ivy-fail:


ivy-configure:

[ivy:configure] :: loading settings :: file = /home/jenkins/workspace/Lucene-Solr-master-Linux/lucene/top-level-ivy-settings.xml


resolve:


ivy-availability-check:


ivy-fail:


ivy-fail:


ivy-configure:

[ivy:configure] :: loading settings :: file = /home/jenkins/workspace/Lucene-Solr-master-Linux/lucene/top-level-ivy-settings.xml


resolve:


ivy-availability-check:


ivy-fail:


ivy-fail:


ivy-configure:

[ivy:configure] :: loading settings :: file = /home/jenkins/workspace/Lucene-Solr-master-Linux/lucene/top-level-ivy-settings.xml


resolve:


ivy-availability-check:


ivy-fail:


ivy-fail:


ivy-configure:

[ivy:configure] :: loading settings :: file = /home/jenkins/workspace/Lucene-Solr-master-Linux/lucene/top-level-ivy-settings.xml


resolve:


ivy-availability-check:


ivy-fail:


ivy-fail:


ivy-configure:

[ivy:configure] :: loading settings :: file = /home/jenkins/workspace/Lucene-Solr-master-Linux/lucene/top-level-ivy-settings.xml


resolve:


ivy-availability-check:


ivy-fail:


ivy-fail:


ivy-configure:

[ivy:configure] :: loading settings :: file = /home/jenkins/workspace/Lucene-Solr-master-Linux/lucene/top-level-ivy-settings.xml


resolve:


ivy-availability-check:


ivy-fail:


ivy-fail:


ivy-configure:

[ivy:configure] :: loading settings :: file = /home/jenkins/workspace/Lucene-Solr-master-Linux/lucene/top-level-ivy-settings.xml


resolve:


ivy-availability-check:


ivy-fail:


ivy-fail:


ivy-configure:

[ivy:configure] :: loading settings :: file = /home/jenkins/workspace/Lucene-Solr-master-Linux/lucene/top-level-ivy-settings.xml


resolve:


ivy-availability-check:


ivy-fail:


ivy-fail:


ivy-configure:

[ivy:configure] :: loading settings :: file = /home/jenkins/workspace/Lucene-Solr-master-Linux/lucene/top-level-ivy-settings.xml


resolve:


ivy-availability-check:


ivy-fail:


ivy-fail:


ivy-configure:

[ivy:configure] :: loading settings :: file = /home/jenkins/workspace/Lucene-Solr-master-Linux/lucene/top-level-ivy-settings.xml


resolve:


jar-checksums:

    [mkdir] Created dir: /home/jenkins/workspace/Lucene-Solr-master-Linux/solr/null473916063

     [copy] Copying 266 files to /home/jenkins/workspace/Lucene-Solr-master-Linux/solr/null473916063

   [delete] Deleting directory /home/jenkins/workspace/Lucene-Solr-master-Linux/solr/null473916063


check-working-copy:

[ivy:cachepath] :: resolving dependencies :: org.eclipse.jgit#org.eclipse.jgit-caller;working

[ivy:cachepath] 	confs: [default]

[ivy:cachepath] 	found org.eclipse.jgit#org.eclipse.jgit;4.4.1.201607150455-r in public

[ivy:cachepath] 	found com.jcraft#jsch;0.1.53 in public

[ivy:cachepath] 	found com.googlecode.javaewah#JavaEWAH;0.7.9 in public

[ivy:cachepath] 	found org.apache.httpcomponents#httpclient;4.3.6 in public

[ivy:cachepath] 	found org.apache.httpcomponents#httpcore;4.3.3 in public

[ivy:cachepath] 	found commons-logging#commons-logging;1.1.3 in public

[ivy:cachepath] 	found commons-codec#commons-codec;1.6 in public

[ivy:cachepath] 	found org.slf4j#slf4j-api;1.7.2 in public

[ivy:cachepath] :: resolution report :: resolve 23ms :: artifacts dl 1ms

	---------------------------------------------------------------------

	|                  |            modules            ||   artifacts   |

	|       conf       | number| search|dwnlded|evicted|| number|dwnlded|

	---------------------------------------------------------------------

	|      default     |   8   |   0   |   0   |   0   ||   8   |   0   |

	---------------------------------------------------------------------

[wc-checker] Initializing working copy...

[wc-checker] SLF4J: Failed to load class "org.slf4j.impl.StaticLoggerBinder".

[wc-checker] SLF4J: Defaulting to no-operation (NOP) logger implementation

[wc-checker] SLF4J: See http://www.slf4j.org/codes.html#StaticLoggerBinder for further details.

[wc-checker] Checking working copy status...


-jenkins-base:


BUILD SUCCESSFUL

Total time: 63 minutes 48 seconds

Archiving artifacts

WARN: No artifacts found that match the file pattern "**/*.events,heapdumps/**,**/*_pid*.log". Configuration error?

WARN: no matches found within 10000

[WARNINGS] Parsing warnings in console log with parser Java Compiler (javac)

[WARNINGS] Computing warning deltas based on reference build #17405

Recording test results

Build step 'Publish JUnit test result report' changed build result to UNSTABLE

Email was triggered for: Unstable (Test Failures)

Sending email for trigger: Unstable (Test Failures)




Mime
View raw message