lucene-dev mailing list archives

Site index · List index
Message view « Date » · « Thread »
Top « Date » · « Thread »
From Apache Jenkins Server <jenk...@builds.apache.org>
Subject [JENKINS] Lucene-Solr-NightlyTests-6.x - Build # 127 - Still Failing
Date Wed, 27 Jul 2016 10:40:41 GMT
Build: https://builds.apache.org/job/Lucene-Solr-NightlyTests-6.x/127/

2 tests failed.
FAILED:  org.apache.solr.cloud.LeaderFailoverAfterPartitionTest.test

Error Message:
No live SolrServers available to handle this request:[http://127.0.0.1:38909/c8n_1x3_lf_shard1_replica2]

Stack Trace:
org.apache.solr.client.solrj.impl.CloudSolrClient$RouteException: No live SolrServers available to handle this request:[http://127.0.0.1:38909/c8n_1x3_lf_shard1_replica2]
	at __randomizedtesting.SeedInfo.seed([10ABF5368D693666:98FFCAEC23955B9E]:0)
	at org.apache.solr.client.solrj.impl.CloudSolrClient.directUpdate(CloudSolrClient.java:760)
	at org.apache.solr.client.solrj.impl.CloudSolrClient.sendRequest(CloudSolrClient.java:1172)
	at org.apache.solr.client.solrj.impl.CloudSolrClient.requestWithRetryOnStaleState(CloudSolrClient.java:1061)
	at org.apache.solr.client.solrj.impl.CloudSolrClient.request(CloudSolrClient.java:997)
	at org.apache.solr.client.solrj.SolrClient.request(SolrClient.java:1219)
	at org.apache.solr.cloud.HttpPartitionTest.sendDoc(HttpPartitionTest.java:592)
	at org.apache.solr.cloud.HttpPartitionTest.sendDoc(HttpPartitionTest.java:578)
	at org.apache.solr.cloud.LeaderFailoverAfterPartitionTest.testRf3WithLeaderFailover(LeaderFailoverAfterPartitionTest.java:174)
	at org.apache.solr.cloud.LeaderFailoverAfterPartitionTest.test(LeaderFailoverAfterPartitionTest.java:55)
	at sun.reflect.NativeMethodAccessorImpl.invoke0(Native Method)
	at sun.reflect.NativeMethodAccessorImpl.invoke(NativeMethodAccessorImpl.java:62)
	at sun.reflect.DelegatingMethodAccessorImpl.invoke(DelegatingMethodAccessorImpl.java:43)
	at java.lang.reflect.Method.invoke(Method.java:498)
	at com.carrotsearch.randomizedtesting.RandomizedRunner.invoke(RandomizedRunner.java:1764)
	at com.carrotsearch.randomizedtesting.RandomizedRunner$8.evaluate(RandomizedRunner.java:871)
	at com.carrotsearch.randomizedtesting.RandomizedRunner$9.evaluate(RandomizedRunner.java:907)
	at com.carrotsearch.randomizedtesting.RandomizedRunner$10.evaluate(RandomizedRunner.java:921)
	at org.apache.solr.BaseDistributedSearchTestCase$ShardsRepeatRule$ShardsFixedStatement.callStatement(BaseDistributedSearchTestCase.java:992)
	at org.apache.solr.BaseDistributedSearchTestCase$ShardsRepeatRule$ShardsStatement.evaluate(BaseDistributedSearchTestCase.java:967)
	at com.carrotsearch.randomizedtesting.rules.SystemPropertiesRestoreRule$1.evaluate(SystemPropertiesRestoreRule.java:57)
	at org.apache.lucene.util.TestRuleSetupTeardownChained$1.evaluate(TestRuleSetupTeardownChained.java:49)
	at org.apache.lucene.util.AbstractBeforeAfterRule$1.evaluate(AbstractBeforeAfterRule.java:45)
	at org.apache.lucene.util.TestRuleThreadAndTestName$1.evaluate(TestRuleThreadAndTestName.java:48)
	at org.apache.lucene.util.TestRuleIgnoreAfterMaxFailures$1.evaluate(TestRuleIgnoreAfterMaxFailures.java:64)
	at org.apache.lucene.util.TestRuleMarkFailure$1.evaluate(TestRuleMarkFailure.java:47)
	at com.carrotsearch.randomizedtesting.rules.StatementAdapter.evaluate(StatementAdapter.java:36)
	at com.carrotsearch.randomizedtesting.ThreadLeakControl$StatementRunner.run(ThreadLeakControl.java:367)
	at com.carrotsearch.randomizedtesting.ThreadLeakControl.forkTimeoutingTask(ThreadLeakControl.java:809)
	at com.carrotsearch.randomizedtesting.ThreadLeakControl$3.evaluate(ThreadLeakControl.java:460)
	at com.carrotsearch.randomizedtesting.RandomizedRunner.runSingleTest(RandomizedRunner.java:880)
	at com.carrotsearch.randomizedtesting.RandomizedRunner$5.evaluate(RandomizedRunner.java:781)
	at com.carrotsearch.randomizedtesting.RandomizedRunner$6.evaluate(RandomizedRunner.java:816)
	at com.carrotsearch.randomizedtesting.RandomizedRunner$7.evaluate(RandomizedRunner.java:827)
	at com.carrotsearch.randomizedtesting.rules.StatementAdapter.evaluate(StatementAdapter.java:36)
	at com.carrotsearch.randomizedtesting.rules.SystemPropertiesRestoreRule$1.evaluate(SystemPropertiesRestoreRule.java:57)
	at org.apache.lucene.util.AbstractBeforeAfterRule$1.evaluate(AbstractBeforeAfterRule.java:45)
	at com.carrotsearch.randomizedtesting.rules.StatementAdapter.evaluate(StatementAdapter.java:36)
	at org.apache.lucene.util.TestRuleStoreClassName$1.evaluate(TestRuleStoreClassName.java:41)
	at com.carrotsearch.randomizedtesting.rules.NoShadowingOrOverridesOnMethodsRule$1.evaluate(NoShadowingOrOverridesOnMethodsRule.java:40)
	at com.carrotsearch.randomizedtesting.rules.NoShadowingOrOverridesOnMethodsRule$1.evaluate(NoShadowingOrOverridesOnMethodsRule.java:40)
	at com.carrotsearch.randomizedtesting.rules.StatementAdapter.evaluate(StatementAdapter.java:36)
	at com.carrotsearch.randomizedtesting.rules.StatementAdapter.evaluate(StatementAdapter.java:36)
	at com.carrotsearch.randomizedtesting.rules.StatementAdapter.evaluate(StatementAdapter.java:36)
	at org.apache.lucene.util.TestRuleAssertionsRequired$1.evaluate(TestRuleAssertionsRequired.java:53)
	at org.apache.lucene.util.TestRuleMarkFailure$1.evaluate(TestRuleMarkFailure.java:47)
	at org.apache.lucene.util.TestRuleIgnoreAfterMaxFailures$1.evaluate(TestRuleIgnoreAfterMaxFailures.java:64)
	at org.apache.lucene.util.TestRuleIgnoreTestSuites$1.evaluate(TestRuleIgnoreTestSuites.java:54)
	at com.carrotsearch.randomizedtesting.rules.StatementAdapter.evaluate(StatementAdapter.java:36)
	at com.carrotsearch.randomizedtesting.ThreadLeakControl$StatementRunner.run(ThreadLeakControl.java:367)
	at java.lang.Thread.run(Thread.java:745)
Caused by: org.apache.solr.client.solrj.SolrServerException: No live SolrServers available to handle this request:[http://127.0.0.1:38909/c8n_1x3_lf_shard1_replica2]
	at org.apache.solr.client.solrj.impl.LBHttpSolrClient.request(LBHttpSolrClient.java:383)
	at org.apache.solr.client.solrj.impl.CloudSolrClient.lambda$directUpdate$0(CloudSolrClient.java:735)
	at java.util.concurrent.FutureTask.run(FutureTask.java:266)
	at org.apache.solr.common.util.ExecutorUtil$MDCAwareThreadPoolExecutor.lambda$execute$0(ExecutorUtil.java:229)
	at java.util.concurrent.ThreadPoolExecutor.runWorker(ThreadPoolExecutor.java:1142)
	at java.util.concurrent.ThreadPoolExecutor$Worker.run(ThreadPoolExecutor.java:617)
	... 1 more
Caused by: org.apache.solr.client.solrj.SolrServerException: Server refused connection at: http://127.0.0.1:38909/c8n_1x3_lf_shard1_replica2
	at org.apache.solr.client.solrj.impl.HttpSolrClient.executeMethod(HttpSolrClient.java:597)
	at org.apache.solr.client.solrj.impl.HttpSolrClient.request(HttpSolrClient.java:259)
	at org.apache.solr.client.solrj.impl.HttpSolrClient.request(HttpSolrClient.java:248)
	at org.apache.solr.client.solrj.impl.LBHttpSolrClient.doRequest(LBHttpSolrClient.java:403)
	at org.apache.solr.client.solrj.impl.LBHttpSolrClient.request(LBHttpSolrClient.java:356)
	... 6 more
Caused by: java.net.ConnectException: Connection refused
	at java.net.PlainSocketImpl.socketConnect(Native Method)
	at java.net.AbstractPlainSocketImpl.doConnect(AbstractPlainSocketImpl.java:350)
	at java.net.AbstractPlainSocketImpl.connectToAddress(AbstractPlainSocketImpl.java:206)
	at java.net.AbstractPlainSocketImpl.connect(AbstractPlainSocketImpl.java:188)
	at java.net.SocksSocketImpl.connect(SocksSocketImpl.java:392)
	at java.net.Socket.connect(Socket.java:589)
	at org.apache.http.conn.scheme.PlainSocketFactory.connectSocket(PlainSocketFactory.java:117)
	at org.apache.http.impl.conn.DefaultClientConnectionOperator.openConnection(DefaultClientConnectionOperator.java:177)
	at org.apache.http.impl.conn.ManagedClientConnectionImpl.open(ManagedClientConnectionImpl.java:304)
	at org.apache.http.impl.client.DefaultRequestDirector.tryConnect(DefaultRequestDirector.java:611)
	at org.apache.http.impl.client.DefaultRequestDirector.execute(DefaultRequestDirector.java:446)
	at org.apache.http.impl.client.AbstractHttpClient.doExecute(AbstractHttpClient.java:882)
	at org.apache.http.impl.client.CloseableHttpClient.execute(CloseableHttpClient.java:82)
	at org.apache.http.impl.client.CloseableHttpClient.execute(CloseableHttpClient.java:107)
	at org.apache.http.impl.client.CloseableHttpClient.execute(CloseableHttpClient.java:55)
	at org.apache.solr.client.solrj.impl.HttpSolrClient.executeMethod(HttpSolrClient.java:495)
	... 10 more


FAILED:  org.apache.solr.handler.TestReqParamsAPI.test

Error Message:
Could not get expected value  'first' for path 'response/params/x/_appends_/add' full output: {   "responseHeader":{     "status":0,     "QTime":0},   "response":{     "znodeVersion":3,     "params":{       "x":{         "a":"A val",         "b":"B val",         "":{"v":0}},       "y":{         "p":"P val",         "q":"Q val",         "":{"v":2}}}}},  from server:  https://127.0.0.1:54160/hz_/w/collection1

Stack Trace:
java.lang.AssertionError: Could not get expected value  'first' for path 'response/params/x/_appends_/add' full output: {
  "responseHeader":{
    "status":0,
    "QTime":0},
  "response":{
    "znodeVersion":3,
    "params":{
      "x":{
        "a":"A val",
        "b":"B val",
        "":{"v":0}},
      "y":{
        "p":"P val",
        "q":"Q val",
        "":{"v":2}}}}},  from server:  https://127.0.0.1:54160/hz_/w/collection1
	at __randomizedtesting.SeedInfo.seed([10ABF5368D693666:98FFCAEC23955B9E]:0)
	at org.junit.Assert.fail(Assert.java:93)
	at org.junit.Assert.assertTrue(Assert.java:43)
	at org.apache.solr.core.TestSolrConfigHandler.testForResponseElement(TestSolrConfigHandler.java:481)
	at org.apache.solr.handler.TestReqParamsAPI.testReqParams(TestReqParamsAPI.java:230)
	at org.apache.solr.handler.TestReqParamsAPI.test(TestReqParamsAPI.java:61)
	at sun.reflect.NativeMethodAccessorImpl.invoke0(Native Method)
	at sun.reflect.NativeMethodAccessorImpl.invoke(NativeMethodAccessorImpl.java:62)
	at sun.reflect.DelegatingMethodAccessorImpl.invoke(DelegatingMethodAccessorImpl.java:43)
	at java.lang.reflect.Method.invoke(Method.java:498)
	at com.carrotsearch.randomizedtesting.RandomizedRunner.invoke(RandomizedRunner.java:1764)
	at com.carrotsearch.randomizedtesting.RandomizedRunner$8.evaluate(RandomizedRunner.java:871)
	at com.carrotsearch.randomizedtesting.RandomizedRunner$9.evaluate(RandomizedRunner.java:907)
	at com.carrotsearch.randomizedtesting.RandomizedRunner$10.evaluate(RandomizedRunner.java:921)
	at org.apache.solr.BaseDistributedSearchTestCase$ShardsRepeatRule$ShardsFixedStatement.callStatement(BaseDistributedSearchTestCase.java:992)
	at org.apache.solr.BaseDistributedSearchTestCase$ShardsRepeatRule$ShardsStatement.evaluate(BaseDistributedSearchTestCase.java:967)
	at com.carrotsearch.randomizedtesting.rules.SystemPropertiesRestoreRule$1.evaluate(SystemPropertiesRestoreRule.java:57)
	at org.apache.lucene.util.TestRuleSetupTeardownChained$1.evaluate(TestRuleSetupTeardownChained.java:49)
	at org.apache.lucene.util.AbstractBeforeAfterRule$1.evaluate(AbstractBeforeAfterRule.java:45)
	at org.apache.lucene.util.TestRuleThreadAndTestName$1.evaluate(TestRuleThreadAndTestName.java:48)
	at org.apache.lucene.util.TestRuleIgnoreAfterMaxFailures$1.evaluate(TestRuleIgnoreAfterMaxFailures.java:64)
	at org.apache.lucene.util.TestRuleMarkFailure$1.evaluate(TestRuleMarkFailure.java:47)
	at com.carrotsearch.randomizedtesting.rules.StatementAdapter.evaluate(StatementAdapter.java:36)
	at com.carrotsearch.randomizedtesting.ThreadLeakControl$StatementRunner.run(ThreadLeakControl.java:367)
	at com.carrotsearch.randomizedtesting.ThreadLeakControl.forkTimeoutingTask(ThreadLeakControl.java:809)
	at com.carrotsearch.randomizedtesting.ThreadLeakControl$3.evaluate(ThreadLeakControl.java:460)
	at com.carrotsearch.randomizedtesting.RandomizedRunner.runSingleTest(RandomizedRunner.java:880)
	at com.carrotsearch.randomizedtesting.RandomizedRunner$5.evaluate(RandomizedRunner.java:781)
	at com.carrotsearch.randomizedtesting.RandomizedRunner$6.evaluate(RandomizedRunner.java:816)
	at com.carrotsearch.randomizedtesting.RandomizedRunner$7.evaluate(RandomizedRunner.java:827)
	at com.carrotsearch.randomizedtesting.rules.StatementAdapter.evaluate(StatementAdapter.java:36)
	at com.carrotsearch.randomizedtesting.rules.SystemPropertiesRestoreRule$1.evaluate(SystemPropertiesRestoreRule.java:57)
	at org.apache.lucene.util.AbstractBeforeAfterRule$1.evaluate(AbstractBeforeAfterRule.java:45)
	at com.carrotsearch.randomizedtesting.rules.StatementAdapter.evaluate(StatementAdapter.java:36)
	at org.apache.lucene.util.TestRuleStoreClassName$1.evaluate(TestRuleStoreClassName.java:41)
	at com.carrotsearch.randomizedtesting.rules.NoShadowingOrOverridesOnMethodsRule$1.evaluate(NoShadowingOrOverridesOnMethodsRule.java:40)
	at com.carrotsearch.randomizedtesting.rules.NoShadowingOrOverridesOnMethodsRule$1.evaluate(NoShadowingOrOverridesOnMethodsRule.java:40)
	at com.carrotsearch.randomizedtesting.rules.StatementAdapter.evaluate(StatementAdapter.java:36)
	at com.carrotsearch.randomizedtesting.rules.StatementAdapter.evaluate(StatementAdapter.java:36)
	at com.carrotsearch.randomizedtesting.rules.StatementAdapter.evaluate(StatementAdapter.java:36)
	at org.apache.lucene.util.TestRuleAssertionsRequired$1.evaluate(TestRuleAssertionsRequired.java:53)
	at org.apache.lucene.util.TestRuleMarkFailure$1.evaluate(TestRuleMarkFailure.java:47)
	at org.apache.lucene.util.TestRuleIgnoreAfterMaxFailures$1.evaluate(TestRuleIgnoreAfterMaxFailures.java:64)
	at org.apache.lucene.util.TestRuleIgnoreTestSuites$1.evaluate(TestRuleIgnoreTestSuites.java:54)
	at com.carrotsearch.randomizedtesting.rules.StatementAdapter.evaluate(StatementAdapter.java:36)
	at com.carrotsearch.randomizedtesting.ThreadLeakControl$StatementRunner.run(ThreadLeakControl.java:367)
	at java.lang.Thread.run(Thread.java:745)




Build Log:
[...truncated 11289 lines...]
   [junit4] Suite: org.apache.solr.handler.TestReqParamsAPI
   [junit4]   2> Creating dataDir: /x1/jenkins/jenkins-slave/workspace/Lucene-Solr-NightlyTests-6.x/solr/build/solr-core/test/J0/temp/solr.handler.TestReqParamsAPI_10ABF5368D693666-001/init-core-data-001
   [junit4]   2> 176609 INFO  (SUITE-TestReqParamsAPI-seed#[10ABF5368D693666]-worker) [    ] o.a.s.SolrTestCaseJ4 Randomized ssl (true) and clientAuth (false) via: @org.apache.solr.util.RandomizeSSL(reason=, ssl=NaN, value=NaN, clientAuth=NaN)
   [junit4]   2> 176609 INFO  (SUITE-TestReqParamsAPI-seed#[10ABF5368D693666]-worker) [    ] o.a.s.BaseDistributedSearchTestCase Setting hostContext system property: /hz_/w
   [junit4]   2> 176614 INFO  (TEST-TestReqParamsAPI.test-seed#[10ABF5368D693666]) [    ] o.a.s.c.ZkTestServer STARTING ZK TEST SERVER
   [junit4]   2> 176614 INFO  (Thread-393) [    ] o.a.s.c.ZkTestServer client port:0.0.0.0/0.0.0.0:0
   [junit4]   2> 176615 INFO  (Thread-393) [    ] o.a.s.c.ZkTestServer Starting server
   [junit4]   2> 176714 INFO  (TEST-TestReqParamsAPI.test-seed#[10ABF5368D693666]) [    ] o.a.s.c.ZkTestServer start zk server on port:46324
   [junit4]   2> 176715 INFO  (TEST-TestReqParamsAPI.test-seed#[10ABF5368D693666]) [    ] o.a.s.c.c.SolrZkClient Using default ZkCredentialsProvider
   [junit4]   2> 176715 INFO  (TEST-TestReqParamsAPI.test-seed#[10ABF5368D693666]) [    ] o.a.s.c.c.ConnectionManager Waiting for client to connect to ZooKeeper
   [junit4]   2> 176722 INFO  (zkCallback-239-thread-1) [    ] o.a.s.c.c.ConnectionManager Watcher org.apache.solr.common.cloud.ConnectionManager@1667d566 name:ZooKeeperConnection Watcher:127.0.0.1:46324 got event WatchedEvent state:SyncConnected type:None path:null path:null type:None
   [junit4]   2> 176722 INFO  (TEST-TestReqParamsAPI.test-seed#[10ABF5368D693666]) [    ] o.a.s.c.c.ConnectionManager Client is connected to ZooKeeper
   [junit4]   2> 176722 INFO  (TEST-TestReqParamsAPI.test-seed#[10ABF5368D693666]) [    ] o.a.s.c.c.SolrZkClient Using default ZkACLProvider
   [junit4]   2> 176722 INFO  (TEST-TestReqParamsAPI.test-seed#[10ABF5368D693666]) [    ] o.a.s.c.c.SolrZkClient makePath: /solr
   [junit4]   2> 176725 INFO  (TEST-TestReqParamsAPI.test-seed#[10ABF5368D693666]) [    ] o.a.s.c.c.SolrZkClient Using default ZkCredentialsProvider
   [junit4]   2> 176725 INFO  (TEST-TestReqParamsAPI.test-seed#[10ABF5368D693666]) [    ] o.a.s.c.c.ConnectionManager Waiting for client to connect to ZooKeeper
   [junit4]   2> 176727 INFO  (zkCallback-240-thread-1) [    ] o.a.s.c.c.ConnectionManager Watcher org.apache.solr.common.cloud.ConnectionManager@44e927e3 name:ZooKeeperConnection Watcher:127.0.0.1:46324/solr got event WatchedEvent state:SyncConnected type:None path:null path:null type:None
   [junit4]   2> 176727 INFO  (TEST-TestReqParamsAPI.test-seed#[10ABF5368D693666]) [    ] o.a.s.c.c.ConnectionManager Client is connected to ZooKeeper
   [junit4]   2> 176727 INFO  (TEST-TestReqParamsAPI.test-seed#[10ABF5368D693666]) [    ] o.a.s.c.c.SolrZkClient Using default ZkACLProvider
   [junit4]   2> 176727 INFO  (TEST-TestReqParamsAPI.test-seed#[10ABF5368D693666]) [    ] o.a.s.c.c.SolrZkClient makePath: /collections/collection1
   [junit4]   2> 176728 INFO  (TEST-TestReqParamsAPI.test-seed#[10ABF5368D693666]) [    ] o.a.s.c.c.SolrZkClient makePath: /collections/collection1/shards
   [junit4]   2> 176730 INFO  (TEST-TestReqParamsAPI.test-seed#[10ABF5368D693666]) [    ] o.a.s.c.c.SolrZkClient makePath: /collections/control_collection
   [junit4]   2> 176731 INFO  (TEST-TestReqParamsAPI.test-seed#[10ABF5368D693666]) [    ] o.a.s.c.c.SolrZkClient makePath: /collections/control_collection/shards
   [junit4]   2> 176732 INFO  (TEST-TestReqParamsAPI.test-seed#[10ABF5368D693666]) [    ] o.a.s.c.AbstractZkTestCase put /x1/jenkins/jenkins-slave/workspace/Lucene-Solr-NightlyTests-6.x/solr/core/src/test-files/solr/collection1/conf/solrconfig-tlog.xml to /configs/conf1/solrconfig.xml
   [junit4]   2> 176732 INFO  (TEST-TestReqParamsAPI.test-seed#[10ABF5368D693666]) [    ] o.a.s.c.c.SolrZkClient makePath: /configs/conf1/solrconfig.xml
   [junit4]   2> 176735 INFO  (TEST-TestReqParamsAPI.test-seed#[10ABF5368D693666]) [    ] o.a.s.c.AbstractZkTestCase put /x1/jenkins/jenkins-slave/workspace/Lucene-Solr-NightlyTests-6.x/solr/core/src/test-files/solr/collection1/conf/schema.xml to /configs/conf1/schema.xml
   [junit4]   2> 176735 INFO  (TEST-TestReqParamsAPI.test-seed#[10ABF5368D693666]) [    ] o.a.s.c.c.SolrZkClient makePath: /configs/conf1/schema.xml
   [junit4]   2> 176736 INFO  (TEST-TestReqParamsAPI.test-seed#[10ABF5368D693666]) [    ] o.a.s.c.AbstractZkTestCase put /x1/jenkins/jenkins-slave/workspace/Lucene-Solr-NightlyTests-6.x/solr/core/src/test-files/solr/collection1/conf/solrconfig.snippet.randomindexconfig.xml to /configs/conf1/solrconfig.snippet.randomindexconfig.xml
   [junit4]   2> 176737 INFO  (TEST-TestReqParamsAPI.test-seed#[10ABF5368D693666]) [    ] o.a.s.c.c.SolrZkClient makePath: /configs/conf1/solrconfig.snippet.randomindexconfig.xml
   [junit4]   2> 176738 INFO  (TEST-TestReqParamsAPI.test-seed#[10ABF5368D693666]) [    ] o.a.s.c.AbstractZkTestCase put /x1/jenkins/jenkins-slave/workspace/Lucene-Solr-NightlyTests-6.x/solr/core/src/test-files/solr/collection1/conf/stopwords.txt to /configs/conf1/stopwords.txt
   [junit4]   2> 176738 INFO  (TEST-TestReqParamsAPI.test-seed#[10ABF5368D693666]) [    ] o.a.s.c.c.SolrZkClient makePath: /configs/conf1/stopwords.txt
   [junit4]   2> 176740 INFO  (TEST-TestReqParamsAPI.test-seed#[10ABF5368D693666]) [    ] o.a.s.c.AbstractZkTestCase put /x1/jenkins/jenkins-slave/workspace/Lucene-Solr-NightlyTests-6.x/solr/core/src/test-files/solr/collection1/conf/protwords.txt to /configs/conf1/protwords.txt
   [junit4]   2> 176740 INFO  (TEST-TestReqParamsAPI.test-seed#[10ABF5368D693666]) [    ] o.a.s.c.c.SolrZkClient makePath: /configs/conf1/protwords.txt
   [junit4]   2> 176741 INFO  (TEST-TestReqParamsAPI.test-seed#[10ABF5368D693666]) [    ] o.a.s.c.AbstractZkTestCase put /x1/jenkins/jenkins-slave/workspace/Lucene-Solr-NightlyTests-6.x/solr/core/src/test-files/solr/collection1/conf/currency.xml to /configs/conf1/currency.xml
   [junit4]   2> 176741 INFO  (TEST-TestReqParamsAPI.test-seed#[10ABF5368D693666]) [    ] o.a.s.c.c.SolrZkClient makePath: /configs/conf1/currency.xml
   [junit4]   2> 176743 INFO  (TEST-TestReqParamsAPI.test-seed#[10ABF5368D693666]) [    ] o.a.s.c.AbstractZkTestCase put /x1/jenkins/jenkins-slave/workspace/Lucene-Solr-NightlyTests-6.x/solr/core/src/test-files/solr/collection1/conf/enumsConfig.xml to /configs/conf1/enumsConfig.xml
   [junit4]   2> 176743 INFO  (TEST-TestReqParamsAPI.test-seed#[10ABF5368D693666]) [    ] o.a.s.c.c.SolrZkClient makePath: /configs/conf1/enumsConfig.xml
   [junit4]   2> 176744 INFO  (TEST-TestReqParamsAPI.test-seed#[10ABF5368D693666]) [    ] o.a.s.c.AbstractZkTestCase put /x1/jenkins/jenkins-slave/workspace/Lucene-Solr-NightlyTests-6.x/solr/core/src/test-files/solr/collection1/conf/open-exchange-rates.json to /configs/conf1/open-exchange-rates.json
   [junit4]   2> 176745 INFO  (TEST-TestReqParamsAPI.test-seed#[10ABF5368D693666]) [    ] o.a.s.c.c.SolrZkClient makePath: /configs/conf1/open-exchange-rates.json
   [junit4]   2> 176746 INFO  (TEST-TestReqParamsAPI.test-seed#[10ABF5368D693666]) [    ] o.a.s.c.AbstractZkTestCase put /x1/jenkins/jenkins-slave/workspace/Lucene-Solr-NightlyTests-6.x/solr/core/src/test-files/solr/collection1/conf/mapping-ISOLatin1Accent.txt to /configs/conf1/mapping-ISOLatin1Accent.txt
   [junit4]   2> 176746 INFO  (TEST-TestReqParamsAPI.test-seed#[10ABF5368D693666]) [    ] o.a.s.c.c.SolrZkClient makePath: /configs/conf1/mapping-ISOLatin1Accent.txt
   [junit4]   2> 176747 INFO  (TEST-TestReqParamsAPI.test-seed#[10ABF5368D693666]) [    ] o.a.s.c.AbstractZkTestCase put /x1/jenkins/jenkins-slave/workspace/Lucene-Solr-NightlyTests-6.x/solr/core/src/test-files/solr/collection1/conf/old_synonyms.txt to /configs/conf1/old_synonyms.txt
   [junit4]   2> 176748 INFO  (TEST-TestReqParamsAPI.test-seed#[10ABF5368D693666]) [    ] o.a.s.c.c.SolrZkClient makePath: /configs/conf1/old_synonyms.txt
   [junit4]   2> 176751 INFO  (TEST-TestReqParamsAPI.test-seed#[10ABF5368D693666]) [    ] o.a.s.c.AbstractZkTestCase put /x1/jenkins/jenkins-slave/workspace/Lucene-Solr-NightlyTests-6.x/solr/core/src/test-files/solr/collection1/conf/synonyms.txt to /configs/conf1/synonyms.txt
   [junit4]   2> 176751 INFO  (TEST-TestReqParamsAPI.test-seed#[10ABF5368D693666]) [    ] o.a.s.c.c.SolrZkClient makePath: /configs/conf1/synonyms.txt
   [junit4]   2> 176753 INFO  (TEST-TestReqParamsAPI.test-seed#[10ABF5368D693666]) [    ] o.a.s.c.c.SolrZkClient Using default ZkCredentialsProvider
   [junit4]   2> 176761 INFO  (TEST-TestReqParamsAPI.test-seed#[10ABF5368D693666]) [    ] o.a.s.c.c.ConnectionManager Waiting for client to connect to ZooKeeper
   [junit4]   2> 176761 INFO  (zkCallback-242-thread-1) [    ] o.a.s.c.c.ConnectionManager Watcher org.apache.solr.common.cloud.ConnectionManager@2dd888a7 name:ZooKeeperConnection Watcher:127.0.0.1:46324/solr got event WatchedEvent state:SyncConnected type:None path:null path:null type:None
   [junit4]   2> 176761 INFO  (TEST-TestReqParamsAPI.test-seed#[10ABF5368D693666]) [    ] o.a.s.c.c.ConnectionManager Client is connected to ZooKeeper
   [junit4]   2> 176761 INFO  (TEST-TestReqParamsAPI.test-seed#[10ABF5368D693666]) [    ] o.a.s.c.c.SolrZkClient Using default ZkACLProvider
   [junit4]   2> 176876 INFO  (TEST-TestReqParamsAPI.test-seed#[10ABF5368D693666]) [    ] o.a.s.SolrTestCaseJ4 Writing core.properties file to /x1/jenkins/jenkins-slave/workspace/Lucene-Solr-NightlyTests-6.x/solr/build/solr-core/test/J0/temp/solr.handler.TestReqParamsAPI_10ABF5368D693666-001/control-001/cores/collection1
   [junit4]   2> 176879 INFO  (TEST-TestReqParamsAPI.test-seed#[10ABF5368D693666]) [    ] o.e.j.s.Server jetty-9.3.8.v20160314
   [junit4]   2> 176881 INFO  (TEST-TestReqParamsAPI.test-seed#[10ABF5368D693666]) [    ] o.e.j.s.h.ContextHandler Started o.e.j.s.ServletContextHandler@340233bd{/hz_/w,null,AVAILABLE}
   [junit4]   2> 176884 INFO  (TEST-TestReqParamsAPI.test-seed#[10ABF5368D693666]) [    ] o.e.j.s.ServerConnector Started ServerConnector@1d45c581{SSL,[ssl, http/1.1]}{127.0.0.1:56468}
   [junit4]   2> 176884 INFO  (TEST-TestReqParamsAPI.test-seed#[10ABF5368D693666]) [    ] o.e.j.s.Server Started @180009ms
   [junit4]   2> 176884 INFO  (TEST-TestReqParamsAPI.test-seed#[10ABF5368D693666]) [    ] o.a.s.c.s.e.JettySolrRunner Jetty properties: {solr.data.dir=/x1/jenkins/jenkins-slave/workspace/Lucene-Solr-NightlyTests-6.x/solr/build/solr-core/test/J0/temp/solr.handler.TestReqParamsAPI_10ABF5368D693666-001/tempDir-001/control/data, hostContext=/hz_/w, hostPort=56468, coreRootDirectory=/x1/jenkins/jenkins-slave/workspace/Lucene-Solr-NightlyTests-6.x/solr/build/solr-core/test/J0/temp/solr.handler.TestReqParamsAPI_10ABF5368D693666-001/control-001/cores}
   [junit4]   2> 176885 INFO  (TEST-TestReqParamsAPI.test-seed#[10ABF5368D693666]) [    ] o.a.s.s.SolrDispatchFilter SolrDispatchFilter.init(): sun.misc.Launcher$AppClassLoader@73d16e93
   [junit4]   2> 176885 INFO  (TEST-TestReqParamsAPI.test-seed#[10ABF5368D693666]) [    ] o.a.s.c.SolrResourceLoader new SolrResourceLoader for directory: '/x1/jenkins/jenkins-slave/workspace/Lucene-Solr-NightlyTests-6.x/solr/build/solr-core/test/J0/temp/solr.handler.TestReqParamsAPI_10ABF5368D693666-001/control-001'
   [junit4]   2> 176885 INFO  (TEST-TestReqParamsAPI.test-seed#[10ABF5368D693666]) [    ] o.a.s.c.SolrResourceLoader JNDI not configured for solr (NoInitialContextEx)
   [junit4]   2> 176885 INFO  (TEST-TestReqParamsAPI.test-seed#[10ABF5368D693666]) [    ] o.a.s.c.SolrResourceLoader solr home defaulted to 'solr/' (could not find system property or JNDI)
   [junit4]   2> 176885 INFO  (TEST-TestReqParamsAPI.test-seed#[10ABF5368D693666]) [    ] o.a.s.c.c.SolrZkClient Using default ZkCredentialsProvider
   [junit4]   2> 176890 INFO  (TEST-TestReqParamsAPI.test-seed#[10ABF5368D693666]) [    ] o.a.s.c.c.ConnectionManager Waiting for client to connect to ZooKeeper
   [junit4]   2> 176890 INFO  (zkCallback-243-thread-1) [    ] o.a.s.c.c.ConnectionManager Watcher org.apache.solr.common.cloud.ConnectionManager@a2077df name:ZooKeeperConnection Watcher:127.0.0.1:46324/solr got event WatchedEvent state:SyncConnected type:None path:null path:null type:None
   [junit4]   2> 176890 INFO  (TEST-TestReqParamsAPI.test-seed#[10ABF5368D693666]) [    ] o.a.s.c.c.ConnectionManager Client is connected to ZooKeeper
   [junit4]   2> 176891 INFO  (TEST-TestReqParamsAPI.test-seed#[10ABF5368D693666]) [    ] o.a.s.c.c.SolrZkClient Using default ZkACLProvider
   [junit4]   2> 176892 INFO  (TEST-TestReqParamsAPI.test-seed#[10ABF5368D693666]) [    ] o.a.s.s.SolrDispatchFilter Loading solr.xml from SolrHome (not found in ZooKeeper)
   [junit4]   2> 176892 INFO  (TEST-TestReqParamsAPI.test-seed#[10ABF5368D693666]) [    ] o.a.s.c.SolrXmlConfig Loading container configuration from /x1/jenkins/jenkins-slave/workspace/Lucene-Solr-NightlyTests-6.x/solr/build/solr-core/test/J0/temp/solr.handler.TestReqParamsAPI_10ABF5368D693666-001/control-001/solr.xml
   [junit4]   2> 176897 INFO  (TEST-TestReqParamsAPI.test-seed#[10ABF5368D693666]) [    ] o.a.s.c.CorePropertiesLocator Config-defined core root directory: /x1/jenkins/jenkins-slave/workspace/Lucene-Solr-NightlyTests-6.x/solr/build/solr-core/test/J0/temp/solr.handler.TestReqParamsAPI_10ABF5368D693666-001/control-001/cores
   [junit4]   2> 176897 INFO  (TEST-TestReqParamsAPI.test-seed#[10ABF5368D693666]) [    ] o.a.s.c.CoreContainer New CoreContainer 1227848967
   [junit4]   2> 176897 INFO  (TEST-TestReqParamsAPI.test-seed#[10ABF5368D693666]) [    ] o.a.s.c.CoreContainer Loading cores into CoreContainer [instanceDir=/x1/jenkins/jenkins-slave/workspace/Lucene-Solr-NightlyTests-6.x/solr/build/solr-core/test/J0/temp/solr.handler.TestReqParamsAPI_10ABF5368D693666-001/control-001]
   [junit4]   2> 176898 WARN  (TEST-TestReqParamsAPI.test-seed#[10ABF5368D693666]) [    ] o.a.s.c.CoreContainer Couldn't add files from /x1/jenkins/jenkins-slave/workspace/Lucene-Solr-NightlyTests-6.x/solr/build/solr-core/test/J0/temp/solr.handler.TestReqParamsAPI_10ABF5368D693666-001/control-001/lib to classpath: /x1/jenkins/jenkins-slave/workspace/Lucene-Solr-NightlyTests-6.x/solr/build/solr-core/test/J0/temp/solr.handler.TestReqParamsAPI_10ABF5368D693666-001/control-001/lib
   [junit4]   2> 176898 INFO  (TEST-TestReqParamsAPI.test-seed#[10ABF5368D693666]) [    ] o.a.s.h.c.HttpShardHandlerFactory created with socketTimeout : 90000,urlScheme : ,connTimeout : 15000,maxConnectionsPerHost : 20,maxConnections : 10000,corePoolSize : 0,maximumPoolSize : 2147483647,maxThreadIdleTime : 5,sizeOfQueue : -1,fairnessPolicy : false,useRetries : false,connectionsEvictorSleepDelay : 5000,maxConnectionIdleTime : 40000,
   [junit4]   2> 176899 INFO  (TEST-TestReqParamsAPI.test-seed#[10ABF5368D693666]) [    ] o.a.s.u.UpdateShardHandler Creating UpdateShardHandler HTTP client with params: socketTimeout=340000&connTimeout=45000&retry=true
   [junit4]   2> 176900 INFO  (TEST-TestReqParamsAPI.test-seed#[10ABF5368D693666]) [    ] o.a.s.l.LogWatcher SLF4J impl is org.slf4j.impl.Log4jLoggerFactory
   [junit4]   2> 176900 INFO  (TEST-TestReqParamsAPI.test-seed#[10ABF5368D693666]) [    ] o.a.s.l.LogWatcher Registering Log Listener [Log4j (org.slf4j.impl.Log4jLoggerFactory)]
   [junit4]   2> 176900 INFO  (TEST-TestReqParamsAPI.test-seed#[10ABF5368D693666]) [    ] o.a.s.c.ZkContainer Zookeeper client=127.0.0.1:46324/solr
   [junit4]   2> 176900 INFO  (TEST-TestReqParamsAPI.test-seed#[10ABF5368D693666]) [    ] o.a.s.c.ZkController zkHost includes chroot
   [junit4]   2> 176900 INFO  (TEST-TestReqParamsAPI.test-seed#[10ABF5368D693666]) [    ] o.a.s.c.c.SolrZkClient Using default ZkCredentialsProvider
   [junit4]   2> 176901 INFO  (TEST-TestReqParamsAPI.test-seed#[10ABF5368D693666]) [    ] o.a.s.c.c.ConnectionManager Waiting for client to connect to ZooKeeper
   [junit4]   2> 176902 INFO  (zkCallback-246-thread-1) [    ] o.a.s.c.c.ConnectionManager Watcher org.apache.solr.common.cloud.ConnectionManager@3de46ce9 name:ZooKeeperConnection Watcher:127.0.0.1:46324 got event WatchedEvent state:SyncConnected type:None path:null path:null type:None
   [junit4]   2> 176903 INFO  (TEST-TestReqParamsAPI.test-seed#[10ABF5368D693666]) [    ] o.a.s.c.c.ConnectionManager Client is connected to ZooKeeper
   [junit4]   2> 176903 INFO  (TEST-TestReqParamsAPI.test-seed#[10ABF5368D693666]) [    ] o.a.s.c.c.SolrZkClient Using default ZkACLProvider
   [junit4]   2> 176904 INFO  (TEST-TestReqParamsAPI.test-seed#[10ABF5368D693666]) [n:127.0.0.1:56468_hz_%2Fw    ] o.a.s.c.ZkController Added new OnReconnect listener org.apache.solr.cloud.ZkController$$Lambda$50/377473286@34b08d43
   [junit4]   2> 176905 INFO  (TEST-TestReqParamsAPI.test-seed#[10ABF5368D693666]) [n:127.0.0.1:56468_hz_%2Fw    ] o.a.s.c.c.ConnectionManager Waiting for client to connect to ZooKeeper
   [junit4]   2> 176906 INFO  (zkCallback-247-thread-1-processing-n:127.0.0.1:56468_hz_%2Fw) [n:127.0.0.1:56468_hz_%2Fw    ] o.a.s.c.c.ConnectionManager Watcher org.apache.solr.common.cloud.ConnectionManager@26e24523 name:ZooKeeperConnection Watcher:127.0.0.1:46324/solr got event WatchedEvent state:SyncConnected type:None path:null path:null type:None
   [junit4]   2> 176908 INFO  (TEST-TestReqParamsAPI.test-seed#[10ABF5368D693666]) [n:127.0.0.1:56468_hz_%2Fw    ] o.a.s.c.c.ConnectionManager Client is connected to ZooKeeper
   [junit4]   2> 176908 INFO  (TEST-TestReqParamsAPI.test-seed#[10ABF5368D693666]) [n:127.0.0.1:56468_hz_%2Fw    ] o.a.s.c.c.SolrZkClient makePath: /overseer/queue
   [junit4]   2> 176910 INFO  (TEST-TestReqParamsAPI.test-seed#[10ABF5368D693666]) [n:127.0.0.1:56468_hz_%2Fw    ] o.a.s.c.c.SolrZkClient makePath: /overseer/collection-queue-work
   [junit4]   2> 176912 INFO  (TEST-TestReqParamsAPI.test-seed#[10ABF5368D693666]) [n:127.0.0.1:56468_hz_%2Fw    ] o.a.s.c.c.SolrZkClient makePath: /overseer/collection-map-running
   [junit4]   2> 176914 INFO  (TEST-TestReqParamsAPI.test-seed#[10ABF5368D693666]) [n:127.0.0.1:56468_hz_%2Fw    ] o.a.s.c.c.SolrZkClient makePath: /overseer/collection-map-completed
   [junit4]   2> 176916 INFO  (TEST-TestReqParamsAPI.test-seed#[10ABF5368D693666]) [n:127.0.0.1:56468_hz_%2Fw    ] o.a.s.c.c.SolrZkClient makePath: /overseer/collection-map-failure
   [junit4]   2> 176917 INFO  (TEST-TestReqParamsAPI.test-seed#[10ABF5368D693666]) [n:127.0.0.1:56468_hz_%2Fw    ] o.a.s.c.c.SolrZkClient makePath: /live_nodes
   [junit4]   2> 176918 INFO  (TEST-TestReqParamsAPI.test-seed#[10ABF5368D693666]) [n:127.0.0.1:56468_hz_%2Fw    ] o.a.s.c.c.SolrZkClient makePath: /aliases.json
   [junit4]   2> 176919 INFO  (TEST-TestReqParamsAPI.test-seed#[10ABF5368D693666]) [n:127.0.0.1:56468_hz_%2Fw    ] o.a.s.c.c.SolrZkClient makePath: /clusterstate.json
   [junit4]   2> 176920 INFO  (TEST-TestReqParamsAPI.test-seed#[10ABF5368D693666]) [n:127.0.0.1:56468_hz_%2Fw    ] o.a.s.c.c.SolrZkClient makePath: /security.json
   [junit4]   2> 176921 INFO  (TEST-TestReqParamsAPI.test-seed#[10ABF5368D693666]) [n:127.0.0.1:56468_hz_%2Fw    ] o.a.s.c.c.ZkStateReader Updating cluster state from ZooKeeper... 
   [junit4]   2> 176921 INFO  (TEST-TestReqParamsAPI.test-seed#[10ABF5368D693666]) [n:127.0.0.1:56468_hz_%2Fw    ] o.a.s.c.c.ZkStateReader Loaded cluster properties: {urlScheme=https}
   [junit4]   2> 176922 INFO  (TEST-TestReqParamsAPI.test-seed#[10ABF5368D693666]) [n:127.0.0.1:56468_hz_%2Fw    ] o.a.s.c.c.ZkStateReader Updated live nodes from ZooKeeper... (0) -> (0)
   [junit4]   2> 176924 INFO  (TEST-TestReqParamsAPI.test-seed#[10ABF5368D693666]) [n:127.0.0.1:56468_hz_%2Fw    ] o.a.s.c.c.SolrZkClient makePath: /overseer_elect
   [junit4]   2> 176925 INFO  (TEST-TestReqParamsAPI.test-seed#[10ABF5368D693666]) [n:127.0.0.1:56468_hz_%2Fw    ] o.a.s.c.c.SolrZkClient makePath: /overseer_elect/election
   [junit4]   2> 176925 INFO  (TEST-TestReqParamsAPI.test-seed#[10ABF5368D693666]) [n:127.0.0.1:56468_hz_%2Fw    ] o.a.s.c.Overseer Overseer (id=null) closing
   [junit4]   2> 176926 INFO  (TEST-TestReqParamsAPI.test-seed#[10ABF5368D693666]) [n:127.0.0.1:56468_hz_%2Fw    ] o.a.s.c.LeaderElector Joined leadership election with path: /overseer_elect/election/96311457290387461-127.0.0.1:56468_hz_%2Fw-n_0000000000
   [junit4]   2> 176926 INFO  (TEST-TestReqParamsAPI.test-seed#[10ABF5368D693666]) [n:127.0.0.1:56468_hz_%2Fw    ] o.a.s.c.OverseerElectionContext I am going to be the leader 127.0.0.1:56468_hz_%2Fw
   [junit4]   2> 176926 INFO  (TEST-TestReqParamsAPI.test-seed#[10ABF5368D693666]) [n:127.0.0.1:56468_hz_%2Fw    ] o.a.s.c.c.SolrZkClient makePath: /overseer_elect/leader
   [junit4]   2> 176927 INFO  (TEST-TestReqParamsAPI.test-seed#[10ABF5368D693666]) [n:127.0.0.1:56468_hz_%2Fw    ] o.a.s.c.Overseer Overseer (id=96311457290387461-127.0.0.1:56468_hz_%2Fw-n_0000000000) starting
   [junit4]   2> 176928 INFO  (TEST-TestReqParamsAPI.test-seed#[10ABF5368D693666]) [n:127.0.0.1:56468_hz_%2Fw    ] o.a.s.c.c.SolrZkClient makePath: /overseer/queue-work
   [junit4]   2> 176933 INFO  (TEST-TestReqParamsAPI.test-seed#[10ABF5368D693666]) [n:127.0.0.1:56468_hz_%2Fw    ] o.a.s.c.OverseerAutoReplicaFailoverThread Starting OverseerAutoReplicaFailoverThread autoReplicaFailoverWorkLoopDelay=10000 autoReplicaFailoverWaitAfterExpiration=10000 autoReplicaFailoverBadNodeExpiration=60000
   [junit4]   2> 176933 INFO  (OverseerCollectionConfigSetProcessor-96311457290387461-127.0.0.1:56468_hz_%2Fw-n_0000000000) [n:127.0.0.1:56468_hz_%2Fw    ] o.a.s.c.OverseerTaskProcessor Process current queue of overseer operations
   [junit4]   2> 176933 INFO  (OverseerStateUpdate-96311457290387461-127.0.0.1:56468_hz_%2Fw-n_0000000000) [n:127.0.0.1:56468_hz_%2Fw    ] o.a.s.c.Overseer Starting to work on the main queue
   [junit4]   2> 176934 INFO  (TEST-TestReqParamsAPI.test-seed#[10ABF5368D693666]) [n:127.0.0.1:56468_hz_%2Fw    ] o.a.s.c.ZkController Register node as live in ZooKeeper:/live_nodes/127.0.0.1:56468_hz_%2Fw
   [junit4]   2> 176934 INFO  (TEST-TestReqParamsAPI.test-seed#[10ABF5368D693666]) [n:127.0.0.1:56468_hz_%2Fw    ] o.a.s.c.c.SolrZkClient makePath: /live_nodes/127.0.0.1:56468_hz_%2Fw
   [junit4]   2> 176936 INFO  (OverseerStateUpdate-96311457290387461-127.0.0.1:56468_hz_%2Fw-n_0000000000) [n:127.0.0.1:56468_hz_%2Fw    ] o.a.s.c.c.ZkStateReader Updated live nodes from ZooKeeper... (0) -> (0)
   [junit4]   2> 176936 INFO  (zkCallback-247-thread-1-processing-n:127.0.0.1:56468_hz_%2Fw) [n:127.0.0.1:56468_hz_%2Fw    ] o.a.s.c.c.ZkStateReader A live node change: [WatchedEvent state:SyncConnected type:NodeChildrenChanged path:/live_nodes], has occurred - updating... (live nodes size: [0])
   [junit4]   2> 176937 INFO  (zkCallback-247-thread-1-processing-n:127.0.0.1:56468_hz_%2Fw) [n:127.0.0.1:56468_hz_%2Fw    ] o.a.s.c.c.ZkStateReader Updated live nodes from ZooKeeper... (0) -> (1)
   [junit4]   2> 176962 INFO  (TEST-TestReqParamsAPI.test-seed#[10ABF5368D693666]) [n:127.0.0.1:56468_hz_%2Fw    ] o.a.s.c.CoreContainer Security conf doesn't exist. Skipping setup for authorization module.
   [junit4]   2> 176962 INFO  (TEST-TestReqParamsAPI.test-seed#[10ABF5368D693666]) [n:127.0.0.1:56468_hz_%2Fw    ] o.a.s.c.CoreContainer No authentication plugin used.
   [junit4]   2> 176963 INFO  (TEST-TestReqParamsAPI.test-seed#[10ABF5368D693666]) [n:127.0.0.1:56468_hz_%2Fw    ] o.a.s.c.CorePropertiesLocator Looking for core definitions underneath /x1/jenkins/jenkins-slave/workspace/Lucene-Solr-NightlyTests-6.x/solr/build/solr-core/test/J0/temp/solr.handler.TestReqParamsAPI_10ABF5368D693666-001/control-001/cores
   [junit4]   2> 176964 INFO  (TEST-TestReqParamsAPI.test-seed#[10ABF5368D693666]) [n:127.0.0.1:56468_hz_%2Fw    ] o.a.s.c.CoreDescriptor Created CoreDescriptor: {name=collection1, config=solrconfig.xml, transient=false, schema=schema.xml, loadOnStartup=true, configSetProperties=configsetprops.json, collection=control_collection, coreNodeName=, dataDir=data/, shard=}
   [junit4]   2> 176964 INFO  (TEST-TestReqParamsAPI.test-seed#[10ABF5368D693666]) [n:127.0.0.1:56468_hz_%2Fw    ] o.a.s.c.CorePropertiesLocator Found core collection1 in /x1/jenkins/jenkins-slave/workspace/Lucene-Solr-NightlyTests-6.x/solr/build/solr-core/test/J0/temp/solr.handler.TestReqParamsAPI_10ABF5368D693666-001/control-001/cores/collection1
   [junit4]   2> 176964 INFO  (TEST-TestReqParamsAPI.test-seed#[10ABF5368D693666]) [n:127.0.0.1:56468_hz_%2Fw    ] o.a.s.c.CorePropertiesLocator Found 1 core definitions
   [junit4]   2> 176965 INFO  (TEST-TestReqParamsAPI.test-seed#[10ABF5368D693666]) [n:127.0.0.1:56468_hz_%2Fw    ] o.a.s.s.SolrDispatchFilter user.dir=/x1/jenkins/jenkins-slave/workspace/Lucene-Solr-NightlyTests-6.x/solr/build/solr-core/test/J0
   [junit4]   2> 176965 INFO  (TEST-TestReqParamsAPI.test-seed#[10ABF5368D693666]) [n:127.0.0.1:56468_hz_%2Fw    ] o.a.s.s.SolrDispatchFilter SolrDispatchFilter.init() done
   [junit4]   2> 176966 INFO  (coreLoadExecutor-467-thread-1-processing-n:127.0.0.1:56468_hz_%2Fw) [n:127.0.0.1:56468_hz_%2Fw c:control_collection   x:collection1] o.a.s.c.ZkController publishing state=down
   [junit4]   2> 176966 INFO  (coreLoadExecutor-467-thread-1-processing-n:127.0.0.1:56468_hz_%2Fw) [n:127.0.0.1:56468_hz_%2Fw c:control_collection   x:collection1] o.a.s.c.ZkController numShards not found on descriptor - reading it from system property
   [junit4]   2> 176968 INFO  (coreLoadExecutor-467-thread-1-processing-n:127.0.0.1:56468_hz_%2Fw) [n:127.0.0.1:56468_hz_%2Fw c:control_collection   x:collection1] o.a.s.c.ZkController Collection control_collection not visible yet, but flagging it so a watch is registered when it becomes visible
   [junit4]   2> 176968 INFO  (OverseerStateUpdate-96311457290387461-127.0.0.1:56468_hz_%2Fw-n_0000000000) [n:127.0.0.1:56468_hz_%2Fw    ] o.a.s.c.Overseer processMessage: queueSize: 1, message = {
   [junit4]   2>   "core":"collection1",
   [junit4]   2>   "roles":null,
   [junit4]   2>   "base_url":"https://127.0.0.1:56468/hz_/w",
   [junit4]   2>   "node_name":"127.0.0.1:56468_hz_%2Fw",
   [junit4]   2>   "numShards":"1",
   [junit4]   2>   "state":"down",
   [junit4]   2>   "shard":null,
   [junit4]   2>   "collection":"control_collection",
   [junit4]   2>   "operation":"state"} current state version: 0
   [junit4]   2> 176968 INFO  (OverseerStateUpdate-96311457290387461-127.0.0.1:56468_hz_%2Fw-n_0000000000) [n:127.0.0.1:56468_hz_%2Fw    ] o.a.s.c.o.ReplicaMutator Update state numShards=1 message={
   [junit4]   2>   "core":"collection1",
   [junit4]   2>   "roles":null,
   [junit4]   2>   "base_url":"https://127.0.0.1:56468/hz_/w",
   [junit4]   2>   "node_name":"127.0.0.1:56468_hz_%2Fw",
   [junit4]   2>   "numShards":"1",
   [junit4]   2>   "state":"down",
   [junit4]   2>   "shard":null,
   [junit4]   2>   "collection":"control_collection",
   [junit4]   2>   "operation":"state"}
   [junit4]   2> 176969 INFO  (OverseerStateUpdate-96311457290387461-127.0.0.1:56468_hz_%2Fw-n_0000000000) [n:127.0.0.1:56468_hz_%2Fw    ] o.a.s.c.o.ClusterStateMutator building a new cName: control_collection
   [junit4]   2> 176969 INFO  (coreLoadExecutor-467-thread-1-processing-n:127.0.0.1:56468_hz_%2Fw) [n:127.0.0.1:56468_hz_%2Fw c:control_collection   x:collection1] o.a.s.c.c.ZkStateReader Deleting data for [control_collection]
   [junit4]   2> 176970 INFO  (OverseerStateUpdate-96311457290387461-127.0.0.1:56468_hz_%2Fw-n_0000000000) [n:127.0.0.1:56468_hz_%2Fw    ] o.a.s.c.o.ReplicaMutator Assigning new node to shard shard=shard1
   [junit4]   2> 176971 INFO  (zkCallback-247-thread-1-processing-n:127.0.0.1:56468_hz_%2Fw) [n:127.0.0.1:56468_hz_%2Fw    ] o.a.s.c.c.ZkStateReader A cluster state change: [WatchedEvent state:SyncConnected type:NodeDataChanged path:/clusterstate.json], has occurred - updating... (live nodes size: [1])
   [junit4]   2> 176978 INFO  (coreLoadExecutor-467-thread-1-processing-n:127.0.0.1:56468_hz_%2Fw) [n:127.0.0.1:56468_hz_%2Fw c:control_collection   x:collection1] o.a.s.c.ZkController look for our core node name
   [junit4]   2> 176978 INFO  (coreLoadExecutor-467-thread-1-processing-n:127.0.0.1:56468_hz_%2Fw) [n:127.0.0.1:56468_hz_%2Fw c:control_collection   x:collection1] o.a.s.c.ZkController waiting to find shard id in clusterstate for collection1
   [junit4]   2> 176978 INFO  (coreLoadExecutor-467-thread-1-processing-n:127.0.0.1:56468_hz_%2Fw) [n:127.0.0.1:56468_hz_%2Fw c:control_collection   x:collection1] o.a.s.c.ZkController Check for collection zkNode:control_collection
   [junit4]   2> 176979 INFO  (coreLoadExecutor-467-thread-1-processing-n:127.0.0.1:56468_hz_%2Fw) [n:127.0.0.1:56468_hz_%2Fw c:control_collection   x:collection1] o.a.s.c.ZkController Collection zkNode exists
   [junit4]   2> 176979 INFO  (coreLoadExecutor-467-thread-1-processing-n:127.0.0.1:56468_hz_%2Fw) [n:127.0.0.1:56468_hz_%2Fw c:control_collection   x:collection1] o.a.s.c.c.ZkStateReader Load collection config from: [/collections/control_collection]
   [junit4]   2> 176979 INFO  (coreLoadExecutor-467-thread-1-processing-n:127.0.0.1:56468_hz_%2Fw) [n:127.0.0.1:56468_hz_%2Fw c:control_collection   x:collection1] o.a.s.c.c.ZkStateReader path=[/collections/control_collection] [configName]=[conf1] specified config exists in ZooKeeper
   [junit4]   2> 176979 INFO  (coreLoadExecutor-467-thread-1-processing-n:127.0.0.1:56468_hz_%2Fw) [n:127.0.0.1:56468_hz_%2Fw c:control_collection   x:collection1] o.a.s.c.SolrResourceLoader new SolrResourceLoader for directory: '/x1/jenkins/jenkins-slave/workspace/Lucene-Solr-NightlyTests-6.x/solr/build/solr-core/test/J0/temp/solr.handler.TestReqParamsAPI_10ABF5368D693666-001/control-001/cores/collection1'
   [junit4]   2> 176979 INFO  (coreLoadExecutor-467-thread-1-processing-n:127.0.0.1:56468_hz_%2Fw) [n:127.0.0.1:56468_hz_%2Fw c:control_collection   x:collection1] o.a.s.c.SolrResourceLoader JNDI not configured for solr (NoInitialContextEx)
   [junit4]   2> 176980 INFO  (coreLoadExecutor-467-thread-1-processing-n:127.0.0.1:56468_hz_%2Fw) [n:127.0.0.1:56468_hz_%2Fw c:control_collection   x:collection1] o.a.s.c.SolrResourceLoader solr home defaulted to 'solr/' (could not find system property or JNDI)
   [junit4]   2> 176981 INFO  (coreLoadExecutor-467-thread-1-processing-n:127.0.0.1:56468_hz_%2Fw) [n:127.0.0.1:56468_hz_%2Fw c:control_collection   x:collection1] o.a.s.c.Config loaded config solrconfig.xml with version 0 
   [junit4]   2> 176987 INFO  (coreLoadExecutor-467-thread-1-processing-n:127.0.0.1:56468_hz_%2Fw) [n:127.0.0.1:56468_hz_%2Fw c:control_collection   x:collection1] o.a.s.c.SolrConfig current version of requestparams : -1
   [junit4]   2> 176991 INFO  (coreLoadExecutor-467-thread-1-processing-n:127.0.0.1:56468_hz_%2Fw) [n:127.0.0.1:56468_hz_%2Fw c:control_collection   x:collection1] o.a.s.c.SolrConfig Using Lucene MatchVersion: 6.2.0
   [junit4]   2> 176999 INFO  (coreLoadExecutor-467-thread-1-processing-n:127.0.0.1:56468_hz_%2Fw) [n:127.0.0.1:56468_hz_%2Fw c:control_collection   x:collection1] o.a.s.c.SolrConfig Loaded SolrConfig: solrconfig.xml
   [junit4]   2> 177004 INFO  (coreLoadExecutor-467-thread-1-processing-n:127.0.0.1:56468_hz_%2Fw) [n:127.0.0.1:56468_hz_%2Fw c:control_collection   x:collection1] o.a.s.s.IndexSchema [collection1] Schema name=test
   [junit4]   2> 177136 INFO  (coreLoadExecutor-467-thread-1-processing-n:127.0.0.1:56468_hz_%2Fw) [n:127.0.0.1:56468_hz_%2Fw c:control_collection   x:collection1] o.a.s.s.OpenExchangeRatesOrgProvider Initialized with rates=open-exchange-rates.json, refreshInterval=1440.
   [junit4]   2> 177146 INFO  (coreLoadExecutor-467-thread-1-processing-n:127.0.0.1:56468_hz_%2Fw) [n:127.0.0.1:56468_hz_%2Fw c:control_collection   x:collection1] o.a.s.s.IndexSchema default search field in schema is text
   [junit4]   2> 177147 INFO  (coreLoadExecutor-467-thread-1-processing-n:127.0.0.1:56468_hz_%2Fw) [n:127.0.0.1:56468_hz_%2Fw c:control_collection   x:collection1] o.a.s.s.IndexSchema unique key field: id
   [junit4]   2> 177157 INFO  (coreLoadExecutor-467-thread-1-processing-n:127.0.0.1:56468_hz_%2Fw) [n:127.0.0.1:56468_hz_%2Fw c:control_collection   x:collection1] o.a.s.s.FileExchangeRateProvider Reloading exchange rates from file currency.xml
   [junit4]   2> 177159 INFO  (coreLoadExecutor-467-thread-1-processing-n:127.0.0.1:56468_hz_%2Fw) [n:127.0.0.1:56468_hz_%2Fw c:control_collection   x:collection1] o.a.s.s.FileExchangeRateProvider Reloading exchange rates from file currency.xml
   [junit4]   2> 177161 INFO  (coreLoadExecutor-467-thread-1-processing-n:127.0.0.1:56468_hz_%2Fw) [n:127.0.0.1:56468_hz_%2Fw c:control_collection   x:collection1] o.a.s.s.OpenExchangeRatesOrgProvider Reloading exchange rates from open-exchange-rates.json
   [junit4]   2> 177162 INFO  (coreLoadExecutor-467-thread-1-processing-n:127.0.0.1:56468_hz_%2Fw) [n:127.0.0.1:56468_hz_%2Fw c:control_collection   x:collection1] o.a.s.s.OpenExchangeRatesOrgProvider Reloading exchange rates from open-exchange-rates.json
   [junit4]   2> 177163 INFO  (coreLoadExecutor-467-thread-1-processing-n:127.0.0.1:56468_hz_%2Fw) [n:127.0.0.1:56468_hz_%2Fw c:control_collection   x:collection1] o.a.s.c.ConfigSetProperties Did not find ConfigSet properties, assuming default properties: Can't find resource 'configsetprops.json' in classpath or '/configs/conf1', cwd=/x1/jenkins/jenkins-slave/workspace/Lucene-Solr-NightlyTests-6.x/solr/build/solr-core/test/J0
   [junit4]   2> 177163 INFO  (coreLoadExecutor-467-thread-1-processing-n:127.0.0.1:56468_hz_%2Fw) [n:127.0.0.1:56468_hz_%2Fw c:control_collection   x:collection1] o.a.s.c.CoreContainer Creating SolrCore 'collection1' using configuration from collection control_collection
   [junit4]   2> 177164 INFO  (coreLoadExecutor-467-thread-1-processing-n:127.0.0.1:56468_hz_%2Fw) [n:127.0.0.1:56468_hz_%2Fw c:control_collection s:shard1 r:core_node1 x:collection1] o.a.s.c.SolrCore org.apache.solr.core.MockDirectoryFactory
   [junit4]   2> 177164 INFO  (coreLoadExecutor-467-thread-1-processing-n:127.0.0.1:56468_hz_%2Fw) [n:127.0.0.1:56468_hz_%2Fw c:control_collection s:shard1 r:core_node1 x:collection1] o.a.s.c.SolrCore [[collection1] ] Opening new SolrCore at [/x1/jenkins/jenkins-slave/workspace/Lucene-Solr-NightlyTests-6.x/solr/build/solr-core/test/J0/temp/solr.handler.TestReqParamsAPI_10ABF5368D693666-001/control-001/cores/collection1], dataDir=[/x1/jenkins/jenkins-slave/workspace/Lucene-Solr-NightlyTests-6.x/solr/build/solr-core/test/J0/temp/solr.handler.TestReqParamsAPI_10ABF5368D693666-001/control-001/cores/collection1/data/]
   [junit4]   2> 177164 INFO  (coreLoadExecutor-467-thread-1-processing-n:127.0.0.1:56468_hz_%2Fw) [n:127.0.0.1:56468_hz_%2Fw c:control_collection s:shard1 r:core_node1 x:collection1] o.a.s.c.JmxMonitoredMap JMX monitoring is enabled. Adding Solr mbeans to JMX Server: com.sun.jmx.mbeanserver.JmxMBeanServer@791c25b7
   [junit4]   2> 177165 INFO  (coreLoadExecutor-467-thread-1-processing-n:127.0.0.1:56468_hz_%2Fw) [n:127.0.0.1:56468_hz_%2Fw c:control_collection s:shard1 r:core_node1 x:collection1] o.a.s.c.CachingDirectoryFactory return new directory for /x1/jenkins/jenkins-slave/workspace/Lucene-Solr-NightlyTests-6.x/solr/build/solr-core/test/J0/temp/solr.handler.TestReqParamsAPI_10ABF5368D693666-001/control-001/cores/collection1/data
   [junit4]   2> 177165 INFO  (coreLoadExecutor-467-thread-1-processing-n:127.0.0.1:56468_hz_%2Fw) [n:127.0.0.1:56468_hz_%2Fw c:control_collection s:shard1 r:core_node1 x:collection1] o.a.s.c.SolrCore New index directory detected: old=null new=/x1/jenkins/jenkins-slave/workspace/Lucene-Solr-NightlyTests-6.x/solr/build/solr-core/test/J0/temp/solr.handler.TestReqParamsAPI_10ABF5368D693666-001/control-001/cores/collection1/data/index/
   [junit4]   2> 177165 WARN  (coreLoadExecutor-467-thread-1-processing-n:127.0.0.1:56468_hz_%2Fw) [n:127.0.0.1:56468_hz_%2Fw c:control_collection s:shard1 r:core_node1 x:collection1] o.a.s.c.SolrCore [collection1] Solr index directory '/x1/jenkins/jenkins-slave/workspace/Lucene-Solr-NightlyTests-6.x/solr/build/solr-core/test/J0/temp/solr.handler.TestReqParamsAPI_10ABF5368D693666-001/control-001/cores/collection1/data/index' doesn't exist. Creating new index...
   [junit4]   2> 177166 INFO  (coreLoadExecutor-467-thread-1-processing-n:127.0.0.1:56468_hz_%2Fw) [n:127.0.0.1:56468_hz_%2Fw c:control_collection s:shard1 r:core_node1 x:collection1] o.a.s.c.CachingDirectoryFactory return new directory for /x1/jenkins/jenkins-slave/workspace/Lucene-Solr-NightlyTests-6.x/solr/build/solr-core/test/J0/temp/solr.handler.TestReqParamsAPI_10ABF5368D693666-001/control-001/cores/collection1/data/index
   [junit4]   2> 177167 INFO  (coreLoadExecutor-467-thread-1-processing-n:127.0.0.1:56468_hz_%2Fw) [n:127.0.0.1:56468_hz_%2Fw c:control_collection s:shard1 r:core_node1 x:collection1] o.a.s.u.RandomMergePolicy RandomMergePolicy wrapping class org.apache.lucene.index.TieredMergePolicy: [TieredMergePolicy: maxMergeAtOnce=17, maxMergeAtOnceExplicit=27, maxMergedSegmentMB=96.1171875, floorSegmentMB=1.619140625, forceMergeDeletesPctAllowed=16.92658774746169, segmentsPerTier=40.0, maxCFSSegmentSizeMB=8.796093022207999E12, noCFSRatio=0.643981415252059
   [junit4]   2> 177169 INFO  (coreLoadExecutor-467-thread-1-processing-n:127.0.0.1:56468_hz_%2Fw) [n:127.0.0.1:56468_hz_%2Fw c:control_collection s:shard1 r:core_node1 x:collection1] o.a.s.c.SolrDeletionPolicy SolrDeletionPolicy.onCommit: commits: num=1
   [junit4]   2> 	commit{dir=MockDirectoryWrapper(RAMDirectory@45f59248 lockFactory=org.apache.lucene.store.SingleInstanceLockFactory@70047083),segFN=segments_1,generation=1}
   [junit4]   2> 177169 INFO  (coreLoadExecutor-467-thread-1-processing-n:127.0.0.1:56468_hz_%2Fw) [n:127.0.0.1:56468_hz_%2Fw c:control_collection s:shard1 r:core_node1 x:collection1] o.a.s.c.SolrDeletionPolicy newest commit generation = 1
   [junit4]   2> 177170 INFO  (OldIndexDirectoryCleanupThreadForCore-collection1) [n:127.0.0.1:56468_hz_%2Fw c:control_collection s:shard1 r:core_node1 x:collection1] o.a.s.c.SolrCore Looking for old index directories to cleanup for core collection1 in /x1/jenkins/jenkins-slave/workspace/Lucene-Solr-NightlyTests-6.x/solr/build/solr-core/test/J0/temp/solr.handler.TestReqParamsAPI_10ABF5368D693666-001/control-001/cores/collection1/data/
   [junit4]   2> 177173 WARN  (OldIndexDirectoryCleanupThreadForCore-collection1) [n:127.0.0.1:56468_hz_%2Fw c:control_collection s:shard1 r:core_node1 x:collection1] o.a.s.c.DirectoryFactory /x1/jenkins/jenkins-slave/workspace/Lucene-Solr-NightlyTests-6.x/solr/build/solr-core/test/J0/temp/solr.handler.TestReqParamsAPI_10ABF5368D693666-001/control-001/cores/collection1/data/ does not point to a valid data directory; skipping clean-up of old index directories.
   [junit4]   2> 177173 INFO  (coreLoadExecutor-467-thread-1-processing-n:127.0.0.1:56468_hz_%2Fw) [n:127.0.0.1:56468_hz_%2Fw c:control_collection s:shard1 r:core_node1 x:collection1] o.a.s.u.p.UpdateRequestProcessorChain creating updateRequestProcessorChain "nodistrib"
   [junit4]   2> 177174 INFO  (coreLoadExecutor-467-thread-1-processing-n:127.0.0.1:56468_hz_%2Fw) [n:127.0.0.1:56468_hz_%2Fw c:control_collection s:shard1 r:core_node1 x:collection1] o.a.s.u.p.UpdateRequestProcessorChain creating updateRequestProcessorChain "dedupe"
   [junit4]   2> 177174 INFO  (coreLoadExecutor-467-thread-1-processing-n:127.0.0.1:56468_hz_%2Fw) [n:127.0.0.1:56468_hz_%2Fw c:control_collection s:shard1 r:core_node1 x:collection1] o.a.s.u.p.UpdateRequestProcessorChain inserting DistributedUpdateProcessorFactory into updateRequestProcessorChain "dedupe"
   [junit4]   2> 177174 INFO  (coreLoadExecutor-467-thread-1-processing-n:127.0.0.1:56468_hz_%2Fw) [n:127.0.0.1:56468_hz_%2Fw c:control_collection s:shard1 r:core_node1 x:collection1] o.a.s.u.p.UpdateRequestProcessorChain creating updateRequestProcessorChain "stored_sig"
   [junit4]   2> 177174 INFO  (coreLoadExecutor-467-thread-1-processing-n:127.0.0.1:56468_hz_%2Fw) [n:127.0.0.1:56468_hz_%2Fw c:control_collection s:shard1 r:core_node1 x:collection1] o.a.s.u.p.UpdateRequestProcessorChain inserting DistributedUpdateProcessorFactory into updateRequestProcessorChain "stored_sig"
   [junit4]   2> 177174 INFO  (coreLoadExecutor-467-thread-1-processing-n:127.0.0.1:56468_hz_%2Fw) [n:127.0.0.1:56468_hz_%2Fw c:control_collection s:shard1 r:core_node1 x:collection1] o.a.s.u.p.UpdateRequestProcessorChain creating updateRequestProcessorChain "distrib-dup-test-chain-explicit"
   [junit4]   2> 177174 INFO  (coreLoadExecutor-467-thread-1-processing-n:127.0.0.1:56468_hz_%2Fw) [n:127.0.0.1:56468_hz_%2Fw c:control_collection s:shard1 r:core_node1 x:collection1] o.a.s.u.p.UpdateRequestProcessorChain creating updateRequestProcessorChain "distrib-dup-test-chain-implicit"
   [junit4]   2> 177175 INFO  (coreLoadExecutor-467-thread-1-processing-n:127.0.0.1:56468_hz_%2Fw) [n:127.0.0.1:56468_hz_%2Fw c:control_collection s:shard1 r:core_node1 x:collection1] o.a.s.u.p.UpdateRequestProcessorChain inserting DistributedUpdateProcessorFactory into updateRequestProcessorChain "distrib-dup-test-chain-implicit"
   [junit4]   2> 177175 INFO  (coreLoadExecutor-467-thread-1-processing-n:127.0.0.1:56468_hz_%2Fw) [n:127.0.0.1:56468_hz_%2Fw c:control_collection s:shard1 r:core_node1 x:collection1] o.a.s.c.SolrCore no updateRequestProcessorChain defined as default, creating implicit default
   [junit4]   2> 177175 WARN  (coreLoadExecutor-467-thread-1-processing-n:127.0.0.1:56468_hz_%2Fw) [n:127.0.0.1:56468_hz_%2Fw c:control_collection s:shard1 r:core_node1 x:collection1] o.a.s.c.RequestHandlers INVALID paramSet a in requestHandler {type = requestHandler,name = /dump,class = DumpRequestHandler,args = {defaults={a=A,b=B}}}
   [junit4]   2> 177187 INFO  (coreLoadExecutor-467-thread-1-processing-n:127.0.0.1:56468_hz_%2Fw) [n:127.0.0.1:56468_hz_%2Fw c:control_collection s:shard1 r:core_node1 x:collection1] o.a.s.h.l.XMLLoader xsltCacheLifetimeSeconds=60
   [junit4]   2> 177188 INFO  (coreLoadExecutor-467-thread-1-processing-n:127.0.0.1:56468_hz_%2Fw) [n:127.0.0.1:56468_hz_%2Fw c:control_collection s:shard1 r:core_node1 x:collection1] o.a.s.h.l.XMLLoader xsltCacheLifetimeSeconds=60
   [junit4]   2> 177189 INFO  (coreLoadExecutor-467-thread-1-processing-n:127.0.0.1:56468_hz_%2Fw) [n:127.0.0.1:56468_hz_%2Fw c:control_collection s:shard1 r:core_node1 x:collection1] o.a.s.h.l.XMLLoader xsltCacheLifetimeSeconds=60
   [junit4]   2> 177192 INFO  (coreLoadExecutor-467-thread-1-processing-n:127.0.0.1:56468_hz_%2Fw) [n:127.0.0.1:56468_hz_%2Fw c:control_collection s:shard1 r:core_node1 x:collection1] o.a.s.h.l.XMLLoader xsltCacheLifetimeSeconds=60
   [junit4]   2> 177196 INFO  (coreLoadExecutor-467-thread-1-processing-n:127.0.0.1:56468_hz_%2Fw) [n:127.0.0.1:56468_hz_%2Fw c:control_collection s:shard1 r:core_node1 x:collection1] o.a.s.c.RequestHandlers Registered paths: /admin/mbeans,standard,/update/json/docs,/admin/luke,/export,/get,/admin/properties,/update/json,/admin/threads,/dump,/update/csv,/sql,/graph,/admin/segments,/admin/system,/replication,/config,/stream,/schema,/admin/plugins,/admin/logging,/admin/ping,/update,/admin/file,/terms
   [junit4]   2> 177196 INFO  (coreLoadExecutor-467-thread-1-processing-n:127.0.0.1:56468_hz_%2Fw) [n:127.0.0.1:56468_hz_%2Fw c:control_collection s:shard1 r:core_node1 x:collection1] o.a.s.c.SolrCore Using default statsCache cache: org.apache.solr.search.stats.LocalStatsCache
   [junit4]   2> 177196 INFO  (coreLoadExecutor-467-thread-1-processing-n:127.0.0.1:56468_hz_%2Fw) [n:127.0.0.1:56468_hz_%2Fw c:control_collection s:shard1 r:core_node1 x:collection1] o.a.s.u.UpdateHandler Using UpdateLog implementation: org.apache.solr.update.UpdateLog
   [junit4]   2> 177196 INFO  (coreLoadExecutor-467-thread-1-processing-n:127.0.0.1:56468_hz_%2Fw) [n:127.0.0.1:56468_hz_%2Fw c:control_collection s:shard1 r:core_node1 x:collection1] o.a.s.u.UpdateLog Initializing UpdateLog: dataDir= defaultSyncLevel=FLUSH numRecordsToKeep=100 maxNumLogsToKeep=10 numVersionBuckets=65536
   [junit4]   2> 177197 INFO  (coreLoadExecutor-467-thread-1-processing-n:127.0.0.1:56468_hz_%2Fw) [n:127.0.0.1:56468_hz_%2Fw c:control_collection s:shard1 r:core_node1 x:collection1] o.a.s.u.CommitTracker Hard AutoCommit: disabled
   [junit4]   2> 177197 INFO  (coreLoadExecutor-467-thread-1-processing-n:127.0.0.1:56468_hz_%2Fw) [n:127.0.0.1:56468_hz_%2Fw c:control_collection s:shard1 r:core_node1 x:collection1] o.a.s.u.CommitTracker Soft AutoCommit: disabled
   [junit4]   2> 177199 INFO  (coreLoadExecutor-467-thread-1-processing-n:127.0.0.1:56468_hz_%2Fw) [n:127.0.0.1:56468_hz_%2Fw c:control_collection s:shard1 r:core_node1 x:collection1] o.a.s.u.RandomMergePolicy RandomMergePolicy wrapping class org.apache.lucene.index.LogDocMergePolicy: [LogDocMergePolicy: minMergeSize=1000, mergeFactor=40, maxMergeSize=9223372036854775807, maxMergeSizeForForcedMerge=9223372036854775807, calibrateSizeByDeletes=false, maxMergeDocs=2147483647, maxCFSSegmentSizeMB=8.796093022207999E12, noCFSRatio=0.2579475976111197]
   [junit4]   2> 177201 INFO  (coreLoadExecutor-467-thread-1-processing-n:127.0.0.1:56468_hz_%2Fw) [n:127.0.0.1:56468_hz_%2Fw c:control_collection s:shard1 r:core_node1 x:collection1] o.a.s.c.SolrDeletionPolicy SolrDeletionPolicy.onInit: commits: num=1
   [junit4]   2> 	commit{dir=MockDirectoryWrapper(RAMDirectory@45f59248 lockFactory=org.apache.lucene.store.SingleInstanceLockFactory@70047083),segFN=segments_1,generation=1}
   [junit4]   2> 177201 INFO  (coreLoadExecutor-467-thread-1-processing-n:127.0.0.1:56468_hz_%2Fw) [n:127.0.0.1:56468_hz_%2Fw c:control_collection s:shard1 r:core_node1 x:collection1] o.a.s.c.SolrDeletionPolicy newest commit generation = 1
   [junit4]   2> 177202 INFO  (coreLoadExecutor-467-thread-1-processing-n:127.0.0.1:56468_hz_%2Fw) [n:127.0.0.1:56468_hz_%2Fw c:control_collection s:shard1 r:core_node1 x:collection1] o.a.s.s.SolrIndexSearcher Opening [Searcher@762e477b[collection1] main]
   [junit4]   2> 177202 INFO  (coreLoadExecutor-467-thread-1-processing-n:127.0.0.1:56468_hz_%2Fw) [n:127.0.0.1:56468_hz_%2Fw c:control_collection s:shard1 r:core_node1 x:collection1] o.a.s.c.c.ZkStateReader Load collection config from: [/collections/control_collection]
   [junit4]   2> 177205 INFO  (coreLoadExecutor-467-thread-1-processing-n:127.0.0.1:56468_hz_%2Fw) [n:127.0.0.1:56468_hz_%2Fw c:control_collection s:shard1 r:core_node1 x:collection1] o.a.s.c.c.ZkStateReader path=[/collections/control_collection] [configName]=[conf1] specified config exists in ZooKeeper
   [junit4]   2> 177205 INFO  (coreLoadExecutor-467-thread-1-processing-n:127.0.0.1:56468_hz_%2Fw) [n:127.0.0.1:56468_hz_%2Fw c:control_collection s:shard1 r:core_node1 x:collection1] o.a.s.r.ManagedResourceStorage Setting up ZooKeeper-based storage for the RestManager with znodeBase: /configs/conf1
   [junit4]   2> 177205 INFO  (coreLoadExecutor-467-thread-1-processing-n:127.0.0.1:56468_hz_%2Fw) [n:127.0.0.1:56468_hz_%2Fw c:control_collection s:shard1 r:core_node1 x:collection1] o.a.s.r.ManagedResourceStorage Configured ZooKeeperStorageIO with znodeBase: /configs/conf1
   [junit4]   2> 177205 INFO  (coreLoadExecutor-467-thread-1-processing-n:127.0.0.1:56468_hz_%2Fw) [n:127.0.0.1:56468_hz_%2Fw c:control_collection s:shard1 r:core_node1 x:collection1] o.a.s.r.RestManager Initializing RestManager with initArgs: {}
   [junit4]   2> 177205 INFO  (coreLoadExecutor-467-thread-1-processing-n:127.0.0.1:56468_hz_%2Fw) [n:127.0.0.1:56468_hz_%2Fw c:control_collection s:shard1 r:core_node1 x:collection1] o.a.s.r.ManagedResourceStorage Reading _rest_managed.json using ZooKeeperStorageIO:path=/configs/conf1
   [junit4]   2> 177206 INFO  (coreLoadExecutor-467-thread-1-processing-n:127.0.0.1:56468_hz_%2Fw) [n:127.0.0.1:56468_hz_%2Fw c:control_collection s:shard1 r:core_node1 x:collection1] o.a.s.r.ManagedResourceStorage No data found for znode /configs/conf1/_rest_managed.json
   [junit4]   2> 177206 INFO  (coreLoadExecutor-467-thread-1-processing-n:127.0.0.1:56468_hz_%2Fw) [n:127.0.0.1:56468_hz_%2Fw c:control_collection s:shard1 r:core_node1 x:collection1] o.a.s.r.ManagedResourceStorage Loaded null at path _rest_managed.json using ZooKeeperStorageIO:path=/configs/conf1
   [junit4]   2> 177206 INFO  (coreLoadExecutor-467-thread-1-processing-n:127.0.0.1:56468_hz_%2Fw) [n:127.0.0.1:56468_hz_%2Fw c:control_collection s:shard1 r:core_node1 x:collection1] o.a.s.r.RestManager Initializing 0 registered ManagedResources
   [junit4]   2> 177206 INFO  (coreLoadExecutor-467-thread-1-processing-n:127.0.0.1:56468_hz_%2Fw) [n:127.0.0.1:56468_hz_%2Fw c:control_collection s:shard1 r:core_node1 x:collection1] o.a.s.h.ReplicationHandler Commits will be reserved for  10000
   [junit4]   2> 177206 INFO  (coreLoadExecutor-467-thread-1-processing-n:127.0.0.1:56468_hz_%2Fw) [n:127.0.0.1:56468_hz_%2Fw c:control_collection s:shard1 r:core_node1 x:collection1] o.a.s.u.UpdateLog Looking up max value of version field to seed version buckets
   [junit4]   2> 177206 INFO  (coreLoadExecutor-467-thread-1-processing-n:127.0.0.1:56468_hz_%2Fw) [n:127.0.0.1:56468_hz_%2Fw c:control_collection s:shard1 r:core_node1 x:collection1] o.a.s.u.VersionInfo Refreshing highest value of _version_ for 65536 version buckets from index
   [junit4]   2> 177207 INFO  (coreLoadExecutor-467-thread-1-processing-n:127.0.0.1:56468_hz_%2Fw) [n:127.0.0.1:56468_hz_%2Fw c:control_collection s:shard1 r:core_node1 x:collection1] o.a.s.u.VersionInfo No terms found for _version_, cannot seed version bucket highest value from index
   [junit4]   2> 177207 INFO  (coreLoadExecutor-467-thread-1-processing-n:127.0.0.1:56468_hz_%2Fw) [n:127.0.0.1:56468_hz_%2Fw c:control_collection s:shard1 r:core_node1 x:collection1] o.a.s.u.UpdateLog Could not find max version in index or recent updates, using new clock 1540983317265907712
   [junit4]   2> 177208 INFO  (coreLoadExecutor-467-thread-1-processing-n:127.0.0.1:56468_hz_%2Fw) [n:127.0.0.1:56468_hz_%2Fw c:control_collection s:shard1 r:core_node1 x:collection1] o.a.s.u.UpdateLog Took 1.0ms to seed version buckets with highest version 1540983317265907712
   [junit4]   2> 177209 INFO  (coreLoadExecutor-467-thread-1-processing-n:127.0.0.1:56468_hz_%2Fw) [n:127.0.0.1:56468_hz_%2Fw c:control_collection s:shard1 r:core_node1 x:collection1] o.a.s.c.ZkController watch zkdir /configs/conf1
   [junit4]   2> 177210 INFO  (searcherExecutor-468-thread-1-processing-n:127.0.0.1:56468_hz_%2Fw x:collection1 s:shard1 c:control_collection r:core_node1) [n:127.0.0.1:56468_hz_%2Fw c:control_collection s:shard1 r:core_node1 x:collection1] o.a.s.c.SolrCore [collection1] Registered new searcher Searcher@762e477b[collection1] main{ExitableDirectoryReader(UninvertingDirectoryReader())}
   [junit4]   2> 177210 INFO  (coreLoadExecutor-467-thread-1-processing-n:127.0.0.1:56468_hz_%2Fw) [n:127.0.0.1:56468_hz_%2Fw c:control_collection s:shard1 r:core_node1 x:collection1] o.a.s.c.CoreContainer registering core: collection1
   [junit4]   2> 177210 INFO  (coreZkRegister-461-thread-1-processing-n:127.0.0.1:56468_hz_%2Fw x:collection1 s:shard1 c:control_collection r:core_node1) [n:127.0.0.1:56468_hz_%2Fw c:control_collection s:shard1 r:core_node1 x:collection1] o.a.s.c.ZkController Register replica - core:collection1 address:https://127.0.0.1:56468/hz_/w collection:control_collection shard:shard1
   [junit4]   2> 177211 INFO  (coreZkRegister-461-thread-1-processing-n:127.0.0.1:56468_hz_%2Fw x:collection1 s:shard1 c:control_collection r:core_node1) [n:127.0.0.1:56468_hz_%2Fw c:control_collection s:shard1 r:core_node1 x:collection1] o.a.s.c.c.SolrZkClient makePath: /collections/control_collection/leader_elect/shard1/election
   [junit4]   2> 177219 INFO  (coreZkRegister-461-thread-1-processing-n:127.0.0.1:56468_hz_%2Fw x:collection1 s:shard1 c:control_collection r:core_node1) [n:127.0.0.1:56468_hz_%2Fw c:control_collection s:shard1 r:core_node1 x:collection1] o.a.s.c.LeaderElector Joined leadership election with path: /collections/control_collection/leader_elect/shard1/election/96311457290387461-core_node1-n_0000000000
   [junit4]   2> 177219 INFO  (coreZkRegister-461-thread-1-processing-n:127.0.0.1:56468_hz_%2Fw x:collection1 s:shard1 c:control_collection r:core_node1) [n:127.0.0.1:56468_hz_%2Fw c:control_collection s:shard1 r:core_node1 x:collection1] o.a.s.c.ShardLeaderElectionContext Running the leader process for shard=shard1 and weAreReplacement=false and leaderVoteWait=10000
   [junit4]   2> 177221 INFO  (coreZkRegister-461-thread-1-processing-n:127.0.0.1:56468_hz_%2Fw x:collection1 s:shard1 c:control_collection r:core_node1) [n:127.0.0.1:56468_hz_%2Fw c:control_collection s:shard1 r:core_node1 x:collection1] o.a.s.c.ShardLeaderElectionContext Enough replicas found to continue.
   [junit4]   2> 177221 INFO  (coreZkRegister-461-thread-1-processing-n:127.0.0.1:56468_hz_%2Fw x:collection1 s:shard1 c:control_collection r:core_node1) [n:127.0.0.1:56468_hz_%2Fw c:control_collection s:shard1 r:core_node1 x:collection1] o.a.s.c.ShardLeaderElectionContext I may be the new leader - try and sync
   [junit4]   2> 177221 INFO  (coreZkRegister-461-thread-1-processing-n:127.0.0.1:56468_hz_%2Fw x:collection1 s:shard1 c:control_collection r:core_node1) [n:127.0.0.1:56468_hz_%2Fw c:control_collection s:shard1 r:core_node1 x:collection1] o.a.s.c.SyncStrategy Sync replicas to https://127.0.0.1:56468/hz_/w/collection1/
   [junit4]   2> 177221 INFO  (coreZkRegister-461-thread-1-processing-n:127.0.0.1:56468_hz_%2Fw x:collection1 s:shard1 c:control_collection r:core_node1) [n:127.0.0.1:56468_hz_%2Fw c:control_collection s:shard1 r:core_node1 x:collection1] o.a.s.c.SyncStrategy Sync Success - now sync replicas to me
   [junit4]   2> 177222 INFO  (coreZkRegister-461-thread-1-processing-n:127.0.0.1:56468_hz_%2Fw x:collection1 s:shard1 c:control_collection r:core_node1) [n:127.0.0.1:56468_hz_%2Fw c:control_collection s:shard1 r:core_node1 x:collection1] o.a.s.c.SyncStrategy https://127.0.0.1:56468/hz_/w/collection1/ has no replicas
   [junit4]   2> 177222 INFO  (OverseerStateUpdate-96311457290387461-127.0.0.1:56468_hz_%2Fw-n_0000000000) [n:127.0.0.1:56468_hz_%2Fw    ] o.a.s.c.Overseer processMessage: queueSize: 1, message = {
   [junit4]   2>   "operation":"leader",
   [junit4]   2>   "shard":"shard1",
   [junit4]   2>   "collection":"control_collection"} current state version: 1
   [junit4]   2> 177223 INFO  (coreZkRegister-461-thread-1-processing-n:127.0.0.1:56468_hz_%2Fw x:collection1 s:shard1 c:control_collection r:core_node1) [n:127.0.0.1:56468_hz_%2Fw c:control_collection s:shard1 r:core_node1 x:collection1] o.a.s.c.c.SolrZkClient makePath: /collections/control_collection/leaders/shard1
   [junit4]   2> 177225 INFO  (coreZkRegister-461-thread-1-processing-n:127.0.0.1:56468_hz_%2Fw x:collection1 s:shard1 c:control_collection r:core_node1) [n:127.0.0.1:56468_hz_%2Fw c:control_collection s:shard1 r:core_node1 x:collection1] o.a.s.c.ShardLeaderElectionContextBase Creating leader registration node /collections/control_collection/leaders/shard1/leader after winning as /collections/control_collection/leader_elect/shard1/election/96311457290387461-core_node1-n_0000000000
   [junit4]   2> 177227 INFO  (coreZkRegister-461-thread-1-processing-n:127.0.0.1:56468_hz_%2Fw x:collection1 s:shard1 c:control_collection r:core_node1) [n:127.0.0.1:56468_hz_%2Fw c:control_collection s:shard1 r:core_node1 x:collection1] o.a.s.c.ShardLeaderElectionContext I am the new leader: https://127.0.0.1:56468/hz_/w/collection1/ shard1
   [junit4]   2> 177227 INFO  (OverseerStateUpdate-96311457290387461-127.0.0.1:56468_hz_%2Fw-n_0000000000) [n:127.0.0.1:56468_hz_%2Fw    ] o.a.s.c.Overseer processMessage: queueSize: 1, message = {
   [junit4]   2>   "operation":"leader",
   [junit4]   2>   "shard":"shard1",
   [junit4]   2>   "collection":"control_collection",
   [junit4]   2>   "base_url":"https://127.0.0.1:56468/hz_/w",
   [junit4]   2>   "core":"collection1",
   [junit4]   2>   "state":"active"} current state version: 1
   [junit4]   2> 177335 INFO  (zkCallback-247-thread-3-processing-n:127.0.0.1:56468_hz_%2Fw) [n:127.0.0.1:56468_hz_%2Fw    ] o.a.s.c.c.ZkStateReader A cluster state change: [WatchedEvent state:SyncConnected type:NodeDataChanged path:/clusterstate.json], has occurred - updating... (live nodes size: [1])
   [junit4]   2> 177379 INFO  (coreZkRegister-461-thread-1-processing-n:127.0.0.1:56468_hz_%2Fw x:collection1 s:shard1 c:control_collection r:core_node1) [n:127.0.0.1:56468_hz_%2Fw c:control_collection s:shard1 r:core_node1 x:collection1] o.a.s.c.ZkController We are https://127.0.0.1:56468/hz_/w/collection1/ and leader is https://127.0.0.1:56468/hz_/w/collection1/
   [junit4]   2> 177379 INFO  (coreZkRegister-461-thread-1-processing-n:127.0.0.1:56468_hz_%2Fw x:collection1 s:shard1 c:control_collection r:core_node1) [n:127.0.0.1:56468_hz_%2Fw c:control_collection s:shard1 r:core_node1 x:collection1] o.a.s.c.ZkController No LogReplay needed for core=collection1 baseURL=https://127.0.0.1:56468/hz_/w
   [junit4]   2> 177379 INFO  (coreZkRegister-461-thread-1-processing-n:127.0.0.1:56468_hz_%2Fw x:collection1 s:shard1 c:control_collection r:core_node1) [n:127.0.0.1:56468_hz_%2Fw c:control_collection s:shard1 r:core_node1 x:collection1] o.a.s.c.ZkController I am the leader, no recovery necessary
   [junit4]   2> 177379 INFO  (coreZkRegister-461-thread-1-processing-n:127.0.0.1:56468_hz_%2Fw x:collection1 s:shard1 c:control_collection r:core_node1) [n:127.0.0.1:56468_hz_%2Fw c:control_collection s:shard1 r:core_node1 x:collection1] o.a.s.c.ZkController publishing state=active
   [junit4]   2> 177379 INFO  (coreZkRegister-461-thread-1-processing-n:127.0.0.1:56468_hz_%2Fw x:collection1 s:shard1 c:control_collection r:core_node1) [n:127.0.0.1:56468_hz_%2Fw c:control_collection s:shard1 r:core_node1 x:collection1] o.a.s.c.ZkController numShards not found on descriptor - reading it from system property
   [junit4]   2> 177380 INFO  (coreZkRegister-461-thread-1-processing-n:127.0.0.1:56468_hz_%2Fw x:collection1 s:shard1 c:control_collection r:core_node1) [n:127.0.0.1:56468_hz_%2Fw c:control_collection s:shard1 r:core_node1 x:collection1] o.a.s.c.c.ZkStateReader Checking legacy cluster state for collection control_collection
   [junit4]   2> 177381 INFO  (OverseerStateUpdate-96311457290387461-127.0.0.1:56468_hz_%2Fw-n_0000000000) [n:127.0.0.1:56468_hz_%2Fw    ] o.a.s.c.Overseer processMessage: queueSize: 1, message = {
   [junit4]   2>   "core":"collection1",
   [junit4]   2>   "core_node_name":"core_node1",
   [junit4]   2>   "roles":null,
   [junit4]   2>   "base_url":"https://127.0.0.1:56468/hz_/w",
   [junit4]   2>   "node_name":"127.0.0.1:56468_hz_%2Fw",
   [junit4]   2>   "numShards":"1",
   [junit4]   2>   "state":"active",
   [junit4]   2>   "shard":"shard1",
   [junit4]   2>   "collection":"control_collection",
   [junit4]   2>   "operation":"state"} current state version: 2
   [junit4]   2> 177381 INFO  (OverseerStateUpdate-96311457290387461-127.0.0.1:56468_hz_%2Fw-n_0000000000) [n:127.0.0.1:56468_hz_%2Fw    ] o.a.s.c.o.ReplicaMutator Update state numShards=1 message={
   [junit4]   2>   "core":"collection1",
   [junit4]   2>   "core_node_name":"core_node1",
   [junit4]   2>   "roles":null,
   [junit4]   2>   "base_url":"https://127.0.0.1:56468/hz_/w",
   [junit4]   2>   "node_name":"127.0.0.1:56468_hz_%2Fw",
   [junit4]   2>   "numShards":"1",
   [junit4]   2>   "state":"active",
   [junit4]   2>   "shard":"shard1",
   [junit4]   2>   "collection":"control_collection",
   [junit4]   2>   "operation":"state"}
   [junit4]   2> 177467 INFO  (TEST-TestReqParamsAPI.test-seed#[10ABF5368D693666]) [    ] o.a.s.c.c.SolrZkClient Using default ZkCredentialsProvider
   [junit4]   2> 177467 INFO  (TEST-TestReqParamsAPI.test-seed#[10ABF5368D693666]) [    ] o.a.s.c.c.ConnectionManager Waiting for client to connect to ZooKeeper
   [junit4]   2> 177473 INFO  (zkCallback-251-thread-1) [    ] o.a.s.c.c.ConnectionManager Watcher org.apache.solr.common.cloud.ConnectionManager@4df33374 name:ZooKeeperConnection Watcher:127.0.0.1:46324/solr got event WatchedEvent state:SyncConnected type:None path:null path:null type:None
   [junit4]   2> 177473 INFO  (TEST-TestReqParamsAPI.test-seed#[10ABF5368D693666]) [    ] o.a.s.c.c.ConnectionManager Client is connected to ZooKeeper
   [junit4]   2> 177474 INFO  (TEST-TestReqParamsAPI.test-seed#[10ABF5368D693666]) [    ] o.a.s.c.c.SolrZkClient Using default ZkACLProvider
   [junit4]   2> 177474 INFO  (TEST-TestReqParamsAPI.test-seed#[10ABF5368D693666]) [    ] o.a.s.c.c.ZkStateReader Updating cluster state from ZooKeeper... 
   [junit4]   2> 177475 INFO  (TEST-TestReqParamsAPI.test-seed#[10ABF5368D693666]) [    ] o.a.s.c.c.ZkStateReader Loaded cluster properties: {urlScheme=https}
   [junit4]   2> 177475 INFO  (TEST-TestReqParamsAPI.test-seed#[10ABF5368D693666]) [    ] o.a.s.c.c.ZkStateReader Updated live nodes from ZooKeeper... (0) -> (1)
   [junit4]   2> 177476 INFO  (TEST-TestReqParamsAPI.test-seed#[10ABF5368D693666]) [    ] o.a.s.c.ChaosMonkey monkey: init - expire sessions:false cause connection loss:false
   [junit4]   2> 177476 INFO  (TEST-TestReqParamsAPI.test-seed#[10ABF5368D693666]) [    ] o.a.s.c.AbstractFullDistribZkTestBase Creating collection1 with stateFormat=2
   [junit4]   2> 177476 INFO  (TEST-TestReqParamsAPI.test-seed#[10ABF5368D693666]) [    ] o.a.s.c.c.SolrZkClient Using default ZkCredentialsProvider
   [junit4]   2> 177484 INFO  (TEST-TestReqParamsAPI.test-seed#[10ABF5368D693666]) [    ] o.a.s.c.c.ConnectionManager Waiting for client to connect to ZooKeeper
   [junit4]   2> 177484 INFO  (zkCallback-247-thread-2-processing-n:127.0.0.1:56468_hz_%2Fw) [n:127.0.0.1:56468_hz_%2Fw    ] o.a.s.c.c.ZkStateReader A cluster state change: [WatchedEvent state:SyncConnected type:NodeDataChanged path:/clusterstate.json], has occurred - updating... (live nodes size: [1])
   [junit4]   2> 177484 INFO  (zkCallback-251-thread-1) [    ] o.a.s.c.c.ZkStateReader A cluster state change: [WatchedEvent state:SyncConnected type:NodeDataChanged path:/clusterstate.json], has occurred - updating... (live nodes size: [1])
   [junit4]   2> 177485 INFO  (zkCallback-252-thread-1) [    ] o.a.s.c.c.ConnectionManager Watcher org.apache.solr.common.cloud.ConnectionManager@476924ed name:ZooKeeperConnection Watcher:127.0.0.1:46324/solr got event WatchedEvent state:SyncConnected type:None path:null path:null type:None
   [junit4]   2> 177485 INFO  (TEST-TestReqParamsAPI.test-seed#[10ABF5368D693666]) [    ] o.a.s.c.c.ConnectionManager Client is connected to ZooKeeper
   [junit4]   2> 177485 INFO  (TEST-TestReqParamsAPI.test-seed#[10ABF5368D693666]) [    ] o.a.s.c.c.SolrZkClient Using default ZkACLProvider
   [junit4]   2> 177488 INFO  (OverseerStateUpdate-96311457290387461-127.0.0.1:56468_hz_%2Fw-n_0000000000) [n:127.0.0.1:56468_hz_%2Fw    ] o.a.s.c.Overseer processMessage: queueSize: 1, message = {
   [junit4]   2>   "operation":"create",
   [junit4]   2>   "name":"collection1",
   [junit4]   2>   "numShards":"2",
   [junit4]   2>   "stateFormat":"2"} current state version: 3
   [junit4]   2> 177488 INFO  (OverseerStateUpdate-96311457290387461-127.0.0.1:56468_hz_%2Fw-n_0000000000) [n:127.0.0.1:56468_hz_%2Fw    ] o.a.s.c.o.ClusterStateMutator building a new cName: collection1
   [junit4]   2> 177590 INFO  (OverseerStateUpdate-96311457290387461-127.0.0.1:56468_hz_%2Fw-n_0000000000) [n:127.0.0.1:56468_hz_%2Fw    ] o.a.s.c.o.ZkStateWriter going to create_collection /collections/collection1/state.json
   [junit4]   2> 177611 INFO  (TEST-TestReqParamsAPI.test-seed#[10ABF5368D693666]) [    ] o.a.s.SolrTestCaseJ4 Writing core.properties file to /x1/jenkins/jenkins-slave/workspace/Lucene-Solr-NightlyTests-6.x/solr/build/solr-core/test/J0/temp/solr.handler.TestReqParamsAPI_10ABF5368D693666-001/shard-1-001/cores/collection1
   [junit4]   2> 177613 INFO  (TEST-TestReqParamsAPI.test-seed#[10ABF5368D693666]) [    ] o.a.s.c.AbstractFullDistribZkTestBase create jetty 1 in directory /x1/jenkins/jenkins-slave/workspace/Lucene-Solr-NightlyTests-6.x/solr/build/solr-core/test/J0/temp/solr.handler.TestReqParamsAPI_10ABF5368D693666-001/shard-1-001
   [junit4]   2> 177615 INFO  (TEST-TestReqParamsAPI.test-seed#[10ABF5368D693666]) [    ] o.e.j.s.Server jetty-9.3.8.v20160314
   [junit4]   2> 177629 INFO  (TEST-TestReqParamsAPI.test-seed#[10ABF5368D693666]) [    ] o.e.j.s.h.ContextHandler Started o.e.j.s.ServletContextHandler@165437d4{/hz_/w,null,AVAILABLE}
   [junit4]   2> 177631 INFO  (TEST-TestReqParamsAPI.test-seed#[10ABF5368D693666]) [    ] o.e.j.s.ServerConnector Started ServerConnector@1741de5d{SSL,[ssl, http/1.1]}{127.0.0.1:47216}
   [junit4]   2> 177631 INFO  (TEST-TestReqParamsAPI.test-seed#[10ABF5368D693666]) [    ] o.e.j.s.Server Started @180755ms
   [junit4]   2> 177631 INFO  (TEST-TestReqParamsAPI.test-seed#[10ABF5368D693666]) [    ] o.a.s.c.s.e.JettySolrRunner Jetty properties: {solr.data.dir=/x1/jenkins/jenkins-slave/workspace/Lucene-Solr-NightlyTests-6.x/solr/build/solr-core/test/J0/temp/solr.handler.TestReqParamsAPI_10ABF5368D693666-001/tempDir-001/jetty1, solrconfig=solrconfig.xml, hostContext=/hz_/w, hostPort=47216, coreRootDirectory=/x1/jenkins/jenkins-slave/workspace/Lucene-Solr-NightlyTests-6.x/solr/build/solr-core/test/J0/temp/solr.handler.TestReqParamsAPI_10ABF5368D693666-001/shard-1-001/cores}
   [junit4]   2> 177631 INFO  (TEST-TestReqParamsAPI.test-seed#[10ABF5368D693666]) [    ] o.a.s.s.SolrDispatchFilter SolrDispatchFilter.init(): sun.misc.Launcher$AppClassLoader@73d16e93
   [junit4]   2> 177631 INFO  (TEST-TestReqParamsAPI.test-seed#[10ABF5368D693666]) [    ] o.a.s.c.SolrResourceLoader new SolrResourceLoader for directory: '/x1/jenkins/jenkins-slave/workspace/Lucene-Solr-NightlyTests-6.x/solr/build/solr-core/test/J0/temp/solr.handler.TestReqParamsAPI_10ABF5368D693666-001/shard-1-001'
   [junit4]   2> 177632 INFO  (TEST-TestReqParamsAPI.test-seed#[10ABF5368D693666]) [    ] o.a.s.c.SolrResourceLoader JNDI not configured for solr (NoInitialContextEx)
   [junit4]   2> 177632 INFO  (TEST-TestReqParamsAPI.test-seed#[10ABF5368D693666]) [    ] o.a.s.c.SolrResourceLoader solr home defaulted to 'solr/' (could not find system property or JNDI)
   [junit4]   2> 177632 INFO  (TEST-TestReqParamsAPI.test-seed#[10ABF5368D693666]) [    ] o.a.s.c.c.SolrZkClient Using default ZkCredentialsProvider
   [junit4]   2> 177633 INFO  (TEST-TestReqParamsAPI.test-seed#[10ABF5368D693666]) [    ] o.a.s.c.c.ConnectionManager Waiting for client to connect to ZooKeeper
   [junit4]   2> 177640 INFO  (zkCallback-253-thread-1) [    ] o.a.s.c.c.ConnectionManager Watcher org.apache.solr.common.cloud.ConnectionManager@60a65d2f name:ZooKeeperConnection Watcher:127.0.0.1:46324/solr got event WatchedEvent state:SyncConnected type:None path:null path:null type:None
   [junit4]   2> 177640 INFO  (TEST-TestReqParamsAPI.test-seed#[10ABF5368D693666]) [    ] o.a.s.c.c.ConnectionManager Client is connected to ZooKeeper
   [junit4]   2> 177640 INFO  (TEST-TestReqParamsAPI.test-seed#[10ABF5368D693666]) [    ] o.a.s.c.c.SolrZkClient Using default ZkACLProvider
   [junit4]   2> 177649 INFO  (TEST-TestReqParamsAPI.test-seed#[10ABF5368D693666]) [    ] o.a.s.s.SolrDispatchFilter Loading solr.xml from SolrHome (not found in ZooKeeper)
   [junit4]   2> 177650 INFO  (TEST-TestReqParamsAPI.test-seed#[10ABF5368D693666]) [    ] o.a.s.c.SolrXmlConfig Loading container configuration from /x1/jenkins/jenkins-slave/workspace/Lucene-Solr-NightlyTests-6.x/solr/build/solr-core/test/J0/temp/solr.handler.TestReqParamsAPI_10ABF5368D693666-001/shard-1-001/solr.xml
   [junit4]   2> 177656 INFO  (TEST-TestReqParamsAPI.test-seed#[10ABF5368D693666]) [    ] o.a.s.c.CorePropertiesLocator Config-defined core root directory: /x1/jenkins/jenkins-slave/workspace/Lucene-Solr-NightlyTests-6.x/solr/build/solr-core/test/J0/temp/solr.handler.TestReqParamsAPI_10ABF5368D693666-001/shard-1-001/cores
   [junit4]   2> 177656 INFO  (TEST-TestReqParamsAPI.test-seed#[10ABF5368D693666]) [    ] o.a.s.c.CoreContainer New CoreContainer 1860857874
   [junit4]   2> 177656 INFO  (TEST-TestReqParamsAPI.test-seed#[10ABF5368D693666]) [    ] o.a.s.c.CoreContainer Loading cores into CoreContainer [instanceDir=/x1/jenkins/jenkins-slave/workspace/Lucene-Solr-NightlyTests-6.x/solr/build/solr-core/test/J0/temp/solr.handler.TestReqParamsAPI_10ABF5368D693666-001/shard-1-001]
   [junit4]   2> 177656 WARN  (TEST-TestReqParamsAPI.test-seed#[10ABF5368D693666]) [    ] o.a.s.c.CoreContainer Couldn't add files from /x1/jenkins/jenkins-slave/workspace/Lucene-Solr-NightlyTests-6.x/solr/build/solr-core/test/J0/temp/solr.handler.TestReqParamsAPI_10ABF5368D693666-001/shard-1-001/lib to classpath: /x1/jenkins/jenkins-slave/workspace/Lucene-Solr-NightlyTests-6.x/solr/build/solr-core/test/J0/temp/solr.handler.TestReqParamsAPI_10ABF5368D693666-001/shard-1-001/lib
   [junit4]   2> 177656 INFO  (TEST-TestReqParamsAPI.test-seed#[10ABF5368D693666]) [    ] o.a.s.h.c.HttpShardHandlerFactory created with socketTimeout : 90000,urlScheme : ,connTimeout : 15000,maxConnectionsPerHost : 20,maxConnections : 10000,corePoolSize : 0,maximumPoolSize : 2147483647,maxThreadIdleTime : 5,sizeOfQueue : -1,fairnessPolicy : false,useRetries : false,connectionsEvictorSleepDelay : 5000,maxConnectionIdleTime : 40000,
   [junit4]   2> 177666 INFO  (TEST-TestReqParamsAPI.test-seed#[10ABF5368D693666]) [    ] o.a.s.u.UpdateShardHandler Creating UpdateShardHandler HTTP client with params: socketTimeout=340000&connTimeout=45000&retry=true
   [junit4]   2> 177667 INFO  (TEST-TestReqParamsAPI.test-seed#[10ABF5368D693666]) [    ] o.a.s.l.LogWatcher SLF4J impl is org.slf4j.impl.Log4jLoggerFactory
   [junit4]   2> 177668 INFO  (TEST-TestReqParamsAPI.test-seed#[10ABF5368D693666]) [    ] o.a.s.l.LogWatcher Registering Log Listener [Log4j (org.slf4j.impl.Log4jLoggerFactory)]
   [junit4]   2> 177668 INFO  (TEST-TestReqParamsAPI.test-seed#[10ABF5368D693666]) [    ] o.a.s.c.ZkContainer Zookeeper client=127.0.0.1:46324/solr
   [junit4]   2> 177668 INFO  (TEST-TestReqParamsAPI.test-seed#[10ABF5368D693666]) [    ] o.a.s.c.ZkController zkHost includes chroot
   [junit4]   2> 177668 INFO  (TEST-TestReqParamsAPI.test-seed#[10ABF5368D693666]) [    ] o.a.s.c.c.SolrZkClient Using default ZkCredentialsProvider
   [junit4]   2> 177669 INFO  (TEST-TestReqParamsAPI.test-seed#[10ABF5368D693666]) [    ] o.a.s.c.c.ConnectionManager Waiting for client to connect to ZooKeeper
   [junit4]   2> 177678 INFO  (zkCallback-256-thread-1) [    ] o.a.s.c.c.ConnectionManager Watcher org.apache.solr.common.cloud.ConnectionManager@3d13ee33 name:ZooKeeperConnection Watcher:127.0.0.1:46324 got event WatchedEvent state:SyncConnected type:None path:null path:null type:None
   [junit4]   2> 177678 INFO  (TEST-TestReqParamsAPI.test-seed#[10ABF5368D693666]) [    ] o.a.s.c.c.ConnectionManager Client is connected to ZooKeeper
   [junit4]   2> 177679 INFO  (TEST-TestReqParamsAPI.test-seed#[10ABF5368D693666]) [    ] o.a.s.c.c.SolrZkClient Using default ZkACLProvider
   [junit4]   2> 177680 INFO  (TEST-TestReqParamsAPI.test-seed#[10ABF5368D693666]) [n:127.0.0.1:47216_hz_%2Fw    ] o.a.s.c.ZkController Added new OnReconnect listener org.apache.solr.cloud.ZkController$$Lambda$50/377473286@57ad8a56
   [junit4]   2> 177681 INFO  (TEST-TestReqParamsAPI.test-seed#[10ABF5368D693666]) [n:127.0.0.1:47216_hz_%2Fw    ] o.a.s.c.c.ConnectionManager Waiting for client to connect to ZooKeeper
   [junit4]   2> 177682 INFO  (zkCallback-257-thread-1-processing-n:127.0.0.1:47216_hz_%2Fw) [n:127.0.0.1:47216_hz_%2Fw    ] o.a.s.c.c.ConnectionManager Watcher org.apache.solr.common.cloud.ConnectionManager@1a45bffd name:ZooKeeperConnection Watcher:127.0.0.1:46324/solr got event WatchedEvent state:SyncConnected type:None path:null path:null type:None
   [junit4]   2> 177682 INFO  (TEST-TestReqParamsAPI.test-seed#[10ABF5368D693666]) [n:127.0.0.1:47216_hz_%2Fw    ] o.a.s.c.c.ConnectionManager Client is connected to ZooKeeper
   [junit4]   2> 177686 INFO  (TEST-TestReqParamsAPI.test-seed#[10ABF5368D693666]) [n:127.0.0.1:47216_hz_%2Fw    ] o.a.s.c.c.ZkStateReader Updating cluster state from ZooKeeper... 
   [junit4]   2> 177687 INFO  (TEST-TestReqParamsAPI.test-seed#[10ABF5368D693666]) [n:127.0.0.1:47216_hz_%2Fw    ] o.a.s.c.c.ZkStateReader Loaded cluster properties: {urlScheme=https}
   [junit4]   2> 177690 INFO  (TEST-TestReqParamsAPI.test-seed#[10ABF5368D693666]) [n:127.0.0.1:47216_hz_%2Fw    ] o.a.s.c.c.ZkStateReader Updated live nodes from ZooKeeper... (0) -> (1)
   [junit4]   2> 177692 INFO  (TEST-TestReqParamsAPI.test-seed#[10ABF5368D693666]) [n:127.0.0.1:47216_hz_%2Fw    ] o.a.s.c.Overseer Overseer (id=null) closing
   [junit4]   2> 177692 INFO  (TEST-TestReqParamsAPI.test-seed#[10ABF5368D693666]) [n:127.0.0.1:47216_hz_%2Fw    ] o.a.s.c.LeaderElector Joined leadership election with path: /overseer_elect/election/96311457290387466-127.0.0.1:47216_hz_%2Fw-n_0000000001
   [junit4]   2> 177693 INFO  (TEST-TestReqParamsAPI.test-seed#[10ABF5368D693666]) [n:127.0.0.1:47216_hz_%2Fw    ] o.a.s.c.LeaderElector Watching path /overseer_elect/election/96311457290387461-127.0.0.1:56468_hz_%2Fw-n_0000000000 to know if I could be the leader
   [junit4]   2> 177693 INFO  (TEST-TestReqParamsAPI.test-seed#[10ABF5368D693666]) [n:127.0.0.1:47216_hz_%2Fw    ] o.a.s.c.ZkController Publish node=127.0.0.1:47216_hz_%2Fw as DOWN
   [junit4]   2> 177694 INFO  (TEST-TestReqParamsAPI.test-seed#[10ABF5368D693666]) [n:127.0.0.1:47216_hz_%2Fw    ] o.a.s.c.ZkController Register node as live in ZooKeeper:/live_nodes/127.0.0.1:47216_hz_%2Fw
   [junit4]   2> 177694 INFO  (TEST-TestReqParamsAPI.test-seed#[10ABF5368D693666]) [n:127.0.0.1:47216_hz_%2Fw    ] o.a.s.c.c.SolrZkClient makePath: /live_nodes/127.0.0.1:47216_hz_%2Fw
   [junit4]   2> 177695 INFO  (zkCallback-251-thread-1) [    ] o.a.s.c.c.ZkStateReader A live node change: [WatchedEvent state:SyncConnected type:NodeChildrenChanged path:/live_nodes], has occurred - updating... (live nodes size: [1])
   [junit4]   2> 177695 INFO  (zkCallback-251-thread-1) [    ] o.a.s.c.c.ZkStateReader Updated live nodes from ZooKeeper... (1) -> (2)
   [junit4]   2> 177698 INFO  (zkCallback-247-thread-1-processing-n:127.0.0.1:56468_hz_%2Fw) [n:127.0.0.1:56468_hz_%2Fw    ] o.a.s.c.c.ZkStateReader A live node change: [WatchedEvent state:SyncConnected type:NodeChildrenChanged path:/live_nodes], has occurred - updating... (live nodes size: [1])
   [junit4]   2> 177698 INFO  (zkCallback-257-thread-1-processing-n:127.0.0.1:47216_hz_%2Fw) [n:127.0.0.1:47216_hz_%2Fw    ] o.a.s.c.c.ZkStateReader A live node change: [WatchedEvent state:SyncConnected type:NodeChildrenChanged path:/live_nodes], has occurred - updating... (live nodes size: [1])
   [junit4]   2> 177698 INFO  (zkCallback-247-thread-1-processing-n:127.0.0.1:56468_hz_%2Fw) [n:127.0.0.1:56468_hz_%2Fw    ] o.a.s.c.c.ZkStateReader Updated live nodes from ZooKeeper... (1) -> (2)
   [junit4]   2> 177698 INFO  (OverseerStateUpdate-96311457290387461-127.0.0.1:56468_hz_%2Fw-n_0000000000) [n:127.0.0.1:56468_hz_%2Fw    ] o.a.s.c.Overseer processMessage: queueSize: 1, message = {
   [junit4]   2>   "operation":"downnode",
   [junit4]   2>   "node_name":"127.0.0.1:47216_hz_%2Fw"} current state version: 3
   [junit4]   2> 177699 INFO  (OverseerStateUpdate-96311457290387461-127.0.0.1:56468_hz_%2Fw-n_0000000000) [n:127.0.0.1:56468_hz_%2Fw    ] o.a.s.c.o.NodeMutator DownNode state invoked for node: 127.0.0.1:47216_hz_%2Fw
   [junit4]   2> 177700 INFO  (zkCallback-251-thread-1) [    ] o.a.s.c.c.ZkStateReader A cluster state change: [WatchedEvent state:SyncConnected type:NodeDataChanged path:/clusterstate.json], has occurred - updating... (live nodes size: [2])
   [junit4]   2> 177700 INFO  (zkCallback-247-thread-1-processing-n:127.0.0.1:56468_hz_%2Fw) [n:127.0.0.1:56468_hz_%2Fw    ] o.a.s.c.c.ZkStateReader A cluster state change: [WatchedEvent state:SyncConnected type:NodeDataChanged path:/clusterstate.json], has occurred - updating... (live nodes size: [2])
   [junit4]   2> 177703 INFO  (zkCallback-257-thread-1-processing-n:127.0.0.1:47216_hz_%2Fw) [n:127.0.0.1:47216_hz_%2Fw    ] o.a.s.c.c.ZkStateReader Updated live nodes from Zo

[...truncated too long message...]

0.0-M15.jar:/x1/jenkins/jenkins-slave/workspace/Lucene-Solr-NightlyTests-6.x/solr/core/test-lib/apacheds-interceptors-subtree-2.0.0-M15.jar:/x1/jenkins/jenkins-slave/workspace/Lucene-Solr-NightlyTests-6.x/solr/core/test-lib/apacheds-interceptors-trigger-2.0.0-M15.jar:/x1/jenkins/jenkins-slave/workspace/Lucene-Solr-NightlyTests-6.x/solr/core/test-lib/apacheds-jdbm-partition-2.0.0-M15.jar:/x1/jenkins/jenkins-slave/workspace/Lucene-Solr-NightlyTests-6.x/solr/core/test-lib/apacheds-jdbm1-2.0.0-M2.jar:/x1/jenkins/jenkins-slave/workspace/Lucene-Solr-NightlyTests-6.x/solr/core/test-lib/apacheds-kerberos-codec-2.0.0-M15.jar:/x1/jenkins/jenkins-slave/workspace/Lucene-Solr-NightlyTests-6.x/solr/core/test-lib/apacheds-ldif-partition-2.0.0-M15.jar:/x1/jenkins/jenkins-slave/workspace/Lucene-Solr-NightlyTests-6.x/solr/core/test-lib/apacheds-mavibot-partition-2.0.0-M15.jar:/x1/jenkins/jenkins-slave/workspace/Lucene-Solr-NightlyTests-6.x/solr/core/test-lib/apacheds-protocol-kerberos-2.0.0-M15.jar:/x1/jenkins/jenkins-slave/workspace/Lucene-Solr-NightlyTests-6.x/solr/core/test-lib/apacheds-protocol-ldap-2.0.0-M15.jar:/x1/jenkins/jenkins-slave/workspace/Lucene-Solr-NightlyTests-6.x/solr/core/test-lib/apacheds-protocol-shared-2.0.0-M15.jar:/x1/jenkins/jenkins-slave/workspace/Lucene-Solr-NightlyTests-6.x/solr/core/test-lib/apacheds-xdbm-partition-2.0.0-M15.jar:/x1/jenkins/jenkins-slave/workspace/Lucene-Solr-NightlyTests-6.x/solr/core/test-lib/api-all-1.0.0-M20.jar:/x1/jenkins/jenkins-slave/workspace/Lucene-Solr-NightlyTests-6.x/solr/core/test-lib/bcprov-jdk15-1.45.jar:/x1/jenkins/jenkins-slave/workspace/Lucene-Solr-NightlyTests-6.x/solr/core/test-lib/cglib-nodep-2.2.jar:/x1/jenkins/jenkins-slave/workspace/Lucene-Solr-NightlyTests-6.x/solr/core/test-lib/commons-collections-3.2.2.jar:/x1/jenkins/jenkins-slave/workspace/Lucene-Solr-NightlyTests-6.x/solr/core/test-lib/commons-math3-3.4.1.jar:/x1/jenkins/jenkins-slave/workspace/Lucene-Solr-NightlyTests-6.x/solr/core/test-lib/easymock-3.0.jar:/x1/jenkins/jenkins-slave/workspace/Lucene-Solr-NightlyTests-6.x/solr/core/test-lib/ehcache-core-2.4.4.jar:/x1/jenkins/jenkins-slave/workspace/Lucene-Solr-NightlyTests-6.x/solr/core/test-lib/hadoop-common-2.7.2-tests.jar:/x1/jenkins/jenkins-slave/workspace/Lucene-Solr-NightlyTests-6.x/solr/core/test-lib/hadoop-hdfs-2.7.2-tests.jar:/x1/jenkins/jenkins-slave/workspace/Lucene-Solr-NightlyTests-6.x/solr/core/test-lib/hadoop-minikdc-2.7.2.jar:/x1/jenkins/jenkins-slave/workspace/Lucene-Solr-NightlyTests-6.x/solr/core/test-lib/htrace-core-3.2.0-incubating.jar:/x1/jenkins/jenkins-slave/workspace/Lucene-Solr-NightlyTests-6.x/solr/core/test-lib/jackson-annotations-2.5.4.jar:/x1/jenkins/jenkins-slave/workspace/Lucene-Solr-NightlyTests-6.x/solr/core/test-lib/jackson-core-asl-1.9.13.jar:/x1/jenkins/jenkins-slave/workspace/Lucene-Solr-NightlyTests-6.x/solr/core/test-lib/jackson-databind-2.5.4.jar:/x1/jenkins/jenkins-slave/workspace/Lucene-Solr-NightlyTests-6.x/solr/core/test-lib/jackson-mapper-asl-1.9.13.jar:/x1/jenkins/jenkins-slave/workspace/Lucene-Solr-NightlyTests-6.x/solr/core/test-lib/jersey-core-1.9.jar:/x1/jenkins/jenkins-slave/workspace/Lucene-Solr-NightlyTests-6.x/solr/core/test-lib/jersey-server-1.9.jar:/x1/jenkins/jenkins-slave/workspace/Lucene-Solr-NightlyTests-6.x/solr/core/test-lib/jetty-6.1.26.jar:/x1/jenkins/jenkins-slave/workspace/Lucene-Solr-NightlyTests-6.x/solr/core/test-lib/jetty-util-6.1.26.jar:/x1/jenkins/jenkins-slave/workspace/Lucene-Solr-NightlyTests-6.x/solr/core/test-lib/mina-core-2.0.0-M5.jar:/x1/jenkins/jenkins-slave/workspace/Lucene-Solr-NightlyTests-6.x/solr/core/test-lib/mockito-core-1.9.5.jar:/x1/jenkins/jenkins-slave/workspace/Lucene-Solr-NightlyTests-6.x/solr/core/test-lib/netty-all-4.0.36.Final.jar:/x1/jenkins/jenkins-slave/workspace/Lucene-Solr-NightlyTests-6.x/solr/core/test-lib/objenesis-1.2.jar:/x1/jenkins/jenkins-slave/workspace/Lucene-Solr-NightlyTests-6.x/solr/core/test-lib/presto-parser-0.122.jar:/x1/jenkins/jenkins-slave/workspace/Lucene-Solr-NightlyTests-6.x/solr/core/test-lib/slice-0.10.jar:/x1/jenkins/jenkins-slave/workspace/Lucene-Solr-NightlyTests-6.x/lucene/build/analysis/icu/lucene-analyzers-icu-6.2.0-SNAPSHOT.jar:/x1/jenkins/jenkins-slave/workspace/Lucene-Solr-NightlyTests-6.x/solr/build/contrib/solr-analysis-extras/classes/java:/x1/jenkins/jenkins-slave/workspace/Lucene-Solr-NightlyTests-6.x/lucene/build/queryparser/classes/test:/x1/jenkins/jenkins-slave/workspace/Lucene-Solr-NightlyTests-6.x/solr/contrib/analysis-extras/lib/icu4j-56.1.jar:/home/jenkins/jenkins-slave/tools/hudson.tasks.Ant_AntInstallation/ant-1.8.2/lib/ant-launcher.jar:/x1/jenkins/.ant/lib/ivy-2.3.0.jar:/home/jenkins/jenkins-slave/tools/hudson.tasks.Ant_AntInstallation/ant-1.8.2/lib/ant-antlr.jar:/home/jenkins/jenkins-slave/tools/hudson.tasks.Ant_AntInstallation/ant-1.8.2/lib/ant-apache-regexp.jar:/home/jenkins/jenkins-slave/tools/hudson.tasks.Ant_AntInstallation/ant-1.8.2/lib/ant-apache-resolver.jar:/home/jenkins/jenkins-slave/tools/hudson.tasks.Ant_AntInstallation/ant-1.8.2/lib/ant-commons-net.jar:/home/jenkins/jenkins-slave/tools/hudson.tasks.Ant_AntInstallation/ant-1.8.2/lib/ant-jmf.jar:/home/jenkins/jenkins-slave/tools/hudson.tasks.Ant_AntInstallation/ant-1.8.2/lib/ant-apache-oro.jar:/home/jenkins/jenkins-slave/tools/hudson.tasks.Ant_AntInstallation/ant-1.8.2/lib/ant-apache-xalan2.jar:/home/jenkins/jenkins-slave/tools/hudson.tasks.Ant_AntInstallation/ant-1.8.2/lib/ant-commons-logging.jar:/home/jenkins/jenkins-slave/tools/hudson.tasks.Ant_AntInstallation/ant-1.8.2/lib/ant-jsch.jar:/home/jenkins/jenkins-slave/tools/hudson.tasks.Ant_AntInstallation/ant-1.8.2/lib/ant-junit4.jar:/home/jenkins/jenkins-slave/tools/hudson.tasks.Ant_AntInstallation/ant-1.8.2/lib/ant-javamail.jar:/home/jenkins/jenkins-slave/tools/hudson.tasks.Ant_AntInstallation/ant-1.8.2/lib/ant-jai.jar:/home/jenkins/jenkins-slave/tools/hudson.tasks.Ant_AntInstallation/ant-1.8.2/lib/ant-jdepend.jar:/home/jenkins/jenkins-slave/tools/hudson.tasks.Ant_AntInstallation/ant-1.8.2/lib/ant-junit.jar:/home/jenkins/jenkins-slave/tools/hudson.tasks.Ant_AntInstallation/ant-1.8.2/lib/ant-apache-bsf.jar:/home/jenkins/jenkins-slave/tools/hudson.tasks.Ant_AntInstallation/ant-1.8.2/lib/ant-swing.jar:/home/jenkins/jenkins-slave/tools/hudson.tasks.Ant_AntInstallation/ant-1.8.2/lib/ant.jar:/home/jenkins/jenkins-slave/tools/hudson.tasks.Ant_AntInstallation/ant-1.8.2/lib/ant-netrexx.jar:/home/jenkins/jenkins-slave/tools/hudson.tasks.Ant_AntInstallation/ant-1.8.2/lib/ant-apache-bcel.jar:/home/jenkins/jenkins-slave/tools/hudson.tasks.Ant_AntInstallation/ant-1.8.2/lib/ant-testutil.jar:/home/jenkins/jenkins-slave/tools/hudson.tasks.Ant_AntInstallation/ant-1.8.2/lib/ant-apache-log4j.jar:/x1/jenkins/jenkins-slave/tools/hudson.model.JDK/latest1.8/lib/tools.jar:/x1/jenkins/.ivy2/cache/com.carrotsearch.randomizedtesting/junit4-ant/jars/junit4-ant-2.3.4.jar com.carrotsearch.ant.tasks.junit4.slave.SlaveMainSafe -eventsfile /x1/jenkins/jenkins-slave/workspace/Lucene-Solr-NightlyTests-6.x/solr/build/solr-core/test/temp/junit4-J2-20160727_050711_309.events @/x1/jenkins/jenkins-slave/workspace/Lucene-Solr-NightlyTests-6.x/solr/build/solr-core/test/temp/junit4-J2-20160727_050711_309.suites -stdin
   [junit4] ERROR: JVM J2 ended with an exception: Quit event not received from the forked process? This may indicate JVM crash or runner bugs.
   [junit4] 	at com.carrotsearch.ant.tasks.junit4.JUnit4.executeSlave(JUnit4.java:1501)
   [junit4] 	at com.carrotsearch.ant.tasks.junit4.JUnit4.access$000(JUnit4.java:121)
   [junit4] 	at com.carrotsearch.ant.tasks.junit4.JUnit4$2.call(JUnit4.java:955)
   [junit4] 	at com.carrotsearch.ant.tasks.junit4.JUnit4$2.call(JUnit4.java:952)
   [junit4] 	at java.util.concurrent.FutureTask.run(FutureTask.java:266)
   [junit4] 	at java.util.concurrent.ThreadPoolExecutor.runWorker(ThreadPoolExecutor.java:1142)
   [junit4] 	at java.util.concurrent.ThreadPoolExecutor$Worker.run(ThreadPoolExecutor.java:617)
   [junit4] 	at java.lang.Thread.run(Thread.java:745)

BUILD FAILED
/x1/jenkins/jenkins-slave/workspace/Lucene-Solr-NightlyTests-6.x/build.xml:771: The following error occurred while executing this line:
/x1/jenkins/jenkins-slave/workspace/Lucene-Solr-NightlyTests-6.x/build.xml:707: The following error occurred while executing this line:
/x1/jenkins/jenkins-slave/workspace/Lucene-Solr-NightlyTests-6.x/build.xml:59: The following error occurred while executing this line:
/x1/jenkins/jenkins-slave/workspace/Lucene-Solr-NightlyTests-6.x/solr/build.xml:233: The following error occurred while executing this line:
/x1/jenkins/jenkins-slave/workspace/Lucene-Solr-NightlyTests-6.x/solr/common-build.xml:536: The following error occurred while executing this line:
/x1/jenkins/jenkins-slave/workspace/Lucene-Solr-NightlyTests-6.x/lucene/common-build.xml:1443: The following error occurred while executing this line:
/x1/jenkins/jenkins-slave/workspace/Lucene-Solr-NightlyTests-6.x/lucene/common-build.xml:984: At least one slave process threw an exception, first: Quit event not received from the forked process? This may indicate JVM crash or runner bugs.

Total time: 483 minutes 8 seconds
Build step 'Invoke Ant' marked build as failure
Archiving artifacts
ERROR: Failed to archive {solr/build/solr-core/test/temp/junit4-J1-20160727_050711_309.events=solr/build/solr-core/test/temp/junit4-J1-20160727_050711_309.events, README.txt=README.txt, solr/build/solr-core/test/temp/junit4-J0-20160727_050711_309.events=solr/build/solr-core/test/temp/junit4-J0-20160727_050711_309.events, heapdumps/java_pid6266.hprof=heapdumps/java_pid6266.hprof, heapdumps/java_pid6267.hprof=heapdumps/java_pid6267.hprof, solr/build/solr-core/test/temp/junit4-J2-20160727_050711_309.events=solr/build/solr-core/test/temp/junit4-J2-20160727_050711_309.events} due to internal error; falling back to full archiving
java.lang.NullPointerException
Recording test results
Email was triggered for: Failure - Any
Sending email for trigger: Failure - Any




Mime
View raw message