lucene-dev mailing list archives

Site index · List index
Message view « Date » · « Thread »
Top « Date » · « Thread »
From Policeman Jenkins Server <jenk...@thetaphi.de>
Subject [JENKINS] Lucene-Solr-6.x-Windows (64bit/jdk1.8.0_92) - Build # 295 - Still Failing!
Date Tue, 05 Jul 2016 00:30:43 GMT
Build: http://jenkins.thetaphi.de/job/Lucene-Solr-6.x-Windows/295/
Java: 64bit/jdk1.8.0_92 -XX:-UseCompressedOops -XX:+UseG1GC

1 tests failed.
FAILED:  junit.framework.TestSuite.org.apache.lucene.search.TestLiveFieldValues

Error Message:
Could not remove the following files (in the order of attempts):    C:\Users\jenkins\workspace\Lucene-Solr-6.x-Windows\lucene\build\core\test\J0\temp\lucene.search.TestLiveFieldValues_ADB1A07FC497DB73-001\livefieldupdates-001:
java.nio.file.AccessDeniedException: C:\Users\jenkins\workspace\Lucene-Solr-6.x-Windows\lucene\build\core\test\J0\temp\lucene.search.TestLiveFieldValues_ADB1A07FC497DB73-001\livefieldupdates-001
   C:\Users\jenkins\workspace\Lucene-Solr-6.x-Windows\lucene\build\core\test\J0\temp\lucene.search.TestLiveFieldValues_ADB1A07FC497DB73-001:
java.nio.file.DirectoryNotEmptyException: C:\Users\jenkins\workspace\Lucene-Solr-6.x-Windows\lucene\build\core\test\J0\temp\lucene.search.TestLiveFieldValues_ADB1A07FC497DB73-001


Stack Trace:
java.io.IOException: Could not remove the following files (in the order of attempts):
   C:\Users\jenkins\workspace\Lucene-Solr-6.x-Windows\lucene\build\core\test\J0\temp\lucene.search.TestLiveFieldValues_ADB1A07FC497DB73-001\livefieldupdates-001:
java.nio.file.AccessDeniedException: C:\Users\jenkins\workspace\Lucene-Solr-6.x-Windows\lucene\build\core\test\J0\temp\lucene.search.TestLiveFieldValues_ADB1A07FC497DB73-001\livefieldupdates-001
   C:\Users\jenkins\workspace\Lucene-Solr-6.x-Windows\lucene\build\core\test\J0\temp\lucene.search.TestLiveFieldValues_ADB1A07FC497DB73-001:
java.nio.file.DirectoryNotEmptyException: C:\Users\jenkins\workspace\Lucene-Solr-6.x-Windows\lucene\build\core\test\J0\temp\lucene.search.TestLiveFieldValues_ADB1A07FC497DB73-001

	at __randomizedtesting.SeedInfo.seed([ADB1A07FC497DB73]:0)
	at org.apache.lucene.util.IOUtils.rm(IOUtils.java:323)
	at org.apache.lucene.util.TestRuleTemporaryFilesCleanup.afterAlways(TestRuleTemporaryFilesCleanup.java:216)
	at com.carrotsearch.randomizedtesting.rules.TestRuleAdapter$1.afterAlways(TestRuleAdapter.java:31)
	at com.carrotsearch.randomizedtesting.rules.StatementAdapter.evaluate(StatementAdapter.java:43)
	at com.carrotsearch.randomizedtesting.rules.StatementAdapter.evaluate(StatementAdapter.java:36)
	at org.apache.lucene.util.TestRuleAssertionsRequired$1.evaluate(TestRuleAssertionsRequired.java:53)
	at org.apache.lucene.util.TestRuleMarkFailure$1.evaluate(TestRuleMarkFailure.java:47)
	at org.apache.lucene.util.TestRuleIgnoreAfterMaxFailures$1.evaluate(TestRuleIgnoreAfterMaxFailures.java:64)
	at org.apache.lucene.util.TestRuleIgnoreTestSuites$1.evaluate(TestRuleIgnoreTestSuites.java:54)
	at com.carrotsearch.randomizedtesting.rules.StatementAdapter.evaluate(StatementAdapter.java:36)
	at com.carrotsearch.randomizedtesting.ThreadLeakControl$StatementRunner.run(ThreadLeakControl.java:367)
	at java.lang.Thread.run(Thread.java:745)




Build Log:
[...truncated 1145 lines...]
   [junit4] Suite: org.apache.lucene.search.TestLiveFieldValues
   [junit4]   2> NOTE: test params are: codec=Asserting(Lucene62): {id=PostingsFormat(name=Direct)},
docValues:{}, maxPointsInLeafNode=1550, maxMBSortInHeap=7.777715307974528, sim=ClassicSimilarity,
locale=de-CH, timezone=VST
   [junit4]   2> NOTE: Windows 10 10.0 amd64/Oracle Corporation 1.8.0_92 (64-bit)/cpus=3,threads=1,free=418069280,total=520093696
   [junit4]   2> NOTE: All tests run in this JVM: [TestSubScorerFreqs, TestPostingsOffsets,
TestLegacyNumericUtils, TestDocInverterPerFieldErrorInfo, TestFilterDirectoryReader, TestBytesRefAttImpl,
TestFSTs, TestPolygon2D, TestLongPostings, TestSimilarity, TestBooleanMinShouldMatch, TestSortRescorer,
TestMultiTermsEnum, TestExitableDirectoryReader, Test2BPostings, Test2BTerms, TestUnicodeUtil,
TestLucene50FieldInfoFormat, TestBasics, TestTermsEnum, TestSloppyMath, TestIndexFileDeleter,
TestBytesStore, MultiCollectorTest, TestPositiveScoresOnlyCollector, TestMultiFields, TestOfflineSorter,
TestPayloadsOnVectors, TestMaxPosition, TestTimSorterWorstCase, TestSegmentTermEnum, TestCharArrayMap,
TestFuzzyQuery, TestStringMSBRadixSorter, TestField, TestPhraseQuery, TestGeoUtils, TestFixedBitSet,
TestNRTCachingDirectory, TestRoaringDocIdSet, TestCharTermAttributeImpl, TestNotDocIdSet,
TestAllFilesHaveChecksumFooter, TestMultiCollector, TestBM25Similarity, TestIndexSorting,
TestBlockPostingsFormat2, TestWeakIdentityMap, TestTerms, TestLucene53NormsFormat, TestBagOfPositions,
TestNIOFSDirectory, TestBufferedIndexInput, TestReaderWrapperDVTypeCheck, TestDisjunctionMaxQuery,
TestElevationComparator, TestLongBitSet, TestSpanExplanations, TestSearchAfter, TestRecyclingByteBlockAllocator,
TestBinaryDocument, TestIndexWriterCommit, TestCharFilter, TestBagOfPostings, TestDocValuesRewriteMethod,
TestFieldMaskingSpanQuery, Test2BBKDPoints, TestSynonymQuery, Test2BPagedBytes, TestHighCompressionMode,
Test2BSortedDocValuesFixedSorted, TestIndexWriterOnDiskFull, TestParallelReaderEmptyIndex,
TestSumDocFreq, TestPhrasePrefixQuery, TestMultiTermQueryRewrites, TestFastDecompressionMode,
TestTopDocsMerge, TestDocumentsWriterDeleteQueue, TestAllFilesHaveCodecHeader, TestSegmentTermDocs,
TestSparseFixedBitSet, TestBytesRef, TestVersion, TestSpanOrQuery, TestFilterIterator, TestDocIdsWriter,
TestBooleanRewrites, TestNumericDocValuesUpdates, TestRateLimiter, TestBooleanQuery, TestOperations,
TestFilterLeafReader, TestFlex, TestFieldCacheRewriteMethod, TestTwoPhaseCommitTool, TestMergeRateLimiter,
TestSpanNearQuery, TestAllFilesCheckIndexHeader, Test2BNumericDocValues, TestPerSegmentDeletes,
TestSnapshotDeletionPolicy, TestCharacterUtils, TestIndexWriterMerging, TestWildcardRandom,
TestDuelingCodecsAtNight, Test2BBinaryDocValues, TestFixedLengthBytesRefArray, TestNRTThreads,
TestDuelingCodecs, TestStressAdvance, TestTimeLimitingCollector, TestMinimize, TestRollingUpdates,
TestIndexWriterUnicode, TestTieredMergePolicy, TestArrayUtil, TestByteSlices, TestLockFactory,
TestSegmentMerger, TestRegexpRandom2, TestPagedBytes, TestMultiDocValues, TestDocValuesIndexing,
TestSimilarityBase, TestDeterminizeLexicon, TestCustomNorms, TestMixedCodecs, TestRAMDirectory,
TestMultiPhraseQuery, TestMergeSchedulerExternal, TestBytesRefHash, TestStressNRT, TestIndexInput,
TestForceMergeForever, TestNearSpansOrdered, TestSameScoresWithThreads, TestTermRangeQuery,
TestMultiTermConstantScore, TestLiveFieldValues]
   [junit4]   2> NOTE: reproduce with: ant test  -Dtestcase=TestLiveFieldValues -Dtests.seed=ADB1A07FC497DB73
-Dtests.slow=true -Dtests.locale=de-CH -Dtests.timezone=VST -Dtests.asserts=true -Dtests.file.encoding=US-ASCII
   [junit4] ERROR   0.00s J0 | TestLiveFieldValues (suite) <<<
   [junit4]    > Throwable #1: java.io.IOException: Could not remove the following files
(in the order of attempts):
   [junit4]    >    C:\Users\jenkins\workspace\Lucene-Solr-6.x-Windows\lucene\build\core\test\J0\temp\lucene.search.TestLiveFieldValues_ADB1A07FC497DB73-001\livefieldupdates-001:
java.nio.file.AccessDeniedException: C:\Users\jenkins\workspace\Lucene-Solr-6.x-Windows\lucene\build\core\test\J0\temp\lucene.search.TestLiveFieldValues_ADB1A07FC497DB73-001\livefieldupdates-001
   [junit4]    >    C:\Users\jenkins\workspace\Lucene-Solr-6.x-Windows\lucene\build\core\test\J0\temp\lucene.search.TestLiveFieldValues_ADB1A07FC497DB73-001:
java.nio.file.DirectoryNotEmptyException: C:\Users\jenkins\workspace\Lucene-Solr-6.x-Windows\lucene\build\core\test\J0\temp\lucene.search.TestLiveFieldValues_ADB1A07FC497DB73-001
   [junit4]    > 	at __randomizedtesting.SeedInfo.seed([ADB1A07FC497DB73]:0)
   [junit4]    > 	at org.apache.lucene.util.IOUtils.rm(IOUtils.java:323)
   [junit4]    > 	at java.lang.Thread.run(Thread.java:745)
   [junit4] Completed [288/433 (1!)] on J0 in 0.38s, 1 test, 1 error <<< FAILURES!

[...truncated 496 lines...]
BUILD FAILED
C:\Users\jenkins\workspace\Lucene-Solr-6.x-Windows\build.xml:740: The following error occurred
while executing this line:
C:\Users\jenkins\workspace\Lucene-Solr-6.x-Windows\build.xml:684: The following error occurred
while executing this line:
C:\Users\jenkins\workspace\Lucene-Solr-6.x-Windows\build.xml:59: The following error occurred
while executing this line:
C:\Users\jenkins\workspace\Lucene-Solr-6.x-Windows\lucene\build.xml:50: The following error
occurred while executing this line:
C:\Users\jenkins\workspace\Lucene-Solr-6.x-Windows\lucene\common-build.xml:1427: The following
error occurred while executing this line:
C:\Users\jenkins\workspace\Lucene-Solr-6.x-Windows\lucene\common-build.xml:984: There were
test failures: 433 suites (1 ignored), 3709 tests, 1 suite-level error, 71 ignored (67 assumptions)
[seed: ADB1A07FC497DB73]

Total time: 7 minutes 55 seconds
Build step 'Invoke Ant' marked build as failure
Archiving artifacts
[WARNINGS] Skipping publisher since build result is FAILURE
Recording test results
Email was triggered for: Failure - Any
Sending email for trigger: Failure - Any



Mime
View raw message