lucene-dev mailing list archives

Site index · List index
Message view « Date » · « Thread »
Top « Date » · « Thread »
From Policeman Jenkins Server <jenk...@thetaphi.de>
Subject [JENKINS] Lucene-Solr-6.x-Solaris (64bit/jdk1.8.0) - Build # 293 - Unstable!
Date Wed, 27 Jul 2016 01:48:39 GMT
Build: http://jenkins.thetaphi.de/job/Lucene-Solr-6.x-Solaris/293/
Java: 64bit/jdk1.8.0 -XX:+UseCompressedOops -XX:+UseParallelGC

3 tests failed.
FAILED:  junit.framework.TestSuite.org.apache.solr.core.TestLazyCores

Error Message:
ObjectTracker found 4 object(s) that were not released!!! [MDCAwareThreadPoolExecutor, MockDirectoryWrapper, MockDirectoryWrapper, SolrCore]

Stack Trace:
java.lang.AssertionError: ObjectTracker found 4 object(s) that were not released!!! [MDCAwareThreadPoolExecutor, MockDirectoryWrapper, MockDirectoryWrapper, SolrCore]
	at __randomizedtesting.SeedInfo.seed([4C707C46A220E571]:0)
	at org.junit.Assert.fail(Assert.java:93)
	at org.junit.Assert.assertTrue(Assert.java:43)
	at org.junit.Assert.assertNull(Assert.java:551)
	at org.apache.solr.SolrTestCaseJ4.teardownTestCases(SolrTestCaseJ4.java:258)
	at sun.reflect.NativeMethodAccessorImpl.invoke0(Native Method)
	at sun.reflect.NativeMethodAccessorImpl.invoke(NativeMethodAccessorImpl.java:62)
	at sun.reflect.DelegatingMethodAccessorImpl.invoke(DelegatingMethodAccessorImpl.java:43)
	at java.lang.reflect.Method.invoke(Method.java:498)
	at com.carrotsearch.randomizedtesting.RandomizedRunner.invoke(RandomizedRunner.java:1764)
	at com.carrotsearch.randomizedtesting.RandomizedRunner$7.evaluate(RandomizedRunner.java:834)
	at com.carrotsearch.randomizedtesting.rules.StatementAdapter.evaluate(StatementAdapter.java:36)
	at com.carrotsearch.randomizedtesting.rules.SystemPropertiesRestoreRule$1.evaluate(SystemPropertiesRestoreRule.java:57)
	at org.apache.lucene.util.AbstractBeforeAfterRule$1.evaluate(AbstractBeforeAfterRule.java:45)
	at com.carrotsearch.randomizedtesting.rules.StatementAdapter.evaluate(StatementAdapter.java:36)
	at org.apache.lucene.util.TestRuleStoreClassName$1.evaluate(TestRuleStoreClassName.java:41)
	at com.carrotsearch.randomizedtesting.rules.NoShadowingOrOverridesOnMethodsRule$1.evaluate(NoShadowingOrOverridesOnMethodsRule.java:40)
	at com.carrotsearch.randomizedtesting.rules.NoShadowingOrOverridesOnMethodsRule$1.evaluate(NoShadowingOrOverridesOnMethodsRule.java:40)
	at com.carrotsearch.randomizedtesting.rules.StatementAdapter.evaluate(StatementAdapter.java:36)
	at com.carrotsearch.randomizedtesting.rules.StatementAdapter.evaluate(StatementAdapter.java:36)
	at com.carrotsearch.randomizedtesting.rules.StatementAdapter.evaluate(StatementAdapter.java:36)
	at org.apache.lucene.util.TestRuleAssertionsRequired$1.evaluate(TestRuleAssertionsRequired.java:53)
	at org.apache.lucene.util.TestRuleMarkFailure$1.evaluate(TestRuleMarkFailure.java:47)
	at org.apache.lucene.util.TestRuleIgnoreAfterMaxFailures$1.evaluate(TestRuleIgnoreAfterMaxFailures.java:64)
	at org.apache.lucene.util.TestRuleIgnoreTestSuites$1.evaluate(TestRuleIgnoreTestSuites.java:54)
	at com.carrotsearch.randomizedtesting.rules.StatementAdapter.evaluate(StatementAdapter.java:36)
	at com.carrotsearch.randomizedtesting.ThreadLeakControl$StatementRunner.run(ThreadLeakControl.java:367)
	at java.lang.Thread.run(Thread.java:745)


FAILED:  junit.framework.TestSuite.org.apache.solr.core.TestLazyCores

Error Message:
1 thread leaked from SUITE scope at org.apache.solr.core.TestLazyCores:     1) Thread[id=709, name=searcherExecutor-272-thread-1, state=WAITING, group=TGRP-TestLazyCores]         at sun.misc.Unsafe.park(Native Method)         at java.util.concurrent.locks.LockSupport.park(LockSupport.java:175)         at java.util.concurrent.locks.AbstractQueuedSynchronizer$ConditionObject.await(AbstractQueuedSynchronizer.java:2039)         at java.util.concurrent.LinkedBlockingQueue.take(LinkedBlockingQueue.java:442)         at java.util.concurrent.ThreadPoolExecutor.getTask(ThreadPoolExecutor.java:1067)         at java.util.concurrent.ThreadPoolExecutor.runWorker(ThreadPoolExecutor.java:1127)         at java.util.concurrent.ThreadPoolExecutor$Worker.run(ThreadPoolExecutor.java:617)         at java.lang.Thread.run(Thread.java:745)

Stack Trace:
com.carrotsearch.randomizedtesting.ThreadLeakError: 1 thread leaked from SUITE scope at org.apache.solr.core.TestLazyCores: 
   1) Thread[id=709, name=searcherExecutor-272-thread-1, state=WAITING, group=TGRP-TestLazyCores]
        at sun.misc.Unsafe.park(Native Method)
        at java.util.concurrent.locks.LockSupport.park(LockSupport.java:175)
        at java.util.concurrent.locks.AbstractQueuedSynchronizer$ConditionObject.await(AbstractQueuedSynchronizer.java:2039)
        at java.util.concurrent.LinkedBlockingQueue.take(LinkedBlockingQueue.java:442)
        at java.util.concurrent.ThreadPoolExecutor.getTask(ThreadPoolExecutor.java:1067)
        at java.util.concurrent.ThreadPoolExecutor.runWorker(ThreadPoolExecutor.java:1127)
        at java.util.concurrent.ThreadPoolExecutor$Worker.run(ThreadPoolExecutor.java:617)
        at java.lang.Thread.run(Thread.java:745)
	at __randomizedtesting.SeedInfo.seed([4C707C46A220E571]:0)


FAILED:  junit.framework.TestSuite.org.apache.solr.core.TestLazyCores

Error Message:
There are still zombie threads that couldn't be terminated:    1) Thread[id=709, name=searcherExecutor-272-thread-1, state=WAITING, group=TGRP-TestLazyCores]         at sun.misc.Unsafe.park(Native Method)         at java.util.concurrent.locks.LockSupport.park(LockSupport.java:175)         at java.util.concurrent.locks.AbstractQueuedSynchronizer$ConditionObject.await(AbstractQueuedSynchronizer.java:2039)         at java.util.concurrent.LinkedBlockingQueue.take(LinkedBlockingQueue.java:442)         at java.util.concurrent.ThreadPoolExecutor.getTask(ThreadPoolExecutor.java:1067)         at java.util.concurrent.ThreadPoolExecutor.runWorker(ThreadPoolExecutor.java:1127)         at java.util.concurrent.ThreadPoolExecutor$Worker.run(ThreadPoolExecutor.java:617)         at java.lang.Thread.run(Thread.java:745)

Stack Trace:
com.carrotsearch.randomizedtesting.ThreadLeakError: There are still zombie threads that couldn't be terminated:
   1) Thread[id=709, name=searcherExecutor-272-thread-1, state=WAITING, group=TGRP-TestLazyCores]
        at sun.misc.Unsafe.park(Native Method)
        at java.util.concurrent.locks.LockSupport.park(LockSupport.java:175)
        at java.util.concurrent.locks.AbstractQueuedSynchronizer$ConditionObject.await(AbstractQueuedSynchronizer.java:2039)
        at java.util.concurrent.LinkedBlockingQueue.take(LinkedBlockingQueue.java:442)
        at java.util.concurrent.ThreadPoolExecutor.getTask(ThreadPoolExecutor.java:1067)
        at java.util.concurrent.ThreadPoolExecutor.runWorker(ThreadPoolExecutor.java:1127)
        at java.util.concurrent.ThreadPoolExecutor$Worker.run(ThreadPoolExecutor.java:617)
        at java.lang.Thread.run(Thread.java:745)
	at __randomizedtesting.SeedInfo.seed([4C707C46A220E571]:0)




Build Log:
[...truncated 10688 lines...]
   [junit4] Suite: org.apache.solr.core.TestLazyCores
   [junit4]   2> Creating dataDir: /export/home/jenkins/workspace/Lucene-Solr-6.x-Solaris/solr/build/solr-core/test/J0/temp/solr.core.TestLazyCores_4C707C46A220E571-001/init-core-data-001
   [junit4]   2> 45472 INFO  (SUITE-TestLazyCores-seed#[4C707C46A220E571]-worker) [    ] o.a.s.SolrTestCaseJ4 Randomized ssl (false) and clientAuth (false) via: @org.apache.solr.util.RandomizeSSL(reason=, value=NaN, ssl=NaN, clientAuth=NaN)
   [junit4]   2> 45474 INFO  (TEST-TestLazyCores.testLazySearch-seed#[4C707C46A220E571]) [    ] o.a.s.SolrTestCaseJ4 ###Starting testLazySearch
   [junit4]   2> 45506 INFO  (TEST-TestLazyCores.testLazySearch-seed#[4C707C46A220E571]) [    ] o.a.s.c.SolrResourceLoader new SolrResourceLoader for directory: '/export/home/jenkins/workspace/Lucene-Solr-6.x-Solaris/solr/build/solr-core/test/J0/temp/solr.core.TestLazyCores_4C707C46A220E571-001/tempDir-001'
   [junit4]   2> 45506 INFO  (TEST-TestLazyCores.testLazySearch-seed#[4C707C46A220E571]) [    ] o.a.s.c.SolrResourceLoader JNDI not configured for solr (NoInitialContextEx)
   [junit4]   2> 45506 INFO  (TEST-TestLazyCores.testLazySearch-seed#[4C707C46A220E571]) [    ] o.a.s.c.SolrResourceLoader solr home defaulted to 'solr/' (could not find system property or JNDI)
   [junit4]   2> 45506 INFO  (TEST-TestLazyCores.testLazySearch-seed#[4C707C46A220E571]) [    ] o.a.s.c.CoreContainer New CoreContainer 1516180186
   [junit4]   2> 45506 INFO  (TEST-TestLazyCores.testLazySearch-seed#[4C707C46A220E571]) [    ] o.a.s.c.CoreContainer Loading cores into CoreContainer [instanceDir=/export/home/jenkins/workspace/Lucene-Solr-6.x-Solaris/solr/build/solr-core/test/J0/temp/solr.core.TestLazyCores_4C707C46A220E571-001/tempDir-001]
   [junit4]   2> 45507 WARN  (TEST-TestLazyCores.testLazySearch-seed#[4C707C46A220E571]) [    ] o.a.s.c.CoreContainer Couldn't add files from /export/home/jenkins/workspace/Lucene-Solr-6.x-Solaris/solr/build/solr-core/test/J0/temp/solr.core.TestLazyCores_4C707C46A220E571-001/tempDir-001/lib to classpath: /export/home/jenkins/workspace/Lucene-Solr-6.x-Solaris/solr/build/solr-core/test/J0/temp/solr.core.TestLazyCores_4C707C46A220E571-001/tempDir-001/lib
   [junit4]   2> 45507 INFO  (TEST-TestLazyCores.testLazySearch-seed#[4C707C46A220E571]) [    ] o.a.s.h.c.HttpShardHandlerFactory created with socketTimeout : 600000,connTimeout : 60000,maxConnectionsPerHost : 20,maxConnections : 10000,corePoolSize : 0,maximumPoolSize : 2147483647,maxThreadIdleTime : 5,sizeOfQueue : -1,fairnessPolicy : false,useRetries : false,connectionsEvictorSleepDelay : 5000,maxConnectionIdleTime : 40000,
   [junit4]   2> 45510 INFO  (TEST-TestLazyCores.testLazySearch-seed#[4C707C46A220E571]) [    ] o.a.s.u.UpdateShardHandler Creating UpdateShardHandler HTTP client with params: socketTimeout=600000&connTimeout=60000&retry=true
   [junit4]   2> 45510 INFO  (TEST-TestLazyCores.testLazySearch-seed#[4C707C46A220E571]) [    ] o.a.s.c.SolrCores Allocating transient cache for 4 transient cores
   [junit4]   2> 45511 INFO  (TEST-TestLazyCores.testLazySearch-seed#[4C707C46A220E571]) [    ] o.a.s.l.LogWatcher SLF4J impl is org.slf4j.impl.Log4jLoggerFactory
   [junit4]   2> 45511 INFO  (TEST-TestLazyCores.testLazySearch-seed#[4C707C46A220E571]) [    ] o.a.s.l.LogWatcher Registering Log Listener [Log4j (org.slf4j.impl.Log4jLoggerFactory)]
   [junit4]   2> 45511 INFO  (TEST-TestLazyCores.testLazySearch-seed#[4C707C46A220E571]) [    ] o.a.s.c.CoreContainer Security conf doesn't exist. Skipping setup for authorization module.
   [junit4]   2> 45511 INFO  (TEST-TestLazyCores.testLazySearch-seed#[4C707C46A220E571]) [    ] o.a.s.c.CoreContainer No authentication plugin used.
   [junit4]   2> 45513 INFO  (TEST-TestLazyCores.testLazySearch-seed#[4C707C46A220E571]) [    ] o.a.s.c.CoreDescriptor Created CoreDescriptor: {name=collection1, config=solrconfig.xml, loadOnStartup=true, schema=schema.xml, configSetProperties=configsetprops.json, transient=false, dataDir=data/}
   [junit4]   2> 45513 INFO  (TEST-TestLazyCores.testLazySearch-seed#[4C707C46A220E571]) [    ] o.a.s.c.CoreDescriptor Created CoreDescriptor: {name=collection2, config=solrconfig.xml, loadOnStartup=true, schema=schema.xml, configSetProperties=configsetprops.json, transient=true, dataDir=data/}
   [junit4]   2> 45513 INFO  (TEST-TestLazyCores.testLazySearch-seed#[4C707C46A220E571]) [    ] o.a.s.c.CoreDescriptor Created CoreDescriptor: {name=collection3, config=solrconfig.xml, loadOnStartup=false, schema=schema.xml, configSetProperties=configsetprops.json, transient=on, dataDir=data/}
   [junit4]   2> 45513 INFO  (TEST-TestLazyCores.testLazySearch-seed#[4C707C46A220E571]) [    ] o.a.s.c.CoreDescriptor Created CoreDescriptor: {name=collection4, config=solrconfig.xml, loadOnStartup=false, schema=schema.xml, configSetProperties=configsetprops.json, transient=false, dataDir=data/}
   [junit4]   2> 45513 INFO  (TEST-TestLazyCores.testLazySearch-seed#[4C707C46A220E571]) [    ] o.a.s.c.CoreDescriptor Created CoreDescriptor: {name=collection5, config=solrconfig.xml, loadOnStartup=true, schema=schema.xml, configSetProperties=configsetprops.json, transient=false, dataDir=data/}
   [junit4]   2> 45514 INFO  (TEST-TestLazyCores.testLazySearch-seed#[4C707C46A220E571]) [    ] o.a.s.c.CoreDescriptor Created CoreDescriptor: {name=collection6, config=solrconfig.xml, loadOnStartup=false, schema=schema.xml, configSetProperties=configsetprops.json, transient=true, dataDir=data/}
   [junit4]   2> 45514 INFO  (TEST-TestLazyCores.testLazySearch-seed#[4C707C46A220E571]) [    ] o.a.s.c.CoreDescriptor Created CoreDescriptor: {name=collection7, config=solrconfig.xml, loadOnStartup=false, schema=schema.xml, configSetProperties=configsetprops.json, transient=true, dataDir=data/}
   [junit4]   2> 45514 INFO  (TEST-TestLazyCores.testLazySearch-seed#[4C707C46A220E571]) [    ] o.a.s.c.CoreDescriptor Created CoreDescriptor: {name=collection8, config=solrconfig.xml, loadOnStartup=false, schema=schema.xml, configSetProperties=configsetprops.json, transient=true, dataDir=data/}
   [junit4]   2> 45514 INFO  (TEST-TestLazyCores.testLazySearch-seed#[4C707C46A220E571]) [    ] o.a.s.c.CoreDescriptor Created CoreDescriptor: {name=collection9, config=solrconfig.xml, loadOnStartup=false, schema=schema.xml, configSetProperties=configsetprops.json, transient=true, dataDir=data/}
   [junit4]   2> 45515 INFO  (coreLoadExecutor-203-thread-1) [    ] o.a.s.c.SolrResourceLoader new SolrResourceLoader for directory: '/export/home/jenkins/workspace/Lucene-Solr-6.x-Solaris/solr/build/solr-core/test/J0/temp/solr.core.TestLazyCores_4C707C46A220E571-001/tempDir-001/collection1'
   [junit4]   2> 45516 INFO  (coreLoadExecutor-203-thread-1) [    ] o.a.s.c.SolrResourceLoader JNDI not configured for solr (NoInitialContextEx)
   [junit4]   2> 45516 INFO  (coreLoadExecutor-203-thread-1) [    ] o.a.s.c.SolrResourceLoader solr home defaulted to 'solr/' (could not find system property or JNDI)
   [junit4]   2> 45516 INFO  (coreLoadExecutor-203-thread-3) [    ] o.a.s.c.SolrResourceLoader new SolrResourceLoader for directory: '/export/home/jenkins/workspace/Lucene-Solr-6.x-Solaris/solr/build/solr-core/test/J0/temp/solr.core.TestLazyCores_4C707C46A220E571-001/tempDir-001/collection5'
   [junit4]   2> 45516 INFO  (coreLoadExecutor-203-thread-3) [    ] o.a.s.c.SolrResourceLoader JNDI not configured for solr (NoInitialContextEx)
   [junit4]   2> 45516 INFO  (coreLoadExecutor-203-thread-3) [    ] o.a.s.c.SolrResourceLoader solr home defaulted to 'solr/' (could not find system property or JNDI)
   [junit4]   2> 45518 INFO  (coreLoadExecutor-203-thread-2) [    ] o.a.s.c.SolrResourceLoader new SolrResourceLoader for directory: '/export/home/jenkins/workspace/Lucene-Solr-6.x-Solaris/solr/build/solr-core/test/J0/temp/solr.core.TestLazyCores_4C707C46A220E571-001/tempDir-001/collection2'
   [junit4]   2> 45518 INFO  (coreLoadExecutor-203-thread-2) [    ] o.a.s.c.SolrResourceLoader JNDI not configured for solr (NoInitialContextEx)
   [junit4]   2> 45518 INFO  (coreLoadExecutor-203-thread-2) [    ] o.a.s.c.SolrResourceLoader solr home defaulted to 'solr/' (could not find system property or JNDI)
   [junit4]   2> 45527 INFO  (coreLoadExecutor-203-thread-2) [    ] o.a.s.c.SolrConfig current version of requestparams : -1
   [junit4]   2> 45527 INFO  (coreLoadExecutor-203-thread-1) [    ] o.a.s.c.SolrConfig current version of requestparams : -1
   [junit4]   2> 45527 INFO  (coreLoadExecutor-203-thread-3) [    ] o.a.s.c.SolrConfig current version of requestparams : -1
   [junit4]   2> 45529 INFO  (coreLoadExecutor-203-thread-2) [    ] o.a.s.c.SolrConfig Using Lucene MatchVersion: 6.2.0
   [junit4]   2> 45529 INFO  (coreLoadExecutor-203-thread-1) [    ] o.a.s.c.SolrConfig Using Lucene MatchVersion: 6.2.0
   [junit4]   2> 45530 INFO  (coreLoadExecutor-203-thread-3) [    ] o.a.s.c.SolrConfig Using Lucene MatchVersion: 6.2.0
   [junit4]   2> 45537 INFO  (coreLoadExecutor-203-thread-2) [    ] o.a.s.c.SolrConfig Loaded SolrConfig: solrconfig.xml
   [junit4]   2> 45540 INFO  (coreLoadExecutor-203-thread-2) [    ] o.a.s.s.IndexSchema [collection2] Schema name=tiny
   [junit4]   2> 45543 INFO  (coreLoadExecutor-203-thread-2) [    ] o.a.s.s.IndexSchema unique key field: id
   [junit4]   2> 45544 INFO  (coreLoadExecutor-203-thread-2) [    ] o.a.s.c.ConfigSetProperties Did not find ConfigSet properties, assuming default properties: Can't find resource 'configsetprops.json' in classpath or '/export/home/jenkins/workspace/Lucene-Solr-6.x-Solaris/solr/build/solr-core/test/J0/temp/solr.core.TestLazyCores_4C707C46A220E571-001/tempDir-001/collection2'
   [junit4]   2> 45544 INFO  (coreLoadExecutor-203-thread-2) [    ] o.a.s.c.CoreContainer Creating SolrCore 'collection2' using configuration from instancedir /export/home/jenkins/workspace/Lucene-Solr-6.x-Solaris/solr/build/solr-core/test/J0/temp/solr.core.TestLazyCores_4C707C46A220E571-001/tempDir-001/collection2
   [junit4]   2> 45544 INFO  (coreLoadExecutor-203-thread-2) [    x:collection2] o.a.s.c.SolrCore org.apache.solr.core.MockDirectoryFactory
   [junit4]   2> 45545 INFO  (coreLoadExecutor-203-thread-2) [    x:collection2] o.a.s.c.SolrCore [[collection2] ] Opening new SolrCore at [/export/home/jenkins/workspace/Lucene-Solr-6.x-Solaris/solr/build/solr-core/test/J0/temp/solr.core.TestLazyCores_4C707C46A220E571-001/tempDir-001/collection2], dataDir=[/export/home/jenkins/workspace/Lucene-Solr-6.x-Solaris/solr/build/solr-core/test/J0/temp/solr.core.TestLazyCores_4C707C46A220E571-001/tempDir-001/collection2/data/]
   [junit4]   2> 45545 INFO  (coreLoadExecutor-203-thread-2) [    x:collection2] o.a.s.c.SolrCore JMX monitoring not detected for core: collection2
   [junit4]   2> 45545 INFO  (coreLoadExecutor-203-thread-2) [    x:collection2] o.a.s.c.CachingDirectoryFactory return new directory for /export/home/jenkins/workspace/Lucene-Solr-6.x-Solaris/solr/build/solr-core/test/J0/temp/solr.core.TestLazyCores_4C707C46A220E571-001/tempDir-001/collection2/data
   [junit4]   2> 45545 INFO  (coreLoadExecutor-203-thread-2) [    x:collection2] o.a.s.c.SolrCore New index directory detected: old=null new=/export/home/jenkins/workspace/Lucene-Solr-6.x-Solaris/solr/build/solr-core/test/J0/temp/solr.core.TestLazyCores_4C707C46A220E571-001/tempDir-001/collection2/data/index/
   [junit4]   2> 45545 WARN  (coreLoadExecutor-203-thread-2) [    x:collection2] o.a.s.c.SolrCore [collection2] Solr index directory '/export/home/jenkins/workspace/Lucene-Solr-6.x-Solaris/solr/build/solr-core/test/J0/temp/solr.core.TestLazyCores_4C707C46A220E571-001/tempDir-001/collection2/data/index' doesn't exist. Creating new index...
   [junit4]   2> 45546 INFO  (coreLoadExecutor-203-thread-2) [    x:collection2] o.a.s.c.CachingDirectoryFactory return new directory for /export/home/jenkins/workspace/Lucene-Solr-6.x-Solaris/solr/build/solr-core/test/J0/temp/solr.core.TestLazyCores_4C707C46A220E571-001/tempDir-001/collection2/data/index
   [junit4]   2> 45547 INFO  (coreLoadExecutor-203-thread-2) [    x:collection2] o.a.s.u.RandomMergePolicy RandomMergePolicy wrapping class org.apache.lucene.index.LogByteSizeMergePolicy: [LogByteSizeMergePolicy: minMergeSize=1677721, mergeFactor=33, maxMergeSize=2147483648, maxMergeSizeForForcedMerge=9223372036854775807, calibrateSizeByDeletes=true, maxMergeDocs=2147483647, maxCFSSegmentSizeMB=8.796093022207999E12, noCFSRatio=0.16511331506942897]
   [junit4]   2> 45547 INFO  (coreLoadExecutor-203-thread-2) [    x:collection2] o.a.s.c.SolrDeletionPolicy SolrDeletionPolicy.onCommit: commits: num=1
   [junit4]   2> 	commit{dir=MockDirectoryWrapper(RAMDirectory@23adaa6c lockFactory=org.apache.lucene.store.SingleInstanceLockFactory@4677d2f1),segFN=segments_1,generation=1}
   [junit4]   2> 45547 INFO  (coreLoadExecutor-203-thread-2) [    x:collection2] o.a.s.c.SolrDeletionPolicy newest commit generation = 1
   [junit4]   2> 45547 INFO  (OldIndexDirectoryCleanupThreadForCore-collection2) [    x:collection2] o.a.s.c.SolrCore Looking for old index directories to cleanup for core collection2 in /export/home/jenkins/workspace/Lucene-Solr-6.x-Solaris/solr/build/solr-core/test/J0/temp/solr.core.TestLazyCores_4C707C46A220E571-001/tempDir-001/collection2/data/
   [junit4]   2> 45548 WARN  (OldIndexDirectoryCleanupThreadForCore-collection2) [    x:collection2] o.a.s.c.DirectoryFactory /export/home/jenkins/workspace/Lucene-Solr-6.x-Solaris/solr/build/solr-core/test/J0/temp/solr.core.TestLazyCores_4C707C46A220E571-001/tempDir-001/collection2/data/ does not point to a valid data directory; skipping clean-up of old index directories.
   [junit4]   2> 45549 INFO  (coreLoadExecutor-203-thread-1) [    ] o.a.s.c.SolrConfig Loaded SolrConfig: solrconfig.xml
   [junit4]   2> 45550 INFO  (coreLoadExecutor-203-thread-2) [    x:collection2] o.a.s.c.SolrCore no updateRequestProcessorChain defined as default, creating implicit default
   [junit4]   2> 45552 INFO  (coreLoadExecutor-203-thread-2) [    x:collection2] o.a.s.h.l.XMLLoader xsltCacheLifetimeSeconds=60
   [junit4]   2> 45548 INFO  (coreLoadExecutor-203-thread-3) [    ] o.a.s.c.SolrConfig Loaded SolrConfig: solrconfig.xml
   [junit4]   2> 45554 INFO  (coreLoadExecutor-203-thread-1) [    ] o.a.s.s.IndexSchema [collection1] Schema name=tiny
   [junit4]   2> 45555 INFO  (coreLoadExecutor-203-thread-3) [    ] o.a.s.s.IndexSchema [collection5] Schema name=tiny
   [junit4]   2> 45556 INFO  (coreLoadExecutor-203-thread-1) [    ] o.a.s.s.IndexSchema unique key field: id
   [junit4]   2> 45557 INFO  (coreLoadExecutor-203-thread-2) [    x:collection2] o.a.s.h.l.XMLLoader xsltCacheLifetimeSeconds=60
   [junit4]   2> 45557 INFO  (coreLoadExecutor-203-thread-1) [    ] o.a.s.c.ConfigSetProperties Did not find ConfigSet properties, assuming default properties: Can't find resource 'configsetprops.json' in classpath or '/export/home/jenkins/workspace/Lucene-Solr-6.x-Solaris/solr/build/solr-core/test/J0/temp/solr.core.TestLazyCores_4C707C46A220E571-001/tempDir-001/collection1'
   [junit4]   2> 45557 INFO  (coreLoadExecutor-203-thread-1) [    ] o.a.s.c.CoreContainer Creating SolrCore 'collection1' using configuration from instancedir /export/home/jenkins/workspace/Lucene-Solr-6.x-Solaris/solr/build/solr-core/test/J0/temp/solr.core.TestLazyCores_4C707C46A220E571-001/tempDir-001/collection1
   [junit4]   2> 45557 INFO  (coreLoadExecutor-203-thread-1) [    x:collection1] o.a.s.c.SolrCore org.apache.solr.core.MockDirectoryFactory
   [junit4]   2> 45557 INFO  (coreLoadExecutor-203-thread-1) [    x:collection1] o.a.s.c.SolrCore [[collection1] ] Opening new SolrCore at [/export/home/jenkins/workspace/Lucene-Solr-6.x-Solaris/solr/build/solr-core/test/J0/temp/solr.core.TestLazyCores_4C707C46A220E571-001/tempDir-001/collection1], dataDir=[/export/home/jenkins/workspace/Lucene-Solr-6.x-Solaris/solr/build/solr-core/test/J0/temp/solr.core.TestLazyCores_4C707C46A220E571-001/tempDir-001/collection1/data/]
   [junit4]   2> 45557 INFO  (coreLoadExecutor-203-thread-1) [    x:collection1] o.a.s.c.SolrCore JMX monitoring not detected for core: collection1
   [junit4]   2> 45558 INFO  (coreLoadExecutor-203-thread-2) [    x:collection2] o.a.s.h.l.XMLLoader xsltCacheLifetimeSeconds=60
   [junit4]   2> 45558 INFO  (coreLoadExecutor-203-thread-1) [    x:collection1] o.a.s.c.CachingDirectoryFactory return new directory for /export/home/jenkins/workspace/Lucene-Solr-6.x-Solaris/solr/build/solr-core/test/J0/temp/solr.core.TestLazyCores_4C707C46A220E571-001/tempDir-001/collection1/data
   [junit4]   2> 45558 INFO  (coreLoadExecutor-203-thread-1) [    x:collection1] o.a.s.c.SolrCore New index directory detected: old=null new=/export/home/jenkins/workspace/Lucene-Solr-6.x-Solaris/solr/build/solr-core/test/J0/temp/solr.core.TestLazyCores_4C707C46A220E571-001/tempDir-001/collection1/data/index/
   [junit4]   2> 45558 WARN  (coreLoadExecutor-203-thread-1) [    x:collection1] o.a.s.c.SolrCore [collection1] Solr index directory '/export/home/jenkins/workspace/Lucene-Solr-6.x-Solaris/solr/build/solr-core/test/J0/temp/solr.core.TestLazyCores_4C707C46A220E571-001/tempDir-001/collection1/data/index' doesn't exist. Creating new index...
   [junit4]   2> 45558 INFO  (coreLoadExecutor-203-thread-1) [    x:collection1] o.a.s.c.CachingDirectoryFactory return new directory for /export/home/jenkins/workspace/Lucene-Solr-6.x-Solaris/solr/build/solr-core/test/J0/temp/solr.core.TestLazyCores_4C707C46A220E571-001/tempDir-001/collection1/data/index
   [junit4]   2> 45558 INFO  (coreLoadExecutor-203-thread-1) [    x:collection1] o.a.s.u.RandomMergePolicy RandomMergePolicy wrapping class org.apache.lucene.index.LogByteSizeMergePolicy: [LogByteSizeMergePolicy: minMergeSize=1677721, mergeFactor=33, maxMergeSize=2147483648, maxMergeSizeForForcedMerge=9223372036854775807, calibrateSizeByDeletes=true, maxMergeDocs=2147483647, maxCFSSegmentSizeMB=8.796093022207999E12, noCFSRatio=0.16511331506942897]
   [junit4]   2> 45558 INFO  (coreLoadExecutor-203-thread-2) [    x:collection2] o.a.s.h.l.XMLLoader xsltCacheLifetimeSeconds=60
   [junit4]   2> 45559 INFO  (coreLoadExecutor-203-thread-1) [    x:collection1] o.a.s.c.SolrDeletionPolicy SolrDeletionPolicy.onCommit: commits: num=1
   [junit4]   2> 	commit{dir=MockDirectoryWrapper(RAMDirectory@7b8a51e8 lockFactory=org.apache.lucene.store.SingleInstanceLockFactory@1cbdf706),segFN=segments_1,generation=1}
   [junit4]   2> 45559 INFO  (coreLoadExecutor-203-thread-1) [    x:collection1] o.a.s.c.SolrDeletionPolicy newest commit generation = 1
   [junit4]   2> 45560 INFO  (coreLoadExecutor-203-thread-2) [    x:collection2] o.a.s.c.RequestHandlers Registered paths: /admin/mbeans,/update/json/docs,/admin/luke,/export,/get,/admin/properties,/update/json,/admin/threads,/update/csv,/sql,/graph,/select,/admin/segments,/admin/system,/replication,/config,/stream,/schema,/admin/plugins,/admin/logging,/admin/ping,/update,/admin/file,/terms
   [junit4]   2> 45560 INFO  (coreLoadExecutor-203-thread-2) [    x:collection2] o.a.s.c.SolrCore Using default statsCache cache: org.apache.solr.search.stats.LocalStatsCache
   [junit4]   2> 45560 INFO  (coreLoadExecutor-203-thread-2) [    x:collection2] o.a.s.u.CommitTracker Hard AutoCommit: disabled
   [junit4]   2> 45560 INFO  (coreLoadExecutor-203-thread-2) [    x:collection2] o.a.s.u.CommitTracker Soft AutoCommit: disabled
   [junit4]   2> 45560 INFO  (coreLoadExecutor-203-thread-2) [    x:collection2] o.a.s.u.RandomMergePolicy RandomMergePolicy wrapping class org.apache.lucene.index.LogByteSizeMergePolicy: [LogByteSizeMergePolicy: minMergeSize=1677721, mergeFactor=10, maxMergeSize=2147483648, maxMergeSizeForForcedMerge=9223372036854775807, calibrateSizeByDeletes=false, maxMergeDocs=2147483647, maxCFSSegmentSizeMB=8.796093022207999E12, noCFSRatio=1.0]
   [junit4]   2> 45560 INFO  (coreLoadExecutor-203-thread-1) [    x:collection1] o.a.s.c.SolrCore no updateRequestProcessorChain defined as default, creating implicit default
   [junit4]   2> 45561 INFO  (coreLoadExecutor-203-thread-2) [    x:collection2] o.a.s.c.SolrDeletionPolicy SolrDeletionPolicy.onInit: commits: num=1
   [junit4]   2> 	commit{dir=MockDirectoryWrapper(RAMDirectory@23adaa6c lockFactory=org.apache.lucene.store.SingleInstanceLockFactory@4677d2f1),segFN=segments_1,generation=1}
   [junit4]   2> 45561 INFO  (coreLoadExecutor-203-thread-2) [    x:collection2] o.a.s.c.SolrDeletionPolicy newest commit generation = 1
   [junit4]   2> 45561 INFO  (coreLoadExecutor-203-thread-2) [    x:collection2] o.a.s.s.SolrIndexSearcher Opening [Searcher@6a3bccb1[collection2] main]
   [junit4]   2> 45561 INFO  (OldIndexDirectoryCleanupThreadForCore-collection1) [    x:collection1] o.a.s.c.SolrCore Looking for old index directories to cleanup for core collection1 in /export/home/jenkins/workspace/Lucene-Solr-6.x-Solaris/solr/build/solr-core/test/J0/temp/solr.core.TestLazyCores_4C707C46A220E571-001/tempDir-001/collection1/data/
   [junit4]   2> 45561 INFO  (coreLoadExecutor-203-thread-2) [    x:collection2] o.a.s.r.ManagedResourceStorage File-based storage initialized to use dir: /export/home/jenkins/workspace/Lucene-Solr-6.x-Solaris/solr/build/solr-core/test/J0/temp/solr.core.TestLazyCores_4C707C46A220E571-001/tempDir-001/collection2/conf
   [junit4]   2> 45561 INFO  (coreLoadExecutor-203-thread-2) [    x:collection2] o.a.s.r.RestManager Initializing RestManager with initArgs: {storageDir=/export/home/jenkins/workspace/Lucene-Solr-6.x-Solaris/solr/build/solr-core/test/J0/temp/solr.core.TestLazyCores_4C707C46A220E571-001/tempDir-001/collection2/conf}
   [junit4]   2> 45561 INFO  (coreLoadExecutor-203-thread-2) [    x:collection2] o.a.s.r.ManagedResourceStorage Reading _rest_managed.json using file:dir=/export/home/jenkins/workspace/Lucene-Solr-6.x-Solaris/solr/build/solr-core/test/J0/temp/solr.core.TestLazyCores_4C707C46A220E571-001/tempDir-001/collection2/conf
   [junit4]   2> 45561 WARN  (OldIndexDirectoryCleanupThreadForCore-collection1) [    x:collection1] o.a.s.c.DirectoryFactory /export/home/jenkins/workspace/Lucene-Solr-6.x-Solaris/solr/build/solr-core/test/J0/temp/solr.core.TestLazyCores_4C707C46A220E571-001/tempDir-001/collection1/data/ does not point to a valid data directory; skipping clean-up of old index directories.
   [junit4]   2> 45562 INFO  (coreLoadExecutor-203-thread-2) [    x:collection2] o.a.s.r.RestManager Initializing 0 registered ManagedResources
   [junit4]   2> 45562 INFO  (coreLoadExecutor-203-thread-2) [    x:collection2] o.a.s.h.ReplicationHandler Commits will be reserved for  10000
   [junit4]   2> 45562 INFO  (coreLoadExecutor-203-thread-2) [    x:collection2] o.a.s.c.SolrCores Opening transient core collection2
   [junit4]   2> 45562 INFO  (coreLoadExecutor-203-thread-1) [    x:collection1] o.a.s.h.l.XMLLoader xsltCacheLifetimeSeconds=60
   [junit4]   2> 45562 INFO  (coreLoadExecutor-203-thread-2) [    x:collection2] o.a.s.c.CoreContainer registering core: collection2
   [junit4]   2> 45563 INFO  (searcherExecutor-204-thread-1-processing-x:collection2) [    x:collection2] o.a.s.c.SolrCore [collection2] Registered new searcher Searcher@6a3bccb1[collection2] main{ExitableDirectoryReader(UninvertingDirectoryReader())}
   [junit4]   2> 45563 INFO  (coreLoadExecutor-203-thread-1) [    x:collection1] o.a.s.h.l.XMLLoader xsltCacheLifetimeSeconds=60
   [junit4]   2> 45564 INFO  (coreLoadExecutor-203-thread-3) [    ] o.a.s.s.IndexSchema unique key field: id
   [junit4]   2> 45564 INFO  (coreLoadExecutor-203-thread-1) [    x:collection1] o.a.s.h.l.XMLLoader xsltCacheLifetimeSeconds=60
   [junit4]   2> 45565 INFO  (coreLoadExecutor-203-thread-3) [    ] o.a.s.c.ConfigSetProperties Did not find ConfigSet properties, assuming default properties: Can't find resource 'configsetprops.json' in classpath or '/export/home/jenkins/workspace/Lucene-Solr-6.x-Solaris/solr/build/solr-core/test/J0/temp/solr.core.TestLazyCores_4C707C46A220E571-001/tempDir-001/collection5'
   [junit4]   2> 45565 INFO  (coreLoadExecutor-203-thread-3) [    ] o.a.s.c.CoreContainer Creating SolrCore 'collection5' using configuration from instancedir /export/home/jenkins/workspace/Lucene-Solr-6.x-Solaris/solr/build/solr-core/test/J0/temp/solr.core.TestLazyCores_4C707C46A220E571-001/tempDir-001/collection5
   [junit4]   2> 45565 INFO  (coreLoadExecutor-203-thread-3) [    x:collection5] o.a.s.c.SolrCore org.apache.solr.core.MockDirectoryFactory
   [junit4]   2> 45565 INFO  (coreLoadExecutor-203-thread-3) [    x:collection5] o.a.s.c.SolrCore [[collection5] ] Opening new SolrCore at [/export/home/jenkins/workspace/Lucene-Solr-6.x-Solaris/solr/build/solr-core/test/J0/temp/solr.core.TestLazyCores_4C707C46A220E571-001/tempDir-001/collection5], dataDir=[/export/home/jenkins/workspace/Lucene-Solr-6.x-Solaris/solr/build/solr-core/test/J0/temp/solr.core.TestLazyCores_4C707C46A220E571-001/tempDir-001/collection5/data/]
   [junit4]   2> 45565 INFO  (coreLoadExecutor-203-thread-3) [    x:collection5] o.a.s.c.SolrCore JMX monitoring not detected for core: collection5
   [junit4]   2> 45565 INFO  (coreLoadExecutor-203-thread-3) [    x:collection5] o.a.s.c.CachingDirectoryFactory return new directory for /export/home/jenkins/workspace/Lucene-Solr-6.x-Solaris/solr/build/solr-core/test/J0/temp/solr.core.TestLazyCores_4C707C46A220E571-001/tempDir-001/collection5/data
   [junit4]   2> 45565 INFO  (coreLoadExecutor-203-thread-3) [    x:collection5] o.a.s.c.SolrCore New index directory detected: old=null new=/export/home/jenkins/workspace/Lucene-Solr-6.x-Solaris/solr/build/solr-core/test/J0/temp/solr.core.TestLazyCores_4C707C46A220E571-001/tempDir-001/collection5/data/index/
   [junit4]   2> 45565 WARN  (coreLoadExecutor-203-thread-3) [    x:collection5] o.a.s.c.SolrCore [collection5] Solr index directory '/export/home/jenkins/workspace/Lucene-Solr-6.x-Solaris/solr/build/solr-core/test/J0/temp/solr.core.TestLazyCores_4C707C46A220E571-001/tempDir-001/collection5/data/index' doesn't exist. Creating new index...
   [junit4]   2> 45566 INFO  (coreLoadExecutor-203-thread-3) [    x:collection5] o.a.s.c.CachingDirectoryFactory return new directory for /export/home/jenkins/workspace/Lucene-Solr-6.x-Solaris/solr/build/solr-core/test/J0/temp/solr.core.TestLazyCores_4C707C46A220E571-001/tempDir-001/collection5/data/index
   [junit4]   2> 45566 INFO  (coreLoadExecutor-203-thread-3) [    x:collection5] o.a.s.u.RandomMergePolicy RandomMergePolicy wrapping class org.apache.lucene.index.LogByteSizeMergePolicy: [LogByteSizeMergePolicy: minMergeSize=1677721, mergeFactor=33, maxMergeSize=2147483648, maxMergeSizeForForcedMerge=9223372036854775807, calibrateSizeByDeletes=true, maxMergeDocs=2147483647, maxCFSSegmentSizeMB=8.796093022207999E12, noCFSRatio=0.16511331506942897]
   [junit4]   2> 45567 INFO  (coreLoadExecutor-203-thread-1) [    x:collection1] o.a.s.h.l.XMLLoader xsltCacheLifetimeSeconds=60
   [junit4]   2> 45567 INFO  (coreLoadExecutor-203-thread-3) [    x:collection5] o.a.s.c.SolrDeletionPolicy SolrDeletionPolicy.onCommit: commits: num=1
   [junit4]   2> 	commit{dir=MockDirectoryWrapper(RAMDirectory@2dbca03b lockFactory=org.apache.lucene.store.SingleInstanceLockFactory@5a5d252a),segFN=segments_1,generation=1}
   [junit4]   2> 45567 INFO  (coreLoadExecutor-203-thread-3) [    x:collection5] o.a.s.c.SolrDeletionPolicy newest commit generation = 1
   [junit4]   2> 45567 INFO  (OldIndexDirectoryCleanupThreadForCore-collection5) [    x:collection5] o.a.s.c.SolrCore Looking for old index directories to cleanup for core collection5 in /export/home/jenkins/workspace/Lucene-Solr-6.x-Solaris/solr/build/solr-core/test/J0/temp/solr.core.TestLazyCores_4C707C46A220E571-001/tempDir-001/collection5/data/
   [junit4]   2> 45567 WARN  (OldIndexDirectoryCleanupThreadForCore-collection5) [    x:collection5] o.a.s.c.DirectoryFactory /export/home/jenkins/workspace/Lucene-Solr-6.x-Solaris/solr/build/solr-core/test/J0/temp/solr.core.TestLazyCores_4C707C46A220E571-001/tempDir-001/collection5/data/ does not point to a valid data directory; skipping clean-up of old index directories.
   [junit4]   2> 45568 INFO  (coreLoadExecutor-203-thread-1) [    x:collection1] o.a.s.c.RequestHandlers Registered paths: /admin/mbeans,/update/json/docs,/admin/luke,/export,/get,/admin/properties,/update/json,/admin/threads,/update/csv,/sql,/graph,/select,/admin/segments,/admin/system,/replication,/config,/stream,/schema,/admin/plugins,/admin/logging,/admin/ping,/update,/admin/file,/terms
   [junit4]   2> 45569 INFO  (coreLoadExecutor-203-thread-1) [    x:collection1] o.a.s.c.SolrCore Using default statsCache cache: org.apache.solr.search.stats.LocalStatsCache
   [junit4]   2> 45569 INFO  (coreLoadExecutor-203-thread-3) [    x:collection5] o.a.s.c.SolrCore no updateRequestProcessorChain defined as default, creating implicit default
   [junit4]   2> 45569 INFO  (coreLoadExecutor-203-thread-1) [    x:collection1] o.a.s.u.CommitTracker Hard AutoCommit: disabled
   [junit4]   2> 45569 INFO  (coreLoadExecutor-203-thread-1) [    x:collection1] o.a.s.u.CommitTracker Soft AutoCommit: disabled
   [junit4]   2> 45569 INFO  (coreLoadExecutor-203-thread-1) [    x:collection1] o.a.s.u.RandomMergePolicy RandomMergePolicy wrapping class org.apache.lucene.index.LogByteSizeMergePolicy: [LogByteSizeMergePolicy: minMergeSize=1677721, mergeFactor=10, maxMergeSize=2147483648, maxMergeSizeForForcedMerge=9223372036854775807, calibrateSizeByDeletes=false, maxMergeDocs=2147483647, maxCFSSegmentSizeMB=8.796093022207999E12, noCFSRatio=1.0]
   [junit4]   2> 45569 INFO  (coreLoadExecutor-203-thread-1) [    x:collection1] o.a.s.c.SolrDeletionPolicy SolrDeletionPolicy.onInit: commits: num=1
   [junit4]   2> 	commit{dir=MockDirectoryWrapper(RAMDirectory@7b8a51e8 lockFactory=org.apache.lucene.store.SingleInstanceLockFactory@1cbdf706),segFN=segments_1,generation=1}
   [junit4]   2> 45569 INFO  (coreLoadExecutor-203-thread-1) [    x:collection1] o.a.s.c.SolrDeletionPolicy newest commit generation = 1
   [junit4]   2> 45570 INFO  (coreLoadExecutor-203-thread-1) [    x:collection1] o.a.s.s.SolrIndexSearcher Opening [Searcher@6341bf1b[collection1] main]
   [junit4]   2> 45570 INFO  (coreLoadExecutor-203-thread-1) [    x:collection1] o.a.s.r.ManagedResourceStorage File-based storage initialized to use dir: /export/home/jenkins/workspace/Lucene-Solr-6.x-Solaris/solr/build/solr-core/test/J0/temp/solr.core.TestLazyCores_4C707C46A220E571-001/tempDir-001/collection1/conf
   [junit4]   2> 45570 INFO  (coreLoadExecutor-203-thread-1) [    x:collection1] o.a.s.r.RestManager Initializing RestManager with initArgs: {storageDir=/export/home/jenkins/workspace/Lucene-Solr-6.x-Solaris/solr/build/solr-core/test/J0/temp/solr.core.TestLazyCores_4C707C46A220E571-001/tempDir-001/collection1/conf}
   [junit4]   2> 45570 INFO  (coreLoadExecutor-203-thread-1) [    x:collection1] o.a.s.r.ManagedResourceStorage Reading _rest_managed.json using file:dir=/export/home/jenkins/workspace/Lucene-Solr-6.x-Solaris/solr/build/solr-core/test/J0/temp/solr.core.TestLazyCores_4C707C46A220E571-001/tempDir-001/collection1/conf
   [junit4]   2> 45570 INFO  (coreLoadExecutor-203-thread-1) [    x:collection1] o.a.s.r.RestManager Initializing 0 registered ManagedResources
   [junit4]   2> 45570 INFO  (coreLoadExecutor-203-thread-1) [    x:collection1] o.a.s.h.ReplicationHandler Commits will be reserved for  10000
   [junit4]   2> 45570 INFO  (coreLoadExecutor-203-thread-1) [    x:collection1] o.a.s.c.CoreContainer registering core: collection1
   [junit4]   2> 45571 INFO  (searcherExecutor-205-thread-1-processing-x:collection1) [    x:collection1] o.a.s.c.SolrCore [collection1] Registered new searcher Searcher@6341bf1b[collection1] main{ExitableDirectoryReader(UninvertingDirectoryReader())}
   [junit4]   2> 45571 INFO  (coreLoadExecutor-203-thread-3) [    x:collection5] o.a.s.h.l.XMLLoader xsltCacheLifetimeSeconds=60
   [junit4]   2> 45572 INFO  (coreLoadExecutor-203-thread-3) [    x:collection5] o.a.s.h.l.XMLLoader xsltCacheLifetimeSeconds=60
   [junit4]   2> 45573 INFO  (coreLoadExecutor-203-thread-3) [    x:collection5] o.a.s.h.l.XMLLoader xsltCacheLifetimeSeconds=60
   [junit4]   2> 45574 INFO  (coreLoadExecutor-203-thread-3) [    x:collection5] o.a.s.h.l.XMLLoader xsltCacheLifetimeSeconds=60
   [junit4]   2> 45575 INFO  (coreLoadExecutor-203-thread-3) [    x:collection5] o.a.s.c.RequestHandlers Registered paths: /admin/mbeans,/update/json/docs,/admin/luke,/export,/get,/admin/properties,/update/json,/admin/threads,/update/csv,/sql,/graph,/select,/admin/segments,/admin/system,/replication,/config,/stream,/schema,/admin/plugins,/admin/logging,/admin/ping,/update,/admin/file,/terms
   [junit4]   2> 45575 INFO  (coreLoadExecutor-203-thread-3) [    x:collection5] o.a.s.c.SolrCore Using default statsCache cache: org.apache.solr.search.stats.LocalStatsCache
   [junit4]   2> 45576 INFO  (coreLoadExecutor-203-thread-3) [    x:collection5] o.a.s.u.CommitTracker Hard AutoCommit: disabled
   [junit4]   2> 45576 INFO  (coreLoadExecutor-203-thread-3) [    x:collection5] o.a.s.u.CommitTracker Soft AutoCommit: disabled
   [junit4]   2> 45576 INFO  (coreLoadExecutor-203-thread-3) [    x:collection5] o.a.s.u.RandomMergePolicy RandomMergePolicy wrapping class org.apache.lucene.index.LogByteSizeMergePolicy: [LogByteSizeMergePolicy: minMergeSize=1677721, mergeFactor=10, maxMergeSize=2147483648, maxMergeSizeForForcedMerge=9223372036854775807, calibrateSizeByDeletes=false, maxMergeDocs=2147483647, maxCFSSegmentSizeMB=8.796093022207999E12, noCFSRatio=1.0]
   [junit4]   2> 45576 INFO  (coreLoadExecutor-203-thread-3) [    x:collection5] o.a.s.c.SolrDeletionPolicy SolrDeletionPolicy.onInit: commits: num=1
   [junit4]   2> 	commit{dir=MockDirectoryWrapper(RAMDirectory@2dbca03b lockFactory=org.apache.lucene.store.SingleInstanceLockFactory@5a5d252a),segFN=segments_1,generation=1}
   [junit4]   2> 45576 INFO  (coreLoadExecutor-203-thread-3) [    x:collection5] o.a.s.c.SolrDeletionPolicy newest commit generation = 1
   [junit4]   2> 45576 INFO  (coreLoadExecutor-203-thread-3) [    x:collection5] o.a.s.s.SolrIndexSearcher Opening [Searcher@44db93c9[collection5] main]
   [junit4]   2> 45576 INFO  (coreLoadExecutor-203-thread-3) [    x:collection5] o.a.s.r.ManagedResourceStorage File-based storage initialized to use dir: /export/home/jenkins/workspace/Lucene-Solr-6.x-Solaris/solr/build/solr-core/test/J0/temp/solr.core.TestLazyCores_4C707C46A220E571-001/tempDir-001/collection5/conf
   [junit4]   2> 45576 INFO  (coreLoadExecutor-203-thread-3) [    x:collection5] o.a.s.r.RestManager Initializing RestManager with initArgs: {storageDir=/export/home/jenkins/workspace/Lucene-Solr-6.x-Solaris/solr/build/solr-core/test/J0/temp/solr.core.TestLazyCores_4C707C46A220E571-001/tempDir-001/collection5/conf}
   [junit4]   2> 45577 INFO  (coreLoadExecutor-203-thread-3) [    x:collection5] o.a.s.r.ManagedResourceStorage Reading _rest_managed.json using file:dir=/export/home/jenkins/workspace/Lucene-Solr-6.x-Solaris/solr/build/solr-core/test/J0/temp/solr.core.TestLazyCores_4C707C46A220E571-001/tempDir-001/collection5/conf
   [junit4]   2> 45577 INFO  (coreLoadExecutor-203-thread-3) [    x:collection5] o.a.s.r.RestManager Initializing 0 registered ManagedResources
   [junit4]   2> 45577 INFO  (coreLoadExecutor-203-thread-3) [    x:collection5] o.a.s.h.ReplicationHandler Commits will be reserved for  10000
   [junit4]   2> 45577 INFO  (searcherExecutor-209-thread-1-processing-x:collection5) [    x:collection5] o.a.s.c.SolrCore [collection5] Registered new searcher Searcher@44db93c9[collection5] main{ExitableDirectoryReader(UninvertingDirectoryReader())}
   [junit4]   2> 45577 INFO  (coreLoadExecutor-203-thread-3) [    x:collection5] o.a.s.c.CoreContainer registering core: collection5
   [junit4]   2> 45578 INFO  (TEST-TestLazyCores.testLazySearch-seed#[4C707C46A220E571]) [    ] o.a.s.c.SolrResourceLoader new SolrResourceLoader for directory: '/export/home/jenkins/workspace/Lucene-Solr-6.x-Solaris/solr/build/solr-core/test/J0/temp/solr.core.TestLazyCores_4C707C46A220E571-001/tempDir-001/collection4'
   [junit4]   2> 45579 INFO  (TEST-TestLazyCores.testLazySearch-seed#[4C707C46A220E571]) [    ] o.a.s.c.SolrResourceLoader JNDI not configured for solr (NoInitialContextEx)
   [junit4]   2> 45579 INFO  (TEST-TestLazyCores.testLazySearch-seed#[4C707C46A220E571]) [    ] o.a.s.c.SolrResourceLoader solr home defaulted to 'solr/' (could not find system property or JNDI)
   [junit4]   2> 45584 INFO  (TEST-TestLazyCores.testLazySearch-seed#[4C707C46A220E571]) [    ] o.a.s.c.SolrConfig current version of requestparams : -1
   [junit4]   2> 45585 INFO  (TEST-TestLazyCores.testLazySearch-seed#[4C707C46A220E571]) [    ] o.a.s.c.SolrConfig Using Lucene MatchVersion: 6.2.0
   [junit4]   2> 45589 INFO  (TEST-TestLazyCores.testLazySearch-seed#[4C707C46A220E571]) [    ] o.a.s.c.SolrConfig Loaded SolrConfig: solrconfig.xml
   [junit4]   2> 45592 INFO  (TEST-TestLazyCores.testLazySearch-seed#[4C707C46A220E571]) [    ] o.a.s.s.IndexSchema [collection4] Schema name=tiny
   [junit4]   2> 45594 INFO  (TEST-TestLazyCores.testLazySearch-seed#[4C707C46A220E571]) [    ] o.a.s.s.IndexSchema unique key field: id
   [junit4]   2> 45595 INFO  (TEST-TestLazyCores.testLazySearch-seed#[4C707C46A220E571]) [    ] o.a.s.c.ConfigSetProperties Did not find ConfigSet properties, assuming default properties: Can't find resource 'configsetprops.json' in classpath or '/export/home/jenkins/workspace/Lucene-Solr-6.x-Solaris/solr/build/solr-core/test/J0/temp/solr.core.TestLazyCores_4C707C46A220E571-001/tempDir-001/collection4'
   [junit4]   2> 45595 INFO  (TEST-TestLazyCores.testLazySearch-seed#[4C707C46A220E571]) [    ] o.a.s.c.CoreContainer Creating SolrCore 'collection4' using configuration from instancedir /export/home/jenkins/workspace/Lucene-Solr-6.x-Solaris/solr/build/solr-core/test/J0/temp/solr.core.TestLazyCores_4C707C46A220E571-001/tempDir-001/collection4
   [junit4]   2> 45595 INFO  (TEST-TestLazyCores.testLazySearch-seed#[4C707C46A220E571]) [    x:collection4] o.a.s.c.SolrCore org.apache.solr.core.MockDirectoryFactory
   [junit4]   2> 45595 INFO  (TEST-TestLazyCores.testLazySearch-seed#[4C707C46A220E571]) [    x:collection4] o.a.s.c.SolrCore [[collection4] ] Opening new SolrCore at [/export/home/jenkins/workspace/Lucene-Solr-6.x-Solaris/solr/build/solr-core/test/J0/temp/solr.core.TestLazyCores_4C707C46A220E571-001/tempDir-001/collection4], dataDir=[/export/home/jenkins/workspace/Lucene-Solr-6.x-Solaris/solr/build/solr-core/test/J0/temp/solr.core.TestLazyCores_4C707C46A220E571-001/tempDir-001/collection4/data/]
   [junit4]   2> 45595 INFO  (TEST-TestLazyCores.testLazySearch-seed#[4C707C46A220E571]) [    x:collection4] o.a.s.c.SolrCore JMX monitoring not detected for core: collection4
   [junit4]   2> 45596 INFO  (TEST-TestLazyCores.testLazySearch-seed#[4C707C46A220E571]) [    x:collection4] o.a.s.c.CachingDirectoryFactory return new directory for /export/home/jenkins/workspace/Lucene-Solr-6.x-Solaris/solr/build/solr-core/test/J0/temp/solr.core.TestLazyCores_4C707C46A220E571-001/tempDir-001/collection4/data
   [junit4]   2> 45596 INFO  (TEST-TestLazyCores.testLazySearch-seed#[4C707C46A220E571]) [    x:collection4] o.a.s.c.SolrCore New index directory detected: old=null new=/export/home/jenkins/workspace/Lucene-Solr-6.x-Solaris/solr/build/solr-core/test/J0/temp/solr.core.TestLazyCores_4C707C46A220E571-001/tempDir-001/collection4/data/index/
   [junit4]   2> 45596 WARN  (TEST-TestLazyCores.testLazySearch-seed#[4C707C46A220E571]) [    x:collection4] o.a.s.c.SolrCore [collection4] Solr index directory '/export/home/jenkins/workspace/Lucene-Solr-6.x-Solaris/solr/build/solr-core/test/J0/temp/solr.core.TestLazyCores_4C707C46A220E571-001/tempDir-001/collection4/data/index' doesn't exist. Creating new index...
   [junit4]   2> 45596 INFO  (TEST-TestLazyCores.testLazySearch-seed#[4C707C46A220E571]) [    x:collection4] o.a.s.c.CachingDirectoryFactory return new directory for /export/home/jenkins/workspace/Lucene-Solr-6.x-Solaris/solr/build/solr-core/test/J0/temp/solr.core.TestLazyCores_4C707C46A220E571-001/tempDir-001/collection4/data/index
   [junit4]   2> 45597 INFO  (TEST-TestLazyCores.testLazySearch-seed#[4C707C46A220E571]) [    x:collection4] o.a.s.u.RandomMergePolicy RandomMergePolicy wrapping class org.apache.lucene.index.TieredMergePolicy: [TieredMergePolicy: maxMergeAtOnce=41, maxMergeAtOnceExplicit=42, maxMergedSegmentMB=84.1142578125, floorSegmentMB=0.2822265625, forceMergeDeletesPctAllowed=22.861002920305673, segmentsPerTier=18.0, maxCFSSegmentSizeMB=8.796093022207999E12, noCFSRatio=0.38346578933658493
   [junit4]   2> 45597 INFO  (TEST-TestLazyCores.testLazySearch-seed#[4C707C46A220E571]) [    x:collection4] o.a.s.c.SolrDeletionPolicy SolrDeletionPolicy.onCommit: commits: num=1
   [junit4]   2> 	commit{dir=MockDirectoryWrapper(RAMDirectory@61a57b1f lockFactory=org.apache.lucene.store.SingleInstanceLockFactory@32b61f47),segFN=segments_1,generation=1}
   [junit4]   2> 45597 INFO  (TEST-TestLazyCores.testLazySearch-seed#[4C707C46A220E571]) [    x:collection4] o.a.s.c.SolrDeletionPolicy newest commit generation = 1
   [junit4]   2> 45598 INFO  (OldIndexDirectoryCleanupThreadForCore-collection4) [    x:collection4] o.a.s.c.SolrCore Looking for old index directories to cleanup for core collection4 in /export/home/jenkins/workspace/Lucene-Solr-6.x-Solaris/solr/build/solr-core/test/J0/temp/solr.core.TestLazyCores_4C707C46A220E571-001/tempDir-001/collection4/data/
   [junit4]   2> 45598 WARN  (OldIndexDirectoryCleanupThreadForCore-collection4) [    x:collection4] o.a.s.c.DirectoryFactory /export/home/jenkins/workspace/Lucene-Solr-6.x-Solaris/solr/build/solr-core/test/J0/temp/solr.core.TestLazyCores_4C707C46A220E571-001/tempDir-001/collection4/data/ does not point to a valid data directory; skipping clean-up of old index directories.
   [junit4]   2> 45599 INFO  (TEST-TestLazyCores.testLazySearch-seed#[4C707C46A220E571]) [    x:collection4] o.a.s.c.SolrCore no updateRequestProcessorChain defined as default, creating implicit default
   [junit4]   2> 45600 INFO  (TEST-TestLazyCores.testLazySearch-seed#[4C707C46A220E571]) [    x:collection4] o.a.s.h.l.XMLLoader xsltCacheLifetimeSeconds=60
   [junit4]   2> 45601 INFO  (TEST-TestLazyCores.testLazySearch-seed#[4C707C46A220E571]) [    x:collection4] o.a.s.h.l.XMLLoader xsltCacheLifetimeSeconds=60
   [junit4]   2> 45602 INFO  (TEST-TestLazyCores.testLazySearch-seed#[4C707C46A220E571]) [    x:collection4] o.a.s.h.l.XMLLoader xsltCacheLifetimeSeconds=60
   [junit4]   2> 45603 INFO  (TEST-TestLazyCores.testLazySearch-seed#[4C707C46A220E571]) [    x:collection4] o.a.s.h.l.XMLLoader xsltCacheLifetimeSeconds=60
   [junit4]   2> 45605 INFO  (TEST-TestLazyCores.testLazySearch-seed#[4C707C46A220E571]) [    x:collection4] o.a.s.c.RequestHandlers Registered paths: /admin/mbeans,/update/json/docs,/admin/luke,/export,/get,/admin/properties,/update/json,/admin/threads,/update/csv,/sql,/graph,/select,/admin/segments,/admin/system,/replication,/config,/stream,/schema,/admin/plugins,/admin/logging,/admin/ping,/update,/admin/file,/terms
   [junit4]   2> 45605 INFO  (TEST-TestLazyCores.testLazySearch-seed#[4C707C46A220E571]) [    x:collection4] o.a.s.c.SolrCore Using default statsCache cache: org.apache.solr.search.stats.LocalStatsCache
   [junit4]   2> 45605 INFO  (TEST-TestLazyCores.testLazySearch-seed#[4C707C46A220E571]) [    x:collection4] o.a.s.u.CommitTracker Hard AutoCommit: disabled
   [junit4]   2> 45605 INFO  (TEST-TestLazyCores.testLazySearch-seed#[4C707C46A220E571]) [    x:collection4] o.a.s.u.CommitTracker Soft AutoCommit: disabled
   [junit4]   2> 45605 INFO  (TEST-TestLazyCores.testLazySearch-seed#[4C707C46A220E571]) [    x:collection4] o.a.s.u.RandomMergePolicy RandomMergePolicy wrapping class org.apache.lucene.index.TieredMergePolicy: [TieredMergePolicy: maxMergeAtOnce=32, maxMergeAtOnceExplicit=44, maxMergedSegmentMB=74.375, floorSegmentMB=0.212890625, forceMergeDeletesPctAllowed=4.686759546501681, segmentsPerTier=32.0, maxCFSSegmentSizeMB=8.796093022207999E12, noCFSRatio=0.0
   [junit4]   2> 45605 INFO  (TEST-TestLazyCores.testLazySearch-seed#[4C707C46A220E571]) [    x:collection4] o.a.s.c.SolrDeletionPolicy SolrDeletionPolicy.onInit: commits: num=1
   [junit4]   2> 	commit{dir=MockDirectoryWrapper(RAMDirectory@61a57b1f lockFactory=org.apache.lucene.store.SingleInstanceLockFactory@32b61f47),segFN=segments_1,generation=1}
   [junit4]   2> 45605 INFO  (TEST-TestLazyCores.testLazySearch-seed#[4C707C46A220E571]) [    x:collection4] o.a.s.c.SolrDeletionPolicy newest commit generation = 1
   [junit4]   2> 45606 INFO  (TEST-TestLazyCores.testLazySearch-seed#[4C707C46A220E571]) [    x:collection4] o.a.s.s.SolrIndexSearcher Opening [Searcher@5e05e662[collection4] main]
   [junit4]   2> 45606 INFO  (TEST-TestLazyCores.testLazySearch-seed#[4C707C46A220E571]) [    x:collection4] o.a.s.r.ManagedResourceStorage File-based storage initialized to use dir: /export/home/jenkins/workspace/Lucene-Solr-6.x-Solaris/solr/build/solr-core/test/J0/temp/solr.core.TestLazyCores_4C707C46A220E571-001/tempDir-001/collection4/conf
   [junit4]   2> 45606 INFO  (TEST-TestLazyCores.testLazySearch-seed#[4C707C46A220E571]) [    x:collection4] o.a.s.r.RestManager Initializing RestManager with initArgs: {storageDir=/export/home/jenkins/workspace/Lucene-Solr-6.x-Solaris/solr/build/solr-core/test/J0/temp/solr.core.TestLazyCores_4C707C46A220E571-001/tempDir-001/collection4/conf}
   [junit4]   2> 45606 INFO  (TEST-TestLazyCores.testLazySearch-seed#[4C707C46A220E571]) [    x:collection4] o.a.s.r.ManagedResourceStorage Reading _rest_managed.json using file:dir=/export/home/jenkins/workspace/Lucene-Solr-6.x-Solaris/solr/build/solr-core/test/J0/temp/solr.core.TestLazyCores_4C707C46A220E571-001/tempDir-001/collection4/conf
   [junit4]   2> 45606 INFO  (TEST-TestLazyCores.testLazySearch-seed#[4C707C46A220E571]) [    x:collection4] o.a.s.r.RestManager Initializing 0 registered ManagedResources
   [junit4]   2> 45606 INFO  (TEST-TestLazyCores.testLazySearch-seed#[4C707C46A220E571]) [    x:collection4] o.a.s.h.ReplicationHandler Commits will be reserved for  10000
   [junit4]   2> 45607 INFO  (searcherExecutor-216-thread-1-processing-x:collection4) [    x:collection4] o.a.s.c.SolrCore [collection4] Registered new searcher Searcher@5e05e662[collection4] main{ExitableDirectoryReader(UninvertingDirectoryReader())}
   [junit4]   2> 45607 INFO  (TEST-TestLazyCores.testLazySearch-seed#[4C707C46A220E571]) [    x:collection4] o.a.s.c.CoreContainer registering core: collection4
   [junit4]   2> 45608 INFO  (TEST-TestLazyCores.testLazySearch-seed#[4C707C46A220E571]) [    x:collection4] o.a.s.u.DirectUpdateHandler2 start commit{,optimize=false,openSearcher=true,waitSearcher=true,expungeDeletes=false,softCommit=false,prepareCommit=false}
   [junit4]   2> 45610 INFO  (TEST-TestLazyCores.testLazySearch-seed#[4C707C46A220E571]) [    x:collection4] o.a.s.c.SolrDeletionPolicy SolrDeletionPolicy.onCommit: commits: num=2
   [junit4]   2> 	commit{dir=MockDirectoryWrapper(RAMDirectory@61a57b1f lockFactory=org.apache.lucene.store.SingleInstanceLockFactory@32b61f47),segFN=segments_1,generation=1}
   [junit4]   2> 	commit{dir=MockDirectoryWrapper(RAMDirectory@61a57b1f lockFactory=org.apache.lucene.store.SingleInstanceLockFactory@32b61f47),segFN=segments_2,generation=2}
   [junit4]   2> 45610 INFO  (TEST-TestLazyCores.testLazySearch-seed#[4C707C46A220E571]) [    x:collection4] o.a.s.c.SolrDeletionPolicy newest commit generation = 2
   [junit4]   2> 45610 INFO  (TEST-TestLazyCores.testLazySearch-seed#[4C707C46A220E571]) [    x:collection4] o.a.s.s.SolrIndexSearcher Opening [Searcher@10f918c1[collection4] main]
   [junit4]   2> 45611 INFO  (TEST-TestLazyCores.testLazySearch-seed#[4C707C46A220E571]) [    x:collection4] o.a.s.u.DirectUpdateHandler2 end_commit_flush
   [junit4]   2> 45611 INFO  (searcherExecutor-216-thread-1-processing-x:collection4) [    x:collection4] o.a.s.c.SolrCore [collection4] Registered new searcher Searcher@10f918c1[collection4] main{ExitableDirectoryReader(UninvertingDirectoryReader(Uninverting(_0(6.2.0):C7)))}
   [junit4]   2> 45633 INFO  (TEST-TestLazyCores.testLazySearch-seed#[4C707C46A220E571]) [    x:collection4] o.a.s.c.S.Request [collection4]  webapp=null path=null params={q={!prefix+f%3Dv_t}hel&wt=xml} hits=2 status=0 QTime=20
   [junit4]   2> 45637 INFO  (TEST-TestLazyCores.testLazySearch-seed#[4C707C46A220E571]) [    x:collection4] o.a.s.c.S.Request [collection4]  webapp=null path=null params={q={!raw+f%3Dv_t}hello&wt=xml} hits=2 status=0 QTime=1
   [junit4]   2> 45638 INFO  (TEST-TestLazyCores.testLazySearch-seed#[4C707C46A220E571]) [    x:collection4] o.a.s.c.S.Request [collection4]  webapp=null path=null params={q={!raw+f%3Dv_t}Hello&wt=xml} hits=0 status=0 QTime=0
   [junit4]   2> 45638 INFO  (TEST-TestLazyCores.testLazySearch-seed#[4C707C46A220E571]) [    x:collection4] o.a.s.c.S.Request [collection4]  webapp=null path=null params={q={!raw+f%3Dv_f}1.5&wt=xml} hits=0 status=0 QTime=0
   [junit4]   2> 45639 INFO  (TEST-TestLazyCores.testLazySearch-seed#[4C707C46A220E571]) [    x:collection4] o.a.s.c.S.Request [collection1]  webapp=null path=null params={q={!raw+f%3Dv_t}hello&wt=xml} hits=0 status=0 QTime=1
   [junit4]   2> 45640 INFO  (TEST-TestLazyCores.testLazySearch-seed#[4C707C46A220E571]) [    x:collection4] o.a.s.c.CoreContainer Shutting down CoreContainer instance=1516180186
   [junit4]   2> 45640 INFO  (coreCloseExecutor-220-thread-1-processing-x:collection4) [    x:collection1] o.a.s.c.SolrCore [collection1]  CLOSING SolrCore org.apache.solr.core.SolrCore@713583dc
   [junit4]   2> 45640 INFO  (coreCloseExecutor-220-thread-1-processing-x:collection4) [    x:collection1] o.a.s.u.DirectUpdateHandler2 closing DirectUpdateHandler2{commits=0,autocommits=0,soft autocommits=0,optimizes=0,rollbacks=0,expungeDeletes=0,docsPending=0,adds=0,deletesById=0,deletesByQuery=0,errors=0,cumulative_adds=0,cumulative_deletesById=0,cumulative_deletesByQuery=0,cumulative_errors=0}
   [junit4]   2> 45643 INFO  (coreCloseExecutor-220-thread-1-processing-x:collection4) [    x:collection1] o.a.s.u.SolrCoreState Closing SolrCoreState
   [junit4]   2> 45643 INFO  (coreCloseExecutor-220-thread-1-processing-x:collection4) [    x:collection1] o.a.s.u.DefaultSolrCoreState SolrCoreState ref count has reached 0 - closing IndexWriter
   [junit4]   2> 45643 INFO  (coreCloseExecutor-220-thread-1-processing-x:collection4) [    x:collection1] o.a.s.u.DefaultSolrCoreState closing IndexWriter with IndexWriterCloser
   [junit4]   2> 45647 INFO  (coreCloseExecutor-220-thread-4-processing-x:collection4) [    x:collection2] o.a.s.c.SolrCore [collection2]  CLOSING SolrCore org.apache.solr.core.SolrCore@48ed3af9
   [junit4]   2> 45648 INFO  (coreCloseExecutor-220-thread-4-processing-x:collection4) [    x:collection2] o.a.s.u.DirectUpdateHandler2 closing DirectUpdateHandler2{commits=0,autocommits=0,soft autocommits=0,optimizes=0,rollbacks=0,expungeDeletes=0,docsPending=0,adds=0,deletesById=0,deletesByQuery=0,errors=0,cumulative_adds=0,cumulative_deletesById=0,cumulative_deletesByQuery=0,cumulative_errors=0}
   [junit4]   2> 45648 INFO  (coreCloseExecutor-220-thread-4-processing-x:collection4) [    x:collection2] o.a.s.u.SolrCoreState Closing SolrCoreState
   [junit4]   2> 45648 INFO  (coreCloseExecutor-220-thread-4-processing-x:collection4) [    x:collection2] o.a.s.u.DefaultSolrCoreState SolrCoreState ref count has reached 0 - closing IndexWriter
   [junit4]   2> 45648 INFO  (coreCloseExecutor-220-thread-4-processing-x:collection4) [    x:collection2] o.a.s.u.DefaultSolrCoreState closing IndexWriter with IndexWriterCloser
   [junit4]   2> 45648 INFO  (coreCloseExecutor-220-thread-3-processing-x:collection4) [    x:collection4] o.a.s.c.SolrCore [collection4]  CLOSING SolrCore org.apache.solr.core.SolrCore@67d55d8d
   [junit4]   2> 45648 INFO  (coreCloseExecutor-220-thread-2-processing-x:collection4) [    x:collection5] o.a.s.c.SolrCore [collection5]  CLOSING SolrCore org.apache.solr.core.SolrCore@531146c6
   [junit4]   2> 45650 INFO  (coreCloseExecutor-220-thread-3-processing-x:collection4) [    x:collection4] o.a.s.u.DirectUpdateHandler2 closing DirectUpdateHandler2{commits=1,autocommits=0,soft autocommits=0,optimizes=0,rollbacks=0,expungeDeletes=0,docsPending=0,adds=0,deletesById=0,deletesByQuery=0,errors=0,cumulative_adds=7,cumulative_deletesById=0,cumulative_deletesByQuery=0,cumulative_errors=0}
   [junit4]   2> 45650 INFO  (coreCloseExecutor-220-thread-2-processing-x:collection4) [    x:collection5] o.a.s.u.DirectUpdateHandler2 closing DirectUpdateHandler2{commits=0,autocommits=0,soft autocommits=0,optimizes=0,rollbacks=0,expungeDeletes=0,docsPending=0,adds=0,deletesById=0,deletesByQuery=0,errors=0,cumulative_adds=0,cumulative_deletesById=0,cumulative_deletesByQuery=0,cumulative_errors=0}
   [junit4]   2> 45650 INFO  (coreCloseExecutor-220-thread-1-processing-x:collection4) [    x:collection1] o.a.s.c.SolrCore [collection1] Closing main searcher on request.
   [junit4]   2> 45651 INFO  (coreCloseExecutor-220-thread-1-processing-x:collection4) [    x:collection1] o.a.s.c.CachingDirectoryFactory Closing MockDirectoryFactory - 2 directories currently being tracked
   [junit4]   2> 45651 INFO  (coreCloseExecutor-220-thread-1-processing-x:collection4) [    x:collection1] o.a.s.c.CachingDirectoryFactory looking to close /export/home/jenkins/workspace/Lucene-Solr-6.x-Solaris/solr/build/solr-core/test/J0/temp/solr.core.TestLazyCores_4C707C46A220E571-001/tempDir-001/collection1/data/index [CachedDir<<refCount=0;path=/export/home/jenkins/workspace/Lucene-Solr-6.x-Solaris/solr/build/solr-core/test/J0/temp/solr.core.TestLazyCores_4C707C46A220E571-001/tempDir-001/collection1/data/index;done=false>>]
   [junit4]   2> 45651 INFO  (coreCloseExecutor-220-thread-1-processing-x:collection4) [    x:collection1] o.a.s.c.CachingDirectoryFactory Closing directory, CoreContainer#isShutdown=true
   [junit4]   2> 45651 INFO  (coreCloseExecutor-220-thread-1-processing-x:collection4) [    x:collection1] o.a.s.c.CachingDirectoryFactory Closing directory: /export/home/jenkins/workspace/Lucene-Solr-6.x-Solaris/solr/build/solr-core/test/J0/temp/solr.core.TestLazyCores_4C707C46A220E571-001/tempDir-001/collection1/data/index
   [junit4]   2> 45652 INFO  (coreCloseExecutor-220-thread-1-processing-x:collection4) [    x:collection1] o.a.s.c.CachingDirectoryFactory looking to close /export/home/jenkins/workspace/Lucene-Solr-6.x-Solaris/solr/build/solr-core/test/J0/temp/solr.core.TestLazyCores_4C707C46A220E571-001/tempDir-001/collection1/data [CachedDir<<refCount=0;path=/export/home/jenkins/workspace/Lucene-Solr-6.x-Solaris/solr/build/solr-core/test/J0/temp/solr.core.TestLazyCores_4C707C46A220E571-001/tempDir-001/collection1/data;done=false>>]
   [junit4]   2> 45652 INFO  (coreCloseExecutor-220-thread-1-processing-x:collection4) [    x:collection1] o.a.s.c.CachingDirectoryFactory Closing directory, CoreContainer#isShutdown=true
   [junit4]   2> 45652 INFO  (coreCloseExecutor-220-thread-1-processing-x:collection4) [    x:collection1] o.a.s.c.CachingDirectoryFactory Closing directory: /export/home/jenkins/workspace/Lucene-Solr-6.x-Solaris/solr/build/solr-core/test/J0/temp/solr.core.TestLazyCores_4C707C46A220E571-001/tempDir-001/collection1/data
   [junit4]   2> 45652 INFO  (coreCloseExecutor-220-thread-2-processing-x:collection4) [    x:collection5] o.a.s.u.SolrCoreState Closing SolrCoreState
   [junit4]   2> 45652 INFO  (coreCloseExecutor-220-thread-2-processing-x:collection4) [    x:collection5] o.a.s.u.DefaultSolrCoreState SolrCoreState ref count has reached 0 - closing IndexWriter
   [junit4]   2> 45652 INFO  (coreCloseExecutor-220-thread-2-processing-x:collection4) [    x:collection5] o.a.s.u.DefaultSolrCoreState closing IndexWriter with IndexWriterCloser
   [junit4]   2> 45654 INFO  (coreCloseExecutor-220-thread-4-processing-x:collection4) [    x:collection2] o.a.s.c.SolrCore [collection2] Closing main searcher on request.
   [junit4]   2> 45654 INFO  (coreCloseExecutor-220-thread-4-processing-x:collection4) [    x:collection2] o.a.s.c.CachingDirectoryFactory Closing MockDirectoryFactory - 2 directories currently being tracked
   [junit4]   2> 45654 INFO  (coreCloseExecutor-220-thread-4-processing-x:collection4) [    x:collection2] o.a.s.c.CachingDirectoryFactory looking to close /export/home/jenkins/workspace/Lucene-Solr-6.x-Solaris/solr/build/solr-core/test/J0/temp/solr.core.TestLazyCores_4C707C46A220E571-001/tempDir-001/collection2/data/index [CachedDir<<refCount=0;path=/export/home/jenkins/workspace/Lucene-Solr-6.x-Solaris/solr/build/solr-core/test/J0/temp/solr.core.TestLazyCores_4C707C46A220E571-001/tempDir-001/collection2/data/index;done=false>>]
   [junit4]   2> 45654 INFO  (coreCloseExecutor-220-thread-4-processing-x:collection4) [    x:collection2] o.a.s.c.CachingDirectoryFactory Closing directory, CoreContainer#isShutdown=true
   [junit4]   2> 45654 INFO  (coreCloseExecutor-220-thread-4-processing-x:collection4) [    x:collection2] o.a.s.c.CachingDirectoryFactory Closing directory: /export/home/jenkins/workspace/Lucene-Solr-6.x-Solaris/solr/build/solr-core/test/J0/temp/solr.core.TestLazyCores_4C707C46A220E571-001/tempDir-001/collection2/data/index
   [junit4]   2> 45654 INFO  (coreCloseExecutor-220-thread-4-processing-x:collection4) [    x:collection2] o.a.s.c.CachingDirectoryFactory looking to close /export/home/jenkins/workspace/Lucene-Solr-6.x-Solaris/solr/build/solr-core/test/J0/temp/solr.core.TestLazyCores_4C707C46A220E571-001/tempDir-001/collection2/data [CachedDir<<refCount=0;path=/export/home/jenkins/workspace/Lucene-Solr-6.x-Solaris/solr/build/solr-core/test/J0/temp/solr.core.TestLazyCores_4C707C46A220E571-001/tempDir-001/collection2/data;done=false>>]
   [junit4]   2> 45654 INFO  (coreCloseExecutor-220-thread-4-processing-x:collection4) [    x:collection2] o.a.s.c.CachingDirectoryFactory Closing directory, CoreContainer#isShutdown=true
   [junit4]   2> 45654 INFO  (coreCloseExecutor-220-thread-4-processing-x:collection4) [    x:collection2] o.a.s.c.CachingDirectoryFactory Closing directory: /export/home/jenkins/workspace/Lucene-Solr-6.x-Solaris/solr/build/solr-core/test/J0/temp/solr.core.TestLazyCores_4C707C46A220E571-001/tempDir-001/collection2/data
   [junit4]   2> 45656 INFO  (coreCloseExecutor-220-thread-3-processing-x:collection4) [    x:collection4] o.a.s.u.SolrCoreState Closing SolrCoreState
   [junit4]   2> 45656 INFO  (coreCloseExecutor-220-thread-3-processing-x:collection4) [    x:collection4] o.a.s.u.DefaultSolrCoreState SolrCoreState ref count has reached 0 - closing IndexWriter
   [junit4]   2> 45656 INFO  (coreCloseExecutor-220-thread-3-processing-x:collection4) [    x:collection4] o.a.s.u.DefaultSolrCoreState closing IndexWriter with IndexWriterCloser
   [junit4]   2> 45658 INFO  (coreCloseExecutor-220-thread-2-processing-x:collection4) [    x:collection5] o.a.s.c.SolrCore [collection5] Closing main searcher on request.
   [junit4]   2> 45658 INFO  (coreCloseExecutor-220-thread-2-processing-x:collection4) [    x:collection5] o.a.s.c.CachingDirectoryFactory Closing MockDirectoryFactory - 2 directories currently being tracked
   [junit4]   2> 45658 INFO  (coreCloseExecutor-220-thread-2-processing-x:collection4) [    x:collection5] o.a.s.c.CachingDirectoryFactory looking to close /export/home/jenkins/workspace/Lucene-Solr-6.x-Solaris/solr/build/solr-core/test/J0/temp/solr.core.TestLazyCores_4C707C46A220E571-001/tempDir-001/collection5/data/index [CachedDir<<refCount=0;path=/export/home/jenkins/workspace/Lucene-Solr-6.x-Solaris/solr/build/solr-core/test/J0/temp/solr.core.TestLazyCores_4C707C46A220E571-001/tempDir-001/collection5/data/index;done=false>>]
   [junit4]   2> 45658 INFO  (coreCloseExecutor-220-thread-2-processing-x:collection4) [    x:collection5] o.a.s.c.CachingDirectoryFactory Closing directory, CoreContainer#isShutdown=true
   [junit4]   2> 45658 INFO  (coreCloseExecutor-220-thread-2-processing-x:collection4) [    x:collection5] o.a.s.c.CachingDirectoryFactory Closing directory: /export/home/jenkins/workspace/Lucene-Solr-6.x-Solaris/solr/build/solr-core/test/J0/temp/solr.core.TestLazyCores_4C707C46A220E571-001/tempDir-001/collection5/data/index
   [junit4]   2> 45658 INFO  (coreCloseExecutor-220-thread-2-processing-x:collection4) [    x:collection5] o.a.s.c.CachingDirectoryFactory looking to close /export/home/jenkins/workspace/Lucene-Solr-6.x-Solaris/solr/build/solr-core/test/J0/temp/solr.core.TestLazyCores_4C707C46A220E571-001/tempDir-001/collection5/data [CachedDir<<refCount=0;path=/export/home/jenkins/workspace/Lucene-Solr-6.x-Solaris/solr/build/solr-core/test/J0/temp/solr.core.TestLazyCores_4C707C46A220E571-001/tempDir-001/collection5/data;done=false>>]
   [junit4]   2> 45658 INFO  (coreCloseExecutor-220-thread-2-processing-x:collection4) [    x:collection5] o.a.s.c.CachingDirectoryFactory Closing directory, CoreContainer#isShutdown=true
   [junit4]   2> 45658 INFO  (coreCloseExecutor-220-thread-2-processing-x:collection4) [    x:collection5] o.a.s.c.CachingDirectoryFactory Closing directory: /export/home/jenkins/workspace/Lucene-Solr-6.x-Solaris/solr/build/solr-core/test/J0/temp/solr.core.TestLazyCores_4C707C46A220E571-001/tempDir-001/collection5/data
   [junit4]   2> 45658 INFO  (coreCloseExecutor-220-thread-3-processing-x:collection4) [    x:collection4] o.a.s.c.SolrCore [collection4] Closing main searcher on request.
   [junit4]   2> 45660 INFO  (coreCloseExecutor-220-thread-3-processing-x:collection4) [    x:collection4] o.a.s.c.CachingDirectoryFactory Closing MockDirectoryFactory - 2 directories currently being tracked
   [junit4]   2> 45660 INFO  (coreCloseExecutor-220-thread-3-processing-x:collection4) [    x:collection4] o.a.s.c.CachingDirectoryFactory looking to close /export/home/jenkins/workspace/Lucene-Solr-6.x-Solaris/solr/build/solr-core/test/J0/temp/solr.core.TestLazyCores_4C707C46A220E571-001/tempDir-001/collection4/data/index [CachedDir<<refCount=0;path=/export/home/jenkins/workspace/Lucene-Solr-6.x-Solaris/solr/build/solr-core/test/J0/temp/solr.core.TestLazyCores_4C707C46A220E571-001/tempDir-001/collection4/data/index;done=false>>]
   [junit4]   2> 45660 INFO  (coreCloseExecutor-220-thread-3-processing-x:collection4) [    x:collection4] o.a.s.c.CachingDirectoryFactory Closing directory, CoreContainer#isShutdown=true
   [junit4]   2> 45660 INFO  (coreCloseExecutor-220-thread-3-processing-x:collection4) [    x:collection4] o.a.s.c.CachingDirectoryFactory Closing directory: /export/home/jenkins/workspace/Lucene-Solr-6.x-Solaris/solr/build/solr-core/test/J0/temp/solr.core.TestLazyCores_4C707C46A220E571-001/tempDir-001/collection4/data/index
   [junit4]   2> 45660 INFO  (coreCloseExecutor-220-thread-3-processing-x:collection4) [    x:collection4] o.a.s.c.CachingDirectoryFactory looking to close /export/home/jenkins/workspace/Lucene-Solr-6.x-Solaris/solr/build/solr-core/test/J0/temp/solr.core.TestLazyCores_4C707C46A220E571-001/tempDir-001/collection4/data [CachedDir<<refCount=0;path=/export/home/jenkins/workspace/Lucene-Solr-6.x-Solaris/solr/build/solr-core/test/J0/temp/solr.core.TestLazyCores_4C707C46A220E571-001/tempDir-001/collection4/data;done=false>>]
   [junit4]   2> 45660 INFO  (coreCloseExecutor-220-thread-3-processing-x:collection4) [    x:collection4] o.a.s.c.CachingDirectoryFactory Closing directory, CoreContainer#isShutdown=true
   [junit4]   2> 45660 INFO  (coreCloseExecutor-220-thread-3-processing-x:collection4) [    x:collection4] o.a.s.c.CachingDirectoryFactory Closing directory: /export/home/jenkins/workspace/Lucene-Solr-6.x-Solaris/solr/build/solr-core/test/J0/temp/solr.core.TestLazyCores_4C707C46A220E571-001/tempDir-001/collection4/data
   [junit4]   2> 45661 INFO  (TEST-TestLazyCores.testLazySearch-seed#[4C707C46A220E571]) [    x:collection4] o.a.s.SolrTestCaseJ4 ###Ending testLazySearch
   [junit4]   2> 45662 INFO  (TEST-TestLazyCores.testBadConfigsGenerateErrors-seed#[4C707C46A220E571]) [    x:collection4] o.a.s.SolrTestCaseJ4 ###Starting testBadConfigsGenerateErrors
   [junit4]   2> 45673 INFO  (TEST-TestLazyCores.testBadConfigsGenerateErrors-seed#[4C707C46A220E571]) [    x:collection4] o.a.s.c.SolrResourceLoader new SolrResourceLoader for directory: '/export/home/jenkins/workspace/Lucene-Solr-6.x-Solaris/solr/build/solr-core/test/J0/temp/solr.core.TestLazyCores_4C707C46A220E571-001/tempDir-002'
   [junit4]   2> 45674 INFO  (TEST-TestLazyCores.testBadConfigsGenerateErrors-seed#[4C707C46A220E571]) [    x:collection4] o.a.s.c.SolrResourceLoader JNDI not configured for solr (NoInitialContextEx)
   [junit4]   2> 45674 INFO  (TEST-TestLazyCores.testBadConfigsGenerateErrors-seed#[4C707C46A220E571]) [    x:collection4] o.a.s.c.SolrResourceLoader solr home defaulted to 'solr/' (could not find system property or JNDI)
   [junit4]   2> 45678 INFO  (TEST-TestLazyCores.testBadConfigsGenerateErrors-seed#[4C707C46A220E571]) [    x:collection4] o.a.s.c.CorePropertiesLocator Config-defined core root directory: /export/home/jenkins/workspace/Lucene-Solr-6.x-Solaris/solr/build/solr-core/test/J0/temp/solr.core.TestLazyCores_4C707C46A220E571-001/tempDir-002
   [junit4]   2> 45678 INFO  (TEST-TestLazyCores.testBadConfigsGenerateErrors-seed#[4C707C46A220E571]) [    x:collection4] o.a.s.c.CoreContainer New CoreContainer 684535430
   [junit4]   2> 45678 INFO  (TEST-TestLazyCores.testBadConfigsGenerateErrors-seed#[4C707C46A220E571]) [    x:collection4] o.a.s.c.CoreContainer Loading cores into CoreContainer [instanceDir=/export/home/jenkins/workspace/Lucene-Solr-6.x-Solaris/solr/build/solr-core/test/J0/temp/solr.core.TestLazyCores_4C707C46A220E571-001/tempDir-002]
   [junit4]   2> 45678 WARN  (TEST-TestLazyCores.testBadConfigsGenerateErrors-seed#[4C707C46A220E571]) [    x:collection4] o.a.s.c.CoreContainer Couldn't add files from /export/home/jenkins/workspace/Lucene-Solr-6.x-Solaris/solr/build/solr-core/test/J0/temp/solr.core.TestLazyCores_4C707C46A220E571-001/tempDir-002/lib to classpath: /export/home/jenkins/workspace/Lucene-Solr-6.x-Solaris/solr/build/solr-core/test/J0/temp/solr.core.TestLazyCores_4C707C46A220E571-001/tempDir-002/lib
   [junit4]   2> 45678 INFO  (TEST-TestLazyCores.testBadConfigsGenerateErrors-seed#[4C707C46A220E571]) [    x:collection4] o.a.s.h.c.HttpShardHandlerFactory created with socketTimeout : 600000,connTimeout : 60000,maxConnectionsPerHost : 20,maxConnections : 10000,corePoolSize : 0,maximumPoolSize : 2147483647,maxThreadIdleTime : 5,sizeOfQueue : -1,fairnessPolicy : false,useRetries : false,connectionsEvictorSleepDelay : 5000,maxConnectionIdleTime : 40000,
   [junit4]   2> 45679 INFO  (TEST-TestLazyCores.testBadConfigsGenerateErrors-seed#[4C707C46A220E571]) [    x:collection4] o.a.s.u.UpdateShardHandler Creating UpdateShardHandler HTTP client with params: socketTimeout=600000&connTimeout=60000&retry=true
   [junit4]   2> 45680 INFO  (TEST-TestLazyCores.testBadConfigsGenerateErrors-seed#[4C707C46A220E571]) [    x:collection4] o.a.s.l.LogWatcher SLF4J impl is org.slf4j.impl.Log4jLoggerFactory
   [junit4]   2> 45680 INFO  (TEST-TestLazyCores.testBadConfigsGenerateErrors-seed#[4C707C46A220E571]) [    x:collection4] o.a.s.l.LogWatcher Registering Log Listener [Log4j (org.slf4j.impl.Log4jLoggerFactory)]
   [junit4]   2> 45680 INFO  (TEST-TestLazyCores.testBadConfigsGenerateErrors-seed#[4C707C46A220E571]) [    x:collection4] o.a.s.c.CoreContainer Security conf doesn't exist. Skipping setup for authorization module.
   [junit4]   2> 45680 INFO  (TEST-TestLazyCores.testBadConfigsGenerateErrors-seed#[4C707C46A220E571]) [    x:collection4] o.a.s.c.CoreContainer No authentication plugin used.
   [junit4]   2> 45680 INFO  (TEST-TestLazyCores.testBadConfigsGenerateErrors-seed#[4C707C46A220E571]) [    x:collection4] o.a.s.c.CorePropertiesLocator Looking for core definitions underneath /export/home/jenkins/workspace/Lucene-Solr-6.x-Solaris/solr/build/solr-core/test/J0/temp/solr.core.TestLazyCores_4C707C46A220E571-001/tempDir-002
   [junit4]   2> 45681 INFO  (TEST-TestLazyCores.testBadConfigsGenerateErrors-seed#[4C707C46A220E571]) [    x:collection4] o.a.s.c.CoreDescriptor Created CoreDescriptor: {name=core2, config=solrconfig.xml, loadOnStartup=true, schema=schema.xml, configSetProperties=configsetprops.json, transient=false, dataDir=data/}
   [junit4]   2> 45681 INFO  (TEST-TestLazyCores.testBadConfigsGenerateErrors-seed#[4C707C46A220E571]) [    x:collection4] o.a.s.c.CorePropertiesLocator Found core core2 in /export/home/jenkins/workspace/Lucene-Solr-6.x-Solaris/solr/build/solr-core/test/J0/temp/solr.core.TestLazyCores_4C707C46A220E571-001/tempDir-002/core2
   [junit4]   2> 45682 INFO  (TEST-TestLazyCores.testBadConfigsGenerateErrors-seed#[4C707C46A220E571]) [    x:collection4] o.a.s.c.CoreDescriptor Created CoreDescriptor: {name=badSchema2, config=solrconfig.xml, loadOnStartup=true, schema=schema.xml, configSetProperties=configsetprops.json, transient=true, dataDir=data/}
   [junit4]   2> 45682 INFO  (TEST-TestLazyCores.testBadConfigsGenerateErrors-seed#[4C707C46A220E571]) [    x:collection4] o.a.s.c.CorePropertiesLocator Found core badSchema2 in /export/home/jenkins/workspace/Lucene-Solr-6.x-Solaris/solr/build/solr-core/test/J0/temp/solr.core.TestLazyCores_4C707C46A220E571-001/tempDir-002/badSchema2
   [junit4]   2> 45682 INFO  (TEST-TestLazyCores.testBadConfigsGenerateErrors-seed#[4C707C46A220E571]) [    x:collection4] o.a.s.c.CoreDescriptor Created CoreDescriptor: {name=badConfig1, config=solrconfig.xml, loadOnStartup=true, schema=schema.xml, configSetProperties=configsetprops.json, transient=true, dataDir=data/}
   [junit4]   2> 45682 INFO  (TEST-TestLazyCores.testBadConfigsGenerateErrors-seed#[4C707C46A220E571]) [    x:collection4] o.a.s.c.CorePropertiesLocator Found core badConfig1 in /export/home/jenkins/workspace/Lucene-Solr-6.x-Solaris/solr/build/solr-core/test/J0/temp/solr.core.TestLazyCores_4C707C46A220E571-001/tempDir-002/badConfig1
   [junit4]   2> 45683 INFO  (TEST-TestLazyCores.testBadConfigsGenerateErrors-seed#[4C707C46A220E571]) [    x:collection4] o.a.s.c.CoreDescriptor Created CoreDescriptor: {name=core1, config=solrconfig.xml, loadOnStartup=true, schema=schema.xml, configSetProperties=configsetprops.json, transient=false, dataDir=data/}
   [junit4]   2> 45683 INFO  (TEST-TestLazyCores.testBadConfigsGenerateErrors-seed#[4C707C46A220E571]) [    x:collection4] o.a.s.c.CorePropertiesLocator Found core core1 in /export/home/jenkins/workspace/Lucene-Solr-6.x-Solaris/solr/build/solr-core/test/J0/temp/solr.core.TestLazyCores_4C707C46A220E571-001/tempDir-002/core1
   [junit4]   2> 45683 INFO  (TEST-TestLazyCores.testBadConfigsGenerateErrors-seed#[4C707C46A220E571]) [    x:collection4] o.a.s.c.CoreDescriptor Created CoreDescriptor: {name=badSchema1, config=solrconfig.xml, loadOnStartup=true, schema=schema.xml, configSetProperties=configsetprops.json, transient=true, dataDir=data/}
   [junit4]   2> 45684 INFO  (TEST-TestLazyCores.testBadConfigsGenerateErrors-seed#[4C707C46A220E571]) [    x:collection4] o.a.s.c.CorePropertiesLocator Found core badSchema1 in /export/home/jenkins/workspace/Lucene-Solr-6.x-Solaris/solr/build/solr-core/test/J0/temp/solr.core.TestLazyCores_4C707C46A220E571-001/tempDir-002/badSchema1
   [junit4]   2> 45684 INFO  (TEST-TestLazyCores.testBadConfigsGenerateErrors-seed#[4C707C46A220E571]) [    x:collection4] o.a.s.c.CoreDescriptor Created CoreDescriptor: {name=badConfig2, config=solrconfig.xml, loadOnStartup=true, schema=schema.xml, configSetProperties=configsetprops.json, transient=true, dataDir=data/}
   [junit4]   2> 45684 INFO  (TEST-TestLazyCores.testBadConfigsGenerateErrors-seed#[4C707C46A220E571]) [    x:collection4] o.a.s.c.CorePropertiesLocator Found core badConfig2 in /export/home/jenkins/workspace/Lucene-Solr-6.x-Solaris/solr/build/solr-core/test/J0/temp/solr.core.TestLazyCores_4C707C46A220E571-001/tempDir-002/badConfig2
   [junit4]   2> 45684 INFO  (TEST-TestLazyCores.testBadConfigsGenerateErrors-seed#[4C707C46A220E571]) [    x:collection4] o.a.s.c.CorePropertiesLocator Found 6 core definitions
   [junit4]   2> 45685 INFO  (coreLoadExecutor-227-thread-1-processing-x:collection4) [    x:collection4] o.a.s.c.SolrResourceLoader new SolrResourceLoader for directory: '/export/home/jenkins/workspace/Lucene-Solr-6.x-Solaris/solr/build/solr-core/test/J0/temp/solr.core.TestLazyCores_4C707C46A220E571-001/tempDir-002/core2'
   [junit4]   2> 45685 INFO  (coreLoadExecutor-227-thread-3-processing-x:collection4) [    x:collection4] o.a.s.c.SolrResourceLoader new SolrResourceLoader for directory: '/export/home/jenkins/workspace/Lucene-Solr-6.x-Solaris/solr/build/solr-core/test/J0/temp/solr.core.TestLazyCores_4C707C46A220E571-001/tempDir-002/badConfig1'
   [junit4]   2> 45685 INFO  (coreLoadExecutor-227-thread-1-processing-x:collection4) [    x:collection4] o.a.s.c.SolrResourceLoader JNDI not configured for solr (NoInitialContextEx)
   [junit4]   2> 45685 INFO  (coreLoadExecutor-227-thread-1-processing-x:collection4) [    x:collection4] o.a.s.c.SolrResourceLoader solr home defaulted to 'solr/' (could not find system property or JNDI)
   [junit4]   2> 45685 INFO  (coreLoadExecutor-227-thread-3-processing-x:collection4) [    x:collection4] o.a.s.c.SolrResourceLoader JNDI not configured for solr (NoInitialContextEx)
   [junit4]   2> 45686 INFO  (coreLoadExecutor-227-thread-3-processing-x:collection4) [    x:collection4] o.a.s.c.SolrResourceLoader solr home defaulted to 'solr/' (could not find system property or JNDI)
   [junit4]   2> 45687 INFO  (coreLoadExecutor-227-thread-2-processing-x:collection4) [    x:collection4] o.a.s.c.SolrResourceLoader new SolrResourceLoader for directory: '/export/home/jenkins/workspace/Lucene-Solr-6.x-Solaris/solr/build/solr-core/test/J0/temp/solr.core.TestLazyCores_4C707C46A220E571-001/tempDir-002/badSchema2'
   [junit4]   2> 45687 INFO  (coreLoadExecutor-227-thread-2-processing-x:collection4) [    x:collection4] o.a.s.c.SolrResourceLoader JNDI not configured for solr (NoInitialContextEx)
   [junit4]   2> 45687 INFO  (coreLoadExecutor-227-thread-2-processing-x:collection4) [    x:collection4] o.a.s.c.SolrResourceLoader solr home defaulted to 'solr/' (could not find system property or JNDI)
   [junit4]   2> 45692 INFO  (coreLoadExecutor-227-thread-1-processing-x:collection4) [    x:collection4] o.a.s.c.SolrConfig current version of requestparams : -1
   [junit4]   2> 45694 INFO  (coreLoadExecutor-227-thread-1-processing-x:collection4) [    x:collection4] o.a.s.c.SolrConfig Using Lucene MatchVersion: 6.2.0
   [junit4]   2> 45697 INFO  (coreLoadExecutor-227-thread-2-processing-x:collection4) [    x:collection4] o.a.s.c.SolrConfig current version of requestparams : -1
   [junit4]   2> 45698 INFO  (coreLoadExecutor-227-thread-1-processing-x:collection4) [    x:collection4] o.a.s.c.SolrConfig Loaded SolrConfig: solrconfig.xml
   [junit4]   2> 45699 INFO  (coreLoadExecutor-227-thread-2-processing-x:collection4) [    x:collection4] o.a.s.c.SolrConfig Using Lucene MatchVersion: 6.2.0
   [junit4]   2> 45702 INFO  (coreLoadExecutor-227-thread-1-processing-x:collection4) [    x:collection4] o.a.s.s.IndexSchema [core2] Schema name=tiny
   [junit4]   2> 45711 INFO  (coreLoadExecutor-227-thread-2-processing-x:collection4) [    x:collection4] o.a.s.c.SolrConfig Loaded SolrConfig: solrconfig.xml
   [junit4]   2> 45712 INFO  (coreLoadExecutor-227-thread-1-processing-x:collection4) [    x:collection4] o.a.s.s.IndexSchema unique key field: id
   [junit4]   2> 45714 INFO  (coreLoadExecutor-227-thread-1-processing-x:collection4) [    x:collection4] o.a.s.c.ConfigSetProperties Did not find ConfigSet properties, assuming default properties: Can't find resource 'configsetprops.json' in classpath or '/export/home/jenkins/workspace/Lucene-Solr-6.x-Solaris/solr/build/solr-core/test/J0/temp/solr.core.TestLazyCores_4C707C46A220E571-001/tempDir-002/core2'
   [junit4]   2> 45714 INFO  (coreLoadExecutor-227-thread-1-processing-x:collection4) [    x:collection4] o.a.s.c.CoreContainer Creating SolrCore 'core2' using configuration from instancedir /export/home/jenkins/workspace/Lucene-Solr-6.x-Solaris/solr/build/solr-core/test/J0/temp/solr.core.TestLazyCores_4C707C46A220E571-001/tempDir-002/core2
   [junit4]   2> 45714 INFO  (coreLoadExecutor-227-thread-1-processing-x:collection4) [    x:core2] o.a.s.c.SolrCore org.apache.solr.core.MockDirectoryFactory
   [junit4]   2> 45714 INFO  (coreLoadExecutor-227-thread-1-processing-x:collection4) [    x:core2] o.a.s.c.SolrCore [[core2] ] Opening new SolrCore at [/export/home/jenkins/workspace/Lucene-Solr-6.x-Solaris/solr/build/solr-core/test/J0/temp/solr.core.TestLazyCores_4C707C46A220E571-001/tempDir-002/core2], dataDir=[/export/home/jenkins/workspace/Lucene-Solr-6.x-Solaris/solr/build/solr-core/test/J0/temp/solr.core.TestLazyCores_4C707C46A220E571-001/tempDir-002/core2/data/]
   [junit4]   2> 45714 INFO  (coreLoadExecutor-227-thread-1-processing-x:collection4) [    x:core2] o.a.s.c.SolrCore JMX monitoring not detected for core: core2
   [junit4]   2> 45715 INFO  (coreLoadExecutor-227-thread-1-processing-x:collection4) [    x:core2] o.a.s.c.CachingDirectoryFactory return new directory for /export/home/jenkins/workspace/Lucene-Solr-6.x-Solaris/solr/build/solr-core/test/J0/temp/solr.core.TestLazyCores_4C707C46A220E571-001/tempDir-002/core2/data
   [junit4]   2> 45715 INFO  (coreLoadExecutor-227-thread-1-processing-x:collection4) [    x:core2] o.a.s.c.SolrCore New index directory detected: old=null new=/export/home/jenkins/workspace/Lucene-Solr-6.x-Solaris/solr/build/solr-core/test/J0/temp/solr.core.TestLazyCores_4C707C46A220E571-001/tempDir-002/core2/data/index/
   [junit4]   2> 45715 WARN  (coreLoadExecutor-227-thread-1-processing-x:collection4) [    x:core2] o.a.s.c.SolrCore [core2] Solr index directory '/export/home/jenkins/workspace/Lucene-Solr-6.x-Solaris/solr/build/solr-core/test/J0/temp/solr.core.TestLazyCores_4C707C46A220E571-001/tempDir-002/core2/data/index' doesn't exist. Creating new index...
   [junit4]   2> 45715 INFO  (coreLoadExecutor-227-thread-1-processing-x:collection4) [    x:core2] o.a.s.c.CachingDirectoryFactory return new directory for /export/home/jenkins/workspace/Lucene-Solr-6.x-Solaris/solr/build/solr-core/test/J0/temp/solr.core.TestLazyCores_4C707C46A220E571-001/tempDir-002/core2/data/index
   [junit4]   2> 45715 INFO  (coreLoadExecutor-227-thread-1-processing-x:collection4) [    x:core2] o.a.s.u.RandomMergePolicy RandomMergePolicy wrapping class org.apache.lucene.index.LogByteSizeMergePolicy: [LogByteSizeMergePolicy: minMergeSize=1677721, mergeFactor=33, maxMergeSize=2147483648, maxMergeSizeForForcedMerge=9223372036854775807, calibrateSizeByDeletes=true, maxMergeDocs=2147483647, maxCFSSegmentSizeMB=8.796093022207999E12, noCFSRatio=0.16511331506942897]
   [junit4]   2> 45716 INFO  (coreLoadExecutor-227-thread-1-processing-x:collection4) [    x:core2] o.a.s.c.SolrDeletionPolicy SolrDeletionPolicy.onCommit: commits: num=1
   [junit4]   2> 	commit{dir=MockDirectoryWrapper(RAMDirectory@36545bb4 lockFactory=org.apache.lucene.store.SingleInstanceLockFactory@5e807585),segFN=segments_1,generation=1}
   [junit4]   2> 45716 INFO  (coreLoadExecutor-227-thread-1-processing-x:collection4) [    x:core2] o.a.s.c.SolrDeletionPolicy newest commit generation = 1
   [junit4]   2> 45716 INFO  (OldIndexDirectoryCleanupThreadForCore-core2) [    x:core2] o.a.s.c.SolrCore Looking for old index directories to cleanup for core core2 in /export/home/jenkins/workspace/Lucene-Solr-6.x-Solaris/solr/build/solr-core/test/J0/temp/solr.core.TestLazyCores_4C707C46A220E571-001/tempDir-002/core2/data/
   [junit4]   2> 45716 WARN  (OldIndexDirectoryCleanupThreadForCore-core2) [    x:core2] o.a.s.c.DirectoryFactory /export/home/jenkins/workspace/Lucene-Solr-6.x-Solaris/solr/build/solr-core/test/J0/temp/solr.core.TestLazyCores_4C707C46A220E571-001/tempDir-002/core2/data/ does not point to a valid data directory; skipping clean-up of old index directories.
   [junit4]   2> 45722 INFO  (coreLoadExecutor-227-thread-1-processing-x:collection4) [    x:core2] o.a.s.c.SolrCore no updateRequestProcessorChain defined as default, creating implicit default
   [junit4]   2> 45724 INFO  (coreLoadExecutor-227-thread-1-processing-x:collection4) [    x:core2] o.a.s.h.l.XMLLoader xsltCacheLifetimeSeconds=60
   [junit4]   2> 45724 INFO  (coreLoadExecutor-227-thread-2-processing-x:collection4) [    x:collection4] o.a.s.c.Config Ignoring exception matching \QSAXParseException\E
   [junit4]   2> 45724 ERROR (coreLoadExecutor-227-thread-2-processing-x:collection4) [    x:collection4] o.a.s.c.CoreContainer Error creating core [badSchema2]: Could not load conf for core badSchema2: Can't load schema /export/home/jenkins/workspace/Lucene-Solr-6.x-Solaris/solr/build/solr-core/test/J0/temp/solr.core.TestLazyCores_4C707C46A220E571-001/tempDir-002/badSchema2/conf/schema.xml: org.xml.sax.SAXParseException; systemId: solrres:/schema.xml; lineNumber: 34; columnNumber: 5; The element type "filedType" must be terminated by the matching end-tag "</filedType>".
   [junit4]   2> org.apache.solr.common.SolrException: Could not load conf for core badSchema2: Can't load schema /export/home/jenkins/workspace/Lucene-Solr-6.x-Solaris/solr/build/solr-core/test/J0/temp/solr.core.TestLazyCores_4C707C46A220E571-001/tempDir-002/badSchema2/conf/schema.xml: org.xml.sax.SAXParseException; systemId: solrres:/schema.xml; lineNumber: 34; columnNumber: 5; The element type "filedType" must be terminated by the matching end-tag "</filedType>".
   [junit4]   2> 	at org.apache.solr.core.ConfigSetService.getConfig(ConfigSetService.java:85)
   [junit4]   2> 	at org.apache.solr.core.CoreContainer.create(CoreContainer.java:836)
   [junit4]   2> 	at org.apache.solr.core.CoreContainer.lambda$load$0(CoreContainer.java:494)
   [junit4]   2> 	at java.util.concurrent.FutureTask.run(FutureTask.java:266)
   [junit4]   2> 	at org.apache.solr.common.util.ExecutorUtil$MDCAwareThreadPoolExecutor.lambda$execute$0(ExecutorUtil.java:229)
   [junit4]   2> 	at java.util.concurrent.ThreadPoolExecutor.runWorker(ThreadPoolExecutor.java:1142)
   [junit4]   2> 	at java.util.concurrent.ThreadPoolExecutor$Worker.run(ThreadPoolExecutor.java:617)
   [junit4]   2> 	at java.lang.Thread.run(Thread.java:745)
   [junit4]   2> Caused by: org.apache.solr.common.SolrException: Can't load schema /export/home/jenkins/workspace/Lucene-Solr-6.x-Solaris/solr/build/solr-core/test/J0/temp/solr.core.TestLazyCores_4C707C46A220E571-001/tempDir-002/badSchema2/conf/schema.xml: org.xml.sax.SAXParseException; systemId: solrres:/schema.xml; lineNumber: 34; columnNumber: 5; The element type "filedType" must be terminated by the matching end-tag "</filedType>".
   [junit4]   2> 	at org.apache.solr.schema.IndexSchema.readSchema(IndexSchema.java:600)
   [junit4]   2> 	at org.apache.solr.schema.IndexSchema.<init>(IndexSchema.java:183)
   [junit4]   2> 	at org.apache.solr.schema.IndexSchemaFactory.create(IndexSchemaFactory.java:56)
   [junit4]   2> 	at org.apache.solr.schema.IndexSchemaFactory.buildInde

[...truncated too long message...]

it4]   2> 	at java.util.concurrent.ThreadPoolExecutor$Worker.run(ThreadPoolExecutor.java:617)
   [junit4]   2> 	at java.lang.Thread.run(Thread.java:745)
   [junit4]   2> 
   [junit4]   2> org.apache.solr.common.util.ObjectReleaseTracker$ObjectTrackerException
   [junit4]   2> 	at org.apache.solr.common.util.ObjectReleaseTracker.track(ObjectReleaseTracker.java:42)
   [junit4]   2> 	at org.apache.solr.core.CachingDirectoryFactory.get(CachingDirectoryFactory.java:347)
   [junit4]   2> 	at org.apache.solr.core.SolrCore.getNewIndexDir(SolrCore.java:322)
   [junit4]   2> 	at org.apache.solr.core.SolrCore.initIndex(SolrCore.java:540)
   [junit4]   2> 	at org.apache.solr.core.SolrCore.<init>(SolrCore.java:747)
   [junit4]   2> 	at org.apache.solr.core.SolrCore.<init>(SolrCore.java:674)
   [junit4]   2> 	at org.apache.solr.core.CoreContainer.create(CoreContainer.java:838)
   [junit4]   2> 	at org.apache.solr.core.CoreContainer.lambda$load$0(CoreContainer.java:494)
   [junit4]   2> 	at java.util.concurrent.FutureTask.run(FutureTask.java:266)
   [junit4]   2> 	at org.apache.solr.common.util.ExecutorUtil$MDCAwareThreadPoolExecutor.lambda$execute$0(ExecutorUtil.java:229)
   [junit4]   2> 	at java.util.concurrent.ThreadPoolExecutor.runWorker(ThreadPoolExecutor.java:1142)
   [junit4]   2> 	at java.util.concurrent.ThreadPoolExecutor$Worker.run(ThreadPoolExecutor.java:617)
   [junit4]   2> 	at java.lang.Thread.run(Thread.java:745)
   [junit4]   2> 
   [junit4]   2> org.apache.solr.common.util.ObjectReleaseTracker$ObjectTrackerException
   [junit4]   2> 	at org.apache.solr.common.util.ObjectReleaseTracker.track(ObjectReleaseTracker.java:42)
   [junit4]   2> 	at org.apache.solr.core.CachingDirectoryFactory.get(CachingDirectoryFactory.java:347)
   [junit4]   2> 	at org.apache.solr.update.SolrIndexWriter.create(SolrIndexWriter.java:63)
   [junit4]   2> 	at org.apache.solr.core.SolrCore.initIndex(SolrCore.java:572)
   [junit4]   2> 	at org.apache.solr.core.SolrCore.<init>(SolrCore.java:747)
   [junit4]   2> 	at org.apache.solr.core.SolrCore.<init>(SolrCore.java:674)
   [junit4]   2> 	at org.apache.solr.core.CoreContainer.create(CoreContainer.java:838)
   [junit4]   2> 	at org.apache.solr.core.CoreContainer.lambda$load$0(CoreContainer.java:494)
   [junit4]   2> 	at java.util.concurrent.FutureTask.run(FutureTask.java:266)
   [junit4]   2> 	at org.apache.solr.common.util.ExecutorUtil$MDCAwareThreadPoolExecutor.lambda$execute$0(ExecutorUtil.java:229)
   [junit4]   2> 	at java.util.concurrent.ThreadPoolExecutor.runWorker(ThreadPoolExecutor.java:1142)
   [junit4]   2> 	at java.util.concurrent.ThreadPoolExecutor$Worker.run(ThreadPoolExecutor.java:617)
   [junit4]   2> 	at java.lang.Thread.run(Thread.java:745)
   [junit4]   2> 
   [junit4]   2> org.apache.solr.common.util.ObjectReleaseTracker$ObjectTrackerException
   [junit4]   2> 	at org.apache.solr.common.util.ObjectReleaseTracker.track(ObjectReleaseTracker.java:42)
   [junit4]   2> 	at org.apache.solr.core.SolrCore.<init>(SolrCore.java:835)
   [junit4]   2> 	at org.apache.solr.core.SolrCore.<init>(SolrCore.java:674)
   [junit4]   2> 	at org.apache.solr.core.CoreContainer.create(CoreContainer.java:838)
   [junit4]   2> 	at org.apache.solr.core.CoreContainer.lambda$load$0(CoreContainer.java:494)
   [junit4]   2> 	at java.util.concurrent.FutureTask.run(FutureTask.java:266)
   [junit4]   2> 	at org.apache.solr.common.util.ExecutorUtil$MDCAwareThreadPoolExecutor.lambda$execute$0(ExecutorUtil.java:229)
   [junit4]   2> 	at java.util.concurrent.ThreadPoolExecutor.runWorker(ThreadPoolExecutor.java:1142)
   [junit4]   2> 	at java.util.concurrent.ThreadPoolExecutor$Worker.run(ThreadPoolExecutor.java:617)
   [junit4]   2> 	at java.lang.Thread.run(Thread.java:745)
   [junit4]   2> 
   [junit4]   2> Jul 27, 2016 1:02:29 AM com.carrotsearch.randomizedtesting.ThreadLeakControl checkThreadLeaks
   [junit4]   2> WARNING: Will linger awaiting termination of 1 leaked thread(s).
   [junit4]   2> Jul 27, 2016 1:02:49 AM com.carrotsearch.randomizedtesting.ThreadLeakControl checkThreadLeaks
   [junit4]   2> SEVERE: 1 thread leaked from SUITE scope at org.apache.solr.core.TestLazyCores: 
   [junit4]   2>    1) Thread[id=709, name=searcherExecutor-272-thread-1, state=WAITING, group=TGRP-TestLazyCores]
   [junit4]   2>         at sun.misc.Unsafe.park(Native Method)
   [junit4]   2>         at java.util.concurrent.locks.LockSupport.park(LockSupport.java:175)
   [junit4]   2>         at java.util.concurrent.locks.AbstractQueuedSynchronizer$ConditionObject.await(AbstractQueuedSynchronizer.java:2039)
   [junit4]   2>         at java.util.concurrent.LinkedBlockingQueue.take(LinkedBlockingQueue.java:442)
   [junit4]   2>         at java.util.concurrent.ThreadPoolExecutor.getTask(ThreadPoolExecutor.java:1067)
   [junit4]   2>         at java.util.concurrent.ThreadPoolExecutor.runWorker(ThreadPoolExecutor.java:1127)
   [junit4]   2>         at java.util.concurrent.ThreadPoolExecutor$Worker.run(ThreadPoolExecutor.java:617)
   [junit4]   2>         at java.lang.Thread.run(Thread.java:745)
   [junit4]   2> Jul 27, 2016 1:02:49 AM com.carrotsearch.randomizedtesting.ThreadLeakControl tryToInterruptAll
   [junit4]   2> INFO: Starting to interrupt leaked threads:
   [junit4]   2>    1) Thread[id=709, name=searcherExecutor-272-thread-1, state=WAITING, group=TGRP-TestLazyCores]
   [junit4]   2> Jul 27, 2016 1:02:52 AM com.carrotsearch.randomizedtesting.ThreadLeakControl tryToInterruptAll
   [junit4]   2> SEVERE: There are still zombie threads that couldn't be terminated:
   [junit4]   2>    1) Thread[id=709, name=searcherExecutor-272-thread-1, state=WAITING, group=TGRP-TestLazyCores]
   [junit4]   2>         at sun.misc.Unsafe.park(Native Method)
   [junit4]   2>         at java.util.concurrent.locks.LockSupport.park(LockSupport.java:175)
   [junit4]   2>         at java.util.concurrent.locks.AbstractQueuedSynchronizer$ConditionObject.await(AbstractQueuedSynchronizer.java:2039)
   [junit4]   2>         at java.util.concurrent.LinkedBlockingQueue.take(LinkedBlockingQueue.java:442)
   [junit4]   2>         at java.util.concurrent.ThreadPoolExecutor.getTask(ThreadPoolExecutor.java:1067)
   [junit4]   2>         at java.util.concurrent.ThreadPoolExecutor.runWorker(ThreadPoolExecutor.java:1127)
   [junit4]   2>         at java.util.concurrent.ThreadPoolExecutor$Worker.run(ThreadPoolExecutor.java:617)
   [junit4]   2>         at java.lang.Thread.run(Thread.java:745)
   [junit4]   2> NOTE: test params are: codec=Lucene62, sim=RandomSimilarity(queryNorm=false,coord=crazy): {}, locale=sl-SI, timezone=America/Shiprock
   [junit4]   2> NOTE: SunOS 5.11 amd64/Oracle Corporation 1.8.0_92 (64-bit)/cpus=3,threads=2,free=122032408,total=255852544
   [junit4]   2> NOTE: All tests run in this JVM: [DisMaxRequestHandlerTest, TestConfigSets, TestSolrConfigHandlerConcurrent, TestRandomFlRTGCloud, SolrCLIZkUtilsTest, TestLazyCores]
   [junit4]   2> NOTE: reproduce with: ant test  -Dtestcase=TestLazyCores -Dtests.seed=4C707C46A220E571 -Dtests.slow=true -Dtests.locale=sl-SI -Dtests.timezone=America/Shiprock -Dtests.asserts=true -Dtests.file.encoding=ISO-8859-1
   [junit4] ERROR   0.00s J0 | TestLazyCores (suite) <<<
   [junit4]    > Throwable #1: java.lang.AssertionError: ObjectTracker found 4 object(s) that were not released!!! [MDCAwareThreadPoolExecutor, MockDirectoryWrapper, MockDirectoryWrapper, SolrCore]
   [junit4]    > 	at __randomizedtesting.SeedInfo.seed([4C707C46A220E571]:0)
   [junit4]    > 	at org.apache.solr.SolrTestCaseJ4.teardownTestCases(SolrTestCaseJ4.java:258)
   [junit4]    > 	at java.lang.Thread.run(Thread.java:745)Throwable #2: com.carrotsearch.randomizedtesting.ThreadLeakError: 1 thread leaked from SUITE scope at org.apache.solr.core.TestLazyCores: 
   [junit4]    >    1) Thread[id=709, name=searcherExecutor-272-thread-1, state=WAITING, group=TGRP-TestLazyCores]
   [junit4]    >         at sun.misc.Unsafe.park(Native Method)
   [junit4]    >         at java.util.concurrent.locks.LockSupport.park(LockSupport.java:175)
   [junit4]    >         at java.util.concurrent.locks.AbstractQueuedSynchronizer$ConditionObject.await(AbstractQueuedSynchronizer.java:2039)
   [junit4]    >         at java.util.concurrent.LinkedBlockingQueue.take(LinkedBlockingQueue.java:442)
   [junit4]    >         at java.util.concurrent.ThreadPoolExecutor.getTask(ThreadPoolExecutor.java:1067)
   [junit4]    >         at java.util.concurrent.ThreadPoolExecutor.runWorker(ThreadPoolExecutor.java:1127)
   [junit4]    >         at java.util.concurrent.ThreadPoolExecutor$Worker.run(ThreadPoolExecutor.java:617)
   [junit4]    >         at java.lang.Thread.run(Thread.java:745)
   [junit4]    > 	at __randomizedtesting.SeedInfo.seed([4C707C46A220E571]:0)Throwable #3: com.carrotsearch.randomizedtesting.ThreadLeakError: There are still zombie threads that couldn't be terminated:
   [junit4]    >    1) Thread[id=709, name=searcherExecutor-272-thread-1, state=WAITING, group=TGRP-TestLazyCores]
   [junit4]    >         at sun.misc.Unsafe.park(Native Method)
   [junit4]    >         at java.util.concurrent.locks.LockSupport.park(LockSupport.java:175)
   [junit4]    >         at java.util.concurrent.locks.AbstractQueuedSynchronizer$ConditionObject.await(AbstractQueuedSynchronizer.java:2039)
   [junit4]    >         at java.util.concurrent.LinkedBlockingQueue.take(LinkedBlockingQueue.java:442)
   [junit4]    >         at java.util.concurrent.ThreadPoolExecutor.getTask(ThreadPoolExecutor.java:1067)
   [junit4]    >         at java.util.concurrent.ThreadPoolExecutor.runWorker(ThreadPoolExecutor.java:1127)
   [junit4]    >         at java.util.concurrent.ThreadPoolExecutor$Worker.run(ThreadPoolExecutor.java:617)
   [junit4]    >         at java.lang.Thread.run(Thread.java:745)
   [junit4]    > 	at __randomizedtesting.SeedInfo.seed([4C707C46A220E571]:0)
   [junit4] Completed [43/624 (1!)] on J0 in 148.61s, 8 tests, 1 failure, 2 errors <<< FAILURES!

[...truncated 61960 lines...]


Mime
View raw message