lucene-dev mailing list archives

Site index · List index
Message view « Date » · « Thread »
Top « Date » · « Thread »
From Apache Jenkins Server <jenk...@builds.apache.org>
Subject [JENKINS] Lucene-Solr-Tests-master - Build # 1184 - Still Failing
Date Wed, 01 Jun 2016 21:08:15 GMT
Build: https://builds.apache.org/job/Lucene-Solr-Tests-master/1184/

1 tests failed.
FAILED:  org.apache.solr.handler.TestReqParamsAPI.test

Error Message:
Could not get expected value  'CY val' for path 'params/c' full output: {   "responseHeader":{     "status":0,     "QTime":0},   "params":{     "a":"A val",     "b":"B val",     "wt":"json",     "useParams":""},   "context":{     "webapp":"",     "path":"/dump1",     "httpMethod":"GET"}},  from server:  http://127.0.0.1:36128/collection1

Stack Trace:
java.lang.AssertionError: Could not get expected value  'CY val' for path 'params/c' full output: {
  "responseHeader":{
    "status":0,
    "QTime":0},
  "params":{
    "a":"A val",
    "b":"B val",
    "wt":"json",
    "useParams":""},
  "context":{
    "webapp":"",
    "path":"/dump1",
    "httpMethod":"GET"}},  from server:  http://127.0.0.1:36128/collection1
	at __randomizedtesting.SeedInfo.seed([507918E187C89A4E:D82D273B2934F7B6]:0)
	at org.junit.Assert.fail(Assert.java:93)
	at org.junit.Assert.assertTrue(Assert.java:43)
	at org.apache.solr.core.TestSolrConfigHandler.testForResponseElement(TestSolrConfigHandler.java:457)
	at org.apache.solr.handler.TestReqParamsAPI.testReqParams(TestReqParamsAPI.java:172)
	at org.apache.solr.handler.TestReqParamsAPI.test(TestReqParamsAPI.java:62)
	at sun.reflect.NativeMethodAccessorImpl.invoke0(Native Method)
	at sun.reflect.NativeMethodAccessorImpl.invoke(NativeMethodAccessorImpl.java:62)
	at sun.reflect.DelegatingMethodAccessorImpl.invoke(DelegatingMethodAccessorImpl.java:43)
	at java.lang.reflect.Method.invoke(Method.java:498)
	at com.carrotsearch.randomizedtesting.RandomizedRunner.invoke(RandomizedRunner.java:1764)
	at com.carrotsearch.randomizedtesting.RandomizedRunner$8.evaluate(RandomizedRunner.java:871)
	at com.carrotsearch.randomizedtesting.RandomizedRunner$9.evaluate(RandomizedRunner.java:907)
	at com.carrotsearch.randomizedtesting.RandomizedRunner$10.evaluate(RandomizedRunner.java:921)
	at org.apache.solr.BaseDistributedSearchTestCase$ShardsRepeatRule$ShardsFixedStatement.callStatement(BaseDistributedSearchTestCase.java:985)
	at org.apache.solr.BaseDistributedSearchTestCase$ShardsRepeatRule$ShardsStatement.evaluate(BaseDistributedSearchTestCase.java:960)
	at com.carrotsearch.randomizedtesting.rules.SystemPropertiesRestoreRule$1.evaluate(SystemPropertiesRestoreRule.java:57)
	at org.apache.lucene.util.TestRuleSetupTeardownChained$1.evaluate(TestRuleSetupTeardownChained.java:49)
	at org.apache.lucene.util.AbstractBeforeAfterRule$1.evaluate(AbstractBeforeAfterRule.java:45)
	at org.apache.lucene.util.TestRuleThreadAndTestName$1.evaluate(TestRuleThreadAndTestName.java:48)
	at org.apache.lucene.util.TestRuleIgnoreAfterMaxFailures$1.evaluate(TestRuleIgnoreAfterMaxFailures.java:64)
	at org.apache.lucene.util.TestRuleMarkFailure$1.evaluate(TestRuleMarkFailure.java:47)
	at com.carrotsearch.randomizedtesting.rules.StatementAdapter.evaluate(StatementAdapter.java:36)
	at com.carrotsearch.randomizedtesting.ThreadLeakControl$StatementRunner.run(ThreadLeakControl.java:367)
	at com.carrotsearch.randomizedtesting.ThreadLeakControl.forkTimeoutingTask(ThreadLeakControl.java:809)
	at com.carrotsearch.randomizedtesting.ThreadLeakControl$3.evaluate(ThreadLeakControl.java:460)
	at com.carrotsearch.randomizedtesting.RandomizedRunner.runSingleTest(RandomizedRunner.java:880)
	at com.carrotsearch.randomizedtesting.RandomizedRunner$5.evaluate(RandomizedRunner.java:781)
	at com.carrotsearch.randomizedtesting.RandomizedRunner$6.evaluate(RandomizedRunner.java:816)
	at com.carrotsearch.randomizedtesting.RandomizedRunner$7.evaluate(RandomizedRunner.java:827)
	at com.carrotsearch.randomizedtesting.rules.StatementAdapter.evaluate(StatementAdapter.java:36)
	at com.carrotsearch.randomizedtesting.rules.SystemPropertiesRestoreRule$1.evaluate(SystemPropertiesRestoreRule.java:57)
	at org.apache.lucene.util.AbstractBeforeAfterRule$1.evaluate(AbstractBeforeAfterRule.java:45)
	at com.carrotsearch.randomizedtesting.rules.StatementAdapter.evaluate(StatementAdapter.java:36)
	at org.apache.lucene.util.TestRuleStoreClassName$1.evaluate(TestRuleStoreClassName.java:41)
	at com.carrotsearch.randomizedtesting.rules.NoShadowingOrOverridesOnMethodsRule$1.evaluate(NoShadowingOrOverridesOnMethodsRule.java:40)
	at com.carrotsearch.randomizedtesting.rules.NoShadowingOrOverridesOnMethodsRule$1.evaluate(NoShadowingOrOverridesOnMethodsRule.java:40)
	at com.carrotsearch.randomizedtesting.rules.StatementAdapter.evaluate(StatementAdapter.java:36)
	at com.carrotsearch.randomizedtesting.rules.StatementAdapter.evaluate(StatementAdapter.java:36)
	at com.carrotsearch.randomizedtesting.rules.StatementAdapter.evaluate(StatementAdapter.java:36)
	at org.apache.lucene.util.TestRuleAssertionsRequired$1.evaluate(TestRuleAssertionsRequired.java:53)
	at org.apache.lucene.util.TestRuleMarkFailure$1.evaluate(TestRuleMarkFailure.java:47)
	at org.apache.lucene.util.TestRuleIgnoreAfterMaxFailures$1.evaluate(TestRuleIgnoreAfterMaxFailures.java:64)
	at org.apache.lucene.util.TestRuleIgnoreTestSuites$1.evaluate(TestRuleIgnoreTestSuites.java:54)
	at com.carrotsearch.randomizedtesting.rules.StatementAdapter.evaluate(StatementAdapter.java:36)
	at com.carrotsearch.randomizedtesting.ThreadLeakControl$StatementRunner.run(ThreadLeakControl.java:367)
	at java.lang.Thread.run(Thread.java:745)




Build Log:
[...truncated 10625 lines...]
   [junit4] Suite: org.apache.solr.handler.TestReqParamsAPI
   [junit4]   2> Creating dataDir: /x1/jenkins/jenkins-slave/workspace/Lucene-Solr-Tests-master/solr/build/solr-core/test/J0/temp/solr.handler.TestReqParamsAPI_507918E187C89A4E-001/init-core-data-001
   [junit4]   2> 145929 INFO  (SUITE-TestReqParamsAPI-seed#[507918E187C89A4E]-worker) [    ] o.a.s.SolrTestCaseJ4 Randomized ssl (false) and clientAuth (false)
   [junit4]   2> 145930 INFO  (SUITE-TestReqParamsAPI-seed#[507918E187C89A4E]-worker) [    ] o.a.s.BaseDistributedSearchTestCase Setting hostContext system property: /
   [junit4]   2> 145931 INFO  (TEST-TestReqParamsAPI.test-seed#[507918E187C89A4E]) [    ] o.a.s.c.ZkTestServer STARTING ZK TEST SERVER
   [junit4]   2> 145953 INFO  (Thread-1241) [    ] o.a.s.c.ZkTestServer client port:0.0.0.0/0.0.0.0:0
   [junit4]   2> 145953 INFO  (Thread-1241) [    ] o.a.s.c.ZkTestServer Starting server
   [junit4]   2> 146052 INFO  (TEST-TestReqParamsAPI.test-seed#[507918E187C89A4E]) [    ] o.a.s.c.ZkTestServer start zk server on port:37748
   [junit4]   2> 146052 INFO  (TEST-TestReqParamsAPI.test-seed#[507918E187C89A4E]) [    ] o.a.s.c.c.SolrZkClient Using default ZkCredentialsProvider
   [junit4]   2> 146059 INFO  (TEST-TestReqParamsAPI.test-seed#[507918E187C89A4E]) [    ] o.a.s.c.c.ConnectionManager Waiting for client to connect to ZooKeeper
   [junit4]   2> 146080 INFO  (zkCallback-86-thread-1) [    ] o.a.s.c.c.ConnectionManager Watcher org.apache.solr.common.cloud.ConnectionManager@f227899 name:ZooKeeperConnection Watcher:127.0.0.1:37748 got event WatchedEvent state:SyncConnected type:None path:null path:null type:None
   [junit4]   2> 146080 INFO  (TEST-TestReqParamsAPI.test-seed#[507918E187C89A4E]) [    ] o.a.s.c.c.ConnectionManager Client is connected to ZooKeeper
   [junit4]   2> 146081 INFO  (TEST-TestReqParamsAPI.test-seed#[507918E187C89A4E]) [    ] o.a.s.c.c.SolrZkClient Using default ZkACLProvider
   [junit4]   2> 146081 INFO  (TEST-TestReqParamsAPI.test-seed#[507918E187C89A4E]) [    ] o.a.s.c.c.SolrZkClient makePath: /solr
   [junit4]   2> 146090 INFO  (TEST-TestReqParamsAPI.test-seed#[507918E187C89A4E]) [    ] o.a.s.c.c.SolrZkClient Using default ZkCredentialsProvider
   [junit4]   2> 146090 INFO  (TEST-TestReqParamsAPI.test-seed#[507918E187C89A4E]) [    ] o.a.s.c.c.ConnectionManager Waiting for client to connect to ZooKeeper
   [junit4]   2> 146107 INFO  (zkCallback-87-thread-1) [    ] o.a.s.c.c.ConnectionManager Watcher org.apache.solr.common.cloud.ConnectionManager@46deaa02 name:ZooKeeperConnection Watcher:127.0.0.1:37748/solr got event WatchedEvent state:SyncConnected type:None path:null path:null type:None
   [junit4]   2> 146107 INFO  (TEST-TestReqParamsAPI.test-seed#[507918E187C89A4E]) [    ] o.a.s.c.c.ConnectionManager Client is connected to ZooKeeper
   [junit4]   2> 146107 INFO  (TEST-TestReqParamsAPI.test-seed#[507918E187C89A4E]) [    ] o.a.s.c.c.SolrZkClient Using default ZkACLProvider
   [junit4]   2> 146108 INFO  (TEST-TestReqParamsAPI.test-seed#[507918E187C89A4E]) [    ] o.a.s.c.c.SolrZkClient makePath: /collections/collection1
   [junit4]   2> 146109 INFO  (TEST-TestReqParamsAPI.test-seed#[507918E187C89A4E]) [    ] o.a.s.c.c.SolrZkClient makePath: /collections/collection1/shards
   [junit4]   2> 146109 INFO  (TEST-TestReqParamsAPI.test-seed#[507918E187C89A4E]) [    ] o.a.s.c.c.SolrZkClient makePath: /collections/control_collection
   [junit4]   2> 146110 INFO  (TEST-TestReqParamsAPI.test-seed#[507918E187C89A4E]) [    ] o.a.s.c.c.SolrZkClient makePath: /collections/control_collection/shards
   [junit4]   2> 146110 INFO  (TEST-TestReqParamsAPI.test-seed#[507918E187C89A4E]) [    ] o.a.s.c.AbstractZkTestCase put /x1/jenkins/jenkins-slave/workspace/Lucene-Solr-Tests-master/solr/core/src/test-files/solr/collection1/conf/solrconfig-tlog.xml to /configs/conf1/solrconfig.xml
   [junit4]   2> 146111 INFO  (TEST-TestReqParamsAPI.test-seed#[507918E187C89A4E]) [    ] o.a.s.c.c.SolrZkClient makePath: /configs/conf1/solrconfig.xml
   [junit4]   2> 146112 INFO  (TEST-TestReqParamsAPI.test-seed#[507918E187C89A4E]) [    ] o.a.s.c.AbstractZkTestCase put /x1/jenkins/jenkins-slave/workspace/Lucene-Solr-Tests-master/solr/core/src/test-files/solr/collection1/conf/schema.xml to /configs/conf1/schema.xml
   [junit4]   2> 146112 INFO  (TEST-TestReqParamsAPI.test-seed#[507918E187C89A4E]) [    ] o.a.s.c.c.SolrZkClient makePath: /configs/conf1/schema.xml
   [junit4]   2> 146113 INFO  (TEST-TestReqParamsAPI.test-seed#[507918E187C89A4E]) [    ] o.a.s.c.AbstractZkTestCase put /x1/jenkins/jenkins-slave/workspace/Lucene-Solr-Tests-master/solr/core/src/test-files/solr/collection1/conf/solrconfig.snippet.randomindexconfig.xml to /configs/conf1/solrconfig.snippet.randomindexconfig.xml
   [junit4]   2> 146113 INFO  (TEST-TestReqParamsAPI.test-seed#[507918E187C89A4E]) [    ] o.a.s.c.c.SolrZkClient makePath: /configs/conf1/solrconfig.snippet.randomindexconfig.xml
   [junit4]   2> 146114 INFO  (TEST-TestReqParamsAPI.test-seed#[507918E187C89A4E]) [    ] o.a.s.c.AbstractZkTestCase put /x1/jenkins/jenkins-slave/workspace/Lucene-Solr-Tests-master/solr/core/src/test-files/solr/collection1/conf/stopwords.txt to /configs/conf1/stopwords.txt
   [junit4]   2> 146114 INFO  (TEST-TestReqParamsAPI.test-seed#[507918E187C89A4E]) [    ] o.a.s.c.c.SolrZkClient makePath: /configs/conf1/stopwords.txt
   [junit4]   2> 146114 INFO  (TEST-TestReqParamsAPI.test-seed#[507918E187C89A4E]) [    ] o.a.s.c.AbstractZkTestCase put /x1/jenkins/jenkins-slave/workspace/Lucene-Solr-Tests-master/solr/core/src/test-files/solr/collection1/conf/protwords.txt to /configs/conf1/protwords.txt
   [junit4]   2> 146114 INFO  (TEST-TestReqParamsAPI.test-seed#[507918E187C89A4E]) [    ] o.a.s.c.c.SolrZkClient makePath: /configs/conf1/protwords.txt
   [junit4]   2> 146115 INFO  (TEST-TestReqParamsAPI.test-seed#[507918E187C89A4E]) [    ] o.a.s.c.AbstractZkTestCase put /x1/jenkins/jenkins-slave/workspace/Lucene-Solr-Tests-master/solr/core/src/test-files/solr/collection1/conf/currency.xml to /configs/conf1/currency.xml
   [junit4]   2> 146115 INFO  (TEST-TestReqParamsAPI.test-seed#[507918E187C89A4E]) [    ] o.a.s.c.c.SolrZkClient makePath: /configs/conf1/currency.xml
   [junit4]   2> 146116 INFO  (TEST-TestReqParamsAPI.test-seed#[507918E187C89A4E]) [    ] o.a.s.c.AbstractZkTestCase put /x1/jenkins/jenkins-slave/workspace/Lucene-Solr-Tests-master/solr/core/src/test-files/solr/collection1/conf/enumsConfig.xml to /configs/conf1/enumsConfig.xml
   [junit4]   2> 146116 INFO  (TEST-TestReqParamsAPI.test-seed#[507918E187C89A4E]) [    ] o.a.s.c.c.SolrZkClient makePath: /configs/conf1/enumsConfig.xml
   [junit4]   2> 146117 INFO  (TEST-TestReqParamsAPI.test-seed#[507918E187C89A4E]) [    ] o.a.s.c.AbstractZkTestCase put /x1/jenkins/jenkins-slave/workspace/Lucene-Solr-Tests-master/solr/core/src/test-files/solr/collection1/conf/open-exchange-rates.json to /configs/conf1/open-exchange-rates.json
   [junit4]   2> 146117 INFO  (TEST-TestReqParamsAPI.test-seed#[507918E187C89A4E]) [    ] o.a.s.c.c.SolrZkClient makePath: /configs/conf1/open-exchange-rates.json
   [junit4]   2> 146117 INFO  (TEST-TestReqParamsAPI.test-seed#[507918E187C89A4E]) [    ] o.a.s.c.AbstractZkTestCase put /x1/jenkins/jenkins-slave/workspace/Lucene-Solr-Tests-master/solr/core/src/test-files/solr/collection1/conf/mapping-ISOLatin1Accent.txt to /configs/conf1/mapping-ISOLatin1Accent.txt
   [junit4]   2> 146118 INFO  (TEST-TestReqParamsAPI.test-seed#[507918E187C89A4E]) [    ] o.a.s.c.c.SolrZkClient makePath: /configs/conf1/mapping-ISOLatin1Accent.txt
   [junit4]   2> 146118 INFO  (TEST-TestReqParamsAPI.test-seed#[507918E187C89A4E]) [    ] o.a.s.c.AbstractZkTestCase put /x1/jenkins/jenkins-slave/workspace/Lucene-Solr-Tests-master/solr/core/src/test-files/solr/collection1/conf/old_synonyms.txt to /configs/conf1/old_synonyms.txt
   [junit4]   2> 146118 INFO  (TEST-TestReqParamsAPI.test-seed#[507918E187C89A4E]) [    ] o.a.s.c.c.SolrZkClient makePath: /configs/conf1/old_synonyms.txt
   [junit4]   2> 146119 INFO  (TEST-TestReqParamsAPI.test-seed#[507918E187C89A4E]) [    ] o.a.s.c.AbstractZkTestCase put /x1/jenkins/jenkins-slave/workspace/Lucene-Solr-Tests-master/solr/core/src/test-files/solr/collection1/conf/synonyms.txt to /configs/conf1/synonyms.txt
   [junit4]   2> 146119 INFO  (TEST-TestReqParamsAPI.test-seed#[507918E187C89A4E]) [    ] o.a.s.c.c.SolrZkClient makePath: /configs/conf1/synonyms.txt
   [junit4]   2> 146182 INFO  (TEST-TestReqParamsAPI.test-seed#[507918E187C89A4E]) [    ] o.a.s.SolrTestCaseJ4 Writing core.properties file to /x1/jenkins/jenkins-slave/workspace/Lucene-Solr-Tests-master/solr/build/solr-core/test/J0/temp/solr.handler.TestReqParamsAPI_507918E187C89A4E-001/control-001/cores/collection1
   [junit4]   2> 146184 INFO  (TEST-TestReqParamsAPI.test-seed#[507918E187C89A4E]) [    ] o.e.j.s.Server jetty-9.3.8.v20160314
   [junit4]   2> 146185 INFO  (TEST-TestReqParamsAPI.test-seed#[507918E187C89A4E]) [    ] o.e.j.s.h.ContextHandler Started o.e.j.s.ServletContextHandler@29d4fdd0{/,null,AVAILABLE}
   [junit4]   2> 146187 INFO  (TEST-TestReqParamsAPI.test-seed#[507918E187C89A4E]) [    ] o.e.j.s.ServerConnector Started ServerConnector@2e1f6802{HTTP/1.1,[http/1.1]}{127.0.0.1:?????}
   [junit4]   2> 146189 INFO  (TEST-TestReqParamsAPI.test-seed#[507918E187C89A4E]) [    ] o.e.j.s.Server Started @??????ms
   [junit4]   2> 146189 INFO  (TEST-TestReqParamsAPI.test-seed#[507918E187C89A4E]) [    ] o.a.s.c.s.e.JettySolrRunner Jetty properties: {solr.data.dir=/x1/jenkins/jenkins-slave/workspace/Lucene-Solr-Tests-master/solr/build/solr-core/test/J0/temp/solr.handler.TestReqParamsAPI_507918E187C89A4E-001/tempDir-001/control/data, hostContext=/, hostPort=55698, coreRootDirectory=/x1/jenkins/jenkins-slave/workspace/Lucene-Solr-Tests-master/solr/build/solr-core/test/J0/temp/solr.handler.TestReqParamsAPI_507918E187C89A4E-001/control-001/cores}
   [junit4]   2> 146190 INFO  (TEST-TestReqParamsAPI.test-seed#[507918E187C89A4E]) [    ] o.a.s.s.SolrDispatchFilter SolrDispatchFilter.init(): sun.misc.Launcher$AppClassLoader@73d16e93
   [junit4]   2> 146190 INFO  (TEST-TestReqParamsAPI.test-seed#[507918E187C89A4E]) [    ] o.a.s.c.SolrResourceLoader new SolrResourceLoader for directory: '/x1/jenkins/jenkins-slave/workspace/Lucene-Solr-Tests-master/solr/build/solr-core/test/J0/temp/solr.handler.TestReqParamsAPI_507918E187C89A4E-001/control-001'
   [junit4]   2> 146190 INFO  (TEST-TestReqParamsAPI.test-seed#[507918E187C89A4E]) [    ] o.a.s.c.SolrResourceLoader JNDI not configured for solr (NoInitialContextEx)
   [junit4]   2> 146190 INFO  (TEST-TestReqParamsAPI.test-seed#[507918E187C89A4E]) [    ] o.a.s.c.SolrResourceLoader solr home defaulted to 'solr/' (could not find system property or JNDI)
   [junit4]   2> 146190 INFO  (TEST-TestReqParamsAPI.test-seed#[507918E187C89A4E]) [    ] o.a.s.c.c.SolrZkClient Using default ZkCredentialsProvider
   [junit4]   2> 146192 INFO  (TEST-TestReqParamsAPI.test-seed#[507918E187C89A4E]) [    ] o.a.s.c.c.ConnectionManager Waiting for client to connect to ZooKeeper
   [junit4]   2> 146208 INFO  (zkCallback-88-thread-1) [    ] o.a.s.c.c.ConnectionManager Watcher org.apache.solr.common.cloud.ConnectionManager@22998f3 name:ZooKeeperConnection Watcher:127.0.0.1:37748/solr got event WatchedEvent state:SyncConnected type:None path:null path:null type:None
   [junit4]   2> 146208 INFO  (TEST-TestReqParamsAPI.test-seed#[507918E187C89A4E]) [    ] o.a.s.c.c.ConnectionManager Client is connected to ZooKeeper
   [junit4]   2> 146209 INFO  (TEST-TestReqParamsAPI.test-seed#[507918E187C89A4E]) [    ] o.a.s.c.c.SolrZkClient Using default ZkACLProvider
   [junit4]   2> 146211 INFO  (TEST-TestReqParamsAPI.test-seed#[507918E187C89A4E]) [    ] o.a.s.s.SolrDispatchFilter Loading solr.xml from SolrHome (not found in ZooKeeper)
   [junit4]   2> 146211 INFO  (TEST-TestReqParamsAPI.test-seed#[507918E187C89A4E]) [    ] o.a.s.c.SolrXmlConfig Loading container configuration from /x1/jenkins/jenkins-slave/workspace/Lucene-Solr-Tests-master/solr/build/solr-core/test/J0/temp/solr.handler.TestReqParamsAPI_507918E187C89A4E-001/control-001/solr.xml
   [junit4]   2> 146215 INFO  (TEST-TestReqParamsAPI.test-seed#[507918E187C89A4E]) [    ] o.a.s.c.CorePropertiesLocator Config-defined core root directory: /x1/jenkins/jenkins-slave/workspace/Lucene-Solr-Tests-master/solr/build/solr-core/test/J0/temp/solr.handler.TestReqParamsAPI_507918E187C89A4E-001/control-001/cores
   [junit4]   2> 146215 INFO  (TEST-TestReqParamsAPI.test-seed#[507918E187C89A4E]) [    ] o.a.s.c.CoreContainer New CoreContainer 1635671659
   [junit4]   2> 146215 INFO  (TEST-TestReqParamsAPI.test-seed#[507918E187C89A4E]) [    ] o.a.s.c.CoreContainer Loading cores into CoreContainer [instanceDir=/x1/jenkins/jenkins-slave/workspace/Lucene-Solr-Tests-master/solr/build/solr-core/test/J0/temp/solr.handler.TestReqParamsAPI_507918E187C89A4E-001/control-001]
   [junit4]   2> 146216 WARN  (TEST-TestReqParamsAPI.test-seed#[507918E187C89A4E]) [    ] o.a.s.c.CoreContainer Couldn't add files from /x1/jenkins/jenkins-slave/workspace/Lucene-Solr-Tests-master/solr/build/solr-core/test/J0/temp/solr.handler.TestReqParamsAPI_507918E187C89A4E-001/control-001/lib to classpath: /x1/jenkins/jenkins-slave/workspace/Lucene-Solr-Tests-master/solr/build/solr-core/test/J0/temp/solr.handler.TestReqParamsAPI_507918E187C89A4E-001/control-001/lib
   [junit4]   2> 146216 INFO  (TEST-TestReqParamsAPI.test-seed#[507918E187C89A4E]) [    ] o.a.s.h.c.HttpShardHandlerFactory created with socketTimeout : 90000,urlScheme : ,connTimeout : 15000,maxConnectionsPerHost : 20,maxConnections : 10000,corePoolSize : 0,maximumPoolSize : 2147483647,maxThreadIdleTime : 5,sizeOfQueue : -1,fairnessPolicy : false,
   [junit4]   2> 146220 INFO  (TEST-TestReqParamsAPI.test-seed#[507918E187C89A4E]) [    ] o.a.s.u.UpdateShardHandler Creating UpdateShardHandler HTTP client with params: 
   [junit4]   2> 146221 INFO  (TEST-TestReqParamsAPI.test-seed#[507918E187C89A4E]) [    ] o.a.s.l.LogWatcher SLF4J impl is org.slf4j.impl.Log4jLoggerFactory
   [junit4]   2> 146222 INFO  (TEST-TestReqParamsAPI.test-seed#[507918E187C89A4E]) [    ] o.a.s.l.LogWatcher Registering Log Listener [Log4j (org.slf4j.impl.Log4jLoggerFactory)]
   [junit4]   2> 146222 INFO  (TEST-TestReqParamsAPI.test-seed#[507918E187C89A4E]) [    ] o.a.s.c.ZkContainer Zookeeper client=127.0.0.1:37748/solr
   [junit4]   2> 146222 INFO  (TEST-TestReqParamsAPI.test-seed#[507918E187C89A4E]) [    ] o.a.s.c.ZkController zkHost includes chroot
   [junit4]   2> 146222 INFO  (TEST-TestReqParamsAPI.test-seed#[507918E187C89A4E]) [    ] o.a.s.c.c.SolrZkClient Using default ZkCredentialsProvider
   [junit4]   2> 146222 INFO  (TEST-TestReqParamsAPI.test-seed#[507918E187C89A4E]) [    ] o.a.s.c.c.ConnectionManager Waiting for client to connect to ZooKeeper
   [junit4]   2> 146230 INFO  (zkCallback-91-thread-1) [    ] o.a.s.c.c.ConnectionManager Watcher org.apache.solr.common.cloud.ConnectionManager@7c988069 name:ZooKeeperConnection Watcher:127.0.0.1:37748 got event WatchedEvent state:SyncConnected type:None path:null path:null type:None
   [junit4]   2> 146232 INFO  (TEST-TestReqParamsAPI.test-seed#[507918E187C89A4E]) [    ] o.a.s.c.c.ConnectionManager Client is connected to ZooKeeper
   [junit4]   2> 146232 INFO  (TEST-TestReqParamsAPI.test-seed#[507918E187C89A4E]) [    ] o.a.s.c.c.SolrZkClient Using default ZkACLProvider
   [junit4]   2> 146234 INFO  (TEST-TestReqParamsAPI.test-seed#[507918E187C89A4E]) [n:127.0.0.1:55698_    ] o.a.s.c.ZkController Added new OnReconnect listener org.apache.solr.cloud.ZkController$$Lambda$111/1213874478@3d9f554f
   [junit4]   2> 146262 INFO  (TEST-TestReqParamsAPI.test-seed#[507918E187C89A4E]) [n:127.0.0.1:55698_    ] o.a.s.c.c.ConnectionManager Waiting for client to connect to ZooKeeper
   [junit4]   2> 146281 INFO  (zkCallback-92-thread-1-processing-n:127.0.0.1:55698_) [n:127.0.0.1:55698_    ] o.a.s.c.c.ConnectionManager Watcher org.apache.solr.common.cloud.ConnectionManager@5761335c name:ZooKeeperConnection Watcher:127.0.0.1:37748/solr got event WatchedEvent state:SyncConnected type:None path:null path:null type:None
   [junit4]   2> 146281 INFO  (TEST-TestReqParamsAPI.test-seed#[507918E187C89A4E]) [n:127.0.0.1:55698_    ] o.a.s.c.c.ConnectionManager Client is connected to ZooKeeper
   [junit4]   2> 146282 INFO  (TEST-TestReqParamsAPI.test-seed#[507918E187C89A4E]) [n:127.0.0.1:55698_    ] o.a.s.c.c.SolrZkClient makePath: /overseer/queue
   [junit4]   2> 146283 INFO  (TEST-TestReqParamsAPI.test-seed#[507918E187C89A4E]) [n:127.0.0.1:55698_    ] o.a.s.c.c.SolrZkClient makePath: /overseer/collection-queue-work
   [junit4]   2> 146284 INFO  (TEST-TestReqParamsAPI.test-seed#[507918E187C89A4E]) [n:127.0.0.1:55698_    ] o.a.s.c.c.SolrZkClient makePath: /overseer/collection-map-running
   [junit4]   2> 146285 INFO  (TEST-TestReqParamsAPI.test-seed#[507918E187C89A4E]) [n:127.0.0.1:55698_    ] o.a.s.c.c.SolrZkClient makePath: /overseer/collection-map-completed
   [junit4]   2> 146286 INFO  (TEST-TestReqParamsAPI.test-seed#[507918E187C89A4E]) [n:127.0.0.1:55698_    ] o.a.s.c.c.SolrZkClient makePath: /overseer/collection-map-failure
   [junit4]   2> 146286 INFO  (TEST-TestReqParamsAPI.test-seed#[507918E187C89A4E]) [n:127.0.0.1:55698_    ] o.a.s.c.c.SolrZkClient makePath: /live_nodes
   [junit4]   2> 146287 INFO  (TEST-TestReqParamsAPI.test-seed#[507918E187C89A4E]) [n:127.0.0.1:55698_    ] o.a.s.c.c.SolrZkClient makePath: /aliases.json
   [junit4]   2> 146287 INFO  (TEST-TestReqParamsAPI.test-seed#[507918E187C89A4E]) [n:127.0.0.1:55698_    ] o.a.s.c.c.SolrZkClient makePath: /clusterstate.json
   [junit4]   2> 146288 INFO  (TEST-TestReqParamsAPI.test-seed#[507918E187C89A4E]) [n:127.0.0.1:55698_    ] o.a.s.c.c.SolrZkClient makePath: /security.json
   [junit4]   2> 146288 INFO  (TEST-TestReqParamsAPI.test-seed#[507918E187C89A4E]) [n:127.0.0.1:55698_    ] o.a.s.c.c.ZkStateReader Updating cluster state from ZooKeeper... 
   [junit4]   2> 146289 INFO  (TEST-TestReqParamsAPI.test-seed#[507918E187C89A4E]) [n:127.0.0.1:55698_    ] o.a.s.c.c.ZkStateReader Loaded empty cluster properties
   [junit4]   2> 146289 INFO  (TEST-TestReqParamsAPI.test-seed#[507918E187C89A4E]) [n:127.0.0.1:55698_    ] o.a.s.c.c.ZkStateReader Updated live nodes from ZooKeeper... (0) -> (0)
   [junit4]   2> 146290 INFO  (TEST-TestReqParamsAPI.test-seed#[507918E187C89A4E]) [n:127.0.0.1:55698_    ] o.a.s.c.c.SolrZkClient makePath: /overseer_elect
   [junit4]   2> 146291 INFO  (TEST-TestReqParamsAPI.test-seed#[507918E187C89A4E]) [n:127.0.0.1:55698_    ] o.a.s.c.c.SolrZkClient makePath: /overseer_elect/election
   [junit4]   2> 146291 INFO  (TEST-TestReqParamsAPI.test-seed#[507918E187C89A4E]) [n:127.0.0.1:55698_    ] o.a.s.c.Overseer Overseer (id=null) closing
   [junit4]   2> 146291 INFO  (TEST-TestReqParamsAPI.test-seed#[507918E187C89A4E]) [n:127.0.0.1:55698_    ] o.a.s.c.LeaderElector Joined leadership election with path: /overseer_elect/election/95997992178548740-127.0.0.1:55698_-n_0000000000
   [junit4]   2> 146291 INFO  (TEST-TestReqParamsAPI.test-seed#[507918E187C89A4E]) [n:127.0.0.1:55698_    ] o.a.s.c.OverseerElectionContext I am going to be the leader 127.0.0.1:55698_
   [junit4]   2> 146291 INFO  (TEST-TestReqParamsAPI.test-seed#[507918E187C89A4E]) [n:127.0.0.1:55698_    ] o.a.s.c.c.SolrZkClient makePath: /overseer_elect/leader
   [junit4]   2> 146292 INFO  (TEST-TestReqParamsAPI.test-seed#[507918E187C89A4E]) [n:127.0.0.1:55698_    ] o.a.s.c.Overseer Overseer (id=95997992178548740-127.0.0.1:55698_-n_0000000000) starting
   [junit4]   2> 146293 INFO  (TEST-TestReqParamsAPI.test-seed#[507918E187C89A4E]) [n:127.0.0.1:55698_    ] o.a.s.c.c.SolrZkClient makePath: /overseer/queue-work
   [junit4]   2> 146295 INFO  (TEST-TestReqParamsAPI.test-seed#[507918E187C89A4E]) [n:127.0.0.1:55698_    ] o.a.s.c.OverseerAutoReplicaFailoverThread Starting OverseerAutoReplicaFailoverThread autoReplicaFailoverWorkLoopDelay=10000 autoReplicaFailoverWaitAfterExpiration=30000 autoReplicaFailoverBadNodeExpiration=60000
   [junit4]   2> 146303 INFO  (OverseerStateUpdate-95997992178548740-127.0.0.1:55698_-n_0000000000) [n:127.0.0.1:55698_    ] o.a.s.c.Overseer Starting to work on the main queue
   [junit4]   2> 146317 INFO  (OverseerCollectionConfigSetProcessor-95997992178548740-127.0.0.1:55698_-n_0000000000) [n:127.0.0.1:55698_    ] o.a.s.c.OverseerTaskProcessor Process current queue of overseer operations
   [junit4]   2> 146331 INFO  (TEST-TestReqParamsAPI.test-seed#[507918E187C89A4E]) [n:127.0.0.1:55698_    ] o.a.s.c.ZkController Register node as live in ZooKeeper:/live_nodes/127.0.0.1:55698_
   [junit4]   2> 146332 INFO  (TEST-TestReqParamsAPI.test-seed#[507918E187C89A4E]) [n:127.0.0.1:55698_    ] o.a.s.c.c.SolrZkClient makePath: /live_nodes/127.0.0.1:55698_
   [junit4]   2> 146332 INFO  (OverseerStateUpdate-95997992178548740-127.0.0.1:55698_-n_0000000000) [n:127.0.0.1:55698_    ] o.a.s.c.c.ZkStateReader Updated live nodes from ZooKeeper... (0) -> (0)
   [junit4]   2> 146333 INFO  (zkCallback-92-thread-1-processing-n:127.0.0.1:55698_) [n:127.0.0.1:55698_    ] o.a.s.c.c.ZkStateReader A live node change: [WatchedEvent state:SyncConnected type:NodeChildrenChanged path:/live_nodes], has occurred - updating... (live nodes size: [0])
   [junit4]   2> 146334 INFO  (zkCallback-92-thread-1-processing-n:127.0.0.1:55698_) [n:127.0.0.1:55698_    ] o.a.s.c.c.ZkStateReader Updated live nodes from ZooKeeper... (0) -> (1)
   [junit4]   2> 146406 INFO  (TEST-TestReqParamsAPI.test-seed#[507918E187C89A4E]) [n:127.0.0.1:55698_    ] o.a.s.c.CoreContainer Security conf doesn't exist. Skipping setup for authorization module.
   [junit4]   2> 146406 INFO  (TEST-TestReqParamsAPI.test-seed#[507918E187C89A4E]) [n:127.0.0.1:55698_    ] o.a.s.c.CoreContainer No authentication plugin used.
   [junit4]   2> 146407 INFO  (TEST-TestReqParamsAPI.test-seed#[507918E187C89A4E]) [n:127.0.0.1:55698_    ] o.a.s.c.CorePropertiesLocator Looking for core definitions underneath /x1/jenkins/jenkins-slave/workspace/Lucene-Solr-Tests-master/solr/build/solr-core/test/J0/temp/solr.handler.TestReqParamsAPI_507918E187C89A4E-001/control-001/cores
   [junit4]   2> 146410 INFO  (TEST-TestReqParamsAPI.test-seed#[507918E187C89A4E]) [n:127.0.0.1:55698_    ] o.a.s.c.CoreDescriptor Created CoreDescriptor: {name=collection1, config=solrconfig.xml, transient=false, schema=schema.xml, loadOnStartup=true, configSetProperties=configsetprops.json, collection=control_collection, coreNodeName=, dataDir=data/, shard=}
   [junit4]   2> 146410 INFO  (TEST-TestReqParamsAPI.test-seed#[507918E187C89A4E]) [n:127.0.0.1:55698_    ] o.a.s.c.CorePropertiesLocator Found core collection1 in /x1/jenkins/jenkins-slave/workspace/Lucene-Solr-Tests-master/solr/build/solr-core/test/J0/temp/solr.handler.TestReqParamsAPI_507918E187C89A4E-001/control-001/cores/collection1
   [junit4]   2> 146410 INFO  (TEST-TestReqParamsAPI.test-seed#[507918E187C89A4E]) [n:127.0.0.1:55698_    ] o.a.s.c.CorePropertiesLocator Found 1 core definitions
   [junit4]   2> 146422 INFO  (coreLoadExecutor-343-thread-1-processing-n:127.0.0.1:55698_) [n:127.0.0.1:55698_ c:control_collection   x:collection1] o.a.s.c.ZkController publishing state=down
   [junit4]   2> 146422 INFO  (coreLoadExecutor-343-thread-1-processing-n:127.0.0.1:55698_) [n:127.0.0.1:55698_ c:control_collection   x:collection1] o.a.s.c.ZkController numShards not found on descriptor - reading it from system property
   [junit4]   2> 146423 INFO  (coreLoadExecutor-343-thread-1-processing-n:127.0.0.1:55698_) [n:127.0.0.1:55698_ c:control_collection   x:collection1] o.a.s.c.ZkController Collection control_collection not visible yet, but flagging it so a watch is registered when it becomes visible
   [junit4]   2> 146423 INFO  (coreLoadExecutor-343-thread-1-processing-n:127.0.0.1:55698_) [n:127.0.0.1:55698_ c:control_collection   x:collection1] o.a.s.c.c.ZkStateReader Deleting data for [control_collection]
   [junit4]   2> 146434 INFO  (TEST-TestReqParamsAPI.test-seed#[507918E187C89A4E]) [n:127.0.0.1:55698_    ] o.a.s.s.SolrDispatchFilter user.dir=/x1/jenkins/jenkins-slave/workspace/Lucene-Solr-Tests-master/solr/build/solr-core/test/J0
   [junit4]   2> 146434 INFO  (TEST-TestReqParamsAPI.test-seed#[507918E187C89A4E]) [n:127.0.0.1:55698_    ] o.a.s.s.SolrDispatchFilter SolrDispatchFilter.init() done
   [junit4]   2> 146441 INFO  (coreLoadExecutor-343-thread-1-processing-n:127.0.0.1:55698_) [n:127.0.0.1:55698_ c:control_collection   x:collection1] o.a.s.c.ZkController look for our core node name
   [junit4]   2> 146441 INFO  (OverseerStateUpdate-95997992178548740-127.0.0.1:55698_-n_0000000000) [n:127.0.0.1:55698_    ] o.a.s.c.Overseer processMessage: queueSize: 1, message = {
   [junit4]   2>   "core":"collection1",
   [junit4]   2>   "roles":null,
   [junit4]   2>   "base_url":"http://127.0.0.1:55698",
   [junit4]   2>   "node_name":"127.0.0.1:55698_",
   [junit4]   2>   "numShards":"1",
   [junit4]   2>   "state":"down",
   [junit4]   2>   "shard":null,
   [junit4]   2>   "collection":"control_collection",
   [junit4]   2>   "operation":"state"} current state version: 0
   [junit4]   2> 146441 INFO  (OverseerStateUpdate-95997992178548740-127.0.0.1:55698_-n_0000000000) [n:127.0.0.1:55698_    ] o.a.s.c.o.ReplicaMutator Update state numShards=1 message={
   [junit4]   2>   "core":"collection1",
   [junit4]   2>   "roles":null,
   [junit4]   2>   "base_url":"http://127.0.0.1:55698",
   [junit4]   2>   "node_name":"127.0.0.1:55698_",
   [junit4]   2>   "numShards":"1",
   [junit4]   2>   "state":"down",
   [junit4]   2>   "shard":null,
   [junit4]   2>   "collection":"control_collection",
   [junit4]   2>   "operation":"state"}
   [junit4]   2> 146441 INFO  (OverseerStateUpdate-95997992178548740-127.0.0.1:55698_-n_0000000000) [n:127.0.0.1:55698_    ] o.a.s.c.o.ClusterStateMutator building a new cName: control_collection
   [junit4]   2> 146441 INFO  (OverseerStateUpdate-95997992178548740-127.0.0.1:55698_-n_0000000000) [n:127.0.0.1:55698_    ] o.a.s.c.o.ReplicaMutator Assigning new node to shard shard=shard1
   [junit4]   2> 146443 INFO  (zkCallback-92-thread-1-processing-n:127.0.0.1:55698_) [n:127.0.0.1:55698_    ] o.a.s.c.c.ZkStateReader A cluster state change: [WatchedEvent state:SyncConnected type:NodeDataChanged path:/clusterstate.json], has occurred - updating... (live nodes size: [1])
   [junit4]   2> 147558 INFO  (coreLoadExecutor-343-thread-1-processing-n:127.0.0.1:55698_) [n:127.0.0.1:55698_ c:control_collection   x:collection1] o.a.s.c.ZkController waiting to find shard id in clusterstate for collection1
   [junit4]   2> 147558 INFO  (coreLoadExecutor-343-thread-1-processing-n:127.0.0.1:55698_) [n:127.0.0.1:55698_ c:control_collection   x:collection1] o.a.s.c.ZkController Check for collection zkNode:control_collection
   [junit4]   2> 147559 INFO  (coreLoadExecutor-343-thread-1-processing-n:127.0.0.1:55698_) [n:127.0.0.1:55698_ c:control_collection   x:collection1] o.a.s.c.ZkController Collection zkNode exists
   [junit4]   2> 147559 INFO  (coreLoadExecutor-343-thread-1-processing-n:127.0.0.1:55698_) [n:127.0.0.1:55698_ c:control_collection   x:collection1] o.a.s.c.c.ZkStateReader Load collection config from: [/collections/control_collection]
   [junit4]   2> 147559 INFO  (coreLoadExecutor-343-thread-1-processing-n:127.0.0.1:55698_) [n:127.0.0.1:55698_ c:control_collection   x:collection1] o.a.s.c.c.ZkStateReader path=[/collections/control_collection] [configName]=[conf1] specified config exists in ZooKeeper
   [junit4]   2> 147559 INFO  (coreLoadExecutor-343-thread-1-processing-n:127.0.0.1:55698_) [n:127.0.0.1:55698_ c:control_collection   x:collection1] o.a.s.c.SolrResourceLoader new SolrResourceLoader for directory: '/x1/jenkins/jenkins-slave/workspace/Lucene-Solr-Tests-master/solr/build/solr-core/test/J0/temp/solr.handler.TestReqParamsAPI_507918E187C89A4E-001/control-001/cores/collection1'
   [junit4]   2> 147559 INFO  (coreLoadExecutor-343-thread-1-processing-n:127.0.0.1:55698_) [n:127.0.0.1:55698_ c:control_collection   x:collection1] o.a.s.c.SolrResourceLoader JNDI not configured for solr (NoInitialContextEx)
   [junit4]   2> 147559 INFO  (coreLoadExecutor-343-thread-1-processing-n:127.0.0.1:55698_) [n:127.0.0.1:55698_ c:control_collection   x:collection1] o.a.s.c.SolrResourceLoader solr home defaulted to 'solr/' (could not find system property or JNDI)
   [junit4]   2> 147560 INFO  (coreLoadExecutor-343-thread-1-processing-n:127.0.0.1:55698_) [n:127.0.0.1:55698_ c:control_collection   x:collection1] o.a.s.c.Config loaded config solrconfig.xml with version 0 
   [junit4]   2> 147568 INFO  (coreLoadExecutor-343-thread-1-processing-n:127.0.0.1:55698_) [n:127.0.0.1:55698_ c:control_collection   x:collection1] o.a.s.c.SolrConfig current version of requestparams : -1
   [junit4]   2> 147573 INFO  (coreLoadExecutor-343-thread-1-processing-n:127.0.0.1:55698_) [n:127.0.0.1:55698_ c:control_collection   x:collection1] o.a.s.c.SolrConfig Using Lucene MatchVersion: 7.0.0
   [junit4]   2> 147580 INFO  (coreLoadExecutor-343-thread-1-processing-n:127.0.0.1:55698_) [n:127.0.0.1:55698_ c:control_collection   x:collection1] o.a.s.c.SolrConfig Loaded SolrConfig: solrconfig.xml
   [junit4]   2> 147584 INFO  (coreLoadExecutor-343-thread-1-processing-n:127.0.0.1:55698_) [n:127.0.0.1:55698_ c:control_collection   x:collection1] o.a.s.s.IndexSchema [collection1] Schema name=test
   [junit4]   2> 148464 INFO  (coreLoadExecutor-343-thread-1-processing-n:127.0.0.1:55698_) [n:127.0.0.1:55698_ c:control_collection   x:collection1] o.a.s.s.OpenExchangeRatesOrgProvider Initialized with rates=open-exchange-rates.json, refreshInterval=1440.
   [junit4]   2> 148486 INFO  (coreLoadExecutor-343-thread-1-processing-n:127.0.0.1:55698_) [n:127.0.0.1:55698_ c:control_collection   x:collection1] o.a.s.s.IndexSchema default search field in schema is text
   [junit4]   2> 148487 INFO  (coreLoadExecutor-343-thread-1-processing-n:127.0.0.1:55698_) [n:127.0.0.1:55698_ c:control_collection   x:collection1] o.a.s.s.IndexSchema unique key field: id
   [junit4]   2> 148506 INFO  (coreLoadExecutor-343-thread-1-processing-n:127.0.0.1:55698_) [n:127.0.0.1:55698_ c:control_collection   x:collection1] o.a.s.s.FileExchangeRateProvider Reloading exchange rates from file currency.xml
   [junit4]   2> 148509 INFO  (coreLoadExecutor-343-thread-1-processing-n:127.0.0.1:55698_) [n:127.0.0.1:55698_ c:control_collection   x:collection1] o.a.s.s.FileExchangeRateProvider Reloading exchange rates from file currency.xml
   [junit4]   2> 148511 INFO  (coreLoadExecutor-343-thread-1-processing-n:127.0.0.1:55698_) [n:127.0.0.1:55698_ c:control_collection   x:collection1] o.a.s.s.OpenExchangeRatesOrgProvider Reloading exchange rates from open-exchange-rates.json
   [junit4]   2> 148511 INFO  (coreLoadExecutor-343-thread-1-processing-n:127.0.0.1:55698_) [n:127.0.0.1:55698_ c:control_collection   x:collection1] o.a.s.s.OpenExchangeRatesOrgProvider Reloading exchange rates from open-exchange-rates.json
   [junit4]   2> 148512 INFO  (coreLoadExecutor-343-thread-1-processing-n:127.0.0.1:55698_) [n:127.0.0.1:55698_ c:control_collection   x:collection1] o.a.s.c.ConfigSetProperties Did not find ConfigSet properties, assuming default properties: Can't find resource 'configsetprops.json' in classpath or '/configs/conf1', cwd=/x1/jenkins/jenkins-slave/workspace/Lucene-Solr-Tests-master/solr/build/solr-core/test/J0
   [junit4]   2> 148512 INFO  (coreLoadExecutor-343-thread-1-processing-n:127.0.0.1:55698_) [n:127.0.0.1:55698_ c:control_collection   x:collection1] o.a.s.c.CoreContainer Creating SolrCore 'collection1' using configuration from collection control_collection
   [junit4]   2> 148513 INFO  (coreLoadExecutor-343-thread-1-processing-n:127.0.0.1:55698_) [n:127.0.0.1:55698_ c:control_collection s:shard1 r:core_node1 x:collection1] o.a.s.c.SolrCore org.apache.solr.core.MockDirectoryFactory
   [junit4]   2> 148513 INFO  (coreLoadExecutor-343-thread-1-processing-n:127.0.0.1:55698_) [n:127.0.0.1:55698_ c:control_collection s:shard1 r:core_node1 x:collection1] o.a.s.c.SolrCore [[collection1] ] Opening new SolrCore at [/x1/jenkins/jenkins-slave/workspace/Lucene-Solr-Tests-master/solr/build/solr-core/test/J0/temp/solr.handler.TestReqParamsAPI_507918E187C89A4E-001/control-001/cores/collection1], dataDir=[/x1/jenkins/jenkins-slave/workspace/Lucene-Solr-Tests-master/solr/build/solr-core/test/J0/temp/solr.handler.TestReqParamsAPI_507918E187C89A4E-001/control-001/cores/collection1/data/]
   [junit4]   2> 148513 INFO  (coreLoadExecutor-343-thread-1-processing-n:127.0.0.1:55698_) [n:127.0.0.1:55698_ c:control_collection s:shard1 r:core_node1 x:collection1] o.a.s.c.JmxMonitoredMap JMX monitoring is enabled. Adding Solr mbeans to JMX Server: com.sun.jmx.mbeanserver.JmxMBeanServer@4714942
   [junit4]   2> 148514 INFO  (coreLoadExecutor-343-thread-1-processing-n:127.0.0.1:55698_) [n:127.0.0.1:55698_ c:control_collection s:shard1 r:core_node1 x:collection1] o.a.s.c.CachingDirectoryFactory return new directory for /x1/jenkins/jenkins-slave/workspace/Lucene-Solr-Tests-master/solr/build/solr-core/test/J0/temp/solr.handler.TestReqParamsAPI_507918E187C89A4E-001/control-001/cores/collection1/data
   [junit4]   2> 148514 INFO  (coreLoadExecutor-343-thread-1-processing-n:127.0.0.1:55698_) [n:127.0.0.1:55698_ c:control_collection s:shard1 r:core_node1 x:collection1] o.a.s.c.SolrCore New index directory detected: old=null new=/x1/jenkins/jenkins-slave/workspace/Lucene-Solr-Tests-master/solr/build/solr-core/test/J0/temp/solr.handler.TestReqParamsAPI_507918E187C89A4E-001/control-001/cores/collection1/data/index/
   [junit4]   2> 148514 WARN  (coreLoadExecutor-343-thread-1-processing-n:127.0.0.1:55698_) [n:127.0.0.1:55698_ c:control_collection s:shard1 r:core_node1 x:collection1] o.a.s.c.SolrCore [collection1] Solr index directory '/x1/jenkins/jenkins-slave/workspace/Lucene-Solr-Tests-master/solr/build/solr-core/test/J0/temp/solr.handler.TestReqParamsAPI_507918E187C89A4E-001/control-001/cores/collection1/data/index' doesn't exist. Creating new index...
   [junit4]   2> 148514 INFO  (coreLoadExecutor-343-thread-1-processing-n:127.0.0.1:55698_) [n:127.0.0.1:55698_ c:control_collection s:shard1 r:core_node1 x:collection1] o.a.s.c.CachingDirectoryFactory return new directory for /x1/jenkins/jenkins-slave/workspace/Lucene-Solr-Tests-master/solr/build/solr-core/test/J0/temp/solr.handler.TestReqParamsAPI_507918E187C89A4E-001/control-001/cores/collection1/data/index
   [junit4]   2> 148514 INFO  (coreLoadExecutor-343-thread-1-processing-n:127.0.0.1:55698_) [n:127.0.0.1:55698_ c:control_collection s:shard1 r:core_node1 x:collection1] o.a.s.u.RandomMergePolicy RandomMergePolicy wrapping class org.apache.lucene.index.LogByteSizeMergePolicy: [LogByteSizeMergePolicy: minMergeSize=1677721, mergeFactor=13, maxMergeSize=2147483648, maxMergeSizeForForcedMerge=9223372036854775807, calibrateSizeByDeletes=true, maxMergeDocs=2147483647, maxCFSSegmentSizeMB=8.796093022207999E12, noCFSRatio=1.0]
   [junit4]   2> 148515 INFO  (coreLoadExecutor-343-thread-1-processing-n:127.0.0.1:55698_) [n:127.0.0.1:55698_ c:control_collection s:shard1 r:core_node1 x:collection1] o.a.s.c.SolrDeletionPolicy SolrDeletionPolicy.onCommit: commits: num=1
   [junit4]   2> 	commit{dir=MockDirectoryWrapper(RAMDirectory@76893100 lockFactory=org.apache.lucene.store.SingleInstanceLockFactory@72629535),segFN=segments_1,generation=1}
   [junit4]   2> 148515 INFO  (coreLoadExecutor-343-thread-1-processing-n:127.0.0.1:55698_) [n:127.0.0.1:55698_ c:control_collection s:shard1 r:core_node1 x:collection1] o.a.s.c.SolrDeletionPolicy newest commit generation = 1
   [junit4]   2> 148518 INFO  (coreLoadExecutor-343-thread-1-processing-n:127.0.0.1:55698_) [n:127.0.0.1:55698_ c:control_collection s:shard1 r:core_node1 x:collection1] o.a.s.u.p.UpdateRequestProcessorChain creating updateRequestProcessorChain "nodistrib"
   [junit4]   2> 148518 INFO  (coreLoadExecutor-343-thread-1-processing-n:127.0.0.1:55698_) [n:127.0.0.1:55698_ c:control_collection s:shard1 r:core_node1 x:collection1] o.a.s.u.p.UpdateRequestProcessorChain creating updateRequestProcessorChain "dedupe"
   [junit4]   2> 148518 INFO  (coreLoadExecutor-343-thread-1-processing-n:127.0.0.1:55698_) [n:127.0.0.1:55698_ c:control_collection s:shard1 r:core_node1 x:collection1] o.a.s.u.p.UpdateRequestProcessorChain inserting DistributedUpdateProcessorFactory into updateRequestProcessorChain "dedupe"
   [junit4]   2> 148518 INFO  (coreLoadExecutor-343-thread-1-processing-n:127.0.0.1:55698_) [n:127.0.0.1:55698_ c:control_collection s:shard1 r:core_node1 x:collection1] o.a.s.u.p.UpdateRequestProcessorChain creating updateRequestProcessorChain "stored_sig"
   [junit4]   2> 148518 INFO  (coreLoadExecutor-343-thread-1-processing-n:127.0.0.1:55698_) [n:127.0.0.1:55698_ c:control_collection s:shard1 r:core_node1 x:collection1] o.a.s.u.p.UpdateRequestProcessorChain inserting DistributedUpdateProcessorFactory into updateRequestProcessorChain "stored_sig"
   [junit4]   2> 148518 INFO  (coreLoadExecutor-343-thread-1-processing-n:127.0.0.1:55698_) [n:127.0.0.1:55698_ c:control_collection s:shard1 r:core_node1 x:collection1] o.a.s.u.p.UpdateRequestProcessorChain creating updateRequestProcessorChain "distrib-dup-test-chain-explicit"
   [junit4]   2> 148519 INFO  (coreLoadExecutor-343-thread-1-processing-n:127.0.0.1:55698_) [n:127.0.0.1:55698_ c:control_collection s:shard1 r:core_node1 x:collection1] o.a.s.u.p.UpdateRequestProcessorChain creating updateRequestProcessorChain "distrib-dup-test-chain-implicit"
   [junit4]   2> 148519 INFO  (coreLoadExecutor-343-thread-1-processing-n:127.0.0.1:55698_) [n:127.0.0.1:55698_ c:control_collection s:shard1 r:core_node1 x:collection1] o.a.s.u.p.UpdateRequestProcessorChain inserting DistributedUpdateProcessorFactory into updateRequestProcessorChain "distrib-dup-test-chain-implicit"
   [junit4]   2> 148519 INFO  (coreLoadExecutor-343-thread-1-processing-n:127.0.0.1:55698_) [n:127.0.0.1:55698_ c:control_collection s:shard1 r:core_node1 x:collection1] o.a.s.c.SolrCore no updateRequestProcessorChain defined as default, creating implicit default
   [junit4]   2> 148520 WARN  (coreLoadExecutor-343-thread-1-processing-n:127.0.0.1:55698_) [n:127.0.0.1:55698_ c:control_collection s:shard1 r:core_node1 x:collection1] o.a.s.c.RequestHandlers INVALID paramSet a in requestHandler {type = requestHandler,name = /dump,class = DumpRequestHandler,args = {defaults={a=A,b=B}}}
   [junit4]   2> 148521 INFO  (coreLoadExecutor-343-thread-1-processing-n:127.0.0.1:55698_) [n:127.0.0.1:55698_ c:control_collection s:shard1 r:core_node1 x:collection1] o.a.s.h.l.XMLLoader xsltCacheLifetimeSeconds=60
   [junit4]   2> 148521 INFO  (coreLoadExecutor-343-thread-1-processing-n:127.0.0.1:55698_) [n:127.0.0.1:55698_ c:control_collection s:shard1 r:core_node1 x:collection1] o.a.s.h.l.XMLLoader xsltCacheLifetimeSeconds=60
   [junit4]   2> 148524 INFO  (coreLoadExecutor-343-thread-1-processing-n:127.0.0.1:55698_) [n:127.0.0.1:55698_ c:control_collection s:shard1 r:core_node1 x:collection1] o.a.s.h.l.XMLLoader xsltCacheLifetimeSeconds=60
   [junit4]   2> 148525 INFO  (coreLoadExecutor-343-thread-1-processing-n:127.0.0.1:55698_) [n:127.0.0.1:55698_ c:control_collection s:shard1 r:core_node1 x:collection1] o.a.s.h.l.XMLLoader xsltCacheLifetimeSeconds=60
   [junit4]   2> 148526 INFO  (OldIndexDirectoryCleanupThreadForCore-collection1) [n:127.0.0.1:55698_ c:control_collection s:shard1 r:core_node1 x:collection1] o.a.s.c.SolrCore Looking for old index directories to cleanup for core collection1 in /x1/jenkins/jenkins-slave/workspace/Lucene-Solr-Tests-master/solr/build/solr-core/test/J0/temp/solr.handler.TestReqParamsAPI_507918E187C89A4E-001/control-001/cores/collection1/data/
   [junit4]   2> 148526 WARN  (OldIndexDirectoryCleanupThreadForCore-collection1) [n:127.0.0.1:55698_ c:control_collection s:shard1 r:core_node1 x:collection1] o.a.s.c.DirectoryFactory /x1/jenkins/jenkins-slave/workspace/Lucene-Solr-Tests-master/solr/build/solr-core/test/J0/temp/solr.handler.TestReqParamsAPI_507918E187C89A4E-001/control-001/cores/collection1/data/ does not point to a valid data directory; skipping clean-up of old index directories.
   [junit4]   2> 148530 INFO  (coreLoadExecutor-343-thread-1-processing-n:127.0.0.1:55698_) [n:127.0.0.1:55698_ c:control_collection s:shard1 r:core_node1 x:collection1] o.a.s.c.RequestHandlers Registered paths: /admin/mbeans,standard,/update/json/docs,/admin/luke,/export,/get,/admin/properties,/update/json,/admin/threads,/dump,/update/csv,/sql,/graph,/admin/segments,/admin/system,/replication,/config,/stream,/schema,/admin/plugins,/admin/logging,/admin/ping,/update,/admin/file
   [junit4]   2> 148530 INFO  (coreLoadExecutor-343-thread-1-processing-n:127.0.0.1:55698_) [n:127.0.0.1:55698_ c:control_collection s:shard1 r:core_node1 x:collection1] o.a.s.c.SolrCore Using default statsCache cache: org.apache.solr.search.stats.LocalStatsCache
   [junit4]   2> 148530 INFO  (coreLoadExecutor-343-thread-1-processing-n:127.0.0.1:55698_) [n:127.0.0.1:55698_ c:control_collection s:shard1 r:core_node1 x:collection1] o.a.s.u.UpdateHandler Using UpdateLog implementation: org.apache.solr.update.UpdateLog
   [junit4]   2> 148530 INFO  (coreLoadExecutor-343-thread-1-processing-n:127.0.0.1:55698_) [n:127.0.0.1:55698_ c:control_collection s:shard1 r:core_node1 x:collection1] o.a.s.u.UpdateLog Initializing UpdateLog: dataDir= defaultSyncLevel=FLUSH numRecordsToKeep=100 maxNumLogsToKeep=10 numVersionBuckets=65536
   [junit4]   2> 148531 INFO  (coreLoadExecutor-343-thread-1-processing-n:127.0.0.1:55698_) [n:127.0.0.1:55698_ c:control_collection s:shard1 r:core_node1 x:collection1] o.a.s.u.CommitTracker Hard AutoCommit: disabled
   [junit4]   2> 148531 INFO  (coreLoadExecutor-343-thread-1-processing-n:127.0.0.1:55698_) [n:127.0.0.1:55698_ c:control_collection s:shard1 r:core_node1 x:collection1] o.a.s.u.CommitTracker Soft AutoCommit: disabled
   [junit4]   2> 148531 INFO  (coreLoadExecutor-343-thread-1-processing-n:127.0.0.1:55698_) [n:127.0.0.1:55698_ c:control_collection s:shard1 r:core_node1 x:collection1] o.a.s.u.RandomMergePolicy RandomMergePolicy wrapping class org.apache.lucene.index.LogDocMergePolicy: [LogDocMergePolicy: minMergeSize=1000, mergeFactor=48, maxMergeSize=9223372036854775807, maxMergeSizeForForcedMerge=9223372036854775807, calibrateSizeByDeletes=false, maxMergeDocs=2147483647, maxCFSSegmentSizeMB=8.796093022207999E12, noCFSRatio=1.0]
   [junit4]   2> 148532 INFO  (coreLoadExecutor-343-thread-1-processing-n:127.0.0.1:55698_) [n:127.0.0.1:55698_ c:control_collection s:shard1 r:core_node1 x:collection1] o.a.s.c.SolrDeletionPolicy SolrDeletionPolicy.onInit: commits: num=1
   [junit4]   2> 	commit{dir=MockDirectoryWrapper(RAMDirectory@76893100 lockFactory=org.apache.lucene.store.SingleInstanceLockFactory@72629535),segFN=segments_1,generation=1}
   [junit4]   2> 148532 INFO  (coreLoadExecutor-343-thread-1-processing-n:127.0.0.1:55698_) [n:127.0.0.1:55698_ c:control_collection s:shard1 r:core_node1 x:collection1] o.a.s.c.SolrDeletionPolicy newest commit generation = 1
   [junit4]   2> 148532 INFO  (coreLoadExecutor-343-thread-1-processing-n:127.0.0.1:55698_) [n:127.0.0.1:55698_ c:control_collection s:shard1 r:core_node1 x:collection1] o.a.s.s.SolrIndexSearcher Opening [Searcher@6e2f9f7d[collection1] main]
   [junit4]   2> 148532 INFO  (coreLoadExecutor-343-thread-1-processing-n:127.0.0.1:55698_) [n:127.0.0.1:55698_ c:control_collection s:shard1 r:core_node1 x:collection1] o.a.s.c.c.ZkStateReader Load collection config from: [/collections/control_collection]
   [junit4]   2> 148545 INFO  (coreLoadExecutor-343-thread-1-processing-n:127.0.0.1:55698_) [n:127.0.0.1:55698_ c:control_collection s:shard1 r:core_node1 x:collection1] o.a.s.c.c.ZkStateReader path=[/collections/control_collection] [configName]=[conf1] specified config exists in ZooKeeper
   [junit4]   2> 148545 INFO  (coreLoadExecutor-343-thread-1-processing-n:127.0.0.1:55698_) [n:127.0.0.1:55698_ c:control_collection s:shard1 r:core_node1 x:collection1] o.a.s.r.ManagedResourceStorage Setting up ZooKeeper-based storage for the RestManager with znodeBase: /configs/conf1
   [junit4]   2> 148545 INFO  (coreLoadExecutor-343-thread-1-processing-n:127.0.0.1:55698_) [n:127.0.0.1:55698_ c:control_collection s:shard1 r:core_node1 x:collection1] o.a.s.r.ManagedResourceStorage Configured ZooKeeperStorageIO with znodeBase: /configs/conf1
   [junit4]   2> 148545 INFO  (coreLoadExecutor-343-thread-1-processing-n:127.0.0.1:55698_) [n:127.0.0.1:55698_ c:control_collection s:shard1 r:core_node1 x:collection1] o.a.s.r.RestManager Initializing RestManager with initArgs: {}
   [junit4]   2> 148545 INFO  (coreLoadExecutor-343-thread-1-processing-n:127.0.0.1:55698_) [n:127.0.0.1:55698_ c:control_collection s:shard1 r:core_node1 x:collection1] o.a.s.r.ManagedResourceStorage Reading _rest_managed.json using ZooKeeperStorageIO:path=/configs/conf1
   [junit4]   2> 148545 INFO  (coreLoadExecutor-343-thread-1-processing-n:127.0.0.1:55698_) [n:127.0.0.1:55698_ c:control_collection s:shard1 r:core_node1 x:collection1] o.a.s.r.ManagedResourceStorage No data found for znode /configs/conf1/_rest_managed.json
   [junit4]   2> 148545 INFO  (coreLoadExecutor-343-thread-1-processing-n:127.0.0.1:55698_) [n:127.0.0.1:55698_ c:control_collection s:shard1 r:core_node1 x:collection1] o.a.s.r.ManagedResourceStorage Loaded null at path _rest_managed.json using ZooKeeperStorageIO:path=/configs/conf1
   [junit4]   2> 148545 INFO  (coreLoadExecutor-343-thread-1-processing-n:127.0.0.1:55698_) [n:127.0.0.1:55698_ c:control_collection s:shard1 r:core_node1 x:collection1] o.a.s.r.RestManager Initializing 0 registered ManagedResources
   [junit4]   2> 148545 INFO  (coreLoadExecutor-343-thread-1-processing-n:127.0.0.1:55698_) [n:127.0.0.1:55698_ c:control_collection s:shard1 r:core_node1 x:collection1] o.a.s.h.ReplicationHandler Commits will be reserved for  10000
   [junit4]   2> 148546 INFO  (searcherExecutor-344-thread-1-processing-n:127.0.0.1:55698_ x:collection1 s:shard1 c:control_collection r:core_node1) [n:127.0.0.1:55698_ c:control_collection s:shard1 r:core_node1 x:collection1] o.a.s.c.SolrCore [collection1] Registered new searcher Searcher@6e2f9f7d[collection1] main{ExitableDirectoryReader(UninvertingDirectoryReader())}
   [junit4]   2> 148546 INFO  (coreLoadExecutor-343-thread-1-processing-n:127.0.0.1:55698_) [n:127.0.0.1:55698_ c:control_collection s:shard1 r:core_node1 x:collection1] o.a.s.u.UpdateLog Looking up max value of version field to seed version buckets
   [junit4]   2> 148546 INFO  (coreLoadExecutor-343-thread-1-processing-n:127.0.0.1:55698_) [n:127.0.0.1:55698_ c:control_collection s:shard1 r:core_node1 x:collection1] o.a.s.u.VersionInfo Refreshing highest value of _version_ for 65536 version buckets from index
   [junit4]   2> 148546 INFO  (coreLoadExecutor-343-thread-1-processing-n:127.0.0.1:55698_) [n:127.0.0.1:55698_ c:control_collection s:shard1 r:core_node1 x:collection1] o.a.s.u.VersionInfo No terms found for _version_, cannot seed version bucket highest value from index
   [junit4]   2> 148546 INFO  (coreLoadExecutor-343-thread-1-processing-n:127.0.0.1:55698_) [n:127.0.0.1:55698_ c:control_collection s:shard1 r:core_node1 x:collection1] o.a.s.u.UpdateLog Could not find max version in index or recent updates, using new clock 1535967877571543040
   [junit4]   2> 148548 INFO  (coreLoadExecutor-343-thread-1-processing-n:127.0.0.1:55698_) [n:127.0.0.1:55698_ c:control_collection s:shard1 r:core_node1 x:collection1] o.a.s.u.UpdateLog Took 1.0ms to seed version buckets with highest version 1535967877571543040
   [junit4]   2> 148548 INFO  (coreLoadExecutor-343-thread-1-processing-n:127.0.0.1:55698_) [n:127.0.0.1:55698_ c:control_collection s:shard1 r:core_node1 x:collection1] o.a.s.c.ZkController watch zkdir /configs/conf1
   [junit4]   2> 148548 INFO  (coreLoadExecutor-343-thread-1-processing-n:127.0.0.1:55698_) [n:127.0.0.1:55698_ c:control_collection s:shard1 r:core_node1 x:collection1] o.a.s.c.CoreContainer registering core: collection1
   [junit4]   2> 148548 INFO  (coreZkRegister-337-thread-1-processing-n:127.0.0.1:55698_ x:collection1 s:shard1 c:control_collection r:core_node1) [n:127.0.0.1:55698_ c:control_collection s:shard1 r:core_node1 x:collection1] o.a.s.c.ZkController Register replica - core:collection1 address:http://127.0.0.1:55698 collection:control_collection shard:shard1
   [junit4]   2> 148550 INFO  (coreZkRegister-337-thread-1-processing-n:127.0.0.1:55698_ x:collection1 s:shard1 c:control_collection r:core_node1) [n:127.0.0.1:55698_ c:control_collection s:shard1 r:core_node1 x:collection1] o.a.s.c.c.SolrZkClient makePath: /collections/control_collection/leader_elect/shard1/election
   [junit4]   2> 148553 INFO  (coreZkRegister-337-thread-1-processing-n:127.0.0.1:55698_ x:collection1 s:shard1 c:control_collection r:core_node1) [n:127.0.0.1:55698_ c:control_collection s:shard1 r:core_node1 x:collection1] o.a.s.c.LeaderElector Joined leadership election with path: /collections/control_collection/leader_elect/shard1/election/95997992178548740-core_node1-n_0000000000
   [junit4]   2> 148555 INFO  (coreZkRegister-337-thread-1-processing-n:127.0.0.1:55698_ x:collection1 s:shard1 c:control_collection r:core_node1) [n:127.0.0.1:55698_ c:control_collection s:shard1 r:core_node1 x:collection1] o.a.s.c.ShardLeaderElectionContext Running the leader process for shard=shard1 and weAreReplacement=false and leaderVoteWait=10000
   [junit4]   2> 148564 INFO  (coreZkRegister-337-thread-1-processing-n:127.0.0.1:55698_ x:collection1 s:shard1 c:control_collection r:core_node1) [n:127.0.0.1:55698_ c:control_collection s:shard1 r:core_node1 x:collection1] o.a.s.c.ShardLeaderElectionContext Enough replicas found to continue.
   [junit4]   2> 148564 INFO  (coreZkRegister-337-thread-1-processing-n:127.0.0.1:55698_ x:collection1 s:shard1 c:control_collection r:core_node1) [n:127.0.0.1:55698_ c:control_collection s:shard1 r:core_node1 x:collection1] o.a.s.c.ShardLeaderElectionContext I may be the new leader - try and sync
   [junit4]   2> 148564 INFO  (coreZkRegister-337-thread-1-processing-n:127.0.0.1:55698_ x:collection1 s:shard1 c:control_collection r:core_node1) [n:127.0.0.1:55698_ c:control_collection s:shard1 r:core_node1 x:collection1] o.a.s.c.SyncStrategy Sync replicas to http://127.0.0.1:55698/collection1/
   [junit4]   2> 148564 INFO  (coreZkRegister-337-thread-1-processing-n:127.0.0.1:55698_ x:collection1 s:shard1 c:control_collection r:core_node1) [n:127.0.0.1:55698_ c:control_collection s:shard1 r:core_node1 x:collection1] o.a.s.c.SyncStrategy Sync Success - now sync replicas to me
   [junit4]   2> 148564 INFO  (coreZkRegister-337-thread-1-processing-n:127.0.0.1:55698_ x:collection1 s:shard1 c:control_collection r:core_node1) [n:127.0.0.1:55698_ c:control_collection s:shard1 r:core_node1 x:collection1] o.a.s.c.SyncStrategy http://127.0.0.1:55698/collection1/ has no replicas
   [junit4]   2> 148564 INFO  (coreZkRegister-337-thread-1-processing-n:127.0.0.1:55698_ x:collection1 s:shard1 c:control_collection r:core_node1) [n:127.0.0.1:55698_ c:control_collection s:shard1 r:core_node1 x:collection1] o.a.s.c.c.SolrZkClient makePath: /collections/control_collection/leaders/shard1
   [junit4]   2> 148565 INFO  (coreZkRegister-337-thread-1-processing-n:127.0.0.1:55698_ x:collection1 s:shard1 c:control_collection r:core_node1) [n:127.0.0.1:55698_ c:control_collection s:shard1 r:core_node1 x:collection1] o.a.s.c.ShardLeaderElectionContextBase Creating leader registration node /collections/control_collection/leaders/shard1/leader after winning as /collections/control_collection/leader_elect/shard1/election/95997992178548740-core_node1-n_0000000000
   [junit4]   2> 148565 INFO  (OverseerStateUpdate-95997992178548740-127.0.0.1:55698_-n_0000000000) [n:127.0.0.1:55698_    ] o.a.s.c.Overseer processMessage: queueSize: 1, message = {
   [junit4]   2>   "operation":"leader",
   [junit4]   2>   "shard":"shard1",
   [junit4]   2>   "collection":"control_collection"} current state version: 1
   [junit4]   2> 148566 INFO  (zkCallback-92-thread-1-processing-n:127.0.0.1:55698_) [n:127.0.0.1:55698_    ] o.a.s.c.c.ZkStateReader A cluster state change: [WatchedEvent state:SyncConnected type:NodeDataChanged path:/clusterstate.json], has occurred - updating... (live nodes size: [1])
   [junit4]   2> 148573 INFO  (OverseerStateUpdate-95997992178548740-127.0.0.1:55698_-n_0000000000) [n:127.0.0.1:55698_    ] o.a.s.c.Overseer processMessage: queueSize: 1, message = {
   [junit4]   2>   "operation":"leader",
   [junit4]   2>   "shard":"shard1",
   [junit4]   2>   "collection":"control_collection",
   [junit4]   2>   "base_url":"http://127.0.0.1:55698",
   [junit4]   2>   "core":"collection1",
   [junit4]   2>   "state":"active"} current state version: 2
   [junit4]   2> 148583 INFO  (coreZkRegister-337-thread-1-processing-n:127.0.0.1:55698_ x:collection1 s:shard1 c:control_collection r:core_node1) [n:127.0.0.1:55698_ c:control_collection s:shard1 r:core_node1 x:collection1] o.a.s.c.ShardLeaderElectionContext I am the new leader: http://127.0.0.1:55698/collection1/ shard1
   [junit4]   2> 148703 INFO  (zkCallback-92-thread-1-processing-n:127.0.0.1:55698_) [n:127.0.0.1:55698_    ] o.a.s.c.c.ZkStateReader A cluster state change: [WatchedEvent state:SyncConnected type:NodeDataChanged path:/clusterstate.json], has occurred - updating... (live nodes size: [1])
   [junit4]   2> 148753 INFO  (coreZkRegister-337-thread-1-processing-n:127.0.0.1:55698_ x:collection1 s:shard1 c:control_collection r:core_node1) [n:127.0.0.1:55698_ c:control_collection s:shard1 r:core_node1 x:collection1] o.a.s.c.ZkController We are http://127.0.0.1:55698/collection1/ and leader is http://127.0.0.1:55698/collection1/
   [junit4]   2> 148753 INFO  (coreZkRegister-337-thread-1-processing-n:127.0.0.1:55698_ x:collection1 s:shard1 c:control_collection r:core_node1) [n:127.0.0.1:55698_ c:control_collection s:shard1 r:core_node1 x:collection1] o.a.s.c.ZkController No LogReplay needed for core=collection1 baseURL=http://127.0.0.1:55698
   [junit4]   2> 148753 INFO  (coreZkRegister-337-thread-1-processing-n:127.0.0.1:55698_ x:collection1 s:shard1 c:control_collection r:core_node1) [n:127.0.0.1:55698_ c:control_collection s:shard1 r:core_node1 x:collection1] o.a.s.c.ZkController I am the leader, no recovery necessary
   [junit4]   2> 148753 INFO  (coreZkRegister-337-thread-1-processing-n:127.0.0.1:55698_ x:collection1 s:shard1 c:control_collection r:core_node1) [n:127.0.0.1:55698_ c:control_collection s:shard1 r:core_node1 x:collection1] o.a.s.c.ZkController publishing state=active
   [junit4]   2> 148753 INFO  (coreZkRegister-337-thread-1-processing-n:127.0.0.1:55698_ x:collection1 s:shard1 c:control_collection r:core_node1) [n:127.0.0.1:55698_ c:control_collection s:shard1 r:core_node1 x:collection1] o.a.s.c.ZkController numShards not found on descriptor - reading it from system property
   [junit4]   2> 148757 INFO  (OverseerStateUpdate-95997992178548740-127.0.0.1:55698_-n_0000000000) [n:127.0.0.1:55698_    ] o.a.s.c.Overseer processMessage: queueSize: 1, message = {
   [junit4]   2>   "core":"collection1",
   [junit4]   2>   "core_node_name":"core_node1",
   [junit4]   2>   "roles":null,
   [junit4]   2>   "base_url":"http://127.0.0.1:55698",
   [junit4]   2>   "node_name":"127.0.0.1:55698_",
   [junit4]   2>   "numShards":"1",
   [junit4]   2>   "state":"active",
   [junit4]   2>   "shard":"shard1",
   [junit4]   2>   "collection":"control_collection",
   [junit4]   2>   "operation":"state"} current state version: 3
   [junit4]   2> 148758 INFO  (OverseerStateUpdate-95997992178548740-127.0.0.1:55698_-n_0000000000) [n:127.0.0.1:55698_    ] o.a.s.c.o.ReplicaMutator Update state numShards=1 message={
   [junit4]   2>   "core":"collection1",
   [junit4]   2>   "core_node_name":"core_node1",
   [junit4]   2>   "roles":null,
   [junit4]   2>   "base_url":"http://127.0.0.1:55698",
   [junit4]   2>   "node_name":"127.0.0.1:55698_",
   [junit4]   2>   "numShards":"1",
   [junit4]   2>   "state":"active",
   [junit4]   2>   "shard":"shard1",
   [junit4]   2>   "collection":"control_collection",
   [junit4]   2>   "operation":"state"}
   [junit4]   2> 148859 INFO  (zkCallback-92-thread-1-processing-n:127.0.0.1:55698_) [n:127.0.0.1:55698_    ] o.a.s.c.c.ZkStateReader A cluster state change: [WatchedEvent state:SyncConnected type:NodeDataChanged path:/clusterstate.json], has occurred - updating... (live nodes size: [1])
   [junit4]   2> 148929 INFO  (TEST-TestReqParamsAPI.test-seed#[507918E187C89A4E]) [    ] o.a.s.c.s.i.CloudSolrClient Final constructed zkHost string: 127.0.0.1:37748/solr
   [junit4]   2> 148934 INFO  (TEST-TestReqParamsAPI.test-seed#[507918E187C89A4E]) [    ] o.a.s.c.c.SolrZkClient Using default ZkCredentialsProvider
   [junit4]   2> 148934 INFO  (TEST-TestReqParamsAPI.test-seed#[507918E187C89A4E]) [    ] o.a.s.c.c.ConnectionManager Waiting for client to connect to ZooKeeper
   [junit4]   2> 148942 INFO  (zkCallback-96-thread-1) [    ] o.a.s.c.c.ConnectionManager Watcher org.apache.solr.common.cloud.ConnectionManager@2223c49a name:ZooKeeperConnection Watcher:127.0.0.1:37748/solr got event WatchedEvent state:SyncConnected type:None path:null path:null type:None
   [junit4]   2> 148942 INFO  (TEST-TestReqParamsAPI.test-seed#[507918E187C89A4E]) [    ] o.a.s.c.c.ConnectionManager Client is connected to ZooKeeper
   [junit4]   2> 148942 INFO  (TEST-TestReqParamsAPI.test-seed#[507918E187C89A4E]) [    ] o.a.s.c.c.SolrZkClient Using default ZkACLProvider
   [junit4]   2> 148942 INFO  (TEST-TestReqParamsAPI.test-seed#[507918E187C89A4E]) [    ] o.a.s.c.c.ZkStateReader Updating cluster state from ZooKeeper... 
   [junit4]   2> 148949 INFO  (TEST-TestReqParamsAPI.test-seed#[507918E187C89A4E]) [    ] o.a.s.c.c.ZkStateReader Loaded empty cluster properties
   [junit4]   2> 148950 INFO  (TEST-TestReqParamsAPI.test-seed#[507918E187C89A4E]) [    ] o.a.s.c.c.ZkStateReader Updated live nodes from ZooKeeper... (0) -> (1)
   [junit4]   2> 148950 INFO  (TEST-TestReqParamsAPI.test-seed#[507918E187C89A4E]) [    ] o.a.s.c.ChaosMonkey monkey: init - expire sessions:false cause connection loss:false
   [junit4]   2> 149028 INFO  (TEST-TestReqParamsAPI.test-seed#[507918E187C89A4E]) [    ] o.a.s.SolrTestCaseJ4 Writing core.properties file to /x1/jenkins/jenkins-slave/workspace/Lucene-Solr-Tests-master/solr/build/solr-core/test/J0/temp/solr.handler.TestReqParamsAPI_507918E187C89A4E-001/shard-1-001/cores/collection1
   [junit4]   2> 149029 INFO  (TEST-TestReqParamsAPI.test-seed#[507918E187C89A4E]) [    ] o.a.s.c.AbstractFullDistribZkTestBase create jetty 1 in directory /x1/jenkins/jenkins-slave/workspace/Lucene-Solr-Tests-master/solr/build/solr-core/test/J0/temp/solr.handler.TestReqParamsAPI_507918E187C89A4E-001/shard-1-001
   [junit4]   2> 149033 INFO  (TEST-TestReqParamsAPI.test-seed#[507918E187C89A4E]) [    ] o.e.j.s.Server jetty-9.3.8.v20160314
   [junit4]   2> 149037 INFO  (TEST-TestReqParamsAPI.test-seed#[507918E187C89A4E]) [    ] o.e.j.s.h.ContextHandler Started o.e.j.s.ServletContextHandler@7ca192f8{/,null,AVAILABLE}
   [junit4]   2> 149038 INFO  (TEST-TestReqParamsAPI.test-seed#[507918E187C89A4E]) [    ] o.e.j.s.ServerConnector Started ServerConnector@747a1bd4{HTTP/1.1,[http/1.1]}{127.0.0.1:?????}
   [junit4]   2> 149038 INFO  (TEST-TestReqParamsAPI.test-seed#[507918E187C89A4E]) [    ] o.e.j.s.Server Started @??????ms
   [junit4]   2> 149038 INFO  (TEST-TestReqParamsAPI.test-seed#[507918E187C89A4E]) [    ] o.a.s.c.s.e.JettySolrRunner Jetty properties: {solr.data.dir=/x1/jenkins/jenkins-slave/workspace/Lucene-Solr-Tests-master/solr/build/solr-core/test/J0/temp/solr.handler.TestReqParamsAPI_507918E187C89A4E-001/tempDir-001/jetty1, solrconfig=solrconfig.xml, hostContext=/, hostPort=40400, coreRootDirectory=/x1/jenkins/jenkins-slave/workspace/Lucene-Solr-Tests-master/solr/build/solr-core/test/J0/../../../../../../../../../../x1/jenkins/jenkins-slave/workspace/Lucene-Solr-Tests-master/solr/build/solr-core/test/J0/temp/solr.handler.TestReqParamsAPI_507918E187C89A4E-001/shard-1-001/cores}
   [junit4]   2> 149038 INFO  (TEST-TestReqParamsAPI.test-seed#[507918E187C89A4E]) [    ] o.a.s.s.SolrDispatchFilter SolrDispatchFilter.init(): sun.misc.Launcher$AppClassLoader@73d16e93
   [junit4]   2> 149038 INFO  (TEST-TestReqParamsAPI.test-seed#[507918E187C89A4E]) [    ] o.a.s.c.SolrResourceLoader new SolrResourceLoader for directory: '/x1/jenkins/jenkins-slave/workspace/Lucene-Solr-Tests-master/solr/build/solr-core/test/J0/temp/solr.handler.TestReqParamsAPI_507918E187C89A4E-001/shard-1-001'
   [junit4]   2> 149038 INFO  (TEST-TestReqParamsAPI.test-seed#[507918E187C89A4E]) [    ] o.a.s.c.SolrResourceLoader JNDI not configured for solr (NoInitialContextEx)
   [junit4]   2> 149039 INFO  (TEST-TestReqParamsAPI.test-seed#[507918E187C89A4E]) [    ] o.a.s.c.SolrResourceLoader solr home defaulted to 'solr/' (could not find system property or JNDI)
   [junit4]   2> 149039 INFO  (TEST-TestReqParamsAPI.test-seed#[507918E187C89A4E]) [    ] o.a.s.c.c.SolrZkClient Using default ZkCredentialsProvider
   [junit4]   2> 149039 INFO  (TEST-TestReqParamsAPI.test-seed#[507918E187C89A4E]) [    ] o.a.s.c.c.ConnectionManager Waiting for client to connect to ZooKeeper
   [junit4]   2> 149053 INFO  (zkCallback-97-thread-1) [    ] o.a.s.c.c.ConnectionManager Watcher org.apache.solr.common.cloud.ConnectionManager@6a3931cb name:ZooKeeperConnection Watcher:127.0.0.1:37748/solr got event WatchedEvent state:SyncConnected type:None path:null path:null type:None
   [junit4]   2> 149053 INFO  (TEST-TestReqParamsAPI.test-seed#[507918E187C89A4E]) [    ] o.a.s.c.c.ConnectionManager Client is connected to ZooKeeper
   [junit4]   2> 149053 INFO  (TEST-TestReqParamsAPI.test-seed#[507918E187C89A4E]) [    ] o.a.s.c.c.SolrZkClient Using default ZkACLProvider
   [junit4]   2> 149054 INFO  (TEST-TestReqParamsAPI.test-seed#[507918E187C89A4E]) [    ] o.a.s.s.SolrDispatchFilter Loading solr.xml from SolrHome (not found in ZooKeeper)
   [junit4]   2> 149054 INFO  (TEST-TestReqParamsAPI.test-seed#[507918E187C89A4E]) [    ] o.a.s.c.SolrXmlConfig Loading container configuration from /x1/jenkins/jenkins-slave/workspace/Lucene-Solr-Tests-master/solr/build/solr-core/test/J0/temp/solr.handler.TestReqParamsAPI_507918E187C89A4E-001/shard-1-001/solr.xml
   [junit4]   2> 149058 INFO  (TEST-TestReqParamsAPI.test-seed#[507918E187C89A4E]) [    ] o.a.s.c.CorePropertiesLocator Config-defined core root directory: /x1/jenkins/jenkins-slave/workspace/Lucene-Solr-Tests-master/solr/build/solr-core/test/J0/../../../../../../../../../../x1/jenkins/jenkins-slave/workspace/Lucene-Solr-Tests-master/solr/build/solr-core/test/J0/temp/solr.handler.TestReqParamsAPI_507918E187C89A4E-001/shard-1-001/cores
   [junit4]   2> 149058 INFO  (TEST-TestReqParamsAPI.test-seed#[507918E187C89A4E]) [    ] o.a.s.c.CoreContainer New CoreContainer 1053049644
   [junit4]   2> 149058 INFO  (TEST-TestReqParamsAPI.test-seed#[507918E187C89A4E]) [    ] o.a.s.c.CoreContainer Loading cores into CoreContainer [instanceDir=/x1/jenkins/jenkins-slave/workspace/Lucene-Solr-Tests-master/solr/build/solr-core/test/J0/temp/solr.handler.TestReqParamsAPI_507918E187C89A4E-001/shard-1-001]
   [junit4]   2> 149058 WARN  (TEST-TestReqParamsAPI.test-seed#[507918E187C89A4E]) [    ] o.a.s.c.CoreContainer Couldn't add files from /x1/jenkins/jenkins-slave/workspace/Lucene-Solr-Tests-master/solr/build/solr-core/test/J0/temp/solr.handler.TestReqParamsAPI_507918E187C89A4E-001/shard-1-001/lib to classpath: /x1/jenkins/jenkins-slave/workspace/Lucene-Solr-Tests-master/solr/build/solr-core/test/J0/temp/solr.handler.TestReqParamsAPI_507918E187C89A4E-001/shard-1-001/lib
   [junit4]   2> 149058 INFO  (TEST-TestReqParamsAPI.test-seed#[507918E187C89A4E]) [    ] o.a.s.h.c.HttpShardHandlerFactory created with socketTimeout : 90000,urlScheme : ,connTimeout : 15000,maxConnectionsPerHost : 20,maxConnections : 10000,corePoolSize : 0,maximumPoolSize : 2147483647,maxThreadIdleTime : 5,sizeOfQueue : -1,fairnessPolicy : false,
   [junit4]   2> 149088 INFO  (TEST-TestReqParamsAPI.test-seed#[507918E187C89A4E]) [    ] o.a.s.u.UpdateShardHandler Creating UpdateShardHandler HTTP client with params: 
   [junit4]   2> 149152 INFO  (TEST-TestReqParamsAPI.test-seed#[507918E187C89A4E]) [    ] o.a.s.l.LogWatcher SLF4J impl is org.slf4j.impl.Log4jLoggerFactory
   [junit4]   2> 149152 INFO  (TEST-TestReqParamsAPI.test-seed#[507918E187C89A4E]) [    ] o.a.s.l.LogWatcher Registering Log Listener [Log4j (org.slf4j.impl.Log4jLoggerFactory)]
   [junit4]   2> 149152 INFO  (TEST-TestReqParamsAPI.test-seed#[507918E187C89A4E]) [    ] o.a.s.c.ZkContainer Zookeeper client=127.0.0.1:37748/solr
   [junit4]   2> 149152 INFO  (TEST-TestReqParamsAPI.test-seed#[507918E187C89A4E]) [    ] o.a.s.c.ZkController zkHost includes chroot
   [junit4]   2> 149152 INFO  (TEST-TestReqParamsAPI.test-seed#[507918E187C89A4E]) [    ] o.a.s.c.c.SolrZkClient Using default ZkCredentialsProvider
   [junit4]   2> 149172 INFO  (TEST-TestReqParamsAPI.test-seed#[507918E187C89A4E]) [    ] o.a.s.c.c.ConnectionManager Waiting for client to connect to ZooKeeper
   [junit4]   2> 149178 INFO  (zkCallback-100-thread-1) [    ] o.a.s.c.c.ConnectionManager Watcher org.apache.solr.common.cloud.ConnectionManager@766b5d64 name:ZooKeeperConnection Watcher:127.0.0.1:37748 got event WatchedEvent state:SyncConnected type:None path:null path:null type:None
   [junit4]   2> 149181 INFO  (TEST-TestReqParamsAPI.test-seed#[507918E187C89A4E]) [    ] o.a.s.c.c.ConnectionManager Client is connected to ZooKeeper
   [junit4]   2> 149182 INFO  (TEST-TestReqParamsAPI.test-seed#[507918E187C89A4E]) [    ] o.a.s.c.c.SolrZkClient Using default ZkACLProvider
   [junit4]   2> 149184 INFO  (TEST-TestReqParamsAPI.test-seed#[507918E187C89A4E]) [n:127.0.0.1:40400_    ] o.a.s.c.ZkController Added new OnReconnect listener org.apache.solr.cloud.ZkController$$Lambda$111/1213874478@3d746707
   [junit4]   2> 149184 INFO  (TEST-TestReqParamsAPI.test-seed#[507918E187C89A4E]) [n:127.0.0.1:40400_    ] o.a.s.c.c.ConnectionManager Waiting for client to connect to ZooKeeper
   [junit4]   2> 149192 INFO  (zkCallback-101-thread-1-processing-n:127.0.0.1:40400_) [n:127.0.0.1:40400_    ] o.a.s.c.c.ConnectionManager Watcher org.apache.solr.common.cloud.ConnectionManager@54137f3b name:ZooKeeperConnection Watcher:127.0.0.1:37748/solr got event WatchedEvent state:SyncConnected type:None path:null path:null type:None
   [junit4]   2> 149192 INFO  (TEST-TestReqParamsAPI.test-seed#[507918E187C89A4E]) [n:127.0.0.1:40400_    ] o.a.s.c.c.ConnectionManager Client is connected to ZooKeeper
   [junit4]   2> 149195 INFO  (TEST-TestReqParamsAPI.test-seed#[507918E187C89A4E]) [n:127.0.0.1:40400_    ] o.a.s.c.c.ZkStateReader Updating cluster state from ZooKeeper... 
   [junit4]   2> 149195 INFO  (TEST-TestReqParamsAPI.test-seed#[507918E187C89A4E]) [n:127.0.0.1:40400_    ] o.a.s.c.c.ZkStateReader Loaded empty cluster properties
   [junit4]   2> 149195 INFO  (TEST-TestReqParamsAPI.test-seed#[507918E187C89A4E]) [n:127.0.0.1:40400_    ] o.a.s.c.c.ZkStateReader Updated live nodes from ZooKeeper... (0) -> (1)
   [junit4]   2> 149198 INFO  (TEST-TestReqParamsAPI.test-seed#[507918E187C89A4E]) [n:127.0.0.1:40400_    ] o.a.s.c.Overseer Overseer (id=null) closing
   [junit4]   2> 149198 INFO  (TEST-TestReqParamsAPI.test-seed#[507918E187C89A4E]) [n:127.0.0.1:40400_    ] o.a.s.c.LeaderElector Joined leadership election with path: /overseer_elect/election/95997992178548744-127.0.0.1:40400_-n_0000000001
   [junit4]   2> 149198 INFO  (TEST-TestReqParamsAPI.test-seed#[507918E187C89A4E]) [n:127.0.0.1:40400_    ] o.a.s.c.LeaderElector Watching path /overseer_elect/election/95997992178548740-127.0.0.1:55698_-n_0000000000 to know if I could be the leader
   [junit4]   2> 149198 INFO  (TEST-TestReqParamsAPI.test-seed#[507918E187C89A4E]) [n:127.0.0.1:40400_    ] o.a.s.c.ZkController Publish node=127.0.0.1:40400_ as DOWN
   [junit4]   2> 149200 INFO  (OverseerStateUpdate-95997992178548740-127.0.0.1:55698_-n_0000000000) [n:127.0.0.1:55698_    ] o.a.s.c.Overseer processMessage: queueSize: 1, message = {
   [junit4]   2>   "operation":"downnode",
   [junit4]   2>   "node_name":"127.0.0.1:40400_"} current state version: 4
   [junit4]   2> 149200 INFO  (OverseerStateUpdate-95997992178548740-127.0.0.1:55698_-n_0000000000) [n:127.0.0.1:55698_    ] o.a.s.c.o.NodeMutator DownNode state invoked for node: 127.0.0.1:40400_
   [junit4]   2> 149303 INFO  (zkCallback-101-thread-1-processing-n:127.0.0.1:40400_) [n:127.0.0.1:40400_    ] o.a.s.c.c.ZkStateReader A cluster state change: [WatchedEvent state:SyncConnected type:NodeDataChanged path:/clusterstate.json], has occurred - updating... (live nodes size: [1])
   [junit4]   2> 149303 INFO  (zkCallback-96-thread-1) [    ] o.a.s.c.c.ZkStateReader A cluster state change: [WatchedEvent state:SyncConnected type:NodeDataChanged path:/clusterstate.json], has occurred - updating... (live nodes size: [1])
   [junit4]   2> 149303 INFO  (zkCallback-92-thread-1-processing-n:127.0.0.1:55698_) [n:127.0.0.1:55698_    ] o.a.s.c.c.ZkStateReader A cluster state change: [WatchedEvent state:SyncConnected type:NodeDataChanged path:/clusterstate.json], has occurred - updating... (live nodes size: [1])
   [junit4]   2> 150302 INFO  (TEST-TestReqParamsAPI.test-seed#[507918E187C89A4E]) [n:127.0.0.1:40400_    ] o.a.s.c.ZkController Register node as live in ZooKeeper:/live_nodes/127.0.0.1:40400_
   [junit4]   2> 150303 INFO  (TEST-TestReqParamsAPI.test-seed#[507918E187C89A4E]) [n:127.0.0.1:40400_    ] o.a.s.c.c.SolrZkClient makePath: /live_nodes/127.0.0.1:40400_
   [junit4]   2> 150303 INFO  (zkCallback-96-thread-1) [    ] o.a.s.c.c.ZkStateReader A live node change: [WatchedEvent state:SyncConnected type:NodeChildrenChanged path:/live_nodes], has occurred - updating... (live nodes size: [1])
   [junit4]   2> 150303 INFO  (zkCallback-92-thread-1-processing-n:127.0.0.1:55698_) [n:127.0.0.1:55698_    ] o.a.s.c.c.ZkStateReader A live node change: [WatchedEvent state:SyncConnected type:NodeChildrenChanged path:/live_nodes], has occurred - updating... (live nodes size: [1])
   [junit4]   2> 150303 INFO  (zkCallback-96-thread-1) [    ] o.a.s.c.c.ZkStateReader Updated live nodes from ZooKeeper... (1) -> (2)
   [junit4]   2> 150304 INFO  (zkCallback-101-thread-1-processing-n:127.0.0.1:40400_) [n:127.0.0.1:40400_    ] o.a.s.c.c.ZkStateReader A live node change: [WatchedEvent state:SyncConnected type:NodeChildrenChanged path:/live_nodes], has occurred - updating... (live nodes size: [1])
   [junit4]   2> 150304 INFO  (zkCallback-92-thread-1-processing-n:127.0.0.1:55698_) [n:127.0.0.1:55698_    ] o.a.s.c.c.ZkStateReader Updated live nodes from ZooKeeper... (1) -> (2)
   [junit4]   2> 150304 INFO  (zkCallback-101-thread-1-processing-n:127.0.0.1:40400_) [n:127.0.0.1:40400_    ] o.a.s.c.c.ZkStateReader Updated live nodes from ZooKeeper... (1) -> (2)
   [junit4]   2> 150318 INFO  (TEST-TestReqParamsAPI.test-seed#[507918E187C89A4E]) [n:127.0.0.1:40400_    ] o.a.s.c.CoreContainer Security conf doesn't exist. Skipping setup for authorization module.
   [junit4]   2> 150318 INFO  (TEST-TestReqParamsAPI.test-seed#[507918E187C89A4E]) [n:127.0.0.1:40400_    ] o.a.s.c.CoreContainer No authentication plugin used.
   [junit4]   2> 150325 INFO  (TEST-TestReqParamsAPI.test-seed#[507918E187C89A4E]) [n:127.0.0.1:40400_    ] o.a.s.c.CorePropertiesLocator Looking for core definitions underneath /x1/jenkins/jenkins-slave/workspace/Lucene-Solr-Tests-master/solr/build/solr-core/test/J0/../../../../../../../../../../x1/jenkins/jenkins-slave/workspace/Lucene-Solr-Tests-master/solr/build/solr-core/test/J0/temp/solr.handler.TestReqParamsAPI_507918E187C89A4E-001/shard-1-001/cores
   [junit4]   2> 150326 INFO  (TEST-TestReqParamsAPI.test-seed#[507918E187C89A4E]) [n:127.0.0.1:40400_    ] o.a.s.c.CoreDescriptor Created CoreDescriptor: {name=collection1, config=solrconfig.xml, transient=false, schema=schema.xml, loadOnStartup=true, configSetProperties=configsetprops.json, collection=collection1, coreNodeName=, dataDir=data/, shard=}
   [junit4]   2> 150326 INFO  (TEST-TestReqParamsAPI.test-seed#[507918E187C89A4E]) [n:127.0.0.1:40400_    ] o.a.s.c.CorePropertiesLocator Found core collection1 in /x1/jenkins/jenkins-slave/workspace/Lucene-Solr-Tests-master/solr/build/solr-core/test/J0/../../../../../../../../../../x1/jenkins/jenkins-slave/workspace/Lucene-Solr-Tests-master/solr/build/solr-core/test/J0/temp/solr.handler.TestReqParamsAPI_507918E187C89A4E-001/shard-1-001/cores/collection1
   [junit4]   2> 150326 INFO  (TEST-TestReqParamsAPI.test-seed#[507918E187C89A4E]) [n:127.0.0.1:40400_    ] o.a.s.c.CorePropertiesLocator Found 1 core definitions
   [junit4]   2> 150348 INFO  (coreLoadExecutor-354-thread-1-processing-n:127.0.0.1:40400_) [n:127.0.0.1:40400_ c:collection1   x:collection1] o.a.s.c.ZkController publishing state=down
   [junit4]   2> 150349 INFO  (coreLoadExecutor-354-thread-1-processing-n:127.0.0.1:40400_) [n:127.0.0.1:40400_ c:collection1   x:collection1] o.a.s.c.ZkController numShards not found on descriptor - reading it from system property
   [junit4]   2> 150350 INFO  (OverseerStateUpdate-95997992178548740-127.0.0.1:55698_-n_0000000000) [n:127.0.0.1:55698_    ] o.a.s.c.Overseer processMessage: queueSize: 1, message = {
   [junit4]   2>   "core":"collection1",
   [junit4]   2>   "roles":null,
   [junit4]   2>   "base_url":"http://127.0.0.1:40400",
   [junit4]   2>   "node_name":"127.0.0.1:40400_",
   [junit4]   2>   "numShards":"2",
   [junit4]   2>   "state":"down",
   [junit4]   2>   "shard":null,
   [junit4]   2>   "collection":"collection1",
   [junit4]   2>   "operation":"state"} current state version: 5
   [junit4]   2> 150350 INFO  (OverseerStateUpdate-95997992178548740-127.0.0.1:55698_-n_0000000000) [n:127.0.0.1:55698_    ] o.a.s.c.o.ReplicaMutator Update state numShards=2 message={
   [junit4]   2>   "core":"collection1",
   [junit4]   2>   "roles":null,
   [junit4]   2>   "base_url":"http://127.0.0.1:40400",
   [junit4]   2>   "node_name":"127.0.0.1:40400_",
   [junit4]   2>   "numShards":"2",
   [junit4]   2>   "state":"down",
   [junit4]   2>   "shard":null,
   [junit4]   2>   "collection":"collection1",
   [junit4]   2>   "operation":"state"}
   [junit4]   2> 150350 INFO  (OverseerStateUpdate-95997992178548740-127.0.0.1:55698_-n_0000000000) [n:127.0.0.1:55698_    ] o.a.s.c.o.ClusterStateMutator building a new cName: collection1
   [junit4]   2> 150350 INFO  (OverseerStateUpdate-95997992178548740-127.0.0.1:55698_-n_0000000000) [n:127.0.0.1:55698_    ] o.a.s.c.o.ReplicaMutator Assigning new node to shard shard=shard2
   [junit4]   2> 150352 INFO  (coreLoadExecutor-354-thread-1-processing-n:127.0.0.1:40400_) [n:127.0.0.1:40400_ c:collection1   x:collection1] o.a.s.c.ZkController Collection collection1 not visible yet, but flagging it so a watch is registered when it becomes visible
   [junit4]   2> 150352 INFO  (coreLoadExecutor-354-thread-1-processing-n:127.0.0.1:40400_) [n:127.0.0.1:40400_ c:collection1   x:collection1] o.a.s.c.c.ZkStateReader Deleting data for [collection1]
   [junit4]   2> 150356 INFO  (TEST-TestReqParamsAPI.test-seed#[507918E187C89A4E]) [n:127.0.0.1:40400_    ] o.a.s.s.SolrDispatchFilter user.dir=/x1/jenkins/jenkins-slave/workspace/Lucene-Solr-Tests-master/solr/build/solr-core/test/J0
   [junit4]   2> 150357 INFO  (TEST-TestReqParamsAPI.test-seed#[507918E187C89A4E]) [n:127.0.0.1:40400_    ] o.a.s.s.SolrDispatchFilter SolrDispatchFilter.init() done
   [junit4]   2> 150365 INFO  (coreLoadExecutor-354-thread-1-processing-n:127.0.0.1:40400_) [n:127.0.0.1:40400_ c:collection1   x:collection1] o.a.s.c.ZkController look for our core node name
   [junit4]   2> 150452 INFO  (zkCallback-96-thread-1) [    ] o.a.s.c.c.ZkStateReader A cluster state change: [WatchedEvent state:SyncConnected type:NodeDataChanged path:/clusterstate.json], has occurred - updating... (live nodes size: [2])
   [junit4]   2> 150452 INFO  (zkCallback-92-thread-1-processing-n:127.0.0.1:55698_) [n:127.0.0.1:55698_    ] o.a.s.c.c.ZkStateReader A cluster state change: [WatchedEvent state:SyncConnected type:NodeDataChanged path:/clusterstate.json], has occurred - updating... (live nodes size: [2])
   [junit4]   2> 150456 INFO  (zkCallback-101-thread-1-processing-n:127.0.0.1:40400_) [n:127.0.0.1:40400_    ] o.a.s.c.c.ZkStateReader A cluster state change: [WatchedEvent state:SyncConnected type:NodeDataChanged path:/clusterstate.json], has occurred - updating... (live nodes size: [2])
   [junit4]   2> 151380 INFO  (coreLoadExecutor-354-thread-1-processing-n:127.0.0.1:40400_) [n:127.0.0.1:40400_ c:collection1   x:collection1] o.a.s.c.ZkController waiting to find shard id in clusterstate for collection1
   [junit4]   2> 151380 INFO  (coreLoadExecutor-354-thread-1-processing-n:127.0.0.1:40400_) [n:127.0.0.1:40400_ c:collection1   x:collection1] o.a.s.c.ZkController Check for collection zkNode:collection1
   [junit4]   2> 151388 INFO  (coreLoadExecutor-354-thread-1-processing-n:127.0.0.1:40400_) [n:127.0.0.1:40400_ c:collection1   x:collection1] o.a.s.c.ZkController Collection zkNode exists
   [junit4]   2> 151388 INFO  (coreLoadExecutor-354-thread-1-processing-n:127.0.0.1:40400_) [n:127.0.0.1:40400_ c:collection1   x:collection1] o.a.s.c.c.ZkStateReader Load collection config from: [/collections/collection1]
   [junit4]   2> 151389 INFO  (coreLoadExecutor-354-thread-1-processing-n:127.0.0.1:40400_) [n:127.0.0.1:40400_ c:collection1   x:collection1] o.a.s.c.c.ZkStateReader path=[/collections/collection1] [configName]=[conf1] specified config exists in ZooKeeper
   [junit4]   2> 151389 INFO  (coreLoadExecutor-354-thread-1-processing-n:127.0.0.1:40400_) [n:127.0.0.1:40400_ c:collection1   x:collection1] o.a.s.c.SolrResourceLoader new SolrResourceLoader for directory: '/x1/jenkins/jenkins-slave/workspace/Lucene-Solr-Tests-master/solr/build/solr-core/test/J0/temp/solr.handler.TestReqParamsAPI_507918E187C89A4E-001/shard-1-001/cores/collection1'
   [junit4]   2> 151389 INFO  (coreLoadExecutor-354-thread-1-processing-n:127.0.0.1:40400_) [n:127.0.0.1:40400_ c:collection1   x:collection1] o.a.s.c.SolrResourceLoader JNDI not configured for solr (NoInitialContextEx)
   [junit4]   2> 151389 INFO  (coreLoadExecutor-354-thread-1-processing-n:127.0.0.1:40400_) [n:127.0.0.1:40400_ c:collection1   x:collection1] o.a.s.c.SolrResourceLoader solr home defaulted to 'solr/' (could not find system property or JNDI)
   [junit4]   2> 151390 INFO  (coreLoadExecutor-354-thread-1-processing-n:127.0.0.1:40400_) [n:127.0.0.1:40400_ c:collection1   x:collection1] o.a.s.c.Config loaded config solrconfig.xml with version 0 
   [junit4]   2> 151430 INFO  (coreLoadExecutor-354-thread-1-processing-n:127.0.0.1:40400_) [n:127.0.0.1:40400_ c:collection1   x:collection1] o.a.s.c.SolrConfig current version of requestparams : -1
   [junit4]   2> 151433 INFO  (coreLoadExecutor-354-thread-1-processing-n:127.0.0.1:40400_) [n:127.0.0.1:40400_ c:collection1   x:collection1] o.a.s.c.SolrConfig Using Lucene MatchVersion: 7.0.0
   [junit4]   2> 151458 INFO  (coreLoadExecutor-354-thread-1-processing-n:127.0.0.1:40400_) [n:127.0.0.1:40400_ c:collection1   x:collection1] o.a.s.c.SolrConfig Loaded SolrConfig: solrconfig.xml
   [junit4]   2> 151479 INFO  (coreLoadExecutor-354-thread-1-processing-n:127.0.0.1:40400_) [n:127.0.0.1:40400_ c:collection1   x:collection1] o.a.s.s.IndexSchema [collection1] Schema name=test
   [junit4]   2> 151801 INFO  (coreLoadExecutor-354-thread-1-processing-n:127.0.0.1:40400_) [n:127.0.0.1:40400_ c:collection1   x:collection1] o.a.s.s.OpenExchangeRatesOrgProvider Initialized with rates=open-exchange-rates.json, refreshInterval=1440.
   [junit4]   2> 151806 INFO  (coreLoadExecutor-354-thread-1-processing-n:127.0.0.1:40400_) [n:127.0.0.1:40400_ c:collection1   x:collection1] o.a.s.s.IndexSchema default search field in schema is text
   [junit4]   2> 151807 INFO  (coreLoadExecutor-354-thread-1-processing-n:127.0.0.1:40400_) [n:127.0.0.1:40400_ c:collection1   x:collection1] o.a.s.s.IndexSchema unique key field: id
   [junit4]   2> 151821 INFO  (coreLoadExecutor-354-thread-1-processing-n:127.0.0.1:40400_) [n:127.0.0.1:40400_ c:collection1   x:collection1] o.a.s.s.FileExchangeRateProvider Reloading exchange rates from file currency.xml
   [junit4]   2> 151822 INFO  (coreLoadExecutor-354-thread-1-processing-n:127.0.0.1:40400_) [n:127.0.0.1:40400_ c:collection1   x:collection1] o.a.s.s.FileExchangeRateProvider Reloading exchange rates from file currency.xml
   [junit4]   2> 151825 INFO  (coreLoadExecutor-354-thread-1-processing-n:127.0.0.1:40400_) [n:127.0.0.1:40400_ c:collection1   x:collection1] o.a.s.s.OpenExchangeRatesOrgProvider Reloading exchange rates from open-exchange-rates.json
   [junit4]   2> 151826 INFO  (coreLoadExecutor-354-thread-1-processing-n:127.0.0.1:40400_) [n:127.0.0.1:40400_ c:collection1   x:collection1] o.a.s.s.OpenExchangeRatesOrgProvider Reloading exchange rates from open-exchange-rates.json
   [junit4]   2> 151827 INFO  (coreLoadExecutor-354-thread-1-processing-n:127.0.0.1:40400_) [n:127.0.0.1:40400_ c:collection1   x:collection1] o.a.s.c.ConfigSetProperties Did not find ConfigSet properties, assuming default properties: Can't find resource 'configsetprops.json' in classpath or '/configs/conf1', cwd=/x1/jenkins/jenkins-slave/workspace/Lucene-Solr-Tests-master/solr/build/solr-core/test/J0
   [junit4]   2> 151827 INFO  (coreLoadExecutor-354-thread-1-processing-n:127.0.0.1:40400_) [n:127.0.0.1:40400_ c:collection1   x:collection1] o.a.s.c.CoreContainer Creating SolrCore 'collection1' using configuration from collection collection1
   [junit4]   2> 151827 INFO  (coreLoadExecutor-354-thread-1-processing-n:127.0.0.1:40400_) [n:127.0.0.1:40400_ c:collection1 s:shard2 r:core_node1 x:collection1] o.a.s.c.SolrCore org.apache.solr.core.MockDirectoryFactory
   [junit4]   2> 151827 INFO  (coreLoadExecutor-354-thread-1-processing-n:127.0.0.1:40400_) [n:127.0.0.1:40400_ c:collection1 s:shard2 r:core_node1 x:collection1] o.a.s.c.SolrCore [[collection1] ] Opening new SolrCore at [/x1/jenkins/jenkins-slave/workspace/Lucene-Solr-Tests-master/solr/build/solr-core/test/J0/temp/solr.handler.TestReqParamsAPI_507918E187C89A4E-001/shard-1-001/cores/collection1], dataDir=[/x1/jenkins/jenkins-slave/workspace/Lucene-Solr-Tests-master/solr/build/solr-core/test/J0/../../../../../../../../../../x1/jenkins/jenkins-slave/workspace/Lucene-Solr-Tests-master/solr/build/solr-core/test/J0/temp/solr.handler.TestReqParamsAPI_507918E187C89A4E-001/shard-1-001/cores/collection1/data/]
   [junit4]   2> 151827 INFO  (coreLoadExecutor-354-thread-1-processing-n:127.0.0.1:40400_) [n:127.0.0.1:40400_ c:collection1 s:shard2 r:core_node1 x:collection1] o.a.s.c.JmxMonitoredMap JMX monitoring is enabled. Adding Solr mbeans to JMX Server: com.sun.jmx.mbeanserver.JmxMBeanServer@4714942
   [junit4]   2> 151828 INFO  (coreLoadExecutor-354-thread-1-processing-n:127.0.0.1:40400_) [n:127.0.0.1:40400_ c:collection1 s:shard2 r:core_node1 x:collection1] o.a.s.c.CachingDirectoryFactory return new directory for /x1/jenkins/jenkins-slave/workspace/Lucene-Solr-Tests-master/solr/build/solr-core/test/J0/../../../../../../../../../../x1/jenkins/jenkins-slave/workspace/Lucene-Solr-Tests-master/solr/build/solr-core/test/J0/temp/solr.handler.TestReqParamsAPI_507918E187C89A4E-001/shard-1-001/cores/collection1/data
   [junit4]   2> 151828 INFO  (coreLoadExecutor-354-thread-1-processing-n:127.0.0.1:40400_) [n:127.0.0.1:40400_ c:collection1 s:shard2 r:core_node1 x:collection1] o.a.s.c.SolrCore New index directory detected: old=null new=/x1/jenkins/jenkins-slave/workspace/Lucene-Solr-Tests-master/solr/build/solr-core/test/J0/../../../../../../../../../../x1/jenkins/jenkins-slave/workspace/Lucene-Solr-Tests-master/solr/build/solr-core/test/J0/temp/solr.handler.TestReqParamsAPI_507918E187C89A4E-001/shard-1-001/cores/collection1/data/index/
   [junit4]   2> 151828 WARN  (coreLoadExecutor-354-thread-1-processing-n:127.0.0.1:40400_) [n:127.0.0.1:40400_ c:collection1 s:shard2 r:core_node1 x:collection1] o.a.s.c.SolrCore [collection1] Solr index directory '/x1/jenkins/jenkins-slave/workspace/Lucene-Solr-Tests-master/solr/build/solr-core/test/J0/../../../../../../../../../../x1/jenkins/jenkins-slave/workspace/Lucene-Solr-Tests-master/solr/bu

[...truncated too long message...]

tdown=true
   [junit4]   2> 172973 INFO  (recoveryExecutor-118-thread-1-processing-n:127.0.0.1:36128_ x:collection1 s:shard1 c:collection1 r:core_node4) [n:127.0.0.1:36128_ c:collection1 s:shard1 r:core_node4 x:collection1] o.a.s.c.CachingDirectoryFactory Closing directory: /x1/jenkins/jenkins-slave/workspace/Lucene-Solr-Tests-master/solr/build/solr-core/test/J0/../../../../../../../../../../x1/jenkins/jenkins-slave/workspace/Lucene-Solr-Tests-master/solr/build/solr-core/test/J0/temp/solr.handler.TestReqParamsAPI_507918E187C89A4E-001/shard-4-001/cores/collection1/data/index
   [junit4]   2> 172973 INFO  (recoveryExecutor-118-thread-1-processing-n:127.0.0.1:36128_ x:collection1 s:shard1 c:collection1 r:core_node4) [n:127.0.0.1:36128_ c:collection1 s:shard1 r:core_node4 x:collection1] o.a.s.c.CachingDirectoryFactory looking to close /x1/jenkins/jenkins-slave/workspace/Lucene-Solr-Tests-master/solr/build/solr-core/test/J0/../../../../../../../../../../x1/jenkins/jenkins-slave/workspace/Lucene-Solr-Tests-master/solr/build/solr-core/test/J0/temp/solr.handler.TestReqParamsAPI_507918E187C89A4E-001/shard-4-001/cores/collection1/data [CachedDir<<refCount=0;path=/x1/jenkins/jenkins-slave/workspace/Lucene-Solr-Tests-master/solr/build/solr-core/test/J0/../../../../../../../../../../x1/jenkins/jenkins-slave/workspace/Lucene-Solr-Tests-master/solr/build/solr-core/test/J0/temp/solr.handler.TestReqParamsAPI_507918E187C89A4E-001/shard-4-001/cores/collection1/data;done=false>>]
   [junit4]   2> 172973 INFO  (recoveryExecutor-118-thread-1-processing-n:127.0.0.1:36128_ x:collection1 s:shard1 c:collection1 r:core_node4) [n:127.0.0.1:36128_ c:collection1 s:shard1 r:core_node4 x:collection1] o.a.s.c.CachingDirectoryFactory Closing directory, CoreContainer#isShutdown=true
   [junit4]   2> 172973 INFO  (recoveryExecutor-118-thread-1-processing-n:127.0.0.1:36128_ x:collection1 s:shard1 c:collection1 r:core_node4) [n:127.0.0.1:36128_ c:collection1 s:shard1 r:core_node4 x:collection1] o.a.s.c.CachingDirectoryFactory Closing directory: /x1/jenkins/jenkins-slave/workspace/Lucene-Solr-Tests-master/solr/build/solr-core/test/J0/../../../../../../../../../../x1/jenkins/jenkins-slave/workspace/Lucene-Solr-Tests-master/solr/build/solr-core/test/J0/temp/solr.handler.TestReqParamsAPI_507918E187C89A4E-001/shard-4-001/cores/collection1/data
   [junit4]   2> 172974 INFO  (TEST-TestReqParamsAPI.test-seed#[507918E187C89A4E]) [    ] o.a.s.c.Overseer Overseer (id=95997992178548753-127.0.0.1:36128_-n_0000000004) closing
   [junit4]   2> 172974 INFO  (OverseerStateUpdate-95997992178548753-127.0.0.1:36128_-n_0000000004) [n:127.0.0.1:36128_    ] o.a.s.c.Overseer Overseer Loop exiting : 127.0.0.1:36128_
   [junit4]   2> 172977 ERROR (TEST-TestReqParamsAPI.test-seed#[507918E187C89A4E]-EventThread) [n:127.0.0.1:36128_    ] o.a.z.ClientCnxn Error while calling watcher 
   [junit4]   2> java.util.concurrent.RejectedExecutionException: Task org.apache.solr.common.util.ExecutorUtil$MDCAwareThreadPoolExecutor$$Lambda$7/1031784312@7209c530 rejected from org.apache.solr.common.util.ExecutorUtil$MDCAwareThreadPoolExecutor@572159c7[Shutting down, pool size = 1, active threads = 0, queued tasks = 0, completed tasks = 39]
   [junit4]   2> 	at java.util.concurrent.ThreadPoolExecutor$AbortPolicy.rejectedExecution(ThreadPoolExecutor.java:2047)
   [junit4]   2> 	at java.util.concurrent.ThreadPoolExecutor.reject(ThreadPoolExecutor.java:823)
   [junit4]   2> 	at java.util.concurrent.ThreadPoolExecutor.execute(ThreadPoolExecutor.java:1369)
   [junit4]   2> 	at org.apache.solr.common.util.ExecutorUtil$MDCAwareThreadPoolExecutor.execute(ExecutorUtil.java:214)
   [junit4]   2> 	at java.util.concurrent.AbstractExecutorService.submit(AbstractExecutorService.java:112)
   [junit4]   2> 	at org.apache.solr.common.cloud.SolrZkClient$3.process(SolrZkClient.java:266)
   [junit4]   2> 	at org.apache.zookeeper.ClientCnxn$EventThread.processEvent(ClientCnxn.java:522)
   [junit4]   2> 	at org.apache.zookeeper.ClientCnxn$EventThread.run(ClientCnxn.java:498)
   [junit4]   2> 172978 INFO  (TEST-TestReqParamsAPI.test-seed#[507918E187C89A4E]) [    ] o.e.j.s.ServerConnector Stopped ServerConnector@6b804fd5{HTTP/1.1,[http/1.1]}{127.0.0.1:?}
   [junit4]   2> 172978 INFO  (TEST-TestReqParamsAPI.test-seed#[507918E187C89A4E]) [    ] o.e.j.s.h.ContextHandler Stopped o.e.j.s.ServletContextHandler@30c75847{/,null,UNAVAILABLE}
   [junit4]   2> 172979 INFO  (TEST-TestReqParamsAPI.test-seed#[507918E187C89A4E]) [    ] o.a.s.c.ZkTestServer connecting to 127.0.0.1:37748 37748
   [junit4]   2> 173111 INFO  (Thread-1241) [    ] o.a.s.c.ZkTestServer connecting to 127.0.0.1:37748 37748
   [junit4]   2> 173111 WARN  (Thread-1241) [    ] o.a.s.c.ZkTestServer Watch limit violations: 
   [junit4]   2> Maximum concurrent create/delete watches above limit:
   [junit4]   2> 
   [junit4]   2> 	25	/solr/configs/conf1
   [junit4]   2> 	6	/solr/aliases.json
   [junit4]   2> 	6	/solr/clusterprops.json
   [junit4]   2> 	5	/solr/security.json
   [junit4]   2> 	4	/solr/collections/collection1/state.json
   [junit4]   2> 
   [junit4]   2> Maximum concurrent data watches above limit:
   [junit4]   2> 
   [junit4]   2> 	6	/solr/clusterstate.json
   [junit4]   2> 
   [junit4]   2> Maximum concurrent children watches above limit:
   [junit4]   2> 
   [junit4]   2> 	6	/solr/live_nodes
   [junit4]   2> 	6	/solr/collections
   [junit4]   2> 	4	/solr/overseer/queue
   [junit4]   2> 	4	/solr/overseer/collection-queue-work
   [junit4]   2> 
   [junit4]   2> NOTE: reproduce with: ant test  -Dtestcase=TestReqParamsAPI -Dtests.method=test -Dtests.seed=507918E187C89A4E -Dtests.multiplier=2 -Dtests.slow=true -Dtests.locale=hi-IN -Dtests.timezone=Etc/GMT-14 -Dtests.asserts=true -Dtests.file.encoding=ISO-8859-1
   [junit4] FAILURE 27.2s J0 | TestReqParamsAPI.test <<<
   [junit4]    > Throwable #1: java.lang.AssertionError: Could not get expected value  'CY val' for path 'params/c' full output: {
   [junit4]    >   "responseHeader":{
   [junit4]    >     "status":0,
   [junit4]    >     "QTime":0},
   [junit4]    >   "params":{
   [junit4]    >     "a":"A val",
   [junit4]    >     "b":"B val",
   [junit4]    >     "wt":"json",
   [junit4]    >     "useParams":""},
   [junit4]    >   "context":{
   [junit4]    >     "webapp":"",
   [junit4]    >     "path":"/dump1",
   [junit4]    >     "httpMethod":"GET"}},  from server:  http://127.0.0.1:36128/collection1
   [junit4]    > 	at __randomizedtesting.SeedInfo.seed([507918E187C89A4E:D82D273B2934F7B6]:0)
   [junit4]    > 	at org.apache.solr.core.TestSolrConfigHandler.testForResponseElement(TestSolrConfigHandler.java:457)
   [junit4]    > 	at org.apache.solr.handler.TestReqParamsAPI.testReqParams(TestReqParamsAPI.java:172)
   [junit4]    > 	at org.apache.solr.handler.TestReqParamsAPI.test(TestReqParamsAPI.java:62)
   [junit4]    > 	at org.apache.solr.BaseDistributedSearchTestCase$ShardsRepeatRule$ShardsFixedStatement.callStatement(BaseDistributedSearchTestCase.java:985)
   [junit4]    > 	at org.apache.solr.BaseDistributedSearchTestCase$ShardsRepeatRule$ShardsStatement.evaluate(BaseDistributedSearchTestCase.java:960)
   [junit4]    > 	at java.lang.Thread.run(Thread.java:745)
   [junit4]   2> 173116 INFO  (SUITE-TestReqParamsAPI-seed#[507918E187C89A4E]-worker) [    ] o.a.s.SolrTestCaseJ4 ###deleteCore
   [junit4]   2> NOTE: leaving temporary files on disk at: /x1/jenkins/jenkins-slave/workspace/Lucene-Solr-Tests-master/solr/build/solr-core/test/J0/temp/solr.handler.TestReqParamsAPI_507918E187C89A4E-001
   [junit4]   2> Jun 01, 2016 8:32:20 PM com.carrotsearch.randomizedtesting.ThreadLeakControl checkThreadLeaks
   [junit4]   2> WARNING: Will linger awaiting termination of 1 leaked thread(s).
   [junit4]   2> NOTE: test params are: codec=CheapBastard, sim=ClassicSimilarity, locale=hi-IN, timezone=Etc/GMT-14
   [junit4]   2> NOTE: Linux 3.13.0-85-generic amd64/Oracle Corporation 1.8.0_74 (64-bit)/cpus=4,threads=1,free=303967432,total=487063552
   [junit4]   2> NOTE: All tests run in this JVM: [CacheHeaderTest, SystemInfoHandlerTest, XsltUpdateRequestHandlerTest, TestFieldCacheSanityChecker, TestDynamicFieldResource, TestScoreJoinQPNoScore, TestAtomicUpdateErrorCases, PathHierarchyTokenizerFactoryTest, OutputWriterTest, TestSchemaResource, OverseerCollectionConfigSetProcessorTest, TestUniqueKeyFieldResource, PeerSyncTest, TestIBSimilarityFactory, TestHdfsUpdateLog, DeleteLastCustomShardedReplicaTest, TestStressLucene, TestRTGBase, TestSearcherReuse, RuleEngineTest, TestRandomDVFaceting, SignatureUpdateProcessorFactoryTest, CloudMLTQParserTest, TestReqParamsAPI]
   [junit4] Completed [47/611 (1!)] on J0 in 28.22s, 1 test, 1 failure <<< FAILURES!

[...truncated 1837 lines...]
BUILD FAILED
/x1/jenkins/jenkins-slave/workspace/Lucene-Solr-Tests-master/build.xml:740: The following error occurred while executing this line:
/x1/jenkins/jenkins-slave/workspace/Lucene-Solr-Tests-master/build.xml:684: The following error occurred while executing this line:
/x1/jenkins/jenkins-slave/workspace/Lucene-Solr-Tests-master/build.xml:59: The following error occurred while executing this line:
/x1/jenkins/jenkins-slave/workspace/Lucene-Solr-Tests-master/solr/build.xml:233: The following error occurred while executing this line:
/x1/jenkins/jenkins-slave/workspace/Lucene-Solr-Tests-master/solr/common-build.xml:531: The following error occurred while executing this line:
/x1/jenkins/jenkins-slave/workspace/Lucene-Solr-Tests-master/lucene/common-build.xml:1427: The following error occurred while executing this line:
/x1/jenkins/jenkins-slave/workspace/Lucene-Solr-Tests-master/lucene/common-build.xml:984: There were test failures: 611 suites (10 ignored), 2557 tests, 1 failure, 87 ignored (72 assumptions) [seed: 507918E187C89A4E]

Total time: 65 minutes 7 seconds
Build step 'Invoke Ant' marked build as failure
Archiving artifacts
Recording test results
Email was triggered for: Failure - Any
Sending email for trigger: Failure - Any




Mime
View raw message