lucene-dev mailing list archives

Site index · List index
Message view « Date » · « Thread »
Top « Date » · « Thread »
From Policeman Jenkins Server <jenk...@thetaphi.de>
Subject [JENKINS] Lucene-Solr-5.5-Linux (64bit/jdk1.7.0_80) - Build # 325 - Failure!
Date Tue, 21 Jun 2016 13:11:18 GMT
Build: http://jenkins.thetaphi.de/job/Lucene-Solr-5.5-Linux/325/
Java: 64bit/jdk1.7.0_80 -XX:+UseCompressedOops -XX:+UseParallelGC

1 tests failed.
FAILED:  org.apache.solr.schema.TestManagedSchemaAPI.test

Error Message:
Error from server at http://127.0.0.1:33167/solr/testschemaapi_shard1_replica2: ERROR: [doc=2] unknown field 'myNewField1'

Stack Trace:
org.apache.solr.client.solrj.impl.CloudSolrClient$RouteException: Error from server at http://127.0.0.1:33167/solr/testschemaapi_shard1_replica2: ERROR: [doc=2] unknown field 'myNewField1'
	at __randomizedtesting.SeedInfo.seed([9A10A170080020D0:12449EAAA6FC4D28]:0)
	at org.apache.solr.client.solrj.impl.CloudSolrClient.directUpdate(CloudSolrClient.java:632)
	at org.apache.solr.client.solrj.impl.CloudSolrClient.sendRequest(CloudSolrClient.java:981)
	at org.apache.solr.client.solrj.impl.CloudSolrClient.requestWithRetryOnStaleState(CloudSolrClient.java:870)
	at org.apache.solr.client.solrj.impl.CloudSolrClient.request(CloudSolrClient.java:806)
	at org.apache.solr.schema.TestManagedSchemaAPI.testAddFieldAndDocument(TestManagedSchemaAPI.java:101)
	at org.apache.solr.schema.TestManagedSchemaAPI.test(TestManagedSchemaAPI.java:69)
	at sun.reflect.NativeMethodAccessorImpl.invoke0(Native Method)
	at sun.reflect.NativeMethodAccessorImpl.invoke(NativeMethodAccessorImpl.java:57)
	at sun.reflect.DelegatingMethodAccessorImpl.invoke(DelegatingMethodAccessorImpl.java:43)
	at java.lang.reflect.Method.invoke(Method.java:606)
	at com.carrotsearch.randomizedtesting.RandomizedRunner.invoke(RandomizedRunner.java:1764)
	at com.carrotsearch.randomizedtesting.RandomizedRunner$8.evaluate(RandomizedRunner.java:871)
	at com.carrotsearch.randomizedtesting.RandomizedRunner$9.evaluate(RandomizedRunner.java:907)
	at com.carrotsearch.randomizedtesting.RandomizedRunner$10.evaluate(RandomizedRunner.java:921)
	at com.carrotsearch.randomizedtesting.rules.SystemPropertiesRestoreRule$1.evaluate(SystemPropertiesRestoreRule.java:57)
	at org.apache.lucene.util.TestRuleSetupTeardownChained$1.evaluate(TestRuleSetupTeardownChained.java:49)
	at org.apache.lucene.util.AbstractBeforeAfterRule$1.evaluate(AbstractBeforeAfterRule.java:45)
	at org.apache.lucene.util.TestRuleThreadAndTestName$1.evaluate(TestRuleThreadAndTestName.java:48)
	at org.apache.lucene.util.TestRuleIgnoreAfterMaxFailures$1.evaluate(TestRuleIgnoreAfterMaxFailures.java:64)
	at org.apache.lucene.util.TestRuleMarkFailure$1.evaluate(TestRuleMarkFailure.java:47)
	at com.carrotsearch.randomizedtesting.rules.StatementAdapter.evaluate(StatementAdapter.java:36)
	at com.carrotsearch.randomizedtesting.ThreadLeakControl$StatementRunner.run(ThreadLeakControl.java:367)
	at com.carrotsearch.randomizedtesting.ThreadLeakControl.forkTimeoutingTask(ThreadLeakControl.java:809)
	at com.carrotsearch.randomizedtesting.ThreadLeakControl$3.evaluate(ThreadLeakControl.java:460)
	at com.carrotsearch.randomizedtesting.RandomizedRunner.runSingleTest(RandomizedRunner.java:880)
	at com.carrotsearch.randomizedtesting.RandomizedRunner$5.evaluate(RandomizedRunner.java:781)
	at com.carrotsearch.randomizedtesting.RandomizedRunner$6.evaluate(RandomizedRunner.java:816)
	at com.carrotsearch.randomizedtesting.RandomizedRunner$7.evaluate(RandomizedRunner.java:827)
	at com.carrotsearch.randomizedtesting.rules.StatementAdapter.evaluate(StatementAdapter.java:36)
	at com.carrotsearch.randomizedtesting.rules.SystemPropertiesRestoreRule$1.evaluate(SystemPropertiesRestoreRule.java:57)
	at org.apache.lucene.util.AbstractBeforeAfterRule$1.evaluate(AbstractBeforeAfterRule.java:45)
	at com.carrotsearch.randomizedtesting.rules.StatementAdapter.evaluate(StatementAdapter.java:36)
	at org.apache.lucene.util.TestRuleStoreClassName$1.evaluate(TestRuleStoreClassName.java:41)
	at com.carrotsearch.randomizedtesting.rules.NoShadowingOrOverridesOnMethodsRule$1.evaluate(NoShadowingOrOverridesOnMethodsRule.java:40)
	at com.carrotsearch.randomizedtesting.rules.NoShadowingOrOverridesOnMethodsRule$1.evaluate(NoShadowingOrOverridesOnMethodsRule.java:40)
	at com.carrotsearch.randomizedtesting.rules.StatementAdapter.evaluate(StatementAdapter.java:36)
	at com.carrotsearch.randomizedtesting.rules.StatementAdapter.evaluate(StatementAdapter.java:36)
	at com.carrotsearch.randomizedtesting.rules.StatementAdapter.evaluate(StatementAdapter.java:36)
	at org.apache.lucene.util.TestRuleAssertionsRequired$1.evaluate(TestRuleAssertionsRequired.java:53)
	at org.apache.lucene.util.TestRuleMarkFailure$1.evaluate(TestRuleMarkFailure.java:47)
	at org.apache.lucene.util.TestRuleIgnoreAfterMaxFailures$1.evaluate(TestRuleIgnoreAfterMaxFailures.java:64)
	at org.apache.lucene.util.TestRuleIgnoreTestSuites$1.evaluate(TestRuleIgnoreTestSuites.java:54)
	at com.carrotsearch.randomizedtesting.rules.StatementAdapter.evaluate(StatementAdapter.java:36)
	at com.carrotsearch.randomizedtesting.ThreadLeakControl$StatementRunner.run(ThreadLeakControl.java:367)
	at java.lang.Thread.run(Thread.java:745)
Caused by: org.apache.solr.client.solrj.impl.HttpSolrClient$RemoteSolrException: Error from server at http://127.0.0.1:33167/solr/testschemaapi_shard1_replica2: ERROR: [doc=2] unknown field 'myNewField1'
	at org.apache.solr.client.solrj.impl.HttpSolrClient.executeMethod(HttpSolrClient.java:577)
	at org.apache.solr.client.solrj.impl.HttpSolrClient.request(HttpSolrClient.java:241)
	at org.apache.solr.client.solrj.impl.HttpSolrClient.request(HttpSolrClient.java:230)
	at org.apache.solr.client.solrj.impl.LBHttpSolrClient.doRequest(LBHttpSolrClient.java:372)
	at org.apache.solr.client.solrj.impl.LBHttpSolrClient.request(LBHttpSolrClient.java:325)
	at org.apache.solr.client.solrj.impl.CloudSolrClient$2.call(CloudSolrClient.java:607)
	at org.apache.solr.client.solrj.impl.CloudSolrClient$2.call(CloudSolrClient.java:604)
	at java.util.concurrent.FutureTask.run(FutureTask.java:262)
	at org.apache.solr.common.util.ExecutorUtil$MDCAwareThreadPoolExecutor$1.run(ExecutorUtil.java:231)
	at java.util.concurrent.ThreadPoolExecutor.runWorker(ThreadPoolExecutor.java:1145)
	at java.util.concurrent.ThreadPoolExecutor$Worker.run(ThreadPoolExecutor.java:615)
	... 1 more




Build Log:
[...truncated 11322 lines...]
   [junit4] Suite: org.apache.solr.schema.TestManagedSchemaAPI
   [junit4]   2> Creating dataDir: /home/jenkins/workspace/Lucene-Solr-5.5-Linux/solr/build/solr-core/test/J0/temp/solr.schema.TestManagedSchemaAPI_9A10A170080020D0-001/init-core-data-001
   [junit4]   2> 822645 INFO  (SUITE-TestManagedSchemaAPI-seed#[9A10A170080020D0]-worker) [    ] o.a.s.SolrTestCaseJ4 Randomized ssl (false) and clientAuth (false)
   [junit4]   2> 822647 INFO  (TEST-TestManagedSchemaAPI.test-seed#[9A10A170080020D0]) [    ] o.a.s.SolrTestCaseJ4 ###Starting test
   [junit4]   2> 822647 INFO  (TEST-TestManagedSchemaAPI.test-seed#[9A10A170080020D0]) [    ] o.a.s.c.ZkTestServer STARTING ZK TEST SERVER
   [junit4]   2> 822647 INFO  (Thread-1793) [    ] o.a.s.c.ZkTestServer client port:0.0.0.0/0.0.0.0:0
   [junit4]   2> 822647 INFO  (Thread-1793) [    ] o.a.s.c.ZkTestServer Starting server
   [junit4]   2> 822747 INFO  (TEST-TestManagedSchemaAPI.test-seed#[9A10A170080020D0]) [    ] o.a.s.c.ZkTestServer start zk server on port:45674
   [junit4]   2> 822747 INFO  (TEST-TestManagedSchemaAPI.test-seed#[9A10A170080020D0]) [    ] o.a.s.c.c.SolrZkClient Using default ZkCredentialsProvider
   [junit4]   2> 822748 INFO  (TEST-TestManagedSchemaAPI.test-seed#[9A10A170080020D0]) [    ] o.a.s.c.c.ConnectionManager Waiting for client to connect to ZooKeeper
   [junit4]   2> 822749 INFO  (zkCallback-595-thread-1) [    ] o.a.s.c.c.ConnectionManager Watcher org.apache.solr.common.cloud.ConnectionManager@3ad13df3 name:ZooKeeperConnection Watcher:127.0.0.1:45674 got event WatchedEvent state:SyncConnected type:None path:null path:null type:None
   [junit4]   2> 822749 INFO  (TEST-TestManagedSchemaAPI.test-seed#[9A10A170080020D0]) [    ] o.a.s.c.c.ConnectionManager Client is connected to ZooKeeper
   [junit4]   2> 822749 INFO  (TEST-TestManagedSchemaAPI.test-seed#[9A10A170080020D0]) [    ] o.a.s.c.c.SolrZkClient Using default ZkACLProvider
   [junit4]   2> 822749 INFO  (TEST-TestManagedSchemaAPI.test-seed#[9A10A170080020D0]) [    ] o.a.s.c.c.SolrZkClient makePath: /solr/solr.xml
   [junit4]   2> 822752 INFO  (jetty-launcher-594-thread-1) [    ] o.e.j.s.Server jetty-9.2.13.v20150730
   [junit4]   2> 822752 INFO  (jetty-launcher-594-thread-2) [    ] o.e.j.s.Server jetty-9.2.13.v20150730
   [junit4]   2> 822753 INFO  (jetty-launcher-594-thread-1) [    ] o.e.j.s.h.ContextHandler Started o.e.j.s.ServletContextHandler@41c1dc07{/solr,null,AVAILABLE}
   [junit4]   2> 822753 INFO  (jetty-launcher-594-thread-2) [    ] o.e.j.s.h.ContextHandler Started o.e.j.s.ServletContextHandler@1e54714b{/solr,null,AVAILABLE}
   [junit4]   2> 822754 INFO  (jetty-launcher-594-thread-1) [    ] o.e.j.s.ServerConnector Started ServerConnector@253a473a{HTTP/1.1}{127.0.0.1:33057}
   [junit4]   2> 822754 INFO  (jetty-launcher-594-thread-2) [    ] o.e.j.s.ServerConnector Started ServerConnector@67fb77bc{HTTP/1.1}{127.0.0.1:33167}
   [junit4]   2> 822754 INFO  (jetty-launcher-594-thread-1) [    ] o.e.j.s.Server Started @824456ms
   [junit4]   2> 822754 INFO  (jetty-launcher-594-thread-2) [    ] o.e.j.s.Server Started @824456ms
   [junit4]   2> 822754 INFO  (jetty-launcher-594-thread-1) [    ] o.a.s.c.s.e.JettySolrRunner Jetty properties: {hostPort=33057, hostContext=/solr}
   [junit4]   2> 822754 INFO  (jetty-launcher-594-thread-2) [    ] o.a.s.c.s.e.JettySolrRunner Jetty properties: {hostPort=33167, hostContext=/solr}
   [junit4]   2> 822754 INFO  (jetty-launcher-594-thread-1) [    ] o.a.s.s.SolrDispatchFilter SolrDispatchFilter.init(): sun.misc.Launcher$AppClassLoader@6b482747
   [junit4]   2> 822754 INFO  (jetty-launcher-594-thread-2) [    ] o.a.s.s.SolrDispatchFilter SolrDispatchFilter.init(): sun.misc.Launcher$AppClassLoader@6b482747
   [junit4]   2> 822754 INFO  (jetty-launcher-594-thread-1) [    ] o.a.s.c.SolrResourceLoader new SolrResourceLoader for directory: '/home/jenkins/workspace/Lucene-Solr-5.5-Linux/solr/build/solr-core/test/J0/temp/solr.schema.TestManagedSchemaAPI_9A10A170080020D0-001/tempDir-001/node1'
   [junit4]   2> 822754 INFO  (jetty-launcher-594-thread-2) [    ] o.a.s.c.SolrResourceLoader new SolrResourceLoader for directory: '/home/jenkins/workspace/Lucene-Solr-5.5-Linux/solr/build/solr-core/test/J0/temp/solr.schema.TestManagedSchemaAPI_9A10A170080020D0-001/tempDir-001/node2'
   [junit4]   2> 822755 INFO  (jetty-launcher-594-thread-1) [    ] o.a.s.c.SolrResourceLoader JNDI not configured for solr (NoInitialContextEx)
   [junit4]   2> 822755 INFO  (jetty-launcher-594-thread-2) [    ] o.a.s.c.SolrResourceLoader JNDI not configured for solr (NoInitialContextEx)
   [junit4]   2> 822755 INFO  (jetty-launcher-594-thread-1) [    ] o.a.s.c.SolrResourceLoader solr home defaulted to 'solr/' (could not find system property or JNDI)
   [junit4]   2> 822755 INFO  (jetty-launcher-594-thread-2) [    ] o.a.s.c.SolrResourceLoader solr home defaulted to 'solr/' (could not find system property or JNDI)
   [junit4]   2> 822755 INFO  (jetty-launcher-594-thread-1) [    ] o.a.s.c.c.SolrZkClient Using default ZkCredentialsProvider
   [junit4]   2> 822755 INFO  (jetty-launcher-594-thread-2) [    ] o.a.s.c.c.SolrZkClient Using default ZkCredentialsProvider
   [junit4]   2> 822755 INFO  (jetty-launcher-594-thread-1) [    ] o.a.s.c.c.ConnectionManager Waiting for client to connect to ZooKeeper
   [junit4]   2> 822755 INFO  (jetty-launcher-594-thread-2) [    ] o.a.s.c.c.ConnectionManager Waiting for client to connect to ZooKeeper
   [junit4]   2> 822756 INFO  (zkCallback-596-thread-1) [    ] o.a.s.c.c.ConnectionManager Watcher org.apache.solr.common.cloud.ConnectionManager@15175cae name:ZooKeeperConnection Watcher:127.0.0.1:45674/solr got event WatchedEvent state:SyncConnected type:None path:null path:null type:None
   [junit4]   2> 822756 INFO  (jetty-launcher-594-thread-1) [    ] o.a.s.c.c.ConnectionManager Client is connected to ZooKeeper
   [junit4]   2> 822756 INFO  (zkCallback-597-thread-1) [    ] o.a.s.c.c.ConnectionManager Watcher org.apache.solr.common.cloud.ConnectionManager@69a80cc6 name:ZooKeeperConnection Watcher:127.0.0.1:45674/solr got event WatchedEvent state:SyncConnected type:None path:null path:null type:None
   [junit4]   2> 822756 INFO  (jetty-launcher-594-thread-1) [    ] o.a.s.c.c.SolrZkClient Using default ZkACLProvider
   [junit4]   2> 822756 INFO  (jetty-launcher-594-thread-2) [    ] o.a.s.c.c.ConnectionManager Client is connected to ZooKeeper
   [junit4]   2> 822757 INFO  (jetty-launcher-594-thread-2) [    ] o.a.s.c.c.SolrZkClient Using default ZkACLProvider
   [junit4]   2> 822757 INFO  (jetty-launcher-594-thread-1) [    ] o.a.s.s.SolrDispatchFilter solr.xml found in ZooKeeper. Loading...
   [junit4]   2> 822757 INFO  (jetty-launcher-594-thread-2) [    ] o.a.s.s.SolrDispatchFilter solr.xml found in ZooKeeper. Loading...
   [junit4]   2> 822772 INFO  (jetty-launcher-594-thread-2) [    ] o.a.s.c.CorePropertiesLocator Config-defined core root directory: /home/jenkins/workspace/Lucene-Solr-5.5-Linux/solr/build/solr-core/test/J0/temp/solr.schema.TestManagedSchemaAPI_9A10A170080020D0-001/tempDir-001/node2/.
   [junit4]   2> 822772 INFO  (jetty-launcher-594-thread-1) [    ] o.a.s.c.CorePropertiesLocator Config-defined core root directory: /home/jenkins/workspace/Lucene-Solr-5.5-Linux/solr/build/solr-core/test/J0/temp/solr.schema.TestManagedSchemaAPI_9A10A170080020D0-001/tempDir-001/node1/.
   [junit4]   2> 822772 WARN  (NIOServerCxn.Factory:0.0.0.0/0.0.0.0:0) [    ] o.a.z.s.NIOServerCnxn caught end of stream exception
   [junit4]   2> EndOfStreamException: Unable to read additional data from client sessionid 0x15572ffb1300001, likely client has closed socket
   [junit4]   2> 	at org.apache.zookeeper.server.NIOServerCnxn.doIO(NIOServerCnxn.java:228)
   [junit4]   2> 	at org.apache.zookeeper.server.NIOServerCnxnFactory.run(NIOServerCnxnFactory.java:208)
   [junit4]   2> 	at java.lang.Thread.run(Thread.java:745)
   [junit4]   2> 822772 INFO  (jetty-launcher-594-thread-1) [    ] o.a.s.c.CoreContainer New CoreContainer 752840799
   [junit4]   2> 822772 INFO  (jetty-launcher-594-thread-2) [    ] o.a.s.c.CoreContainer New CoreContainer 1862594274
   [junit4]   2> 822772 INFO  (jetty-launcher-594-thread-1) [    ] o.a.s.c.CoreContainer Loading cores into CoreContainer [instanceDir=/home/jenkins/workspace/Lucene-Solr-5.5-Linux/solr/build/solr-core/test/J0/temp/solr.schema.TestManagedSchemaAPI_9A10A170080020D0-001/tempDir-001/node1]
   [junit4]   2> 822772 INFO  (jetty-launcher-594-thread-2) [    ] o.a.s.c.CoreContainer Loading cores into CoreContainer [instanceDir=/home/jenkins/workspace/Lucene-Solr-5.5-Linux/solr/build/solr-core/test/J0/temp/solr.schema.TestManagedSchemaAPI_9A10A170080020D0-001/tempDir-001/node2]
   [junit4]   2> 822773 WARN  (jetty-launcher-594-thread-1) [    ] o.a.s.c.CoreContainer Couldn't add files from /home/jenkins/workspace/Lucene-Solr-5.5-Linux/solr/build/solr-core/test/J0/temp/solr.schema.TestManagedSchemaAPI_9A10A170080020D0-001/tempDir-001/node1/lib to classpath: /home/jenkins/workspace/Lucene-Solr-5.5-Linux/solr/build/solr-core/test/J0/temp/solr.schema.TestManagedSchemaAPI_9A10A170080020D0-001/tempDir-001/node1/lib
   [junit4]   2> 822773 WARN  (jetty-launcher-594-thread-2) [    ] o.a.s.c.CoreContainer Couldn't add files from /home/jenkins/workspace/Lucene-Solr-5.5-Linux/solr/build/solr-core/test/J0/temp/solr.schema.TestManagedSchemaAPI_9A10A170080020D0-001/tempDir-001/node2/lib to classpath: /home/jenkins/workspace/Lucene-Solr-5.5-Linux/solr/build/solr-core/test/J0/temp/solr.schema.TestManagedSchemaAPI_9A10A170080020D0-001/tempDir-001/node2/lib
   [junit4]   2> 822773 INFO  (jetty-launcher-594-thread-1) [    ] o.a.s.h.c.HttpShardHandlerFactory created with socketTimeout : 90000,urlScheme : ,connTimeout : 15000,maxConnectionsPerHost : 20,maxConnections : 10000,corePoolSize : 0,maximumPoolSize : 2147483647,maxThreadIdleTime : 5,sizeOfQueue : -1,fairnessPolicy : false,useRetries : false,
   [junit4]   2> 822773 INFO  (jetty-launcher-594-thread-2) [    ] o.a.s.h.c.HttpShardHandlerFactory created with socketTimeout : 90000,urlScheme : ,connTimeout : 15000,maxConnectionsPerHost : 20,maxConnections : 10000,corePoolSize : 0,maximumPoolSize : 2147483647,maxThreadIdleTime : 5,sizeOfQueue : -1,fairnessPolicy : false,useRetries : false,
   [junit4]   2> 822774 INFO  (jetty-launcher-594-thread-1) [    ] o.a.s.u.UpdateShardHandler Creating UpdateShardHandler HTTP client with params: socketTimeout=340000&connTimeout=45000&retry=true
   [junit4]   2> 822774 INFO  (jetty-launcher-594-thread-2) [    ] o.a.s.u.UpdateShardHandler Creating UpdateShardHandler HTTP client with params: socketTimeout=340000&connTimeout=45000&retry=true
   [junit4]   2> 822774 INFO  (jetty-launcher-594-thread-2) [    ] o.a.s.l.LogWatcher SLF4J impl is org.slf4j.impl.Log4jLoggerFactory
   [junit4]   2> 822774 INFO  (jetty-launcher-594-thread-1) [    ] o.a.s.l.LogWatcher SLF4J impl is org.slf4j.impl.Log4jLoggerFactory
   [junit4]   2> 822774 INFO  (jetty-launcher-594-thread-2) [    ] o.a.s.l.LogWatcher Registering Log Listener [Log4j (org.slf4j.impl.Log4jLoggerFactory)]
   [junit4]   2> 822774 INFO  (jetty-launcher-594-thread-1) [    ] o.a.s.l.LogWatcher Registering Log Listener [Log4j (org.slf4j.impl.Log4jLoggerFactory)]
   [junit4]   2> 822775 INFO  (jetty-launcher-594-thread-2) [    ] o.a.s.c.ZkContainer Zookeeper client=127.0.0.1:45674/solr
   [junit4]   2> 822775 INFO  (jetty-launcher-594-thread-1) [    ] o.a.s.c.ZkContainer Zookeeper client=127.0.0.1:45674/solr
   [junit4]   2> 822775 INFO  (jetty-launcher-594-thread-2) [    ] o.a.s.c.ZkController zkHost includes chroot
   [junit4]   2> 822775 INFO  (jetty-launcher-594-thread-1) [    ] o.a.s.c.ZkController zkHost includes chroot
   [junit4]   2> 822775 INFO  (jetty-launcher-594-thread-2) [    ] o.a.s.c.c.SolrZkClient Using default ZkCredentialsProvider
   [junit4]   2> 822775 INFO  (jetty-launcher-594-thread-1) [    ] o.a.s.c.c.SolrZkClient Using default ZkCredentialsProvider
   [junit4]   2> 822775 INFO  (jetty-launcher-594-thread-1) [    ] o.a.s.c.c.ConnectionManager Waiting for client to connect to ZooKeeper
   [junit4]   2> 822775 INFO  (jetty-launcher-594-thread-2) [    ] o.a.s.c.c.ConnectionManager Waiting for client to connect to ZooKeeper
   [junit4]   2> 822776 INFO  (zkCallback-603-thread-1) [    ] o.a.s.c.c.ConnectionManager Watcher org.apache.solr.common.cloud.ConnectionManager@399c1561 name:ZooKeeperConnection Watcher:127.0.0.1:45674 got event WatchedEvent state:SyncConnected type:None path:null path:null type:None
   [junit4]   2> 822776 INFO  (jetty-launcher-594-thread-1) [    ] o.a.s.c.c.ConnectionManager Client is connected to ZooKeeper
   [junit4]   2> 822776 INFO  (zkCallback-602-thread-1) [    ] o.a.s.c.c.ConnectionManager Watcher org.apache.solr.common.cloud.ConnectionManager@769d43c9 name:ZooKeeperConnection Watcher:127.0.0.1:45674 got event WatchedEvent state:SyncConnected type:None path:null path:null type:None
   [junit4]   2> 822776 INFO  (jetty-launcher-594-thread-1) [    ] o.a.s.c.c.SolrZkClient Using default ZkACLProvider
   [junit4]   2> 822776 INFO  (jetty-launcher-594-thread-2) [    ] o.a.s.c.c.ConnectionManager Client is connected to ZooKeeper
   [junit4]   2> 822777 INFO  (jetty-launcher-594-thread-2) [    ] o.a.s.c.c.SolrZkClient Using default ZkACLProvider
   [junit4]   2> 822777 INFO  (jetty-launcher-594-thread-1) [n:127.0.0.1:33057_solr    ] o.a.s.c.ZkController Added new OnReconnect listener org.apache.solr.cloud.ZkController$6@5ecc3548
   [junit4]   2> 822777 INFO  (jetty-launcher-594-thread-2) [n:127.0.0.1:33167_solr    ] o.a.s.c.ZkController Added new OnReconnect listener org.apache.solr.cloud.ZkController$6@4762bbba
   [junit4]   2> 822777 INFO  (jetty-launcher-594-thread-1) [n:127.0.0.1:33057_solr    ] o.a.s.c.c.ConnectionManager Waiting for client to connect to ZooKeeper
   [junit4]   2> 822778 INFO  (jetty-launcher-594-thread-2) [n:127.0.0.1:33167_solr    ] o.a.s.c.c.ConnectionManager Waiting for client to connect to ZooKeeper
   [junit4]   2> 822778 INFO  (zkCallback-604-thread-1-processing-n:127.0.0.1:33057_solr) [n:127.0.0.1:33057_solr    ] o.a.s.c.c.ConnectionManager Watcher org.apache.solr.common.cloud.ConnectionManager@1add6005 name:ZooKeeperConnection Watcher:127.0.0.1:45674/solr got event WatchedEvent state:SyncConnected type:None path:null path:null type:None
   [junit4]   2> 822778 INFO  (jetty-launcher-594-thread-1) [n:127.0.0.1:33057_solr    ] o.a.s.c.c.ConnectionManager Client is connected to ZooKeeper
   [junit4]   2> 822778 INFO  (zkCallback-605-thread-1-processing-n:127.0.0.1:33167_solr) [n:127.0.0.1:33167_solr    ] o.a.s.c.c.ConnectionManager Watcher org.apache.solr.common.cloud.ConnectionManager@9df2931 name:ZooKeeperConnection Watcher:127.0.0.1:45674/solr got event WatchedEvent state:SyncConnected type:None path:null path:null type:None
   [junit4]   2> 822778 INFO  (jetty-launcher-594-thread-2) [n:127.0.0.1:33167_solr    ] o.a.s.c.c.ConnectionManager Client is connected to ZooKeeper
   [junit4]   2> 822779 INFO  (jetty-launcher-594-thread-1) [n:127.0.0.1:33057_solr    ] o.a.s.c.c.SolrZkClient makePath: /overseer/queue
   [junit4]   2> 822779 INFO  (jetty-launcher-594-thread-2) [n:127.0.0.1:33167_solr    ] o.a.s.c.c.SolrZkClient makePath: /overseer/queue
   [junit4]   2> 822779 INFO  (jetty-launcher-594-thread-2) [n:127.0.0.1:33167_solr    ] o.a.s.c.c.SolrZkClient makePath: /overseer/collection-queue-work
   [junit4]   2> 822781 INFO  (jetty-launcher-594-thread-1) [n:127.0.0.1:33057_solr    ] o.a.s.c.c.SolrZkClient makePath: /overseer/collection-queue-work
   [junit4]   2> 822781 INFO  (jetty-launcher-594-thread-1) [n:127.0.0.1:33057_solr    ] o.a.s.c.c.SolrZkClient makePath: /overseer/collection-map-running
   [junit4]   2> 822781 INFO  (jetty-launcher-594-thread-2) [n:127.0.0.1:33167_solr    ] o.a.s.c.c.SolrZkClient makePath: /overseer/collection-map-running
   [junit4]   2> 822782 INFO  (jetty-launcher-594-thread-1) [n:127.0.0.1:33057_solr    ] o.a.s.c.c.SolrZkClient makePath: /overseer/collection-map-completed
   [junit4]   2> 822782 INFO  (jetty-launcher-594-thread-2) [n:127.0.0.1:33167_solr    ] o.a.s.c.c.SolrZkClient makePath: /overseer/collection-map-completed
   [junit4]   2> 822783 INFO  (jetty-launcher-594-thread-2) [n:127.0.0.1:33167_solr    ] o.a.s.c.c.SolrZkClient makePath: /overseer/collection-map-failure
   [junit4]   2> 822783 INFO  (jetty-launcher-594-thread-1) [n:127.0.0.1:33057_solr    ] o.a.s.c.c.SolrZkClient makePath: /overseer/collection-map-failure
   [junit4]   2> 822783 INFO  (jetty-launcher-594-thread-1) [n:127.0.0.1:33057_solr    ] o.a.s.c.c.SolrZkClient makePath: /live_nodes
   [junit4]   2> 822783 INFO  (jetty-launcher-594-thread-2) [n:127.0.0.1:33167_solr    ] o.a.s.c.c.SolrZkClient makePath: /live_nodes
   [junit4]   2> 822784 INFO  (jetty-launcher-594-thread-2) [n:127.0.0.1:33167_solr    ] o.a.s.c.c.SolrZkClient makePath: /collections
   [junit4]   2> 822784 INFO  (jetty-launcher-594-thread-1) [n:127.0.0.1:33057_solr    ] o.a.s.c.c.SolrZkClient makePath: /collections
   [junit4]   2> 822784 INFO  (jetty-launcher-594-thread-1) [n:127.0.0.1:33057_solr    ] o.a.s.c.c.SolrZkClient makePath: /aliases.json
   [junit4]   2> 822784 INFO  (jetty-launcher-594-thread-2) [n:127.0.0.1:33167_solr    ] o.a.s.c.c.SolrZkClient makePath: /aliases.json
   [junit4]   2> 822784 INFO  (jetty-launcher-594-thread-2) [n:127.0.0.1:33167_solr    ] o.a.s.c.c.SolrZkClient makePath: /clusterstate.json
   [junit4]   2> 822784 INFO  (jetty-launcher-594-thread-1) [n:127.0.0.1:33057_solr    ] o.a.s.c.c.SolrZkClient makePath: /clusterstate.json
   [junit4]   2> 822785 INFO  (jetty-launcher-594-thread-1) [n:127.0.0.1:33057_solr    ] o.a.s.c.c.SolrZkClient makePath: /security.json
   [junit4]   2> 822785 INFO  (jetty-launcher-594-thread-2) [n:127.0.0.1:33167_solr    ] o.a.s.c.c.SolrZkClient makePath: /security.json
   [junit4]   2> 822785 INFO  (jetty-launcher-594-thread-2) [n:127.0.0.1:33167_solr    ] o.a.s.c.ZkController Register node as live in ZooKeeper:/live_nodes/127.0.0.1:33167_solr
   [junit4]   2> 822785 INFO  (jetty-launcher-594-thread-1) [n:127.0.0.1:33057_solr    ] o.a.s.c.ZkController Register node as live in ZooKeeper:/live_nodes/127.0.0.1:33057_solr
   [junit4]   2> 822785 INFO  (jetty-launcher-594-thread-2) [n:127.0.0.1:33167_solr    ] o.a.s.c.c.SolrZkClient makePath: /live_nodes/127.0.0.1:33167_solr
   [junit4]   2> 822785 INFO  (jetty-launcher-594-thread-1) [n:127.0.0.1:33057_solr    ] o.a.s.c.c.SolrZkClient makePath: /live_nodes/127.0.0.1:33057_solr
   [junit4]   2> 822785 INFO  (jetty-launcher-594-thread-2) [n:127.0.0.1:33167_solr    ] o.a.s.c.c.SolrZkClient makePath: /overseer_elect
   [junit4]   2> 822786 INFO  (jetty-launcher-594-thread-1) [n:127.0.0.1:33057_solr    ] o.a.s.c.c.SolrZkClient makePath: /overseer_elect
   [junit4]   2> 822786 INFO  (jetty-launcher-594-thread-1) [n:127.0.0.1:33057_solr    ] o.a.s.c.c.SolrZkClient makePath: /overseer_elect/election
   [junit4]   2> 822786 INFO  (jetty-launcher-594-thread-2) [n:127.0.0.1:33167_solr    ] o.a.s.c.c.SolrZkClient makePath: /overseer_elect/election
   [junit4]   2> 822786 INFO  (jetty-launcher-594-thread-2) [n:127.0.0.1:33167_solr    ] o.a.s.c.Overseer Overseer (id=null) closing
   [junit4]   2> 822786 INFO  (jetty-launcher-594-thread-1) [n:127.0.0.1:33057_solr    ] o.a.s.c.Overseer Overseer (id=null) closing
   [junit4]   2> 822786 INFO  (jetty-launcher-594-thread-2) [n:127.0.0.1:33167_solr    ] o.a.s.c.LeaderElector Joined leadership election with path: /overseer_elect/election/96109409573273606-127.0.0.1:33167_solr-n_0000000000
   [junit4]   2> 822786 INFO  (jetty-launcher-594-thread-1) [n:127.0.0.1:33057_solr    ] o.a.s.c.LeaderElector Joined leadership election with path: /overseer_elect/election/96109409573273605-127.0.0.1:33057_solr-n_0000000001
   [junit4]   2> 822786 INFO  (jetty-launcher-594-thread-2) [n:127.0.0.1:33167_solr    ] o.a.s.c.OverseerElectionContext I am going to be the leader 127.0.0.1:33167_solr
   [junit4]   2> 822787 INFO  (jetty-launcher-594-thread-2) [n:127.0.0.1:33167_solr    ] o.a.s.c.c.SolrZkClient makePath: /overseer_elect/leader
   [junit4]   2> 822787 INFO  (jetty-launcher-594-thread-1) [n:127.0.0.1:33057_solr    ] o.a.s.c.LeaderElector Watching path /overseer_elect/election/96109409573273606-127.0.0.1:33167_solr-n_0000000000 to know if I could be the leader
   [junit4]   2> 822787 INFO  (jetty-launcher-594-thread-1) [n:127.0.0.1:33057_solr    ] o.a.s.c.c.ZkStateReader Updating cluster state from ZooKeeper... 
   [junit4]   2> 822787 INFO  (jetty-launcher-594-thread-2) [n:127.0.0.1:33167_solr    ] o.a.s.c.Overseer Overseer (id=96109409573273606-127.0.0.1:33167_solr-n_0000000000) starting
   [junit4]   2> 822787 INFO  (jetty-launcher-594-thread-2) [n:127.0.0.1:33167_solr    ] o.a.s.c.c.SolrZkClient makePath: /overseer/queue-work
   [junit4]   2> 822789 INFO  (jetty-launcher-594-thread-2) [n:127.0.0.1:33167_solr    ] o.a.s.c.OverseerAutoReplicaFailoverThread Starting OverseerAutoReplicaFailoverThread autoReplicaFailoverWorkLoopDelay=10000 autoReplicaFailoverWaitAfterExpiration=30000 autoReplicaFailoverBadNodeExpiration=60000
   [junit4]   2> 822789 INFO  (OverseerCollectionConfigSetProcessor-96109409573273606-127.0.0.1:33167_solr-n_0000000000) [n:127.0.0.1:33167_solr    ] o.a.s.c.OverseerTaskProcessor Process current queue of overseer operations
   [junit4]   2> 822789 INFO  (jetty-launcher-594-thread-2) [n:127.0.0.1:33167_solr    ] o.a.s.c.c.ZkStateReader Updating cluster state from ZooKeeper... 
   [junit4]   2> 822789 INFO  (OverseerStateUpdate-96109409573273606-127.0.0.1:33167_solr-n_0000000000) [n:127.0.0.1:33167_solr    ] o.a.s.c.Overseer Starting to work on the main queue
   [junit4]   2> 822804 INFO  (jetty-launcher-594-thread-2) [n:127.0.0.1:33167_solr    ] o.a.s.c.CoreContainer Security conf doesn't exist. Skipping setup for authorization module.
   [junit4]   2> 822804 INFO  (jetty-launcher-594-thread-2) [n:127.0.0.1:33167_solr    ] o.a.s.c.CoreContainer No authentication plugin used.
   [junit4]   2> 822805 INFO  (jetty-launcher-594-thread-2) [n:127.0.0.1:33167_solr    ] o.a.s.c.CorePropertiesLocator Looking for core definitions underneath /home/jenkins/workspace/Lucene-Solr-5.5-Linux/solr/build/solr-core/test/J0/temp/solr.schema.TestManagedSchemaAPI_9A10A170080020D0-001/tempDir-001/node2/.
   [junit4]   2> 822805 INFO  (jetty-launcher-594-thread-2) [n:127.0.0.1:33167_solr    ] o.a.s.c.CorePropertiesLocator Found 0 core definitions
   [junit4]   2> 822805 INFO  (jetty-launcher-594-thread-2) [n:127.0.0.1:33167_solr    ] o.a.s.s.SolrDispatchFilter user.dir=/home/jenkins/workspace/Lucene-Solr-5.5-Linux/solr/build/solr-core/test/J0
   [junit4]   2> 822805 INFO  (jetty-launcher-594-thread-2) [n:127.0.0.1:33167_solr    ] o.a.s.s.SolrDispatchFilter SolrDispatchFilter.init() done
   [junit4]   2> 822809 INFO  (jetty-launcher-594-thread-1) [n:127.0.0.1:33057_solr    ] o.a.s.c.CoreContainer Security conf doesn't exist. Skipping setup for authorization module.
   [junit4]   2> 822809 INFO  (jetty-launcher-594-thread-1) [n:127.0.0.1:33057_solr    ] o.a.s.c.CoreContainer No authentication plugin used.
   [junit4]   2> 822809 INFO  (jetty-launcher-594-thread-1) [n:127.0.0.1:33057_solr    ] o.a.s.c.CorePropertiesLocator Looking for core definitions underneath /home/jenkins/workspace/Lucene-Solr-5.5-Linux/solr/build/solr-core/test/J0/temp/solr.schema.TestManagedSchemaAPI_9A10A170080020D0-001/tempDir-001/node1/.
   [junit4]   2> 822810 INFO  (jetty-launcher-594-thread-1) [n:127.0.0.1:33057_solr    ] o.a.s.c.CorePropertiesLocator Found 0 core definitions
   [junit4]   2> 822810 INFO  (jetty-launcher-594-thread-1) [n:127.0.0.1:33057_solr    ] o.a.s.s.SolrDispatchFilter user.dir=/home/jenkins/workspace/Lucene-Solr-5.5-Linux/solr/build/solr-core/test/J0
   [junit4]   2> 822810 INFO  (jetty-launcher-594-thread-1) [n:127.0.0.1:33057_solr    ] o.a.s.s.SolrDispatchFilter SolrDispatchFilter.init() done
   [junit4]   2> 822810 INFO  (TEST-TestManagedSchemaAPI.test-seed#[9A10A170080020D0]) [    ] o.a.s.c.c.SolrZkClient Using default ZkCredentialsProvider
   [junit4]   2> 822810 INFO  (TEST-TestManagedSchemaAPI.test-seed#[9A10A170080020D0]) [    ] o.a.s.c.c.ConnectionManager Waiting for client to connect to ZooKeeper
   [junit4]   2> 822811 INFO  (zkCallback-606-thread-1) [    ] o.a.s.c.c.ConnectionManager Watcher org.apache.solr.common.cloud.ConnectionManager@37660fc7 name:ZooKeeperConnection Watcher:127.0.0.1:45674 got event WatchedEvent state:SyncConnected type:None path:null path:null type:None
   [junit4]   2> 822811 INFO  (TEST-TestManagedSchemaAPI.test-seed#[9A10A170080020D0]) [    ] o.a.s.c.c.ConnectionManager Client is connected to ZooKeeper
   [junit4]   2> 822811 INFO  (TEST-TestManagedSchemaAPI.test-seed#[9A10A170080020D0]) [    ] o.a.s.c.c.SolrZkClient Using default ZkACLProvider
   [junit4]   2> 822812 INFO  (TEST-TestManagedSchemaAPI.test-seed#[9A10A170080020D0]) [    ] o.a.s.c.c.SolrZkClient Using default ZkCredentialsProvider
   [junit4]   2> 822813 INFO  (TEST-TestManagedSchemaAPI.test-seed#[9A10A170080020D0]) [    ] o.a.s.c.c.ConnectionManager Waiting for client to connect to ZooKeeper
   [junit4]   2> 822813 INFO  (zkCallback-608-thread-1) [    ] o.a.s.c.c.ConnectionManager Watcher org.apache.solr.common.cloud.ConnectionManager@2e85065f name:ZooKeeperConnection Watcher:127.0.0.1:45674/solr got event WatchedEvent state:SyncConnected type:None path:null path:null type:None
   [junit4]   2> 822813 INFO  (TEST-TestManagedSchemaAPI.test-seed#[9A10A170080020D0]) [    ] o.a.s.c.c.ConnectionManager Client is connected to ZooKeeper
   [junit4]   2> 822814 INFO  (TEST-TestManagedSchemaAPI.test-seed#[9A10A170080020D0]) [    ] o.a.s.c.c.SolrZkClient Using default ZkACLProvider
   [junit4]   2> 822814 INFO  (TEST-TestManagedSchemaAPI.test-seed#[9A10A170080020D0]) [    ] o.a.s.c.c.SolrZkClient makePath: /configs/conf1/solrconfig.xml
   [junit4]   2> 822815 INFO  (TEST-TestManagedSchemaAPI.test-seed#[9A10A170080020D0]) [    ] o.a.s.c.c.SolrZkClient makePath: /configs/conf1/managed-schema
   [junit4]   2> 822817 INFO  (TEST-TestManagedSchemaAPI.test-seed#[9A10A170080020D0]) [    ] o.a.s.c.c.SolrZkClient Using default ZkCredentialsProvider
   [junit4]   2> 822817 INFO  (TEST-TestManagedSchemaAPI.test-seed#[9A10A170080020D0]) [    ] o.a.s.c.c.ConnectionManager Waiting for client to connect to ZooKeeper
   [junit4]   2> 822818 INFO  (zkCallback-609-thread-1) [    ] o.a.s.c.c.ConnectionManager Watcher org.apache.solr.common.cloud.ConnectionManager@afa63d2 name:ZooKeeperConnection Watcher:127.0.0.1:45674/solr got event WatchedEvent state:SyncConnected type:None path:null path:null type:None
   [junit4]   2> 822818 INFO  (TEST-TestManagedSchemaAPI.test-seed#[9A10A170080020D0]) [    ] o.a.s.c.c.ConnectionManager Client is connected to ZooKeeper
   [junit4]   2> 822818 INFO  (TEST-TestManagedSchemaAPI.test-seed#[9A10A170080020D0]) [    ] o.a.s.c.c.SolrZkClient Using default ZkACLProvider
   [junit4]   2> 822818 INFO  (TEST-TestManagedSchemaAPI.test-seed#[9A10A170080020D0]) [    ] o.a.s.c.c.ZkStateReader Updating cluster state from ZooKeeper... 
   [junit4]   2> 822820 INFO  (qtp821035710-4642) [n:127.0.0.1:33167_solr    ] o.a.s.h.a.CollectionsHandler Invoked Collection Action :create with params name=testschemaapi&wt=javabin&version=2&replicationFactor=2&numShards=1&collection.configName=conf1&action=CREATE and sendToOCPQueue=true
   [junit4]   2> 822821 INFO  (OverseerCollectionConfigSetProcessor-96109409573273606-127.0.0.1:33167_solr-n_0000000000) [n:127.0.0.1:33167_solr    ] o.a.s.c.OverseerTaskProcessor Overseer Collection Message Handler: Get the message id:/overseer/collection-queue-work/qn-0000000000 message:{
   [junit4]   2>   "name":"testschemaapi",
   [junit4]   2>   "fromApi":"true",
   [junit4]   2>   "replicationFactor":"2",
   [junit4]   2>   "collection.configName":"conf1",
   [junit4]   2>   "numShards":"1",
   [junit4]   2>   "stateFormat":"2",
   [junit4]   2>   "operation":"create"}
   [junit4]   2> 822822 INFO  (OverseerThreadFactory-2011-thread-1-processing-n:127.0.0.1:33167_solr) [n:127.0.0.1:33167_solr    ] o.a.s.c.OverseerCollectionMessageHandler OverseerCollectionMessageHandler.processMessage : create , {
   [junit4]   2>   "name":"testschemaapi",
   [junit4]   2>   "fromApi":"true",
   [junit4]   2>   "replicationFactor":"2",
   [junit4]   2>   "collection.configName":"conf1",
   [junit4]   2>   "numShards":"1",
   [junit4]   2>   "stateFormat":"2",
   [junit4]   2>   "operation":"create"}
   [junit4]   2> 822822 INFO  (OverseerThreadFactory-2011-thread-1-processing-n:127.0.0.1:33167_solr) [n:127.0.0.1:33167_solr    ] o.a.s.c.OverseerCollectionMessageHandler Create collection testschemaapi
   [junit4]   2> 822822 INFO  (OverseerThreadFactory-2011-thread-1-processing-n:127.0.0.1:33167_solr) [n:127.0.0.1:33167_solr    ] o.a.s.c.OverseerCollectionMessageHandler creating collections conf node /collections/testschemaapi 
   [junit4]   2> 822822 INFO  (OverseerThreadFactory-2011-thread-1-processing-n:127.0.0.1:33167_solr) [n:127.0.0.1:33167_solr    ] o.a.s.c.c.SolrZkClient makePath: /collections/testschemaapi
   [junit4]   2> 822823 INFO  (zkCallback-609-thread-1) [    ] o.a.s.c.c.ZkStateReader A collections change: [WatchedEvent state:SyncConnected type:NodeChildrenChanged path:/collections], has occurred - updating...
   [junit4]   2> 822823 INFO  (zkCallback-605-thread-1-processing-n:127.0.0.1:33167_solr) [n:127.0.0.1:33167_solr    ] o.a.s.c.c.ZkStateReader A collections change: [WatchedEvent state:SyncConnected type:NodeChildrenChanged path:/collections], has occurred - updating...
   [junit4]   2> 822823 INFO  (zkCallback-604-thread-1-processing-n:127.0.0.1:33057_solr) [n:127.0.0.1:33057_solr    ] o.a.s.c.c.ZkStateReader A collections change: [WatchedEvent state:SyncConnected type:NodeChildrenChanged path:/collections], has occurred - updating...
   [junit4]   2> 822824 INFO  (OverseerStateUpdate-96109409573273606-127.0.0.1:33167_solr-n_0000000000) [n:127.0.0.1:33167_solr    ] o.a.s.c.Overseer processMessage: queueSize: 1, message = {
   [junit4]   2>   "name":"testschemaapi",
   [junit4]   2>   "fromApi":"true",
   [junit4]   2>   "replicationFactor":"2",
   [junit4]   2>   "collection.configName":"conf1",
   [junit4]   2>   "numShards":"1",
   [junit4]   2>   "stateFormat":"2",
   [junit4]   2>   "operation":"create"} current state version: 0
   [junit4]   2> 822824 INFO  (OverseerStateUpdate-96109409573273606-127.0.0.1:33167_solr-n_0000000000) [n:127.0.0.1:33167_solr    ] o.a.s.c.o.ClusterStateMutator building a new cName: testschemaapi
   [junit4]   2> 822824 INFO  (OverseerStateUpdate-96109409573273606-127.0.0.1:33167_solr-n_0000000000) [n:127.0.0.1:33167_solr    ] o.a.s.c.o.ZkStateWriter going to create_collection /collections/testschemaapi/state.json
   [junit4]   2> 822924 INFO  (OverseerThreadFactory-2011-thread-1-processing-n:127.0.0.1:33167_solr) [n:127.0.0.1:33167_solr    ] o.a.s.c.OverseerCollectionMessageHandler Creating SolrCores for new collection testschemaapi, shardNames [shard1] , replicationFactor : 2
   [junit4]   2> 822924 INFO  (OverseerThreadFactory-2011-thread-1-processing-n:127.0.0.1:33167_solr) [n:127.0.0.1:33167_solr    ] o.a.s.c.OverseerCollectionMessageHandler Creating core testschemaapi_shard1_replica2 as part of shard shard1 of collection testschemaapi on 127.0.0.1:33167_solr
   [junit4]   2> 822925 INFO  (OverseerThreadFactory-2011-thread-1-processing-n:127.0.0.1:33167_solr) [n:127.0.0.1:33167_solr    ] o.a.s.c.OverseerCollectionMessageHandler Creating core testschemaapi_shard1_replica1 as part of shard shard1 of collection testschemaapi on 127.0.0.1:33057_solr
   [junit4]   2> 822926 INFO  (qtp821035710-4644) [n:127.0.0.1:33167_solr    ] o.a.s.h.a.CoreAdminOperation core create command name=testschemaapi_shard1_replica2&wt=javabin&version=2&shard=shard1&numShards=1&qt=/admin/cores&action=CREATE&collection.configName=conf1&collection=testschemaapi
   [junit4]   2> 822926 INFO  (qtp821035710-4644) [n:127.0.0.1:33167_solr    ] o.a.s.c.CoreDescriptor Created CoreDescriptor: {schema=schema.xml, configSetProperties=configsetprops.json, loadOnStartup=true, name=testschemaapi_shard1_replica2, collection=testschemaapi, collection.configName=conf1, shard=shard1, dataDir=data/, config=solrconfig.xml, transient=false, numShards=1}
   [junit4]   2> 822926 INFO  (qtp1480556557-4641) [n:127.0.0.1:33057_solr    ] o.a.s.h.a.CoreAdminOperation core create command name=testschemaapi_shard1_replica1&wt=javabin&version=2&shard=shard1&numShards=1&qt=/admin/cores&action=CREATE&collection.configName=conf1&collection=testschemaapi
   [junit4]   2> 822927 INFO  (qtp1480556557-4641) [n:127.0.0.1:33057_solr    ] o.a.s.c.CoreDescriptor Created CoreDescriptor: {collection=testschemaapi, loadOnStartup=true, name=testschemaapi_shard1_replica1, shard=shard1, config=solrconfig.xml, transient=false, collection.configName=conf1, numShards=1, schema=schema.xml, configSetProperties=configsetprops.json, dataDir=data/}
   [junit4]   2> 822927 INFO  (qtp821035710-4644) [n:127.0.0.1:33167_solr c:testschemaapi s:shard1  x:testschemaapi_shard1_replica2] o.a.s.c.ZkController publishing state=down
   [junit4]   2> 822927 INFO  (qtp1480556557-4641) [n:127.0.0.1:33057_solr c:testschemaapi s:shard1  x:testschemaapi_shard1_replica1] o.a.s.c.ZkController publishing state=down
   [junit4]   2> 822927 INFO  (qtp821035710-4644) [n:127.0.0.1:33167_solr c:testschemaapi s:shard1  x:testschemaapi_shard1_replica2] o.a.s.c.ZkController Registering watch for collection testschemaapi
   [junit4]   2> 822927 INFO  (qtp821035710-4644) [n:127.0.0.1:33167_solr c:testschemaapi s:shard1  x:testschemaapi_shard1_replica2] o.a.s.c.c.ZkStateReader addZkWatch [testschemaapi]
   [junit4]   2> 822928 INFO  (OverseerStateUpdate-96109409573273606-127.0.0.1:33167_solr-n_0000000000) [n:127.0.0.1:33167_solr    ] o.a.s.c.Overseer processMessage: queueSize: 1, message = {
   [junit4]   2>   "state":"down",
   [junit4]   2>   "roles":null,
   [junit4]   2>   "core":"testschemaapi_shard1_replica2",
   [junit4]   2>   "base_url":"http://127.0.0.1:33167/solr",
   [junit4]   2>   "operation":"state",
   [junit4]   2>   "numShards":"1",
   [junit4]   2>   "shard":"shard1",
   [junit4]   2>   "node_name":"127.0.0.1:33167_solr",
   [junit4]   2>   "collection":"testschemaapi"} current state version: 0
   [junit4]   2> 822928 INFO  (qtp821035710-4644) [n:127.0.0.1:33167_solr c:testschemaapi s:shard1  x:testschemaapi_shard1_replica2] o.a.s.c.c.ZkStateReader Add data for [testschemaapi] ver [0]
   [junit4]   2> 822928 INFO  (qtp1480556557-4641) [n:127.0.0.1:33057_solr c:testschemaapi s:shard1  x:testschemaapi_shard1_replica1] o.a.s.c.ZkController Registering watch for collection testschemaapi
   [junit4]   2> 822928 INFO  (qtp821035710-4644) [n:127.0.0.1:33167_solr c:testschemaapi s:shard1  x:testschemaapi_shard1_replica2] o.a.s.c.ZkController look for our core node name
   [junit4]   2> 822928 INFO  (qtp1480556557-4641) [n:127.0.0.1:33057_solr c:testschemaapi s:shard1  x:testschemaapi_shard1_replica1] o.a.s.c.c.ZkStateReader addZkWatch [testschemaapi]
   [junit4]   2> 822928 INFO  (OverseerStateUpdate-96109409573273606-127.0.0.1:33167_solr-n_0000000000) [n:127.0.0.1:33167_solr    ] o.a.s.c.o.ReplicaMutator Update state numShards=1 message={
   [junit4]   2>   "state":"down",
   [junit4]   2>   "roles":null,
   [junit4]   2>   "core":"testschemaapi_shard1_replica2",
   [junit4]   2>   "base_url":"http://127.0.0.1:33167/solr",
   [junit4]   2>   "operation":"state",
   [junit4]   2>   "numShards":"1",
   [junit4]   2>   "shard":"shard1",
   [junit4]   2>   "node_name":"127.0.0.1:33167_solr",
   [junit4]   2>   "collection":"testschemaapi"}
   [junit4]   2> 822928 INFO  (qtp1480556557-4641) [n:127.0.0.1:33057_solr c:testschemaapi s:shard1  x:testschemaapi_shard1_replica1] o.a.s.c.c.ZkStateReader Add data for [testschemaapi] ver [0]
   [junit4]   2> 822928 INFO  (qtp1480556557-4641) [n:127.0.0.1:33057_solr c:testschemaapi s:shard1  x:testschemaapi_shard1_replica1] o.a.s.c.ZkController look for our core node name
   [junit4]   2> 822929 INFO  (OverseerStateUpdate-96109409573273606-127.0.0.1:33167_solr-n_0000000000) [n:127.0.0.1:33167_solr    ] o.a.s.c.Overseer processMessage: queueSize: 2, message = {
   [junit4]   2>   "state":"down",
   [junit4]   2>   "roles":null,
   [junit4]   2>   "core":"testschemaapi_shard1_replica1",
   [junit4]   2>   "base_url":"http://127.0.0.1:33057/solr",
   [junit4]   2>   "operation":"state",
   [junit4]   2>   "numShards":"1",
   [junit4]   2>   "shard":"shard1",
   [junit4]   2>   "node_name":"127.0.0.1:33057_solr",
   [junit4]   2>   "collection":"testschemaapi"} current state version: 0
   [junit4]   2> 822929 INFO  (OverseerStateUpdate-96109409573273606-127.0.0.1:33167_solr-n_0000000000) [n:127.0.0.1:33167_solr    ] o.a.s.c.o.ReplicaMutator Update state numShards=1 message={
   [junit4]   2>   "state":"down",
   [junit4]   2>   "roles":null,
   [junit4]   2>   "core":"testschemaapi_shard1_replica1",
   [junit4]   2>   "base_url":"http://127.0.0.1:33057/solr",
   [junit4]   2>   "operation":"state",
   [junit4]   2>   "numShards":"1",
   [junit4]   2>   "shard":"shard1",
   [junit4]   2>   "node_name":"127.0.0.1:33057_solr",
   [junit4]   2>   "collection":"testschemaapi"}
   [junit4]   2> 823030 INFO  (OverseerStateUpdate-96109409573273606-127.0.0.1:33167_solr-n_0000000000) [n:127.0.0.1:33167_solr    ] o.a.s.c.o.ZkStateWriter going to update_collection /collections/testschemaapi/state.json version: 0
   [junit4]   2> 823031 INFO  (zkCallback-605-thread-2-processing-n:127.0.0.1:33167_solr) [n:127.0.0.1:33167_solr    ] o.a.s.c.c.ZkStateReader A cluster state change: [WatchedEvent state:SyncConnected type:NodeDataChanged path:/collections/testschemaapi/state.json] for collection [testschemaapi] has occurred - updating... (live nodes size: [2])
   [junit4]   2> 823031 INFO  (zkCallback-604-thread-1-processing-n:127.0.0.1:33057_solr) [n:127.0.0.1:33057_solr    ] o.a.s.c.c.ZkStateReader A cluster state change: [WatchedEvent state:SyncConnected type:NodeDataChanged path:/collections/testschemaapi/state.json] for collection [testschemaapi] has occurred - updating... (live nodes size: [2])
   [junit4]   2> 823031 INFO  (zkCallback-605-thread-2-processing-n:127.0.0.1:33167_solr) [n:127.0.0.1:33167_solr    ] o.a.s.c.c.ZkStateReader Updating data for [testschemaapi] from [0] to [1]
   [junit4]   2> 823031 INFO  (zkCallback-604-thread-1-processing-n:127.0.0.1:33057_solr) [n:127.0.0.1:33057_solr    ] o.a.s.c.c.ZkStateReader Updating data for [testschemaapi] from [0] to [1]
   [junit4]   2> 823928 INFO  (qtp821035710-4644) [n:127.0.0.1:33167_solr c:testschemaapi s:shard1  x:testschemaapi_shard1_replica2] o.a.s.c.ZkController waiting to find shard id in clusterstate for testschemaapi_shard1_replica2
   [junit4]   2> 823928 INFO  (qtp821035710-4644) [n:127.0.0.1:33167_solr c:testschemaapi s:shard1  x:testschemaapi_shard1_replica2] o.a.s.c.ZkController Check for collection zkNode:testschemaapi
   [junit4]   2> 823928 INFO  (qtp1480556557-4641) [n:127.0.0.1:33057_solr c:testschemaapi s:shard1  x:testschemaapi_shard1_replica1] o.a.s.c.ZkController waiting to find shard id in clusterstate for testschemaapi_shard1_replica1
   [junit4]   2> 823928 INFO  (qtp1480556557-4641) [n:127.0.0.1:33057_solr c:testschemaapi s:shard1  x:testschemaapi_shard1_replica1] o.a.s.c.ZkController Check for collection zkNode:testschemaapi
   [junit4]   2> 823929 INFO  (qtp821035710-4644) [n:127.0.0.1:33167_solr c:testschemaapi s:shard1  x:testschemaapi_shard1_replica2] o.a.s.c.ZkController Collection zkNode exists
   [junit4]   2> 823929 INFO  (qtp821035710-4644) [n:127.0.0.1:33167_solr c:testschemaapi s:shard1  x:testschemaapi_shard1_replica2] o.a.s.c.c.ZkStateReader Load collection config from: [/collections/testschemaapi]
   [junit4]   2> 823929 INFO  (qtp1480556557-4641) [n:127.0.0.1:33057_solr c:testschemaapi s:shard1  x:testschemaapi_shard1_replica1] o.a.s.c.ZkController Collection zkNode exists
   [junit4]   2> 823929 INFO  (qtp1480556557-4641) [n:127.0.0.1:33057_solr c:testschemaapi s:shard1  x:testschemaapi_shard1_replica1] o.a.s.c.c.ZkStateReader Load collection config from: [/collections/testschemaapi]
   [junit4]   2> 823929 INFO  (qtp821035710-4644) [n:127.0.0.1:33167_solr c:testschemaapi s:shard1  x:testschemaapi_shard1_replica2] o.a.s.c.c.ZkStateReader path=[/collections/testschemaapi] [configName]=[conf1] specified config exists in ZooKeeper
   [junit4]   2> 823929 INFO  (qtp821035710-4644) [n:127.0.0.1:33167_solr c:testschemaapi s:shard1  x:testschemaapi_shard1_replica2] o.a.s.c.SolrResourceLoader new SolrResourceLoader for directory: '/home/jenkins/workspace/Lucene-Solr-5.5-Linux/solr/build/solr-core/test/J0/temp/solr.schema.TestManagedSchemaAPI_9A10A170080020D0-001/tempDir-001/node2/testschemaapi_shard1_replica2'
   [junit4]   2> 823929 INFO  (qtp1480556557-4641) [n:127.0.0.1:33057_solr c:testschemaapi s:shard1  x:testschemaapi_shard1_replica1] o.a.s.c.c.ZkStateReader path=[/collections/testschemaapi] [configName]=[conf1] specified config exists in ZooKeeper
   [junit4]   2> 823929 INFO  (qtp1480556557-4641) [n:127.0.0.1:33057_solr c:testschemaapi s:shard1  x:testschemaapi_shard1_replica1] o.a.s.c.SolrResourceLoader new SolrResourceLoader for directory: '/home/jenkins/workspace/Lucene-Solr-5.5-Linux/solr/build/solr-core/test/J0/temp/solr.schema.TestManagedSchemaAPI_9A10A170080020D0-001/tempDir-001/node1/testschemaapi_shard1_replica1'
   [junit4]   2> 823929 INFO  (qtp821035710-4644) [n:127.0.0.1:33167_solr c:testschemaapi s:shard1  x:testschemaapi_shard1_replica2] o.a.s.c.SolrResourceLoader JNDI not configured for solr (NoInitialContextEx)
   [junit4]   2> 823929 INFO  (qtp821035710-4644) [n:127.0.0.1:33167_solr c:testschemaapi s:shard1  x:testschemaapi_shard1_replica2] o.a.s.c.SolrResourceLoader solr home defaulted to 'solr/' (could not find system property or JNDI)
   [junit4]   2> 823929 INFO  (qtp1480556557-4641) [n:127.0.0.1:33057_solr c:testschemaapi s:shard1  x:testschemaapi_shard1_replica1] o.a.s.c.SolrResourceLoader JNDI not configured for solr (NoInitialContextEx)
   [junit4]   2> 823929 INFO  (qtp1480556557-4641) [n:127.0.0.1:33057_solr c:testschemaapi s:shard1  x:testschemaapi_shard1_replica1] o.a.s.c.SolrResourceLoader solr home defaulted to 'solr/' (could not find system property or JNDI)
   [junit4]   2> 823930 INFO  (qtp821035710-4644) [n:127.0.0.1:33167_solr c:testschemaapi s:shard1  x:testschemaapi_shard1_replica2] o.a.s.c.Config loaded config solrconfig.xml with version 0 
   [junit4]   2> 823930 INFO  (qtp1480556557-4641) [n:127.0.0.1:33057_solr c:testschemaapi s:shard1  x:testschemaapi_shard1_replica1] o.a.s.c.Config loaded config solrconfig.xml with version 0 
   [junit4]   2> 823934 INFO  (qtp1480556557-4641) [n:127.0.0.1:33057_solr c:testschemaapi s:shard1  x:testschemaapi_shard1_replica1] o.a.s.c.SolrConfig current version of requestparams : -1
   [junit4]   2> 823934 INFO  (qtp821035710-4644) [n:127.0.0.1:33167_solr c:testschemaapi s:shard1  x:testschemaapi_shard1_replica2] o.a.s.c.SolrConfig current version of requestparams : -1
   [junit4]   2> 823940 INFO  (qtp1480556557-4641) [n:127.0.0.1:33057_solr c:testschemaapi s:shard1  x:testschemaapi_shard1_replica1] o.a.s.c.SolrConfig Using Lucene MatchVersion: 5.5.2
   [junit4]   2> 823940 INFO  (qtp821035710-4644) [n:127.0.0.1:33167_solr c:testschemaapi s:shard1  x:testschemaapi_shard1_replica2] o.a.s.c.SolrConfig Using Lucene MatchVersion: 5.5.2
   [junit4]   2> 823953 INFO  (qtp1480556557-4641) [n:127.0.0.1:33057_solr c:testschemaapi s:shard1  x:testschemaapi_shard1_replica1] o.a.s.c.SolrConfig Loaded SolrConfig: solrconfig.xml
   [junit4]   2> 823953 INFO  (qtp821035710-4644) [n:127.0.0.1:33167_solr c:testschemaapi s:shard1  x:testschemaapi_shard1_replica2] o.a.s.c.SolrConfig Loaded SolrConfig: solrconfig.xml
   [junit4]   2> 823956 INFO  (qtp1480556557-4641) [n:127.0.0.1:33057_solr c:testschemaapi s:shard1  x:testschemaapi_shard1_replica1] o.a.s.s.IndexSchema [testschemaapi_shard1_replica1] Schema name=minimal
   [junit4]   2> 823956 INFO  (qtp821035710-4644) [n:127.0.0.1:33167_solr c:testschemaapi s:shard1  x:testschemaapi_shard1_replica2] o.a.s.s.IndexSchema [testschemaapi_shard1_replica2] Schema name=minimal
   [junit4]   2> 823965 INFO  (qtp1480556557-4641) [n:127.0.0.1:33057_solr c:testschemaapi s:shard1  x:testschemaapi_shard1_replica1] o.a.s.s.IndexSchema unique key field: id
   [junit4]   2> 823966 INFO  (qtp821035710-4644) [n:127.0.0.1:33167_solr c:testschemaapi s:shard1  x:testschemaapi_shard1_replica2] o.a.s.s.IndexSchema unique key field: id
   [junit4]   2> 823966 INFO  (qtp821035710-4644) [n:127.0.0.1:33167_solr c:testschemaapi s:shard1  x:testschemaapi_shard1_replica2] o.a.s.c.ConfigSetProperties Did not find ConfigSet properties, assuming default properties: Can't find resource 'configsetprops.json' in classpath or '/configs/conf1', cwd=/home/jenkins/workspace/Lucene-Solr-5.5-Linux/solr/build/solr-core/test/J0
   [junit4]   2> 823966 INFO  (qtp1480556557-4641) [n:127.0.0.1:33057_solr c:testschemaapi s:shard1  x:testschemaapi_shard1_replica1] o.a.s.c.ConfigSetProperties Did not find ConfigSet properties, assuming default properties: Can't find resource 'configsetprops.json' in classpath or '/configs/conf1', cwd=/home/jenkins/workspace/Lucene-Solr-5.5-Linux/solr/build/solr-core/test/J0
   [junit4]   2> 823966 INFO  (qtp821035710-4644) [n:127.0.0.1:33167_solr c:testschemaapi s:shard1  x:testschemaapi_shard1_replica2] o.a.s.c.CoreContainer Creating SolrCore 'testschemaapi_shard1_replica2' using configuration from collection testschemaapi
   [junit4]   2> 823966 INFO  (qtp1480556557-4641) [n:127.0.0.1:33057_solr c:testschemaapi s:shard1  x:testschemaapi_shard1_replica1] o.a.s.c.CoreContainer Creating SolrCore 'testschemaapi_shard1_replica1' using configuration from collection testschemaapi
   [junit4]   2> 823966 INFO  (qtp1480556557-4641) [n:127.0.0.1:33057_solr c:testschemaapi s:shard1 r:core_node2 x:testschemaapi_shard1_replica1] o.a.s.c.SolrCore org.apache.solr.core.MockDirectoryFactory
   [junit4]   2> 823966 INFO  (qtp821035710-4644) [n:127.0.0.1:33167_solr c:testschemaapi s:shard1 r:core_node1 x:testschemaapi_shard1_replica2] o.a.s.c.SolrCore org.apache.solr.core.MockDirectoryFactory
   [junit4]   2> 823967 INFO  (qtp821035710-4644) [n:127.0.0.1:33167_solr c:testschemaapi s:shard1 r:core_node1 x:testschemaapi_shard1_replica2] o.a.s.c.SolrCore [[testschemaapi_shard1_replica2] ] Opening new SolrCore at [/home/jenkins/workspace/Lucene-Solr-5.5-Linux/solr/build/solr-core/test/J0/temp/solr.schema.TestManagedSchemaAPI_9A10A170080020D0-001/tempDir-001/node2/testschemaapi_shard1_replica2], dataDir=[/home/jenkins/workspace/Lucene-Solr-5.5-Linux/solr/build/solr-core/test/J0/temp/solr.schema.TestManagedSchemaAPI_9A10A170080020D0-001/tempDir-001/node2/./testschemaapi_shard1_replica2/data/]
   [junit4]   2> 823967 INFO  (qtp1480556557-4641) [n:127.0.0.1:33057_solr c:testschemaapi s:shard1 r:core_node2 x:testschemaapi_shard1_replica1] o.a.s.c.SolrCore [[testschemaapi_shard1_replica1] ] Opening new SolrCore at [/home/jenkins/workspace/Lucene-Solr-5.5-Linux/solr/build/solr-core/test/J0/temp/solr.schema.TestManagedSchemaAPI_9A10A170080020D0-001/tempDir-001/node1/testschemaapi_shard1_replica1], dataDir=[/home/jenkins/workspace/Lucene-Solr-5.5-Linux/solr/build/solr-core/test/J0/temp/solr.schema.TestManagedSchemaAPI_9A10A170080020D0-001/tempDir-001/node1/./testschemaapi_shard1_replica1/data/]
   [junit4]   2> 823967 INFO  (qtp821035710-4644) [n:127.0.0.1:33167_solr c:testschemaapi s:shard1 r:core_node1 x:testschemaapi_shard1_replica2] o.a.s.c.SolrCore JMX monitoring not detected for core: testschemaapi_shard1_replica2
   [junit4]   2> 823967 INFO  (qtp1480556557-4641) [n:127.0.0.1:33057_solr c:testschemaapi s:shard1 r:core_node2 x:testschemaapi_shard1_replica1] o.a.s.c.SolrCore JMX monitoring not detected for core: testschemaapi_shard1_replica1
   [junit4]   2> 823967 INFO  (qtp821035710-4644) [n:127.0.0.1:33167_solr c:testschemaapi s:shard1 r:core_node1 x:testschemaapi_shard1_replica2] o.a.s.c.CachingDirectoryFactory return new directory for /home/jenkins/workspace/Lucene-Solr-5.5-Linux/solr/build/solr-core/test/J0/temp/solr.schema.TestManagedSchemaAPI_9A10A170080020D0-001/tempDir-001/node2/./testschemaapi_shard1_replica2/data
   [junit4]   2> 823967 INFO  (qtp1480556557-4641) [n:127.0.0.1:33057_solr c:testschemaapi s:shard1 r:core_node2 x:testschemaapi_shard1_replica1] o.a.s.c.CachingDirectoryFactory return new directory for /home/jenkins/workspace/Lucene-Solr-5.5-Linux/solr/build/solr-core/test/J0/temp/solr.schema.TestManagedSchemaAPI_9A10A170080020D0-001/tempDir-001/node1/./testschemaapi_shard1_replica1/data
   [junit4]   2> 823967 INFO  (qtp821035710-4644) [n:127.0.0.1:33167_solr c:testschemaapi s:shard1 r:core_node1 x:testschemaapi_shard1_replica2] o.a.s.c.SolrCore New index directory detected: old=null new=/home/jenkins/workspace/Lucene-Solr-5.5-Linux/solr/build/solr-core/test/J0/temp/solr.schema.TestManagedSchemaAPI_9A10A170080020D0-001/tempDir-001/node2/./testschemaapi_shard1_replica2/data/index/
   [junit4]   2> 823967 INFO  (qtp1480556557-4641) [n:127.0.0.1:33057_solr c:testschemaapi s:shard1 r:core_node2 x:testschemaapi_shard1_replica1] o.a.s.c.SolrCore New index directory detected: old=null new=/home/jenkins/workspace/Lucene-Solr-5.5-Linux/solr/build/solr-core/test/J0/temp/solr.schema.TestManagedSchemaAPI_9A10A170080020D0-001/tempDir-001/node1/./testschemaapi_shard1_replica1/data/index/
   [junit4]   2> 823967 WARN  (qtp821035710-4644) [n:127.0.0.1:33167_solr c:testschemaapi s:shard1 r:core_node1 x:testschemaapi_shard1_replica2] o.a.s.c.SolrCore [testschemaapi_shard1_replica2] Solr index directory '/home/jenkins/workspace/Lucene-Solr-5.5-Linux/solr/build/solr-core/test/J0/temp/solr.schema.TestManagedSchemaAPI_9A10A170080020D0-001/tempDir-001/node2/./testschemaapi_shard1_replica2/data/index' doesn't exist. Creating new index...
   [junit4]   2> 823967 WARN  (qtp1480556557-4641) [n:127.0.0.1:33057_solr c:testschemaapi s:shard1 r:core_node2 x:testschemaapi_shard1_replica1] o.a.s.c.SolrCore [testschemaapi_shard1_replica1] Solr index directory '/home/jenkins/workspace/Lucene-Solr-5.5-Linux/solr/build/solr-core/test/J0/temp/solr.schema.TestManagedSchemaAPI_9A10A170080020D0-001/tempDir-001/node1/./testschemaapi_shard1_replica1/data/index' doesn't exist. Creating new index...
   [junit4]   2> 823968 INFO  (qtp821035710-4644) [n:127.0.0.1:33167_solr c:testschemaapi s:shard1 r:core_node1 x:testschemaapi_shard1_replica2] o.a.s.c.CachingDirectoryFactory return new directory for /home/jenkins/workspace/Lucene-Solr-5.5-Linux/solr/build/solr-core/test/J0/temp/solr.schema.TestManagedSchemaAPI_9A10A170080020D0-001/tempDir-001/node2/./testschemaapi_shard1_replica2/data/index
   [junit4]   2> 823968 INFO  (qtp1480556557-4641) [n:127.0.0.1:33057_solr c:testschemaapi s:shard1 r:core_node2 x:testschemaapi_shard1_replica1] o.a.s.c.CachingDirectoryFactory return new directory for /home/jenkins/workspace/Lucene-Solr-5.5-Linux/solr/build/solr-core/test/J0/temp/solr.schema.TestManagedSchemaAPI_9A10A170080020D0-001/tempDir-001/node1/./testschemaapi_shard1_replica1/data/index
   [junit4]   2> 823969 INFO  (qtp1480556557-4641) [n:127.0.0.1:33057_solr c:testschemaapi s:shard1 r:core_node2 x:testschemaapi_shard1_replica1] o.a.s.c.SolrDeletionPolicy SolrDeletionPolicy.onCommit: commits: num=1
   [junit4]   2> 	commit{dir=MockDirectoryWrapper(RAMDirectory@fbe3830 lockFactory=org.apache.lucene.store.SingleInstanceLockFactory@115adf63),segFN=segments_1,generation=1}
   [junit4]   2> 823969 INFO  (qtp821035710-4644) [n:127.0.0.1:33167_solr c:testschemaapi s:shard1 r:core_node1 x:testschemaapi_shard1_replica2] o.a.s.c.SolrDeletionPolicy SolrDeletionPolicy.onCommit: commits: num=1
   [junit4]   2> 	commit{dir=MockDirectoryWrapper(RAMDirectory@6d6e7a6a lockFactory=org.apache.lucene.store.SingleInstanceLockFactory@7026fd46),segFN=segments_1,generation=1}
   [junit4]   2> 823969 INFO  (qtp1480556557-4641) [n:127.0.0.1:33057_solr c:testschemaapi s:shard1 r:core_node2 x:testschemaapi_shard1_replica1] o.a.s.c.SolrDeletionPolicy newest commit generation = 1
   [junit4]   2> 823969 INFO  (qtp821035710-4644) [n:127.0.0.1:33167_solr c:testschemaapi s:shard1 r:core_node1 x:testschemaapi_shard1_replica2] o.a.s.c.SolrDeletionPolicy newest commit generation = 1
   [junit4]   2> 823969 INFO  (OldIndexDirectoryCleanupThreadForCore-testschemaapi_shard1_replica1) [n:127.0.0.1:33057_solr c:testschemaapi s:shard1 r:core_node2 x:testschemaapi_shard1_replica1] o.a.s.c.SolrCore Looking for old index directories to cleanup for core testschemaapi_shard1_replica1 in /home/jenkins/workspace/Lucene-Solr-5.5-Linux/solr/build/solr-core/test/J0/temp/solr.schema.TestManagedSchemaAPI_9A10A170080020D0-001/tempDir-001/node1/./testschemaapi_shard1_replica1/data/
   [junit4]   2> 823969 WARN  (OldIndexDirectoryCleanupThreadForCore-testschemaapi_shard1_replica1) [n:127.0.0.1:33057_solr c:testschemaapi s:shard1 r:core_node2 x:testschemaapi_shard1_replica1] o.a.s.c.DirectoryFactory /home/jenkins/workspace/Lucene-Solr-5.5-Linux/solr/build/solr-core/test/J0/temp/solr.schema.TestManagedSchemaAPI_9A10A170080020D0-001/tempDir-001/node1/./testschemaapi_shard1_replica1/data/ does not point to a valid data directory; skipping clean-up of old index directories.
   [junit4]   2> 823969 INFO  (OldIndexDirectoryCleanupThreadForCore-testschemaapi_shard1_replica2) [n:127.0.0.1:33167_solr c:testschemaapi s:shard1 r:core_node1 x:testschemaapi_shard1_replica2] o.a.s.c.SolrCore Looking for old index directories to cleanup for core testschemaapi_shard1_replica2 in /home/jenkins/workspace/Lucene-Solr-5.5-Linux/solr/build/solr-core/test/J0/temp/solr.schema.TestManagedSchemaAPI_9A10A170080020D0-001/tempDir-001/node2/./testschemaapi_shard1_replica2/data/
   [junit4]   2> 823969 WARN  (OldIndexDirectoryCleanupThreadForCore-testschemaapi_shard1_replica2) [n:127.0.0.1:33167_solr c:testschemaapi s:shard1 r:core_node1 x:testschemaapi_shard1_replica2] o.a.s.c.DirectoryFactory /home/jenkins/workspace/Lucene-Solr-5.5-Linux/solr/build/solr-core/test/J0/temp/solr.schema.TestManagedSchemaAPI_9A10A170080020D0-001/tempDir-001/node2/./testschemaapi_shard1_replica2/data/ does not point to a valid data directory; skipping clean-up of old index directories.
   [junit4]   2> 823970 INFO  (qtp1480556557-4641) [n:127.0.0.1:33057_solr c:testschemaapi s:shard1 r:core_node2 x:testschemaapi_shard1_replica1] o.a.s.c.SolrCore no updateRequestProcessorChain defined as default, creating implicit default
   [junit4]   2> 823970 INFO  (qtp821035710-4644) [n:127.0.0.1:33167_solr c:testschemaapi s:shard1 r:core_node1 x:testschemaapi_shard1_replica2] o.a.s.c.SolrCore no updateRequestProcessorChain defined as default, creating implicit default
   [junit4]   2> 823971 INFO  (qtp1480556557-4641) [n:127.0.0.1:33057_solr c:testschemaapi s:shard1 r:core_node2 x:testschemaapi_shard1_replica1] o.a.s.h.l.XMLLoader xsltCacheLifetimeSeconds=60
   [junit4]   2> 823971 INFO  (qtp821035710-4644) [n:127.0.0.1:33167_solr c:testschemaapi s:shard1 r:core_node1 x:testschemaapi_shard1_replica2] o.a.s.h.l.XMLLoader xsltCacheLifetimeSeconds=60
   [junit4]   2> 823971 INFO  (qtp1480556557-4641) [n:127.0.0.1:33057_solr c:testschemaapi s:shard1 r:core_node2 x:testschemaapi_shard1_replica1] o.a.s.h.l.XMLLoader xsltCacheLifetimeSeconds=60
   [junit4]   2> 823972 INFO  (qtp821035710-4644) [n:127.0.0.1:33167_solr c:testschemaapi s:shard1 r:core_node1 x:testschemaapi_shard1_replica2] o.a.s.h.l.XMLLoader xsltCacheLifetimeSeconds=60
   [junit4]   2> 823973 INFO  (qtp1480556557-4641) [n:127.0.0.1:33057_solr c:testschemaapi s:shard1 r:core_node2 x:testschemaapi_shard1_replica1] o.a.s.h.l.XMLLoader xsltCacheLifetimeSeconds=60
   [junit4]   2> 823973 INFO  (qtp821035710-4644) [n:127.0.0.1:33167_solr c:testschemaapi s:shard1 r:core_node1 x:testschemaapi_shard1_replica2] o.a.s.h.l.XMLLoader xsltCacheLifetimeSeconds=60
   [junit4]   2> 823973 INFO  (qtp1480556557-4641) [n:127.0.0.1:33057_solr c:testschemaapi s:shard1 r:core_node2 x:testschemaapi_shard1_replica1] o.a.s.h.l.XMLLoader xsltCacheLifetimeSeconds=60
   [junit4]   2> 823973 INFO  (qtp821035710-4644) [n:127.0.0.1:33167_solr c:testschemaapi s:shard1 r:core_node1 x:testschemaapi_shard1_replica2] o.a.s.h.l.XMLLoader xsltCacheLifetimeSeconds=60
   [junit4]   2> 823974 INFO  (qtp1480556557-4641) [n:127.0.0.1:33057_solr c:testschemaapi s:shard1 r:core_node2 x:testschemaapi_shard1_replica1] o.a.s.c.RequestHandlers Registered paths: /admin/system,/update,/replication,/admin/file,/get,/update/csv,/schema,/admin/properties,/admin/logging,/admin/segments,/config,/select,/admin/luke,/admin/ping,/admin/plugins,/admin/threads,/update/json/docs,/admin/mbeans,/update/json
   [junit4]   2> 823974 INFO  (qtp821035710-4644) [n:127.0.0.1:33167_solr c:testschemaapi s:shard1 r:core_node1 x:testschemaapi_shard1_replica2] o.a.s.c.RequestHandlers Registered paths: /admin/system,/update,/replication,/admin/file,/get,/update/csv,/schema,/admin/properties,/admin/logging,/admin/segments,/config,/select,/admin/luke,/admin/ping,/admin/plugins,/admin/threads,/update/json/docs,/admin/mbeans,/update/json
   [junit4]   2> 823975 INFO  (qtp1480556557-4641) [n:127.0.0.1:33057_solr c:testschemaapi s:shard1 r:core_node2 x:testschemaapi_shard1_replica1] o.a.s.c.SolrCore Using default statsCache cache: org.apache.solr.search.stats.LocalStatsCache
   [junit4]   2> 823975 INFO  (qtp821035710-4644) [n:127.0.0.1:33167_solr c:testschemaapi s:shard1 r:core_node1 x:testschemaapi_shard1_replica2] o.a.s.c.SolrCore Using default statsCache cache: org.apache.solr.search.stats.LocalStatsCache
   [junit4]   2> 823975 INFO  (qtp1480556557-4641) [n:127.0.0.1:33057_solr c:testschemaapi s:shard1 r:core_node2 x:testschemaapi_shard1_replica1] o.a.s.u.UpdateHandler Using UpdateLog implementation: org.apache.solr.update.UpdateLog
   [junit4]   2> 823975 INFO  (qtp821035710-4644) [n:127.0.0.1:33167_solr c:testschemaapi s:shard1 r:core_node1 x:testschemaapi_shard1_replica2] o.a.s.u.UpdateHandler Using UpdateLog implementation: org.apache.solr.update.UpdateLog
   [junit4]   2> 823975 INFO  (qtp1480556557-4641) [n:127.0.0.1:33057_solr c:testschemaapi s:shard1 r:core_node2 x:testschemaapi_shard1_replica1] o.a.s.u.UpdateLog Initializing UpdateLog: dataDir=null defaultSyncLevel=FLUSH numRecordsToKeep=100 maxNumLogsToKeep=10 numVersionBuckets=65536
   [junit4]   2> 823975 INFO  (qtp821035710-4644) [n:127.0.0.1:33167_solr c:testschemaapi s:shard1 r:core_node1 x:testschemaapi_shard1_replica2] o.a.s.u.UpdateLog Initializing UpdateLog: dataDir=null defaultSyncLevel=FLUSH numRecordsToKeep=100 maxNumLogsToKeep=10 numVersionBuckets=65536
   [junit4]   2> 823976 INFO  (qtp1480556557-4641) [n:127.0.0.1:33057_solr c:testschemaapi s:shard1 r:core_node2 x:testschemaapi_shard1_replica1] o.a.s.u.CommitTracker Hard AutoCommit: disabled
   [junit4]   2> 823976 INFO  (qtp821035710-4644) [n:127.0.0.1:33167_solr c:testschemaapi s:shard1 r:core_node1 x:testschemaapi_shard1_replica2] o.a.s.u.CommitTracker Hard AutoCommit: disabled
   [junit4]   2> 823976 INFO  (qtp1480556557-4641) [n:127.0.0.1:33057_solr c:testschemaapi s:shard1 r:core_node2 x:testschemaapi_shard1_replica1] o.a.s.u.CommitTracker Soft AutoCommit: disabled
   [junit4]   2> 823976 INFO  (qtp821035710-4644) [n:127.0.0.1:33167_solr c:testschemaapi s:shard1 r:core_node1 x:testschemaapi_shard1_replica2] o.a.s.u.CommitTracker Soft AutoCommit: disabled
   [junit4]   2> 823976 INFO  (qtp821035710-4644) [n:127.0.0.1:33167_solr c:testschemaapi s:shard1 r:core_node1 x:testschemaapi_shard1_replica2] o.a.s.c.SolrDeletionPolicy SolrDeletionPolicy.onInit: commits: num=1
   [junit4]   2> 	commit{dir=MockDirectoryWrapper(RAMDirectory@6d6e7a6a lockFactory=org.apache.lucene.store.SingleInstanceLockFactory@7026fd46),segFN=segments_1,generation=1}
   [junit4]   2> 823976 INFO  (qtp1480556557-4641) [n:127.0.0.1:33057_solr c:testschemaapi s:shard1 r:core_node2 x:testschemaapi_shard1_replica1] o.a.s.c.SolrDeletionPolicy SolrDeletionPolicy.onInit: commits: num=1
   [junit4]   2> 	commit{dir=MockDirectoryWrapper(RAMDirectory@fbe3830 lockFactory=org.apache.lucene.store.SingleInstanceLockFactory@115adf63),segFN=segments_1,generation=1}
   [junit4]   2> 823976 INFO  (qtp821035710-4644) [n:127.0.0.1:33167_solr c:testschemaapi s:shard1 r:core_node1 x:testschemaapi_shard1_replica2] o.a.s.c.SolrDeletionPolicy newest commit generation = 1
   [junit4]   2> 823976 INFO  (qtp1480556557-4641) [n:127.0.0.1:33057_solr c:testschemaapi s:shard1 r:core_node2 x:testschemaapi_shard1_replica1] o.a.s.c.SolrDeletionPolicy newest commit generation = 1
   [junit4]   2> 823976 INFO  (qtp821035710-4644) [n:127.0.0.1:33167_solr c:testschemaapi s:shard1 r:core_node1 x:testschemaapi_shard1_replica2] o.a.s.s.SolrIndexSearcher Opening Searcher@1f88f8c5[testschemaapi_shard1_replica2] main
   [junit4]   2> 823976 INFO  (qtp1480556557-4641) [n:127.0.0.1:33057_solr c:testschemaapi s:shard1 r:core_node2 x:testschemaapi_shard1_replica1] o.a.s.s.SolrIndexSearcher Opening Searcher@122ba13[testschemaapi_shard1_replica1] main
   [junit4]   2> 823976 INFO  (qtp821035710-4644) [n:127.0.0.1:33167_solr c:testschemaapi s:shard1 r:core_node1 x:testschemaapi_shard1_replica2] o.a.s.c.c.ZkStateReader Load collection config from: [/collections/testschemaapi]
   [junit4]   2> 823976 INFO  (qtp1480556557-4641) [n:127.0.0.1:33057_solr c:testschemaapi s:shard1 r:core_node2 x:testschemaapi_shard1_replica1] o.a.s.c.c.ZkStateReader Load collection config from: [/collections/testschemaapi]
   [junit4]   2> 823977 INFO  (qtp821035710-4644) [n:127.0.0.1:33167_solr c:testschemaapi s:shard1 r:core_node1 x:testschemaapi_shard1_replica2] o.a.s.c.c.ZkStateReader path=[/collections/testschemaapi] [configName]=[conf1] specified config exists in ZooKeeper
   [junit4]   2> 823977 INFO  (qtp1480556557-4641) [n:127.0.0.1:33057_solr c:testschemaapi s:shard1 r:core_node2 x:testschemaapi_shard1_replica1] o.a.s.c.c.ZkStateReader path=[/collections/testschemaapi] [configName]=[conf1] specified config exists in ZooKeeper
   [junit4]   2> 823977 INFO  (qtp821035710-4644) [n:127.0.0.1:33167_solr c:testschemaapi s:shard1 r:core_node1 x:testschemaapi_shard1_replica2] o.a.s.r.ManagedResourceStorage Setting up ZooKeeper-based storage for the RestManager with znodeBase: /configs/conf1
   [junit4]   2> 823977 INFO  (qtp1480556557-4641) [n:127.0.0.1:33057_solr c:testschemaapi s:shard1 r:core_node2 x:testschemaapi_shard1_replica1] o.a.s.r.ManagedResourceStorage Setting up ZooKeeper-based storage for the RestManager with znodeBase: /configs/conf1
   [junit4]   2> 823977 INFO  (qtp821035710-4644) [n:127.0.0.1:33167_solr c:testschemaapi s:shard1 r:core_node1 x:testschemaapi_shard1_replica2] o.a.s.r.ManagedResourceStorage Configured ZooKeeperStorageIO with znodeBase: /configs/conf1
   [junit4]   2> 823977 INFO  (qtp821035710-4644) [n:127.0.0.1:33167_solr c:testschemaapi s:shard1 r:core_node1 x:testschemaapi_shard1_replica2] o.a.s.r.RestManager Initializing RestManager with initArgs: {}
   [junit4]   2> 823977 INFO  (qtp1480556557-4641) [n:127.0.0.1:33057_solr c:testschemaapi s:shard1 r:core_node2 x:testschemaapi_shard1_replica1] o.a.s.r.ManagedResourceStorage Configured ZooKeeperStorageIO with znodeBase: /configs/conf1
   [junit4]   2> 823977 INFO  (qtp821035710-4644) [n:127.0.0.1:33167_solr c:testschemaapi s:shard1 r:core_node1 x:testschemaapi_shard1_replica2] o.a.s.r.ManagedResourceStorage Reading _rest_managed.json using ZooKeeperStorageIO:path=/configs/conf1
   [junit4]   2> 823977 INFO  (qtp1480556557-4641) [n:127.0.0.1:33057_solr c:testschemaapi s:shard1 r:core_node2 x:testschemaapi_shard1_replica1] o.a.s.r.RestManager Initializing RestManager with initArgs: {}
   [junit4]   2> 823977 INFO  (qtp1480556557-4641) [n:127.0.0.1:33057_solr c:testschemaapi s:shard1 r:core_node2 x:testschemaapi_shard1_replica1] o.a.s.r.ManagedResourceStorage Reading _rest_managed.json using ZooKeeperStorageIO:path=/configs/conf1
   [junit4]   2> 823977 INFO  (qtp821035710-4644) [n:127.0.0.1:33167_solr c:testschemaapi s:shard1 r:core_node1 x:testschemaapi_shard1_replica2] o.a.s.r.ManagedResourceStorage No data found for znode /configs/conf1/_rest_managed.json
   [junit4]   2> 823977 INFO  (qtp821035710-4644) [n:127.0.0.1:33167_solr c:testschemaapi s:shard1 r:core_node1 x:testschemaapi_shard1_replica2] o.a.s.r.ManagedResourceStorage Loaded null at path _rest_managed.json using ZooKeeperStorageIO:path=/configs/conf1
   [junit4]   2> 823977 INFO  (qtp1480556557-4641) [n:127.0.0.1:33057_solr c:testschemaapi s:shard1 r:core_node2 x:testschemaapi_shard1_replica1] o.a.s.r.ManagedResourceStorage No data found for znode /configs/conf1/_rest_managed.json
   [junit4]   2> 823977 INFO  (qtp821035710-4644) [n:127.0.0.1:33167_solr c:testschemaapi s:shard1 r:core_node1 x:testschemaapi_shard1_replica2] o.a.s.r.RestManager Initializing 0 registered ManagedResources
   [junit4]   2> 823977 INFO  (qtp1480556557-4641) [n:127.0.0.1:33057_solr c:testschemaapi s:shard1 r:core_node2 x:testschemaapi_shard1_replica1] o.a.s.r.ManagedResourceStorage Loaded null at path _rest_managed.json using ZooKeeperStorageIO:path=/configs/conf1
   [junit4]   2> 823977 INFO  (qtp821035710-4644) [n:127.0.0.1:33167_solr c:testschemaapi s:shard1 r:core_node1 x:testschemaapi_shard1_replica2] o.a.s.s.ZkIndexSchemaReader Creating ZooKeeper watch for the managed schema at /configs/conf1/managed-schema
   [junit4]   2> 823977 INFO  (qtp1480556557-4641) [n:127.0.0.1:33057_solr c:testschemaapi s:shard1 r:core_node2 x:testschemaapi_shard1_replica1] o.a.s.r.RestManager Initializing 0 registered ManagedResources
   [junit4]   2> 823977 INFO  (qtp1480556557-4641) [n:127.0.0.1:33057_solr c:testschemaapi s:shard1 r:core_node2 x:testschemaapi_shard1_replica1] o.a.s.s.ZkIndexSchemaReader Creating ZooKeeper watch for the managed schema at /configs/conf1/managed-schema
   [junit4]   2> 823977 INFO  (qtp821035710-4644) [n:127.0.0.1:33167_solr c:testschemaapi s:shard1 r:core_node1 x:testschemaapi_shard1_replica2] o.a.s.c.ZkController Added new OnReconnect listener ZkIndexSchemaReader: /configs/conf1/managed-schema, uniqueCoreId: testschemaapi_shard1_replica2:744950706797308
   [junit4]   2> 823977 INFO  (qtp1480556557-4641) [n:127.0.0.1:33057_solr c:testschemaapi s:shard1 r:core_node2 x:testschemaapi_shard1_replica1] o.a.s.c.ZkController Added new OnReconnect listener ZkIndexSchemaReader: /configs/conf1/managed-schema, uniqueCoreId: testschemaapi_shard1_replica1:744950706822787
   [junit4]   2> 823977 INFO  (qtp821035710-4644) [n:127.0.0.1:33167_solr c:testschemaapi s:shard1 r:core_node1 x:testschemaapi_shard1_replica2] o.a.s.h.ReplicationHandler Commits will be reserved for  10000
   [junit4]   2> 823977 INFO  (qtp1480556557-4641) [n:127.0.0.1:33057_solr c:testschemaapi s:shard1 r:core_node2 x:testschemaapi_shard1_replica1] o.a.s.h.ReplicationHandler Commits will be reserved for  10000
   [junit4]   2> 823977 INFO  (searcherExecutor-2016-thread-1-processing-x:testschemaapi_shard1_replica2 r:core_node1 s:shard1 n:127.0.0.1:33167_solr c:testschemaapi) [n:127.0.0.1:33167_solr c:testschemaapi s:shard1 r:core_node1 x:testschemaapi_shard1_replica2] o.a.s.c.SolrCore [testschemaapi_shard1_replica2] Registered new searcher Searcher@1f88f8c5[testschemaapi_shard1_replica2] main{ExitableDirectoryReader(UninvertingDirectoryReader())}
   [junit4]   2> 823977 INFO  (qtp1480556557-4641) [n:127.0.0.1:33057_solr c:testschemaapi s:shard1 r:core_node2 x:testschemaapi_shard1_replica1] o.a.s.u.UpdateLog Looking up max value of version field to seed version buckets
   [junit4]   2> 823978 INFO  (qtp821035710-4644) [n:127.0.0.1:33167_solr c:testschemaapi s:shard1 r:core_node1 x:testschemaapi_shard1_replica2] o.a.s.u.UpdateLog Looking up max value of version field to seed version buckets
   [junit4]   2> 823978 INFO  (qtp1480556557-4641) [n:127.0.0.1:33057_solr c:testschemaapi s:shard1 r:core_node2 x:testschemaapi_shard1_replica1] o.a.s.u.VersionInfo Refreshing highest value of _version_ for 65536 version buckets from index
   [junit4]   2> 823978 INFO  (qtp821035710-4644) [n:127.0.0.1:33167_solr c:testschemaapi s:shard1 r:core_node1 x:testschemaapi_shard1_replica2] o.a.s.u.VersionInfo Refreshing highest value of _version_ for 65536 version buckets from index
   [junit4]   2> 823978 INFO  (qtp1480556557-4641) [n:127.0.0.1:33057_solr c:testschemaapi s:shard1 r:core_node2 x:testschemaapi_shard1_replica1] o.a.s.u.VersionInfo No terms found for _version_, cannot seed version bucket highest value from index
   [junit4]   2> 823978 INFO  (qtp821035710-4644) [n:127.0.0.1:33167_solr c:testschemaapi s:shard1 r:core_node1 x:testschemaapi_shard1_replica2] o.a.s.u.VersionInfo No terms found for _version_, cannot seed version bucket highest value from index
   [junit4]   2> 823978 INFO  (qtp1480556557-4641) [n:127.0.0.1:33057_solr c:testschemaapi s:shard1 r:core_node2 x:testschemaapi_shard1_replica1] o.a.s.u.UpdateLog Could not find max version in index or recent updates, using new clock 1537750554566983680
   [junit4]   2> 823978 INFO  (qtp821035710-4644) [n:127.0.0.1:33167_solr c:testschemaapi s:shard1 r:core_node1 x:testschemaapi_shard1_replica2] o.a.s.u.UpdateLog Could not find max version in index or recent updates, using new clock 1537750554566983680
   [junit4]   2> 823977 INFO  (searcherExecutor-2017-thread-1-processing-x:testschemaapi_shard1_replica1 r:core_node2 n:127.0.0.1:33057_solr s:shard1 c:testschemaapi) [n:127.0.0.1:33057_solr c:testschemaapi s:shard1 r:core_node2 x:testschemaapi_shard1_replica1] o.a.s.c.SolrCore [testschemaapi_shard1_replica1] Registered new searcher Searcher@122ba13[testschemaapi_shard1_replica1] main{ExitableDirectoryReader(UninvertingDirectoryReader())}
   [junit4]   2> 823979 INFO  (qtp1480556557-4641) [n:127.0.0.1:33057_solr c:testschemaapi s:shard1 r:core_node2 x:testschemaapi_shard1_replica1] o.a.s.u.UpdateLog Took 1.0ms to seed version buckets with highest version 1537750554566983680
   [junit4]   2> 823979 INFO  (qtp821035710-4644) [n:127.0.0.1:33167_solr c:testschemaapi s:shard1 r:core_node1 x:testschemaapi_shard1_replica2] o.a.s.u.UpdateLog Took 1.0ms to seed version buckets with highest version 1537750554566983680
   [junit4]   2> 823979 INFO  (qtp1480556557-4641) [n:127.0.0.1:33057_solr c:testschemaapi s:shard1 r:core_node2 x:testschemaapi_shard1_replica1] o.a.s.c.ZkController watch zkdir /configs/conf1
   [junit4]   2> 823979 INFO  (qtp821035710-4644) [n:127.0.0.1:33167_solr c:testschemaapi s:shard1 r:core_node1 x:testschemaapi_shard1_replica2] o.a.s.c.ZkController watch zkdir /configs/conf1
   [junit4]   2> 823980 INFO  (qtp1480556557-4641) [n:127.0.0.1:33057_solr c:testschemaapi s:shard1 r:core_node2 x:testschemaapi_shard1_replica1] o.a.s.c.CoreContainer registering core: testschemaapi_shard1_replica1
   [junit4]   2> 823980 INFO  (qtp821035710-4644) [n:127.0.0.1:33167_solr c:testschemaapi s:shard1 r:core_node1 x:testschemaapi_shard1_replica2] o.a.s.c.CoreContainer registering core: testschemaapi_shard1_replica2
   [junit4]   2> 823980 INFO  (qtp1480556557-4641) [n:127.0.0.1:33057_solr c:testschemaapi s:shard1 r:core_node2 x:testschemaapi_shard1_replica1] o.a.s.c.ZkController Register replica - core:testschemaapi_shard1_replica1 address:http://127.0.0.1:33057/solr collection:testschemaapi shard:shard1
   [junit4]   2> 823980 INFO  (qtp821035710-4644) [n:127.0.0.1:33167_solr c:testschemaapi s:shard1 r:core_node1 x:testschemaapi_shard1_replica2] o.a.s.c.ZkController Register replica - core:testschemaapi_shard1_replica2 address:http://127.0.0.1:33167/solr collection:testschemaapi shard:shard1
   [junit4]   2> 823981 INFO  (qtp1480556557-4641) [n:127.0.0.1:33057_solr c:testschemaapi s:shard1 r:core_node2 x:testschemaapi_shard1_replica1] o.a.s.c.c.SolrZkClient makePath: /collections/testschemaapi/leader_elect/shard1/election
   [junit4]   2> 823981 INFO  (qtp821035710-4644) [n:127.0.0.1:33167_solr c:testschemaapi s:shard1 r:core_node1 x:testschemaapi_shard1_replica2] o.a.s.c.c.SolrZkClient makePath: /collections/testschemaapi/leader_elect/shard1/election
   [junit4]   2> 823982 INFO  (qtp821035710-4644) [n:127.0.0.1:33167_solr c:testschemaapi s:shard1 r:core_node1 x:testschemaapi_shard1_replica2] o.a.s.c.LeaderElector Joined leadership election with path: /collections/testschemaapi/leader_elect/shard1/election/96109409573273606-core_node1-n_0000000000
   [junit4]   2> 823982 INFO  (qtp1480556557-4641) [n:127.0.0.1:33057_solr c:testschemaapi s:shard1 r:core_node2 x:testschemaapi_shard1_replica1] o.a.s.c.LeaderElector Joined leadership election with path: /collections/testschemaapi/leader_elect/shard1/election/96109409573273605-core_node2-n_0000000001
   [junit4]   2> 823982 INFO  (qtp821035710-4644) [n:127.0.0.1:33167_solr c:testschemaapi s:shard1 r:core_node1 x:testschemaapi_shard1_replica2] o.a.s.c.ShardLeaderElectionContext Running the leader process for shard=shard1 and weAreReplacement=false and leaderVoteWait=10000
   [junit4]   2> 823982 INFO  (qtp1480556557-4641) [n:127.0.0.1:33057_solr c:testschemaapi s:shard1 r:core_node2 x:testschemaapi_shard1_replica1] o.a.s.c.LeaderElector Watching path /collections/testschemaapi/leader_elect/shard1/election/96109409573273606-core_node1-n_0000000000 to know if I could be the leader
   [junit4]   2> 823982 INFO  (qtp821035710-4644) [n:127.0.0.1:33167_solr c:testschemaapi s:shard1 r:core_node1 x:testschemaapi_shard1_replica2] o.a.s.c.ShardLeaderElectionContext Enough replicas found to continue.
   [junit4]   2> 823982 INFO  (qtp821035710-4644) [n:127.0.0.1:33167_solr c:testschemaapi s:shard1 r:core_node1 x:testschemaapi_shard1_replica2] o.a.s.c.ShardLeaderElectionContext I may be the new leader - try and sync
   [junit4]   2> 823983 INFO  (qtp821035710-4644) [n:127.0.0.1:33167_solr c:testschemaapi s:shard1 r:core_node1 x:testschemaapi_shard1_replica2] o.a.s.c.SyncStrategy Sync replicas to http://127.0.0.1:33167/solr/testschemaapi_shard1_replica2/
   [junit4]   2> 823983 INFO  (qtp821035710-4644) [n:127.0.0.1:33167_solr c:testschemaapi s:shard1 r:core_node1 x:testschemaapi_shard1_replica2] o.a.s.u.PeerSync PeerSync: core=testschemaapi_shard1_replica2 url=http://127.0.0.1:33167/solr START replicas=[http://127.0.0.1:33057/solr/testschemaapi_shard1_replica1/] nUpdates=100
   [junit4]   2> 823983 INFO  (OverseerStateUpdate-96109409573273606-127.0.0.1:33167_solr-n_0000000000) [n:127.0.0.1:33167_solr    ] o.a.s.c.Overseer processMessage: queueSize: 1, message = {
   [junit4]   2>   "operation":"leader",
   [junit4]   2>   "shard":"shard1",
   [junit4]   2>   "collection":"testschemaapi"} current state version: 0
   [junit4]   2> 823983 INFO  (qtp821035710-4644) [n:127.0.0.1:33167_solr c:testschemaapi s:shard1 r:core_node1 x:testschemaapi_shard1_replica2] o.a.s.u.PeerSync PeerSync: core=testschemaapi_shard1_replica2 url=http://127.0.0.1:33167/solr DONE.  We have no versions.  sync failed.
   [junit4]   2> 823983 INFO  (qtp821035710-4644) [n:127.0.0.1:33167_solr c:testschemaapi s:shard1 r:core_node1 x:testschemaapi_shard1_replica2] o.a.s.c.SyncStrategy Leader's attempt to sync with shard failed, moving to the next candidate
   [junit4]   2> 823983 INFO  (qtp821035710-4644) [n:127.0.0.1:33167_solr c:testschemaapi s:shard1 r:core_node1 x:testschemaapi_shard1_replica2] o.a.s.c.ShardLeaderElectionContext We failed sync, but we have no versions - we can't sync in that case - we were active before, so become leader anyway
   [junit4]   2> 823983 INFO  (qtp821035710-4644) [n:127.0.0.1:33167_solr c:testschemaapi s:shard1 r:core_node1 x:testschemaapi_shard1_replica2] o.a.s.c.c.SolrZkClient makePath: /collections/testschemaapi/leaders/shard1
   [junit4]   2> 823984 INFO  (qtp1480556557-4643) [n:127.0.0.1:33057_solr c:testschemaapi s:shard1 r:core_node2 x:testschemaapi_shard1_replica1] o.a.s.c.S.Request [testschemaapi_shard1_replica1]  webapp=/solr path=/get params={fingerprint=false&wt=javabin&version=2&getVersions=100&distrib=false&qt=/get} status=0 QTime=0
   [junit4]   2> 823984 INFO  (qtp821035710-4644) [n:127.0.0.1:33167_solr c:testschemaapi s:shard1 r:core_node1 x:testschemaapi_shard1_replica2] o.a.s.c.ShardLeaderElectionContextBase Creating leader registration node /collections/testschemaapi/leaders/shard1/leader after winning as /collections/testschemaapi/leader_elect/shard1/election/96109409573273606-core_node1-n_0000000000
   [junit4]   2> 823985 INFO  (qtp821035710-4644) [n:127.0.0.1:33167_solr c:testschemaapi s:shard1 r:core_node1 x:testschemaapi_shard1_replica2] o.a.s.c.ShardLeaderElectionContext I am the new leader: http://127.0.0.1:33167/solr/testschemaapi_shard1_replica2/ shard1
   [junit4]   2> 823985 INFO  (OverseerStateUpdate-96109409573273606-127.0.0.1:33167_solr-n_0000000000) [n:127.0.0.1:33167_solr    ] o.a.s.c.Overseer processMessage: queueSize: 1, message = {
   [junit4]   2>   "operation":"leader",
   [junit4]   2>   "shard":"shard1",
   [junit4]   2>   "collection":"testschemaapi",
   [junit4]   2>   "base_url":"http://127.0.0.1:33167/solr",
   [junit4]   2>   "core":"testschemaapi_shard1_replica2",
   [junit4]   2>   "state":"active"} current state version: 0
   [junit4]   2> 824086 INFO  (OverseerStateUpdate-96109409573273606-127.0.0.1:33167_solr-n_0000000000) [n:127.0.0.1:33167_solr    ] o.a.s.c.o.ZkStateWriter going to update_collection /collections/testschemaapi/state.json version: 1
   [junit4]   2> 824087 INFO  (zkCallback-605-thread-3-processing-n:127.0.0.1:33167_solr) [n:127.0.0.1:33167_solr    ] o.a.s.c.c.ZkStateReader A cluster state change: [WatchedEvent state:SyncConnected type:NodeDataChanged path:/collections/testschemaapi/state.json] for collection [testschemaapi] has occurred - updating... (live nodes size: [2])
   [junit4]   2> 824088 INFO  (zkCallback-605-thread-3-processing-n:127.0.0.1:33167_solr) [n:127.0.0.1:33167_solr    ] o.a.s.c.c.ZkStateReader Updating data for [testschemaapi] from [1] to [2]
   [junit4]   2> 824089 INFO  (zkCallback-604-thread-1-processing-n:127.0.0.1:33057_solr) [n:127.0.0.1:33057_solr    ] o.a.s.c.c.ZkStateReader A cluster state change: [WatchedEvent state:SyncConnected type:NodeDataChanged path:/collections/testschemaapi/state.json] for collection [testschemaapi] has occurred - updating... (live nodes size: [2])
   [junit4]   2> 824089 INFO  (zkCallback-604-thread-1-processing-n:127.0.0.1:33057_solr) [n:127.0.0.1:33057_solr    ] o.a.s.c.c.ZkStateReader Updating data for [testschemaapi] from [1] to [2]
   [junit4]   2> 824136 INFO  (qtp821035710-4644) [n:127.0.0.1:33167_solr c:testschemaapi s:shard1 r:core_node1 x:testschemaapi_shard1_replica2] o.a.s.c.ZkController We are http://127.0.0.1:33167/solr/testschemaapi_shard1_replica2/ and leader is http://127.0.0.1:33167/solr/testschemaapi_shard1_replica2/
   [junit4]   2> 824137 INFO  (qtp821035710-4644) [n:127.0.0.1:33167_solr c:testschemaapi s:shard1 r:core_node1 x:testschemaapi_shard1_replica2] o.a.s.c.ZkController No LogReplay needed for core=testschemaapi_shard1_replica2 baseURL=http://127.0.0.1:33167/solr
   [junit4]   2> 824137 INFO  (qtp821035710-4644) [n:127.0.0.1:33167_solr c:testschemaapi s:shard1 r:core_node1 x:testschemaapi_shard1_replica2] o.a.s.c.ZkController I am the leader, no recovery necessary
   [junit4]   2> 824137 INFO  (qtp821035710-4644) [n:127.0.0.1:33167_solr c:testschemaapi s:shard1 r:core_node1 x:testschemaapi_shard1_replica2] o.a.s.c.ZkController publishing state=active
   [junit4]   2> 824138 INFO  (OverseerStateUpdate-96109409573273606-127.0.0.1:33167_solr-n_0000000000) [n:127.0.0.1:33167_solr    ] o.a.s.c.Overseer processMessage: queueSize: 1, message = {
   [junit4]   2>   "state":"active",
   [junit4]   2>   "roles":null,
   [junit4]   2>   "core":"testschemaapi_shard1_replica2",
   [junit4]   2>   "base_url":"http://127.0.0.1:33167/solr",
   [junit4]   2>   "core_node_name":"core_node1",
   [junit4]   2>   "operation":"state",
   [junit4]   2>   "numShards":"1",
   [junit4]   2>   "shard":"shard1",
   [junit4]   2>   "node_name":"127.0.0.1:33167_solr",
   [junit4]   2>   "collection":"testschemaapi"} current state version: 0
   [junit4]   2> 824139 INFO  (OverseerStateUpdate-96109409573273606-127.0.0.1:33167_solr-n_0000000000) [n:127.0.0.1:33167_solr    ] o.a.s.c.o.ReplicaMutator Update state numShards=1 message={
   [junit4]   2>   "state":"active",
   [junit4]   2>   "roles":null,
   [junit4]   2>   "core":"testschemaapi_shard1_replica2",
   [junit4]   2>   "base_url":"http://127.0.0.1:33167/solr",
   [junit4]   2>   "core_node_name":"core_node1",
   [junit4]   2>   "operation":"state",
   [junit4]   2>   "numShards":"1",
   [junit4]   2>   "shard":"shard1",
   [junit4]   2>   "node_name":"127.0.0.1:33167_solr",
   [junit4]   2>   "collection":"testschemaapi"}
   [junit4]   2> 824139 INFO  (qtp821035710-4644) [n:127.0.0.1:33167_solr c:testschemaapi s:shard1 r:core_node1 x:testschemaapi_shard1_replica2] o.a.s.s.HttpSolrCall [admin] webapp=null path=/admin/cores params={name=testschemaapi_shard1_replica2&wt=javabin&version=2&qt=/admin/cores&numShards=1&shard=shard1&collection=testschemaapi&collection.configName=conf1&action=CREATE} status=0 QTime=1213
   [junit4]   2> 824241 INFO  (OverseerStateUpdate-96109409573273606-127.0.0.1:33167_solr-n_0000000000) [n:127.0.0.1:33167_solr    ] o.a.s.c.o.ZkStateWriter going to update_collection /collections/testschemaapi/state.json version: 2
   [junit4]   2> 824242 INFO  (zkCallback-605-thread-2-processing-n:127.0.0.1:33167_solr) [n:127.0.0.1:33167_solr    ] o.a.s.c.c.ZkStateReader A cluster state change: [WatchedEvent state:SyncConnected type:NodeDataChanged path:/collections/testschemaapi/state.json] for collection [testschemaapi] has occurred - updating... (live nodes size: [2])
   [junit4]   2> 824242 INFO  (zkCallback-604-thread-1-processing-n:127.0.0.1:33057_solr) [n:127.0.0.1:33057_solr    ] o.a.s.c.c.ZkStateReader A cluster state change: [WatchedEvent state:SyncConnected type:NodeDataChanged path:/collections/testschemaapi/state.json] for collection [testschemaapi] has occurred - updating... (live nodes size: [2])
   [junit4]   2> 824242 INFO  (zkCallback-604-thread-1-processing-n:127.0.0.1:33057_solr) [n:127.0.0.1:33057_solr    ] o.a.s.c.c.ZkStateReader Updating data for [testschemaapi] from [2] to [3]
   [junit4]   2> 824242 INFO  (zkCallback-605-thread-2-processing-n:127.0.0.1:33167_solr) [n:127.0.0.1:33167_solr    ] o.a.s.c.c.ZkStateReader Updating data for [testschemaapi] from [2] to [3]
   [junit4]   2> 824983 INFO  (qtp1480556557-4641) [n:127.0.0.1:33057_solr c:testschemaapi s:shard1 r:core_node2 x:testschemaapi_shard1_replica1] o.a.s.c.ZkController We are http://127.0.0.1:33057/solr/testschemaapi_shard1_replica1/ and leader is http://127.0.0.1:33167/solr/testschemaapi_shard1_replica2/
   [junit4]   2> 824983 INFO  (qtp1480556557-4641) [n:127.0.0.1:33057_solr c:testschemaapi s:shard1 r:core_node2 x:testschemaapi_shard1_replica1] o.a.s.c.ZkController No LogReplay needed for core=testschemaapi_shard1_replica1 baseURL=http://127.0.0.1:33057/solr
   [junit4]   2> 824983 INFO  (qtp1480556557-4641) [n:127.0.0.1:33057_solr c:testschemaapi s:shard1 r:core_node2 x:testschemaapi_shard1_replica1] o.a.s.c.ZkController Core needs to recover:testschemaapi_shard1_replica1
   [junit4]   2> 824984 INFO  (updateExecutor-599-thread-1-processing-x:testschemaapi_shard1_replica1 r:core_node2 n:127.0.0.1:33057_solr s:shard1 c:testschemaapi) [n:127.0.0.1:33057_solr c:testschemaapi s:shard1 r:core_node2 x:testschemaapi_shard1_re

[...truncated too long message...]

ainer.java:921)
   [junit4]   2> 	at org.apache.solr.core.SolrCore$11.run(SolrCore.java:2623)
   [junit4]   2> 	at org.apache.solr.cloud.ZkController$5.run(ZkController.java:2480)
   [junit4]   2> Caused by: org.apache.solr.common.SolrException: Could not load conf for core testschemaapi_shard1_replica2: Error attempting to access /configs/conf1/managed-schema
   [junit4]   2> 	at org.apache.solr.core.ConfigSetService.getConfig(ConfigSetService.java:84)
   [junit4]   2> 	at org.apache.solr.core.CoreContainer.reload(CoreContainer.java:914)
   [junit4]   2> 	... 2 more
   [junit4]   2> Caused by: org.apache.solr.common.SolrException: Error attempting to access /configs/conf1/managed-schema
   [junit4]   2> 	at org.apache.solr.schema.ManagedIndexSchemaFactory.create(ManagedIndexSchemaFactory.java:143)
   [junit4]   2> 	at org.apache.solr.schema.ManagedIndexSchemaFactory.create(ManagedIndexSchemaFactory.java:47)
   [junit4]   2> 	at org.apache.solr.schema.IndexSchemaFactory.buildIndexSchema(IndexSchemaFactory.java:70)
   [junit4]   2> 	at org.apache.solr.core.ConfigSetService.createIndexSchema(ConfigSetService.java:108)
   [junit4]   2> 	at org.apache.solr.core.ConfigSetService.getConfig(ConfigSetService.java:79)
   [junit4]   2> 	... 3 more
   [junit4]   2> Caused by: org.apache.zookeeper.KeeperException$SessionExpiredException: KeeperErrorCode = Session expired for /configs/conf1/managed-schema
   [junit4]   2> 	at org.apache.zookeeper.KeeperException.create(KeeperException.java:127)
   [junit4]   2> 	at org.apache.zookeeper.KeeperException.create(KeeperException.java:51)
   [junit4]   2> 	at org.apache.zookeeper.ZooKeeper.getData(ZooKeeper.java:1155)
   [junit4]   2> 	at org.apache.solr.common.cloud.SolrZkClient$7.execute(SolrZkClient.java:345)
   [junit4]   2> 	at org.apache.solr.common.cloud.SolrZkClient$7.execute(SolrZkClient.java:342)
   [junit4]   2> 	at org.apache.solr.common.cloud.ZkCmdExecutor.retryOperation(ZkCmdExecutor.java:60)
   [junit4]   2> 	at org.apache.solr.common.cloud.SolrZkClient.getData(SolrZkClient.java:342)
   [junit4]   2> 	at org.apache.solr.schema.ManagedIndexSchemaFactory.create(ManagedIndexSchemaFactory.java:128)
   [junit4]   2> 	... 7 more
   [junit4]   2> 833423 INFO  (Thread-1793) [    ] o.a.s.c.ZkTestServer connecting to 127.0.0.1:45674 45674
   [junit4]   2> 833425 WARN  (Thread-1793) [    ] o.a.s.c.ZkTestServer Watch limit violations: 
   [junit4]   2> Maximum concurrent create/delete watches above limit:
   [junit4]   2> 
   [junit4]   2> 	6	/solr/configs/conf1
   [junit4]   2> 	6	/solr/configs/conf1/managed-schema
   [junit4]   2> 	3	/solr/aliases.json
   [junit4]   2> 	2	/solr/security.json
   [junit4]   2> 
   [junit4]   2> Maximum concurrent data watches above limit:
   [junit4]   2> 
   [junit4]   2> 	3	/solr/clusterstate.json
   [junit4]   2> 	2	/solr/collections/testschemaapi/state.json
   [junit4]   2> 
   [junit4]   2> Maximum concurrent children watches above limit:
   [junit4]   2> 
   [junit4]   2> 	10	/solr/overseer/queue
   [junit4]   2> 	9	/solr/overseer/collection-queue-work
   [junit4]   2> 	3	/solr/overseer/queue-work
   [junit4]   2> 	3	/solr/live_nodes
   [junit4]   2> 	3	/solr/collections
   [junit4]   2> 
   [junit4]   2> 833425 INFO  (TEST-TestManagedSchemaAPI.test-seed#[9A10A170080020D0]) [    ] o.a.s.SolrTestCaseJ4 ###Ending test
   [junit4]   2> NOTE: reproduce with: ant test  -Dtestcase=TestManagedSchemaAPI -Dtests.method=test -Dtests.seed=9A10A170080020D0 -Dtests.multiplier=3 -Dtests.slow=true -Dtests.locale=en-SG -Dtests.timezone=America/Cuiaba -Dtests.asserts=true -Dtests.file.encoding=UTF-8
   [junit4] ERROR   10.8s J0 | TestManagedSchemaAPI.test <<<
   [junit4]    > Throwable #1: org.apache.solr.client.solrj.impl.CloudSolrClient$RouteException: Error from server at http://127.0.0.1:33167/solr/testschemaapi_shard1_replica2: ERROR: [doc=2] unknown field 'myNewField1'
   [junit4]    > 	at __randomizedtesting.SeedInfo.seed([9A10A170080020D0:12449EAAA6FC4D28]:0)
   [junit4]    > 	at org.apache.solr.client.solrj.impl.CloudSolrClient.directUpdate(CloudSolrClient.java:632)
   [junit4]    > 	at org.apache.solr.client.solrj.impl.CloudSolrClient.sendRequest(CloudSolrClient.java:981)
   [junit4]    > 	at org.apache.solr.client.solrj.impl.CloudSolrClient.requestWithRetryOnStaleState(CloudSolrClient.java:870)
   [junit4]    > 	at org.apache.solr.client.solrj.impl.CloudSolrClient.request(CloudSolrClient.java:806)
   [junit4]    > 	at org.apache.solr.schema.TestManagedSchemaAPI.testAddFieldAndDocument(TestManagedSchemaAPI.java:101)
   [junit4]    > 	at org.apache.solr.schema.TestManagedSchemaAPI.test(TestManagedSchemaAPI.java:69)
   [junit4]    > 	at java.lang.Thread.run(Thread.java:745)
   [junit4]    > Caused by: org.apache.solr.client.solrj.impl.HttpSolrClient$RemoteSolrException: Error from server at http://127.0.0.1:33167/solr/testschemaapi_shard1_replica2: ERROR: [doc=2] unknown field 'myNewField1'
   [junit4]    > 	at org.apache.solr.client.solrj.impl.HttpSolrClient.executeMethod(HttpSolrClient.java:577)
   [junit4]    > 	at org.apache.solr.client.solrj.impl.HttpSolrClient.request(HttpSolrClient.java:241)
   [junit4]    > 	at org.apache.solr.client.solrj.impl.HttpSolrClient.request(HttpSolrClient.java:230)
   [junit4]    > 	at org.apache.solr.client.solrj.impl.LBHttpSolrClient.doRequest(LBHttpSolrClient.java:372)
   [junit4]    > 	at org.apache.solr.client.solrj.impl.LBHttpSolrClient.request(LBHttpSolrClient.java:325)
   [junit4]    > 	at org.apache.solr.client.solrj.impl.CloudSolrClient$2.call(CloudSolrClient.java:607)
   [junit4]    > 	at org.apache.solr.client.solrj.impl.CloudSolrClient$2.call(CloudSolrClient.java:604)
   [junit4]    > 	at java.util.concurrent.FutureTask.run(FutureTask.java:262)
   [junit4]    > 	at org.apache.solr.common.util.ExecutorUtil$MDCAwareThreadPoolExecutor$1.run(ExecutorUtil.java:231)
   [junit4]    > 	at java.util.concurrent.ThreadPoolExecutor.runWorker(ThreadPoolExecutor.java:1145)
   [junit4]    > 	at java.util.concurrent.ThreadPoolExecutor$Worker.run(ThreadPoolExecutor.java:615)
   [junit4]    > 	... 1 more
   [junit4]   2> 833429 INFO  (SUITE-TestManagedSchemaAPI-seed#[9A10A170080020D0]-worker) [    ] o.a.s.SolrTestCaseJ4 ###deleteCore
   [junit4]   2> NOTE: leaving temporary files on disk at: /home/jenkins/workspace/Lucene-Solr-5.5-Linux/solr/build/solr-core/test/J0/temp/solr.schema.TestManagedSchemaAPI_9A10A170080020D0-001
   [junit4]   2> Jun 21, 2016 12:46:58 PM com.carrotsearch.randomizedtesting.ThreadLeakControl checkThreadLeaks
   [junit4]   2> WARNING: Will linger awaiting termination of 1 leaked thread(s).
   [junit4]   2> NOTE: test params are: codec=Asserting(Lucene54): {id=PostingsFormat(name=Memory doPackFST= false), _version_=PostingsFormat(name=LuceneVarGapFixedInterval), myNewField=PostingsFormat(name=Direct)}, docValues:{}, sim=DefaultSimilarity, locale=en-SG, timezone=America/Cuiaba
   [junit4]   2> NOTE: Linux 4.4.0-24-generic amd64/Oracle Corporation 1.7.0_80 (64-bit)/cpus=12,threads=1,free=301513072,total=482869248
   [junit4]   2> NOTE: All tests run in this JVM: [CleanupOldIndexTest, TestHdfsUpdateLog, UUIDFieldTest, TestFreeTextSuggestions, PeerSyncTest, RAMDirectoryFactoryTest, TestConfigSetsAPIExclusivity, TestConfig, SyncSliceTest, TestTrieFacet, DistribDocExpirationUpdateProcessorTest, TestArbitraryIndexDir, TestOverriddenPrefixQueryForCustomFieldType, TestSha256AuthenticationProvider, TestPhraseSuggestions, TestRealTimeGet, TestBinaryField, PreAnalyzedFieldTest, TestAnalyzeInfixSuggestions, TestFoldingMultitermQuery, TestOnReconnectListenerSupport, TestJsonRequest, BasicZkTest, TestConfigSetImmutable, TestShardHandlerFactory, PathHierarchyTokenizerFactoryTest, URLClassifyProcessorTest, AnalysisAfterCoreReloadTest, TestExpandComponent, TestChildDocTransformer, TestOmitPositions, TestLuceneMatchVersion, DeleteInactiveReplicaTest, TestAuthorizationFramework, TestBulkSchemaAPI, ShardSplitTest, PrimUtilsTest, HdfsRecoveryZkTest, SystemInfoHandlerTest, TestRandomFaceting, ZkNodePropsTest, JavabinLoaderTest, SynonymTokenizerTest, TestCollapseQParserPlugin, IgnoreCommitOptimizeUpdateProcessorFactoryTest, SolrRequestParserTest, CachingDirectoryFactoryTest, OutputWriterTest, DistributedSuggestComponentTest, TestMiniSolrCloudClusterBase, TestLeaderElectionZkExpiry, DistributedQueryElevationComponentTest, BasicDistributedZkTest, CopyFieldTest, DateFieldTest, BlockDirectoryTest, TestCloudPivotFacet, TestMaxScoreQueryParser, StandardRequestHandlerTest, DistributedFacetPivotLongTailTest, DistributedDebugComponentTest, HLLSerializationTest, TestFieldSortValues, TestManagedResource, TestManagedSchemaAPI]
   [junit4] Completed [238/573 (1!)] on J0 in 11.56s, 1 test, 1 error <<< FAILURES!

[...truncated 1065 lines...]
BUILD FAILED
/home/jenkins/workspace/Lucene-Solr-5.5-Linux/build.xml:750: The following error occurred while executing this line:
/home/jenkins/workspace/Lucene-Solr-5.5-Linux/build.xml:694: The following error occurred while executing this line:
/home/jenkins/workspace/Lucene-Solr-5.5-Linux/build.xml:59: The following error occurred while executing this line:
/home/jenkins/workspace/Lucene-Solr-5.5-Linux/solr/build.xml:233: The following error occurred while executing this line:
/home/jenkins/workspace/Lucene-Solr-5.5-Linux/solr/common-build.xml:534: The following error occurred while executing this line:
/home/jenkins/workspace/Lucene-Solr-5.5-Linux/lucene/common-build.xml:1477: The following error occurred while executing this line:
/home/jenkins/workspace/Lucene-Solr-5.5-Linux/lucene/common-build.xml:1033: There were test failures: 573 suites (7 ignored), 2319 tests, 1 error, 84 ignored (39 assumptions) [seed: 9A10A170080020D0]

Total time: 61 minutes 8 seconds
Build step 'Invoke Ant' marked build as failure
Archiving artifacts
[WARNINGS] Skipping publisher since build result is FAILURE
Recording test results
Email was triggered for: Failure - Any
Sending email for trigger: Failure - Any



Mime
View raw message