lucene-dev mailing list archives

Site index · List index
Message view « Date » · « Thread »
Top « Date » · « Thread »
From Policeman Jenkins Server <jenk...@thetaphi.de>
Subject [JENKINS-EA] Lucene-Solr-6.x-Linux (32bit/jdk-9-ea+124) - Build # 976 - Failure!
Date Mon, 27 Jun 2016 03:03:11 GMT
Build: http://jenkins.thetaphi.de/job/Lucene-Solr-6.x-Linux/976/
Java: 32bit/jdk-9-ea+124 -client -XX:+UseSerialGC

1 tests failed.
FAILED:  org.apache.solr.cloud.HttpPartitionTest.test

Error Message:
Doc with id=2 not found in http://127.0.0.1:42032/c8n_1x2_leader_session_loss due to: Path not found: /id; rsp={doc=null}

Stack Trace:
java.lang.AssertionError: Doc with id=2 not found in http://127.0.0.1:42032/c8n_1x2_leader_session_loss due to: Path not found: /id; rsp={doc=null}
	at __randomizedtesting.SeedInfo.seed([40E288E62AAF1C35:C8B6B73C845371CD]:0)
	at org.junit.Assert.fail(Assert.java:93)
	at org.junit.Assert.assertTrue(Assert.java:43)
	at org.apache.solr.cloud.HttpPartitionTest.assertDocExists(HttpPartitionTest.java:603)
	at org.apache.solr.cloud.HttpPartitionTest.assertDocsExistInAllReplicas(HttpPartitionTest.java:558)
	at org.apache.solr.cloud.HttpPartitionTest.testLeaderZkSessionLoss(HttpPartitionTest.java:506)
	at org.apache.solr.cloud.HttpPartitionTest.test(HttpPartitionTest.java:119)
	at jdk.internal.reflect.NativeMethodAccessorImpl.invoke0(java.base@9-ea/Native Method)
	at jdk.internal.reflect.NativeMethodAccessorImpl.invoke(java.base@9-ea/NativeMethodAccessorImpl.java:62)
	at jdk.internal.reflect.DelegatingMethodAccessorImpl.invoke(java.base@9-ea/DelegatingMethodAccessorImpl.java:43)
	at java.lang.reflect.Method.invoke(java.base@9-ea/Method.java:533)
	at com.carrotsearch.randomizedtesting.RandomizedRunner.invoke(RandomizedRunner.java:1764)
	at com.carrotsearch.randomizedtesting.RandomizedRunner$8.evaluate(RandomizedRunner.java:871)
	at com.carrotsearch.randomizedtesting.RandomizedRunner$9.evaluate(RandomizedRunner.java:907)
	at com.carrotsearch.randomizedtesting.RandomizedRunner$10.evaluate(RandomizedRunner.java:921)
	at org.apache.solr.BaseDistributedSearchTestCase$ShardsRepeatRule$ShardsFixedStatement.callStatement(BaseDistributedSearchTestCase.java:992)
	at org.apache.solr.BaseDistributedSearchTestCase$ShardsRepeatRule$ShardsStatement.evaluate(BaseDistributedSearchTestCase.java:967)
	at com.carrotsearch.randomizedtesting.rules.SystemPropertiesRestoreRule$1.evaluate(SystemPropertiesRestoreRule.java:57)
	at org.apache.lucene.util.TestRuleSetupTeardownChained$1.evaluate(TestRuleSetupTeardownChained.java:49)
	at org.apache.lucene.util.AbstractBeforeAfterRule$1.evaluate(AbstractBeforeAfterRule.java:45)
	at org.apache.lucene.util.TestRuleThreadAndTestName$1.evaluate(TestRuleThreadAndTestName.java:48)
	at org.apache.lucene.util.TestRuleIgnoreAfterMaxFailures$1.evaluate(TestRuleIgnoreAfterMaxFailures.java:64)
	at org.apache.lucene.util.TestRuleMarkFailure$1.evaluate(TestRuleMarkFailure.java:47)
	at com.carrotsearch.randomizedtesting.rules.StatementAdapter.evaluate(StatementAdapter.java:36)
	at com.carrotsearch.randomizedtesting.ThreadLeakControl$StatementRunner.run(ThreadLeakControl.java:367)
	at com.carrotsearch.randomizedtesting.ThreadLeakControl.forkTimeoutingTask(ThreadLeakControl.java:809)
	at com.carrotsearch.randomizedtesting.ThreadLeakControl$3.evaluate(ThreadLeakControl.java:460)
	at com.carrotsearch.randomizedtesting.RandomizedRunner.runSingleTest(RandomizedRunner.java:880)
	at com.carrotsearch.randomizedtesting.RandomizedRunner$5.evaluate(RandomizedRunner.java:781)
	at com.carrotsearch.randomizedtesting.RandomizedRunner$6.evaluate(RandomizedRunner.java:816)
	at com.carrotsearch.randomizedtesting.RandomizedRunner$7.evaluate(RandomizedRunner.java:827)
	at com.carrotsearch.randomizedtesting.rules.StatementAdapter.evaluate(StatementAdapter.java:36)
	at com.carrotsearch.randomizedtesting.rules.SystemPropertiesRestoreRule$1.evaluate(SystemPropertiesRestoreRule.java:57)
	at org.apache.lucene.util.AbstractBeforeAfterRule$1.evaluate(AbstractBeforeAfterRule.java:45)
	at com.carrotsearch.randomizedtesting.rules.StatementAdapter.evaluate(StatementAdapter.java:36)
	at org.apache.lucene.util.TestRuleStoreClassName$1.evaluate(TestRuleStoreClassName.java:41)
	at com.carrotsearch.randomizedtesting.rules.NoShadowingOrOverridesOnMethodsRule$1.evaluate(NoShadowingOrOverridesOnMethodsRule.java:40)
	at com.carrotsearch.randomizedtesting.rules.NoShadowingOrOverridesOnMethodsRule$1.evaluate(NoShadowingOrOverridesOnMethodsRule.java:40)
	at com.carrotsearch.randomizedtesting.rules.StatementAdapter.evaluate(StatementAdapter.java:36)
	at com.carrotsearch.randomizedtesting.rules.StatementAdapter.evaluate(StatementAdapter.java:36)
	at com.carrotsearch.randomizedtesting.rules.StatementAdapter.evaluate(StatementAdapter.java:36)
	at org.apache.lucene.util.TestRuleAssertionsRequired$1.evaluate(TestRuleAssertionsRequired.java:53)
	at org.apache.lucene.util.TestRuleMarkFailure$1.evaluate(TestRuleMarkFailure.java:47)
	at org.apache.lucene.util.TestRuleIgnoreAfterMaxFailures$1.evaluate(TestRuleIgnoreAfterMaxFailures.java:64)
	at org.apache.lucene.util.TestRuleIgnoreTestSuites$1.evaluate(TestRuleIgnoreTestSuites.java:54)
	at com.carrotsearch.randomizedtesting.rules.StatementAdapter.evaluate(StatementAdapter.java:36)
	at com.carrotsearch.randomizedtesting.ThreadLeakControl$StatementRunner.run(ThreadLeakControl.java:367)
	at java.lang.Thread.run(java.base@9-ea/Thread.java:843)




Build Log:
[...truncated 12123 lines...]
   [junit4] Suite: org.apache.solr.cloud.HttpPartitionTest
   [junit4]   2> Creating dataDir: /home/jenkins/workspace/Lucene-Solr-6.x-Linux/solr/build/solr-core/test/J1/temp/solr.cloud.HttpPartitionTest_40E288E62AAF1C35-001/init-core-data-001
   [junit4]   2> 1614115 INFO  (SUITE-HttpPartitionTest-seed#[40E288E62AAF1C35]-worker) [    ] o.a.s.SolrTestCaseJ4 Randomized ssl (false) and clientAuth (false) via: @org.apache.solr.SolrTestCaseJ4$SuppressSSL(bugUrl=https://issues.apache.org/jira/browse/SOLR-5776)
   [junit4]   2> 1614115 INFO  (SUITE-HttpPartitionTest-seed#[40E288E62AAF1C35]-worker) [    ] o.a.s.BaseDistributedSearchTestCase Setting hostContext system property: /
   [junit4]   2> 1614117 INFO  (TEST-HttpPartitionTest.test-seed#[40E288E62AAF1C35]) [    ] o.a.s.c.ZkTestServer STARTING ZK TEST SERVER
   [junit4]   2> 1614117 INFO  (Thread-4461) [    ] o.a.s.c.ZkTestServer client port:0.0.0.0/0.0.0.0:0
   [junit4]   2> 1614117 INFO  (Thread-4461) [    ] o.a.s.c.ZkTestServer Starting server
   [junit4]   2> 1614217 INFO  (TEST-HttpPartitionTest.test-seed#[40E288E62AAF1C35]) [    ] o.a.s.c.ZkTestServer start zk server on port:46250
   [junit4]   2> 1614217 INFO  (TEST-HttpPartitionTest.test-seed#[40E288E62AAF1C35]) [    ] o.a.s.c.c.SolrZkClient Using default ZkCredentialsProvider
   [junit4]   2> 1614218 INFO  (TEST-HttpPartitionTest.test-seed#[40E288E62AAF1C35]) [    ] o.a.s.c.c.ConnectionManager Waiting for client to connect to ZooKeeper
   [junit4]   2> 1614219 INFO  (zkCallback-1953-thread-1) [    ] o.a.s.c.c.ConnectionManager Watcher org.apache.solr.common.cloud.ConnectionManager@1bd9da3 name:ZooKeeperConnection Watcher:127.0.0.1:46250 got event WatchedEvent state:SyncConnected type:None path:null path:null type:None
   [junit4]   2> 1614219 INFO  (TEST-HttpPartitionTest.test-seed#[40E288E62AAF1C35]) [    ] o.a.s.c.c.ConnectionManager Client is connected to ZooKeeper
   [junit4]   2> 1614219 INFO  (TEST-HttpPartitionTest.test-seed#[40E288E62AAF1C35]) [    ] o.a.s.c.c.SolrZkClient Using default ZkACLProvider
   [junit4]   2> 1614220 INFO  (TEST-HttpPartitionTest.test-seed#[40E288E62AAF1C35]) [    ] o.a.s.c.c.SolrZkClient makePath: /solr
   [junit4]   2> 1614221 INFO  (TEST-HttpPartitionTest.test-seed#[40E288E62AAF1C35]) [    ] o.a.s.c.c.SolrZkClient Using default ZkCredentialsProvider
   [junit4]   2> 1614221 INFO  (TEST-HttpPartitionTest.test-seed#[40E288E62AAF1C35]) [    ] o.a.s.c.c.ConnectionManager Waiting for client to connect to ZooKeeper
   [junit4]   2> 1614222 INFO  (zkCallback-1954-thread-1) [    ] o.a.s.c.c.ConnectionManager Watcher org.apache.solr.common.cloud.ConnectionManager@19ef58f name:ZooKeeperConnection Watcher:127.0.0.1:46250/solr got event WatchedEvent state:SyncConnected type:None path:null path:null type:None
   [junit4]   2> 1614222 INFO  (TEST-HttpPartitionTest.test-seed#[40E288E62AAF1C35]) [    ] o.a.s.c.c.ConnectionManager Client is connected to ZooKeeper
   [junit4]   2> 1614222 INFO  (TEST-HttpPartitionTest.test-seed#[40E288E62AAF1C35]) [    ] o.a.s.c.c.SolrZkClient Using default ZkACLProvider
   [junit4]   2> 1614222 INFO  (TEST-HttpPartitionTest.test-seed#[40E288E62AAF1C35]) [    ] o.a.s.c.c.SolrZkClient makePath: /collections/collection1
   [junit4]   2> 1614223 INFO  (TEST-HttpPartitionTest.test-seed#[40E288E62AAF1C35]) [    ] o.a.s.c.c.SolrZkClient makePath: /collections/collection1/shards
   [junit4]   2> 1614224 INFO  (TEST-HttpPartitionTest.test-seed#[40E288E62AAF1C35]) [    ] o.a.s.c.c.SolrZkClient makePath: /collections/control_collection
   [junit4]   2> 1614224 INFO  (TEST-HttpPartitionTest.test-seed#[40E288E62AAF1C35]) [    ] o.a.s.c.c.SolrZkClient makePath: /collections/control_collection/shards
   [junit4]   2> 1614225 INFO  (TEST-HttpPartitionTest.test-seed#[40E288E62AAF1C35]) [    ] o.a.s.c.AbstractZkTestCase put /home/jenkins/workspace/Lucene-Solr-6.x-Linux/solr/core/src/test-files/solr/collection1/conf/solrconfig-tlog.xml to /configs/conf1/solrconfig.xml
   [junit4]   2> 1614225 INFO  (TEST-HttpPartitionTest.test-seed#[40E288E62AAF1C35]) [    ] o.a.s.c.c.SolrZkClient makePath: /configs/conf1/solrconfig.xml
   [junit4]   2> 1614226 INFO  (TEST-HttpPartitionTest.test-seed#[40E288E62AAF1C35]) [    ] o.a.s.c.AbstractZkTestCase put /home/jenkins/workspace/Lucene-Solr-6.x-Linux/solr/core/src/test-files/solr/collection1/conf/schema.xml to /configs/conf1/schema.xml
   [junit4]   2> 1614226 INFO  (TEST-HttpPartitionTest.test-seed#[40E288E62AAF1C35]) [    ] o.a.s.c.c.SolrZkClient makePath: /configs/conf1/schema.xml
   [junit4]   2> 1614227 INFO  (TEST-HttpPartitionTest.test-seed#[40E288E62AAF1C35]) [    ] o.a.s.c.AbstractZkTestCase put /home/jenkins/workspace/Lucene-Solr-6.x-Linux/solr/core/src/test-files/solr/collection1/conf/solrconfig.snippet.randomindexconfig.xml to /configs/conf1/solrconfig.snippet.randomindexconfig.xml
   [junit4]   2> 1614227 INFO  (TEST-HttpPartitionTest.test-seed#[40E288E62AAF1C35]) [    ] o.a.s.c.c.SolrZkClient makePath: /configs/conf1/solrconfig.snippet.randomindexconfig.xml
   [junit4]   2> 1614228 INFO  (TEST-HttpPartitionTest.test-seed#[40E288E62AAF1C35]) [    ] o.a.s.c.AbstractZkTestCase put /home/jenkins/workspace/Lucene-Solr-6.x-Linux/solr/core/src/test-files/solr/collection1/conf/stopwords.txt to /configs/conf1/stopwords.txt
   [junit4]   2> 1614228 INFO  (TEST-HttpPartitionTest.test-seed#[40E288E62AAF1C35]) [    ] o.a.s.c.c.SolrZkClient makePath: /configs/conf1/stopwords.txt
   [junit4]   2> 1614230 INFO  (TEST-HttpPartitionTest.test-seed#[40E288E62AAF1C35]) [    ] o.a.s.c.AbstractZkTestCase put /home/jenkins/workspace/Lucene-Solr-6.x-Linux/solr/core/src/test-files/solr/collection1/conf/protwords.txt to /configs/conf1/protwords.txt
   [junit4]   2> 1614230 INFO  (TEST-HttpPartitionTest.test-seed#[40E288E62AAF1C35]) [    ] o.a.s.c.c.SolrZkClient makePath: /configs/conf1/protwords.txt
   [junit4]   2> 1614230 INFO  (TEST-HttpPartitionTest.test-seed#[40E288E62AAF1C35]) [    ] o.a.s.c.AbstractZkTestCase put /home/jenkins/workspace/Lucene-Solr-6.x-Linux/solr/core/src/test-files/solr/collection1/conf/currency.xml to /configs/conf1/currency.xml
   [junit4]   2> 1614231 INFO  (TEST-HttpPartitionTest.test-seed#[40E288E62AAF1C35]) [    ] o.a.s.c.c.SolrZkClient makePath: /configs/conf1/currency.xml
   [junit4]   2> 1614231 INFO  (TEST-HttpPartitionTest.test-seed#[40E288E62AAF1C35]) [    ] o.a.s.c.AbstractZkTestCase put /home/jenkins/workspace/Lucene-Solr-6.x-Linux/solr/core/src/test-files/solr/collection1/conf/enumsConfig.xml to /configs/conf1/enumsConfig.xml
   [junit4]   2> 1614231 INFO  (TEST-HttpPartitionTest.test-seed#[40E288E62AAF1C35]) [    ] o.a.s.c.c.SolrZkClient makePath: /configs/conf1/enumsConfig.xml
   [junit4]   2> 1614232 INFO  (TEST-HttpPartitionTest.test-seed#[40E288E62AAF1C35]) [    ] o.a.s.c.AbstractZkTestCase put /home/jenkins/workspace/Lucene-Solr-6.x-Linux/solr/core/src/test-files/solr/collection1/conf/open-exchange-rates.json to /configs/conf1/open-exchange-rates.json
   [junit4]   2> 1614232 INFO  (TEST-HttpPartitionTest.test-seed#[40E288E62AAF1C35]) [    ] o.a.s.c.c.SolrZkClient makePath: /configs/conf1/open-exchange-rates.json
   [junit4]   2> 1614233 INFO  (TEST-HttpPartitionTest.test-seed#[40E288E62AAF1C35]) [    ] o.a.s.c.AbstractZkTestCase put /home/jenkins/workspace/Lucene-Solr-6.x-Linux/solr/core/src/test-files/solr/collection1/conf/mapping-ISOLatin1Accent.txt to /configs/conf1/mapping-ISOLatin1Accent.txt
   [junit4]   2> 1614233 INFO  (TEST-HttpPartitionTest.test-seed#[40E288E62AAF1C35]) [    ] o.a.s.c.c.SolrZkClient makePath: /configs/conf1/mapping-ISOLatin1Accent.txt
   [junit4]   2> 1614233 INFO  (TEST-HttpPartitionTest.test-seed#[40E288E62AAF1C35]) [    ] o.a.s.c.AbstractZkTestCase put /home/jenkins/workspace/Lucene-Solr-6.x-Linux/solr/core/src/test-files/solr/collection1/conf/old_synonyms.txt to /configs/conf1/old_synonyms.txt
   [junit4]   2> 1614234 INFO  (TEST-HttpPartitionTest.test-seed#[40E288E62AAF1C35]) [    ] o.a.s.c.c.SolrZkClient makePath: /configs/conf1/old_synonyms.txt
   [junit4]   2> 1614234 INFO  (TEST-HttpPartitionTest.test-seed#[40E288E62AAF1C35]) [    ] o.a.s.c.AbstractZkTestCase put /home/jenkins/workspace/Lucene-Solr-6.x-Linux/solr/core/src/test-files/solr/collection1/conf/synonyms.txt to /configs/conf1/synonyms.txt
   [junit4]   2> 1614234 INFO  (TEST-HttpPartitionTest.test-seed#[40E288E62AAF1C35]) [    ] o.a.s.c.c.SolrZkClient makePath: /configs/conf1/synonyms.txt
   [junit4]   2> 1614299 INFO  (TEST-HttpPartitionTest.test-seed#[40E288E62AAF1C35]) [    ] o.a.s.SolrTestCaseJ4 Writing core.properties file to /home/jenkins/workspace/Lucene-Solr-6.x-Linux/solr/build/solr-core/test/J1/temp/solr.cloud.HttpPartitionTest_40E288E62AAF1C35-001/control-001/cores/collection1
   [junit4]   2> 1614301 INFO  (TEST-HttpPartitionTest.test-seed#[40E288E62AAF1C35]) [    ] o.e.j.s.Server jetty-9.3.8.v20160314
   [junit4]   2> 1614302 INFO  (TEST-HttpPartitionTest.test-seed#[40E288E62AAF1C35]) [    ] o.e.j.s.h.ContextHandler Started o.e.j.s.ServletContextHandler@129f6e9{/,null,AVAILABLE}
   [junit4]   2> 1614302 INFO  (TEST-HttpPartitionTest.test-seed#[40E288E62AAF1C35]) [    ] o.e.j.s.ServerConnector Started ServerConnector@959369{HTTP/1.1,[http/1.1]}{127.0.0.1:35877}
   [junit4]   2> 1614302 INFO  (TEST-HttpPartitionTest.test-seed#[40E288E62AAF1C35]) [    ] o.e.j.s.Server Started @1615625ms
   [junit4]   2> 1614302 INFO  (TEST-HttpPartitionTest.test-seed#[40E288E62AAF1C35]) [    ] o.a.s.c.s.e.JettySolrRunner Jetty properties: {hostContext=/, solr.data.dir=/home/jenkins/workspace/Lucene-Solr-6.x-Linux/solr/build/solr-core/test/J1/temp/solr.cloud.HttpPartitionTest_40E288E62AAF1C35-001/tempDir-001/control/data, hostPort=42032, coreRootDirectory=/home/jenkins/workspace/Lucene-Solr-6.x-Linux/solr/build/solr-core/test/J1/temp/solr.cloud.HttpPartitionTest_40E288E62AAF1C35-001/control-001/cores}
   [junit4]   2> 1614303 INFO  (TEST-HttpPartitionTest.test-seed#[40E288E62AAF1C35]) [    ] o.a.s.s.SolrDispatchFilter SolrDispatchFilter.init(): jdk.internal.loader.ClassLoaders$AppClassLoader@864e92
   [junit4]   2> 1614303 INFO  (TEST-HttpPartitionTest.test-seed#[40E288E62AAF1C35]) [    ] o.a.s.c.SolrResourceLoader new SolrResourceLoader for directory: '/home/jenkins/workspace/Lucene-Solr-6.x-Linux/solr/build/solr-core/test/J1/temp/solr.cloud.HttpPartitionTest_40E288E62AAF1C35-001/control-001'
   [junit4]   2> 1614303 INFO  (TEST-HttpPartitionTest.test-seed#[40E288E62AAF1C35]) [    ] o.a.s.c.SolrResourceLoader JNDI not configured for solr (NoInitialContextEx)
   [junit4]   2> 1614303 INFO  (TEST-HttpPartitionTest.test-seed#[40E288E62AAF1C35]) [    ] o.a.s.c.SolrResourceLoader solr home defaulted to 'solr/' (could not find system property or JNDI)
   [junit4]   2> 1614303 INFO  (TEST-HttpPartitionTest.test-seed#[40E288E62AAF1C35]) [    ] o.a.s.c.c.SolrZkClient Using default ZkCredentialsProvider
   [junit4]   2> 1614304 INFO  (TEST-HttpPartitionTest.test-seed#[40E288E62AAF1C35]) [    ] o.a.s.c.c.ConnectionManager Waiting for client to connect to ZooKeeper
   [junit4]   2> 1614304 INFO  (zkCallback-1955-thread-1) [    ] o.a.s.c.c.ConnectionManager Watcher org.apache.solr.common.cloud.ConnectionManager@8b7443 name:ZooKeeperConnection Watcher:127.0.0.1:46250/solr got event WatchedEvent state:SyncConnected type:None path:null path:null type:None
   [junit4]   2> 1614304 INFO  (TEST-HttpPartitionTest.test-seed#[40E288E62AAF1C35]) [    ] o.a.s.c.c.ConnectionManager Client is connected to ZooKeeper
   [junit4]   2> 1614305 INFO  (TEST-HttpPartitionTest.test-seed#[40E288E62AAF1C35]) [    ] o.a.s.c.c.SolrZkClient Using default ZkACLProvider
   [junit4]   2> 1614306 INFO  (TEST-HttpPartitionTest.test-seed#[40E288E62AAF1C35]) [    ] o.a.s.s.SolrDispatchFilter Loading solr.xml from SolrHome (not found in ZooKeeper)
   [junit4]   2> 1614306 INFO  (TEST-HttpPartitionTest.test-seed#[40E288E62AAF1C35]) [    ] o.a.s.c.SolrXmlConfig Loading container configuration from /home/jenkins/workspace/Lucene-Solr-6.x-Linux/solr/build/solr-core/test/J1/temp/solr.cloud.HttpPartitionTest_40E288E62AAF1C35-001/control-001/solr.xml
   [junit4]   2> 1614310 INFO  (TEST-HttpPartitionTest.test-seed#[40E288E62AAF1C35]) [    ] o.a.s.c.CorePropertiesLocator Config-defined core root directory: /home/jenkins/workspace/Lucene-Solr-6.x-Linux/solr/build/solr-core/test/J1/temp/solr.cloud.HttpPartitionTest_40E288E62AAF1C35-001/control-001/cores
   [junit4]   2> 1614310 INFO  (TEST-HttpPartitionTest.test-seed#[40E288E62AAF1C35]) [    ] o.a.s.c.CoreContainer New CoreContainer 18305820
   [junit4]   2> 1614310 INFO  (TEST-HttpPartitionTest.test-seed#[40E288E62AAF1C35]) [    ] o.a.s.c.CoreContainer Loading cores into CoreContainer [instanceDir=/home/jenkins/workspace/Lucene-Solr-6.x-Linux/solr/build/solr-core/test/J1/temp/solr.cloud.HttpPartitionTest_40E288E62AAF1C35-001/control-001]
   [junit4]   2> 1614311 WARN  (TEST-HttpPartitionTest.test-seed#[40E288E62AAF1C35]) [    ] o.a.s.c.CoreContainer Couldn't add files from /home/jenkins/workspace/Lucene-Solr-6.x-Linux/solr/build/solr-core/test/J1/temp/solr.cloud.HttpPartitionTest_40E288E62AAF1C35-001/control-001/lib to classpath: /home/jenkins/workspace/Lucene-Solr-6.x-Linux/solr/build/solr-core/test/J1/temp/solr.cloud.HttpPartitionTest_40E288E62AAF1C35-001/control-001/lib
   [junit4]   2> 1614311 INFO  (TEST-HttpPartitionTest.test-seed#[40E288E62AAF1C35]) [    ] o.a.s.h.c.HttpShardHandlerFactory created with socketTimeout : 90000,urlScheme : ,connTimeout : 15000,maxConnectionsPerHost : 20,maxConnections : 10000,corePoolSize : 0,maximumPoolSize : 2147483647,maxThreadIdleTime : 5,sizeOfQueue : -1,fairnessPolicy : false,useRetries : false,
   [junit4]   2> 1614312 INFO  (TEST-HttpPartitionTest.test-seed#[40E288E62AAF1C35]) [    ] o.a.s.u.UpdateShardHandler Creating UpdateShardHandler HTTP client with params: socketTimeout=340000&connTimeout=45000&retry=true
   [junit4]   2> 1614312 INFO  (TEST-HttpPartitionTest.test-seed#[40E288E62AAF1C35]) [    ] o.a.s.l.LogWatcher SLF4J impl is org.slf4j.impl.Log4jLoggerFactory
   [junit4]   2> 1614312 INFO  (TEST-HttpPartitionTest.test-seed#[40E288E62AAF1C35]) [    ] o.a.s.l.LogWatcher Registering Log Listener [Log4j (org.slf4j.impl.Log4jLoggerFactory)]
   [junit4]   2> 1614312 INFO  (TEST-HttpPartitionTest.test-seed#[40E288E62AAF1C35]) [    ] o.a.s.c.ZkContainer Zookeeper client=127.0.0.1:46250/solr
   [junit4]   2> 1614312 INFO  (TEST-HttpPartitionTest.test-seed#[40E288E62AAF1C35]) [    ] o.a.s.c.ZkController zkHost includes chroot
   [junit4]   2> 1614312 INFO  (TEST-HttpPartitionTest.test-seed#[40E288E62AAF1C35]) [    ] o.a.s.c.c.SolrZkClient Using default ZkCredentialsProvider
   [junit4]   2> 1614313 INFO  (TEST-HttpPartitionTest.test-seed#[40E288E62AAF1C35]) [    ] o.a.s.c.c.ConnectionManager Waiting for client to connect to ZooKeeper
   [junit4]   2> 1614314 INFO  (zkCallback-1958-thread-1) [    ] o.a.s.c.c.ConnectionManager Watcher org.apache.solr.common.cloud.ConnectionManager@8a207c name:ZooKeeperConnection Watcher:127.0.0.1:46250 got event WatchedEvent state:SyncConnected type:None path:null path:null type:None
   [junit4]   2> 1614314 INFO  (TEST-HttpPartitionTest.test-seed#[40E288E62AAF1C35]) [    ] o.a.s.c.c.ConnectionManager Client is connected to ZooKeeper
   [junit4]   2> 1614314 INFO  (TEST-HttpPartitionTest.test-seed#[40E288E62AAF1C35]) [    ] o.a.s.c.c.SolrZkClient Using default ZkACLProvider
   [junit4]   2> 1614315 INFO  (TEST-HttpPartitionTest.test-seed#[40E288E62AAF1C35]) [    ] o.a.s.c.ZkController Added new OnReconnect listener org.apache.solr.cloud.ZkController$$Lambda$183/8568906@1148444
   [junit4]   2> 1614315 INFO  (TEST-HttpPartitionTest.test-seed#[40E288E62AAF1C35]) [    ] o.a.s.c.c.ConnectionManager Waiting for client to connect to ZooKeeper
   [junit4]   2> 1614316 INFO  (zkCallback-1959-thread-1) [    ] o.a.s.c.c.ConnectionManager Watcher org.apache.solr.common.cloud.ConnectionManager@ff1dc6 name:ZooKeeperConnection Watcher:127.0.0.1:46250/solr got event WatchedEvent state:SyncConnected type:None path:null path:null type:None
   [junit4]   2> 1614316 INFO  (TEST-HttpPartitionTest.test-seed#[40E288E62AAF1C35]) [    ] o.a.s.c.c.ConnectionManager Client is connected to ZooKeeper
   [junit4]   2> 1614317 INFO  (TEST-HttpPartitionTest.test-seed#[40E288E62AAF1C35]) [    ] o.a.s.c.c.SolrZkClient makePath: /overseer/queue
   [junit4]   2> 1614318 INFO  (TEST-HttpPartitionTest.test-seed#[40E288E62AAF1C35]) [    ] o.a.s.c.c.SolrZkClient makePath: /overseer/collection-queue-work
   [junit4]   2> 1614320 INFO  (TEST-HttpPartitionTest.test-seed#[40E288E62AAF1C35]) [    ] o.a.s.c.c.SolrZkClient makePath: /overseer/collection-map-running
   [junit4]   2> 1614320 INFO  (TEST-HttpPartitionTest.test-seed#[40E288E62AAF1C35]) [    ] o.a.s.c.c.SolrZkClient makePath: /overseer/collection-map-completed
   [junit4]   2> 1614321 INFO  (TEST-HttpPartitionTest.test-seed#[40E288E62AAF1C35]) [    ] o.a.s.c.c.SolrZkClient makePath: /overseer/collection-map-failure
   [junit4]   2> 1614322 INFO  (TEST-HttpPartitionTest.test-seed#[40E288E62AAF1C35]) [    ] o.a.s.c.c.SolrZkClient makePath: /live_nodes
   [junit4]   2> 1614323 INFO  (TEST-HttpPartitionTest.test-seed#[40E288E62AAF1C35]) [    ] o.a.s.c.c.SolrZkClient makePath: /aliases.json
   [junit4]   2> 1614323 INFO  (TEST-HttpPartitionTest.test-seed#[40E288E62AAF1C35]) [    ] o.a.s.c.c.SolrZkClient makePath: /clusterstate.json
   [junit4]   2> 1614324 INFO  (TEST-HttpPartitionTest.test-seed#[40E288E62AAF1C35]) [    ] o.a.s.c.c.SolrZkClient makePath: /security.json
   [junit4]   2> 1614324 INFO  (TEST-HttpPartitionTest.test-seed#[40E288E62AAF1C35]) [    ] o.a.s.c.c.ZkStateReader Updating cluster state from ZooKeeper... 
   [junit4]   2> 1614324 INFO  (TEST-HttpPartitionTest.test-seed#[40E288E62AAF1C35]) [    ] o.a.s.c.c.ZkStateReader Loaded empty cluster properties
   [junit4]   2> 1614325 INFO  (TEST-HttpPartitionTest.test-seed#[40E288E62AAF1C35]) [    ] o.a.s.c.c.ZkStateReader Updated live nodes from ZooKeeper... (0) -> (0)
   [junit4]   2> 1614326 INFO  (TEST-HttpPartitionTest.test-seed#[40E288E62AAF1C35]) [    ] o.a.s.c.c.SolrZkClient makePath: /overseer_elect
   [junit4]   2> 1614327 INFO  (TEST-HttpPartitionTest.test-seed#[40E288E62AAF1C35]) [    ] o.a.s.c.c.SolrZkClient makePath: /overseer_elect/election
   [junit4]   2> 1614327 INFO  (TEST-HttpPartitionTest.test-seed#[40E288E62AAF1C35]) [    ] o.a.s.c.Overseer Overseer (id=null) closing
   [junit4]   2> 1614328 INFO  (TEST-HttpPartitionTest.test-seed#[40E288E62AAF1C35]) [    ] o.a.s.c.LeaderElector Joined leadership election with path: /overseer_elect/election/96141046340452356-127.0.0.1:42032_-n_0000000000
   [junit4]   2> 1614328 INFO  (TEST-HttpPartitionTest.test-seed#[40E288E62AAF1C35]) [    ] o.a.s.c.OverseerElectionContext I am going to be the leader 127.0.0.1:42032_
   [junit4]   2> 1614328 INFO  (TEST-HttpPartitionTest.test-seed#[40E288E62AAF1C35]) [    ] o.a.s.c.c.SolrZkClient makePath: /overseer_elect/leader
   [junit4]   2> 1614328 INFO  (TEST-HttpPartitionTest.test-seed#[40E288E62AAF1C35]) [    ] o.a.s.c.Overseer Overseer (id=96141046340452356-127.0.0.1:42032_-n_0000000000) starting
   [junit4]   2> 1614329 INFO  (TEST-HttpPartitionTest.test-seed#[40E288E62AAF1C35]) [    ] o.a.s.c.c.SolrZkClient makePath: /overseer/queue-work
   [junit4]   2> 1614331 INFO  (TEST-HttpPartitionTest.test-seed#[40E288E62AAF1C35]) [    ] o.a.s.c.OverseerAutoReplicaFailoverThread Starting OverseerAutoReplicaFailoverThread autoReplicaFailoverWorkLoopDelay=10000 autoReplicaFailoverWaitAfterExpiration=30000 autoReplicaFailoverBadNodeExpiration=60000
   [junit4]   2> 1614331 INFO  (OverseerCollectionConfigSetProcessor-96141046340452356-127.0.0.1:42032_-n_0000000000) [    ] o.a.s.c.OverseerTaskProcessor Process current queue of overseer operations
   [junit4]   2> 1614331 INFO  (OverseerStateUpdate-96141046340452356-127.0.0.1:42032_-n_0000000000) [    ] o.a.s.c.Overseer Starting to work on the main queue
   [junit4]   2> 1614331 INFO  (TEST-HttpPartitionTest.test-seed#[40E288E62AAF1C35]) [    ] o.a.s.c.ZkController Register node as live in ZooKeeper:/live_nodes/127.0.0.1:42032_
   [junit4]   2> 1614332 INFO  (TEST-HttpPartitionTest.test-seed#[40E288E62AAF1C35]) [    ] o.a.s.c.c.SolrZkClient makePath: /live_nodes/127.0.0.1:42032_
   [junit4]   2> 1614332 INFO  (OverseerStateUpdate-96141046340452356-127.0.0.1:42032_-n_0000000000) [    ] o.a.s.c.c.ZkStateReader Updated live nodes from ZooKeeper... (0) -> (0)
   [junit4]   2> 1614333 INFO  (zkCallback-1959-thread-1) [    ] o.a.s.c.c.ZkStateReader A live node change: [WatchedEvent state:SyncConnected type:NodeChildrenChanged path:/live_nodes], has occurred - updating... (live nodes size: [0])
   [junit4]   2> 1614333 INFO  (zkCallback-1959-thread-1) [    ] o.a.s.c.c.ZkStateReader Updated live nodes from ZooKeeper... (0) -> (1)
   [junit4]   2> 1614372 INFO  (TEST-HttpPartitionTest.test-seed#[40E288E62AAF1C35]) [    ] o.a.s.c.CoreContainer Security conf doesn't exist. Skipping setup for authorization module.
   [junit4]   2> 1614372 INFO  (TEST-HttpPartitionTest.test-seed#[40E288E62AAF1C35]) [    ] o.a.s.c.CoreContainer No authentication plugin used.
   [junit4]   2> 1614372 INFO  (TEST-HttpPartitionTest.test-seed#[40E288E62AAF1C35]) [    ] o.a.s.c.CorePropertiesLocator Looking for core definitions underneath /home/jenkins/workspace/Lucene-Solr-6.x-Linux/solr/build/solr-core/test/J1/temp/solr.cloud.HttpPartitionTest_40E288E62AAF1C35-001/control-001/cores
   [junit4]   2> 1614373 INFO  (TEST-HttpPartitionTest.test-seed#[40E288E62AAF1C35]) [    ] o.a.s.c.CoreDescriptor Created CoreDescriptor: {schema=schema.xml, dataDir=data/, collection=control_collection, loadOnStartup=true, coreNodeName=, transient=false, name=collection1, shard=, config=solrconfig.xml, configSetProperties=configsetprops.json}
   [junit4]   2> 1614373 INFO  (TEST-HttpPartitionTest.test-seed#[40E288E62AAF1C35]) [    ] o.a.s.c.CorePropertiesLocator Found core collection1 in /home/jenkins/workspace/Lucene-Solr-6.x-Linux/solr/build/solr-core/test/J1/temp/solr.cloud.HttpPartitionTest_40E288E62AAF1C35-001/control-001/cores/collection1
   [junit4]   2> 1614374 INFO  (TEST-HttpPartitionTest.test-seed#[40E288E62AAF1C35]) [    ] o.a.s.c.CorePropertiesLocator Found 1 core definitions
   [junit4]   2> 1614374 INFO  (TEST-HttpPartitionTest.test-seed#[40E288E62AAF1C35]) [    ] o.a.s.s.SolrDispatchFilter user.dir=/home/jenkins/workspace/Lucene-Solr-6.x-Linux/solr/build/solr-core/test/J1
   [junit4]   2> 1614374 INFO  (TEST-HttpPartitionTest.test-seed#[40E288E62AAF1C35]) [    ] o.a.s.s.SolrDispatchFilter SolrDispatchFilter.init() done
   [junit4]   2> 1614374 INFO  (coreLoadExecutor-6326-thread-1) [    ] o.a.s.c.ZkController publishing state=down
   [junit4]   2> 1614375 INFO  (coreLoadExecutor-6326-thread-1) [    ] o.a.s.c.ZkController numShards not found on descriptor - reading it from system property
   [junit4]   2> 1614375 INFO  (coreLoadExecutor-6326-thread-1) [    ] o.a.s.c.ZkController Collection control_collection not visible yet, but flagging it so a watch is registered when it becomes visible
   [junit4]   2> 1614375 INFO  (OverseerStateUpdate-96141046340452356-127.0.0.1:42032_-n_0000000000) [    ] o.a.s.c.Overseer processMessage: queueSize: 1, message = {
   [junit4]   2>   "core":"collection1",
   [junit4]   2>   "roles":null,
   [junit4]   2>   "base_url":"http://127.0.0.1:42032",
   [junit4]   2>   "node_name":"127.0.0.1:42032_",
   [junit4]   2>   "numShards":"1",
   [junit4]   2>   "state":"down",
   [junit4]   2>   "shard":null,
   [junit4]   2>   "collection":"control_collection",
   [junit4]   2>   "operation":"state"} current state version: 0
   [junit4]   2> 1614376 INFO  (coreLoadExecutor-6326-thread-1) [    ] o.a.s.c.c.ZkStateReader Deleting data for [control_collection]
   [junit4]   2> 1614376 INFO  (OverseerStateUpdate-96141046340452356-127.0.0.1:42032_-n_0000000000) [    ] o.a.s.c.o.ReplicaMutator Update state numShards=1 message={
   [junit4]   2>   "core":"collection1",
   [junit4]   2>   "roles":null,
   [junit4]   2>   "base_url":"http://127.0.0.1:42032",
   [junit4]   2>   "node_name":"127.0.0.1:42032_",
   [junit4]   2>   "numShards":"1",
   [junit4]   2>   "state":"down",
   [junit4]   2>   "shard":null,
   [junit4]   2>   "collection":"control_collection",
   [junit4]   2>   "operation":"state"}
   [junit4]   2> 1614376 INFO  (OverseerStateUpdate-96141046340452356-127.0.0.1:42032_-n_0000000000) [    ] o.a.s.c.o.ClusterStateMutator building a new cName: control_collection
   [junit4]   2> 1614376 INFO  (coreLoadExecutor-6326-thread-1) [    ] o.a.s.c.ZkController look for our core node name
   [junit4]   2> 1614376 INFO  (OverseerStateUpdate-96141046340452356-127.0.0.1:42032_-n_0000000000) [    ] o.a.s.c.o.ReplicaMutator Assigning new node to shard shard=shard1
   [junit4]   2> 1614377 INFO  (zkCallback-1959-thread-1) [    ] o.a.s.c.c.ZkStateReader A cluster state change: [WatchedEvent state:SyncConnected type:NodeDataChanged path:/clusterstate.json], has occurred - updating... (live nodes size: [1])
   [junit4]   2> 1615376 INFO  (coreLoadExecutor-6326-thread-1) [    ] o.a.s.c.ZkController waiting to find shard id in clusterstate for collection1
   [junit4]   2> 1615376 INFO  (coreLoadExecutor-6326-thread-1) [    ] o.a.s.c.ZkController Check for collection zkNode:control_collection
   [junit4]   2> 1615377 INFO  (coreLoadExecutor-6326-thread-1) [    ] o.a.s.c.ZkController Collection zkNode exists
   [junit4]   2> 1615377 INFO  (coreLoadExecutor-6326-thread-1) [    ] o.a.s.c.c.ZkStateReader Load collection config from: [/collections/control_collection]
   [junit4]   2> 1615377 INFO  (coreLoadExecutor-6326-thread-1) [    ] o.a.s.c.c.ZkStateReader path=[/collections/control_collection] [configName]=[conf1] specified config exists in ZooKeeper
   [junit4]   2> 1615377 INFO  (coreLoadExecutor-6326-thread-1) [    ] o.a.s.c.SolrResourceLoader new SolrResourceLoader for directory: '/home/jenkins/workspace/Lucene-Solr-6.x-Linux/solr/build/solr-core/test/J1/temp/solr.cloud.HttpPartitionTest_40E288E62AAF1C35-001/control-001/cores/collection1'
   [junit4]   2> 1615378 INFO  (coreLoadExecutor-6326-thread-1) [    ] o.a.s.c.SolrResourceLoader JNDI not configured for solr (NoInitialContextEx)
   [junit4]   2> 1615378 INFO  (coreLoadExecutor-6326-thread-1) [    ] o.a.s.c.SolrResourceLoader solr home defaulted to 'solr/' (could not find system property or JNDI)
   [junit4]   2> 1615379 INFO  (coreLoadExecutor-6326-thread-1) [    ] o.a.s.c.Config loaded config solrconfig.xml with version 0 
   [junit4]   2> 1615383 INFO  (coreLoadExecutor-6326-thread-1) [    ] o.a.s.c.SolrConfig current version of requestparams : -1
   [junit4]   2> 1615397 INFO  (coreLoadExecutor-6326-thread-1) [    ] o.a.s.c.SolrConfig Using Lucene MatchVersion: 6.2.0
   [junit4]   2> 1615404 INFO  (coreLoadExecutor-6326-thread-1) [    ] o.a.s.c.SolrConfig Loaded SolrConfig: solrconfig.xml
   [junit4]   2> 1615411 INFO  (coreLoadExecutor-6326-thread-1) [    ] o.a.s.s.IndexSchema [collection1] Schema name=test
   [junit4]   2> 1615488 INFO  (coreLoadExecutor-6326-thread-1) [    ] o.a.s.s.OpenExchangeRatesOrgProvider Initialized with rates=open-exchange-rates.json, refreshInterval=1440.
   [junit4]   2> 1615493 INFO  (coreLoadExecutor-6326-thread-1) [    ] o.a.s.s.IndexSchema default search field in schema is text
   [junit4]   2> 1615494 INFO  (coreLoadExecutor-6326-thread-1) [    ] o.a.s.s.IndexSchema unique key field: id
   [junit4]   2> 1615500 INFO  (coreLoadExecutor-6326-thread-1) [    ] o.a.s.s.FileExchangeRateProvider Reloading exchange rates from file currency.xml
   [junit4]   2> 1615501 INFO  (coreLoadExecutor-6326-thread-1) [    ] o.a.s.s.FileExchangeRateProvider Reloading exchange rates from file currency.xml
   [junit4]   2> 1615503 INFO  (coreLoadExecutor-6326-thread-1) [    ] o.a.s.s.OpenExchangeRatesOrgProvider Reloading exchange rates from open-exchange-rates.json
   [junit4]   2> 1615503 INFO  (coreLoadExecutor-6326-thread-1) [    ] o.a.s.s.OpenExchangeRatesOrgProvider Reloading exchange rates from open-exchange-rates.json
   [junit4]   2> 1615504 INFO  (coreLoadExecutor-6326-thread-1) [    ] o.a.s.c.ConfigSetProperties Did not find ConfigSet properties, assuming default properties: Can't find resource 'configsetprops.json' in classpath or '/configs/conf1', cwd=/home/jenkins/workspace/Lucene-Solr-6.x-Linux/solr/build/solr-core/test/J1
   [junit4]   2> 1615504 INFO  (coreLoadExecutor-6326-thread-1) [    ] o.a.s.c.CoreContainer Creating SolrCore 'collection1' using configuration from collection control_collection
   [junit4]   2> 1615504 INFO  (coreLoadExecutor-6326-thread-1) [    ] o.a.s.c.SolrCore org.apache.solr.core.MockDirectoryFactory
   [junit4]   2> 1615505 INFO  (coreLoadExecutor-6326-thread-1) [    ] o.a.s.c.SolrCore [[collection1] ] Opening new SolrCore at [/home/jenkins/workspace/Lucene-Solr-6.x-Linux/solr/build/solr-core/test/J1/temp/solr.cloud.HttpPartitionTest_40E288E62AAF1C35-001/control-001/cores/collection1], dataDir=[/home/jenkins/workspace/Lucene-Solr-6.x-Linux/solr/build/solr-core/test/J1/temp/solr.cloud.HttpPartitionTest_40E288E62AAF1C35-001/control-001/cores/collection1/data/]
   [junit4]   2> 1615505 INFO  (coreLoadExecutor-6326-thread-1) [    ] o.a.s.c.JmxMonitoredMap JMX monitoring is enabled. Adding Solr mbeans to JMX Server: com.sun.jmx.mbeanserver.JmxMBeanServer@70c8d8
   [junit4]   2> 1615505 INFO  (coreLoadExecutor-6326-thread-1) [    ] o.a.s.c.CachingDirectoryFactory return new directory for /home/jenkins/workspace/Lucene-Solr-6.x-Linux/solr/build/solr-core/test/J1/temp/solr.cloud.HttpPartitionTest_40E288E62AAF1C35-001/control-001/cores/collection1/data
   [junit4]   2> 1615505 INFO  (coreLoadExecutor-6326-thread-1) [    ] o.a.s.c.SolrCore New index directory detected: old=null new=/home/jenkins/workspace/Lucene-Solr-6.x-Linux/solr/build/solr-core/test/J1/temp/solr.cloud.HttpPartitionTest_40E288E62AAF1C35-001/control-001/cores/collection1/data/index/
   [junit4]   2> 1615506 WARN  (coreLoadExecutor-6326-thread-1) [    ] o.a.s.c.SolrCore [collection1] Solr index directory '/home/jenkins/workspace/Lucene-Solr-6.x-Linux/solr/build/solr-core/test/J1/temp/solr.cloud.HttpPartitionTest_40E288E62AAF1C35-001/control-001/cores/collection1/data/index' doesn't exist. Creating new index...
   [junit4]   2> 1615506 INFO  (coreLoadExecutor-6326-thread-1) [    ] o.a.s.c.CachingDirectoryFactory return new directory for /home/jenkins/workspace/Lucene-Solr-6.x-Linux/solr/build/solr-core/test/J1/temp/solr.cloud.HttpPartitionTest_40E288E62AAF1C35-001/control-001/cores/collection1/data/index
   [junit4]   2> 1615506 INFO  (coreLoadExecutor-6326-thread-1) [    ] o.a.s.u.RandomMergePolicy RandomMergePolicy wrapping class org.apache.lucene.index.LogDocMergePolicy: [LogDocMergePolicy: minMergeSize=1000, mergeFactor=24, maxMergeSize=9223372036854775807, maxMergeSizeForForcedMerge=9223372036854775807, calibrateSizeByDeletes=false, maxMergeDocs=2147483647, maxCFSSegmentSizeMB=8.796093022207999E12, noCFSRatio=0.8887018239915925]
   [junit4]   2> 1615506 INFO  (coreLoadExecutor-6326-thread-1) [    ] o.a.s.c.SolrDeletionPolicy SolrDeletionPolicy.onCommit: commits: num=1
   [junit4]   2> 	commit{dir=MockDirectoryWrapper(RAMDirectory@1d0e5ba lockFactory=org.apache.lucene.store.SingleInstanceLockFactory@147e6e6),segFN=segments_1,generation=1}
   [junit4]   2> 1615506 INFO  (coreLoadExecutor-6326-thread-1) [    ] o.a.s.c.SolrDeletionPolicy newest commit generation = 1
   [junit4]   2> 1615507 INFO  (OldIndexDirectoryCleanupThreadForCore-collection1) [    ] o.a.s.c.SolrCore Looking for old index directories to cleanup for core collection1 in /home/jenkins/workspace/Lucene-Solr-6.x-Linux/solr/build/solr-core/test/J1/temp/solr.cloud.HttpPartitionTest_40E288E62AAF1C35-001/control-001/cores/collection1/data/
   [junit4]   2> 1615507 WARN  (OldIndexDirectoryCleanupThreadForCore-collection1) [    ] o.a.s.c.DirectoryFactory /home/jenkins/workspace/Lucene-Solr-6.x-Linux/solr/build/solr-core/test/J1/temp/solr.cloud.HttpPartitionTest_40E288E62AAF1C35-001/control-001/cores/collection1/data/ does not point to a valid data directory; skipping clean-up of old index directories.
   [junit4]   2> 1615509 INFO  (coreLoadExecutor-6326-thread-1) [    ] o.a.s.u.p.UpdateRequestProcessorChain creating updateRequestProcessorChain "nodistrib"
   [junit4]   2> 1615509 INFO  (coreLoadExecutor-6326-thread-1) [    ] o.a.s.u.p.UpdateRequestProcessorChain creating updateRequestProcessorChain "dedupe"
   [junit4]   2> 1615509 INFO  (coreLoadExecutor-6326-thread-1) [    ] o.a.s.u.p.UpdateRequestProcessorChain inserting DistributedUpdateProcessorFactory into updateRequestProcessorChain "dedupe"
   [junit4]   2> 1615509 INFO  (coreLoadExecutor-6326-thread-1) [    ] o.a.s.u.p.UpdateRequestProcessorChain creating updateRequestProcessorChain "stored_sig"
   [junit4]   2> 1615509 INFO  (coreLoadExecutor-6326-thread-1) [    ] o.a.s.u.p.UpdateRequestProcessorChain inserting DistributedUpdateProcessorFactory into updateRequestProcessorChain "stored_sig"
   [junit4]   2> 1615510 INFO  (coreLoadExecutor-6326-thread-1) [    ] o.a.s.u.p.UpdateRequestProcessorChain creating updateRequestProcessorChain "distrib-dup-test-chain-explicit"
   [junit4]   2> 1615510 INFO  (coreLoadExecutor-6326-thread-1) [    ] o.a.s.u.p.UpdateRequestProcessorChain creating updateRequestProcessorChain "distrib-dup-test-chain-implicit"
   [junit4]   2> 1615510 INFO  (coreLoadExecutor-6326-thread-1) [    ] o.a.s.u.p.UpdateRequestProcessorChain inserting DistributedUpdateProcessorFactory into updateRequestProcessorChain "distrib-dup-test-chain-implicit"
   [junit4]   2> 1615510 INFO  (coreLoadExecutor-6326-thread-1) [    ] o.a.s.c.SolrCore no updateRequestProcessorChain defined as default, creating implicit default
   [junit4]   2> 1615510 WARN  (coreLoadExecutor-6326-thread-1) [    ] o.a.s.c.RequestHandlers INVALID paramSet a in requestHandler {type = requestHandler,name = /dump,class = DumpRequestHandler,args = {defaults={a=A,b=B}}}
   [junit4]   2> 1615511 INFO  (coreLoadExecutor-6326-thread-1) [    ] o.a.s.h.l.XMLLoader xsltCacheLifetimeSeconds=60
   [junit4]   2> 1615512 INFO  (coreLoadExecutor-6326-thread-1) [    ] o.a.s.h.l.XMLLoader xsltCacheLifetimeSeconds=60
   [junit4]   2> 1615514 INFO  (coreLoadExecutor-6326-thread-1) [    ] o.a.s.h.l.XMLLoader xsltCacheLifetimeSeconds=60
   [junit4]   2> 1615514 INFO  (coreLoadExecutor-6326-thread-1) [    ] o.a.s.h.l.XMLLoader xsltCacheLifetimeSeconds=60
   [junit4]   2> 1615518 INFO  (coreLoadExecutor-6326-thread-1) [    ] o.a.s.c.RequestHandlers Registered paths: /admin/mbeans,standard,/update/json/docs,/admin/luke,/export,/get,/admin/properties,/update/json,/admin/threads,/dump,/update/csv,/sql,/graph,/admin/segments,/admin/system,/replication,/config,/stream,/schema,/admin/plugins,/admin/logging,/admin/ping,/update,/admin/file
   [junit4]   2> 1615518 INFO  (coreLoadExecutor-6326-thread-1) [    ] o.a.s.c.SolrCore Using default statsCache cache: org.apache.solr.search.stats.LocalStatsCache
   [junit4]   2> 1615519 INFO  (coreLoadExecutor-6326-thread-1) [    ] o.a.s.u.UpdateHandler Using UpdateLog implementation: org.apache.solr.update.UpdateLog
   [junit4]   2> 1615519 INFO  (coreLoadExecutor-6326-thread-1) [    ] o.a.s.u.UpdateLog Initializing UpdateLog: dataDir= defaultSyncLevel=FLUSH numRecordsToKeep=100 maxNumLogsToKeep=10 numVersionBuckets=65536
   [junit4]   2> 1615520 INFO  (coreLoadExecutor-6326-thread-1) [    ] o.a.s.u.CommitTracker Hard AutoCommit: disabled
   [junit4]   2> 1615520 INFO  (coreLoadExecutor-6326-thread-1) [    ] o.a.s.u.CommitTracker Soft AutoCommit: disabled
   [junit4]   2> 1615520 INFO  (coreLoadExecutor-6326-thread-1) [    ] o.a.s.u.RandomMergePolicy RandomMergePolicy wrapping class org.apache.lucene.index.LogByteSizeMergePolicy: [LogByteSizeMergePolicy: minMergeSize=1677721, mergeFactor=19, maxMergeSize=2147483648, maxMergeSizeForForcedMerge=9223372036854775807, calibrateSizeByDeletes=false, maxMergeDocs=2147483647, maxCFSSegmentSizeMB=8.796093022207999E12, noCFSRatio=1.0]
   [junit4]   2> 1615520 INFO  (coreLoadExecutor-6326-thread-1) [    ] o.a.s.c.SolrDeletionPolicy SolrDeletionPolicy.onInit: commits: num=1
   [junit4]   2> 	commit{dir=MockDirectoryWrapper(RAMDirectory@1d0e5ba lockFactory=org.apache.lucene.store.SingleInstanceLockFactory@147e6e6),segFN=segments_1,generation=1}
   [junit4]   2> 1615520 INFO  (coreLoadExecutor-6326-thread-1) [    ] o.a.s.c.SolrDeletionPolicy newest commit generation = 1
   [junit4]   2> 1615520 INFO  (coreLoadExecutor-6326-thread-1) [    ] o.a.s.s.SolrIndexSearcher Opening [Searcher@89dff7[collection1] main]
   [junit4]   2> 1615520 INFO  (coreLoadExecutor-6326-thread-1) [    ] o.a.s.c.c.ZkStateReader Load collection config from: [/collections/control_collection]
   [junit4]   2> 1615521 INFO  (coreLoadExecutor-6326-thread-1) [    ] o.a.s.c.c.ZkStateReader path=[/collections/control_collection] [configName]=[conf1] specified config exists in ZooKeeper
   [junit4]   2> 1615521 INFO  (coreLoadExecutor-6326-thread-1) [    ] o.a.s.r.ManagedResourceStorage Setting up ZooKeeper-based storage for the RestManager with znodeBase: /configs/conf1
   [junit4]   2> 1615521 INFO  (coreLoadExecutor-6326-thread-1) [    ] o.a.s.r.ManagedResourceStorage Configured ZooKeeperStorageIO with znodeBase: /configs/conf1
   [junit4]   2> 1615521 INFO  (coreLoadExecutor-6326-thread-1) [    ] o.a.s.r.RestManager Initializing RestManager with initArgs: {}
   [junit4]   2> 1615521 INFO  (coreLoadExecutor-6326-thread-1) [    ] o.a.s.r.ManagedResourceStorage Reading _rest_managed.json using ZooKeeperStorageIO:path=/configs/conf1
   [junit4]   2> 1615522 INFO  (coreLoadExecutor-6326-thread-1) [    ] o.a.s.r.ManagedResourceStorage No data found for znode /configs/conf1/_rest_managed.json
   [junit4]   2> 1615522 INFO  (coreLoadExecutor-6326-thread-1) [    ] o.a.s.r.ManagedResourceStorage Loaded null at path _rest_managed.json using ZooKeeperStorageIO:path=/configs/conf1
   [junit4]   2> 1615522 INFO  (coreLoadExecutor-6326-thread-1) [    ] o.a.s.r.RestManager Initializing 0 registered ManagedResources
   [junit4]   2> 1615522 INFO  (coreLoadExecutor-6326-thread-1) [    ] o.a.s.h.ReplicationHandler Commits will be reserved for  10000
   [junit4]   2> 1615523 INFO  (searcherExecutor-6327-thread-1) [    ] o.a.s.c.SolrCore [collection1] Registered new searcher Searcher@89dff7[collection1] main{ExitableDirectoryReader(UninvertingDirectoryReader())}
   [junit4]   2> 1615523 INFO  (coreLoadExecutor-6326-thread-1) [    ] o.a.s.u.UpdateLog Looking up max value of version field to seed version buckets
   [junit4]   2> 1615523 INFO  (coreLoadExecutor-6326-thread-1) [    ] o.a.s.u.VersionInfo Refreshing highest value of _version_ for 65536 version buckets from index
   [junit4]   2> 1615523 INFO  (coreLoadExecutor-6326-thread-1) [    ] o.a.s.u.VersionInfo No terms found for _version_, cannot seed version bucket highest value from index
   [junit4]   2> 1615523 INFO  (coreLoadExecutor-6326-thread-1) [    ] o.a.s.u.UpdateLog Could not find max version in index or recent updates, using new clock 1538256742920486912
   [junit4]   2> 1615525 INFO  (coreLoadExecutor-6326-thread-1) [    ] o.a.s.u.UpdateLog Took 2.0ms to seed version buckets with highest version 1538256742920486912
   [junit4]   2> 1615525 INFO  (coreLoadExecutor-6326-thread-1) [    ] o.a.s.c.ZkController watch zkdir /configs/conf1
   [junit4]   2> 1615526 INFO  (coreLoadExecutor-6326-thread-1) [    ] o.a.s.c.CoreContainer registering core: collection1
   [junit4]   2> 1615526 INFO  (coreZkRegister-6320-thread-1) [    ] o.a.s.c.ZkController Register replica - core:collection1 address:http://127.0.0.1:42032 collection:control_collection shard:shard1
   [junit4]   2> 1615526 INFO  (coreZkRegister-6320-thread-1) [    ] o.a.s.c.c.SolrZkClient makePath: /collections/control_collection/leader_elect/shard1/election
   [junit4]   2> 1615528 INFO  (coreZkRegister-6320-thread-1) [    ] o.a.s.c.LeaderElector Joined leadership election with path: /collections/control_collection/leader_elect/shard1/election/96141046340452356-core_node1-n_0000000000
   [junit4]   2> 1615528 INFO  (coreZkRegister-6320-thread-1) [    ] o.a.s.c.ShardLeaderElectionContext Running the leader process for shard=shard1 and weAreReplacement=false and leaderVoteWait=10000
   [junit4]   2> 1615529 INFO  (coreZkRegister-6320-thread-1) [    ] o.a.s.c.ShardLeaderElectionContext Enough replicas found to continue.
   [junit4]   2> 1615529 INFO  (coreZkRegister-6320-thread-1) [    ] o.a.s.c.ShardLeaderElectionContext I may be the new leader - try and sync
   [junit4]   2> 1615529 INFO  (coreZkRegister-6320-thread-1) [    ] o.a.s.c.SyncStrategy Sync replicas to http://127.0.0.1:42032/collection1/
   [junit4]   2> 1615529 INFO  (coreZkRegister-6320-thread-1) [    ] o.a.s.c.SyncStrategy Sync Success - now sync replicas to me
   [junit4]   2> 1615529 INFO  (OverseerStateUpdate-96141046340452356-127.0.0.1:42032_-n_0000000000) [    ] o.a.s.c.Overseer processMessage: queueSize: 1, message = {
   [junit4]   2>   "operation":"leader",
   [junit4]   2>   "shard":"shard1",
   [junit4]   2>   "collection":"control_collection"} current state version: 1
   [junit4]   2> 1615529 INFO  (coreZkRegister-6320-thread-1) [    ] o.a.s.c.SyncStrategy http://127.0.0.1:42032/collection1/ has no replicas
   [junit4]   2> 1615530 INFO  (coreZkRegister-6320-thread-1) [    ] o.a.s.c.c.SolrZkClient makePath: /collections/control_collection/leaders/shard1
   [junit4]   2> 1615542 INFO  (coreZkRegister-6320-thread-1) [    ] o.a.s.c.ShardLeaderElectionContextBase Creating leader registration node /collections/control_collection/leaders/shard1/leader after winning as /collections/control_collection/leader_elect/shard1/election/96141046340452356-core_node1-n_0000000000
   [junit4]   2> 1615543 INFO  (coreZkRegister-6320-thread-1) [    ] o.a.s.c.ShardLeaderElectionContext I am the new leader: http://127.0.0.1:42032/collection1/ shard1
   [junit4]   2> 1615543 INFO  (OverseerStateUpdate-96141046340452356-127.0.0.1:42032_-n_0000000000) [    ] o.a.s.c.Overseer processMessage: queueSize: 1, message = {
   [junit4]   2>   "operation":"leader",
   [junit4]   2>   "shard":"shard1",
   [junit4]   2>   "collection":"control_collection",
   [junit4]   2>   "base_url":"http://127.0.0.1:42032",
   [junit4]   2>   "core":"collection1",
   [junit4]   2>   "state":"active"} current state version: 1
   [junit4]   2> 1615644 INFO  (zkCallback-1959-thread-1) [    ] o.a.s.c.c.ZkStateReader A cluster state change: [WatchedEvent state:SyncConnected type:NodeDataChanged path:/clusterstate.json], has occurred - updating... (live nodes size: [1])
   [junit4]   2> 1615693 INFO  (coreZkRegister-6320-thread-1) [    ] o.a.s.c.ZkController We are http://127.0.0.1:42032/collection1/ and leader is http://127.0.0.1:42032/collection1/
   [junit4]   2> 1615694 INFO  (coreZkRegister-6320-thread-1) [    ] o.a.s.c.ZkController No LogReplay needed for core=collection1 baseURL=http://127.0.0.1:42032
   [junit4]   2> 1615694 INFO  (coreZkRegister-6320-thread-1) [    ] o.a.s.c.ZkController I am the leader, no recovery necessary
   [junit4]   2> 1615694 INFO  (coreZkRegister-6320-thread-1) [    ] o.a.s.c.ZkController publishing state=active
   [junit4]   2> 1615694 INFO  (coreZkRegister-6320-thread-1) [    ] o.a.s.c.ZkController numShards not found on descriptor - reading it from system property
   [junit4]   2> 1615695 INFO  (OverseerStateUpdate-96141046340452356-127.0.0.1:42032_-n_0000000000) [    ] o.a.s.c.Overseer processMessage: queueSize: 1, message = {
   [junit4]   2>   "core":"collection1",
   [junit4]   2>   "core_node_name":"core_node1",
   [junit4]   2>   "roles":null,
   [junit4]   2>   "base_url":"http://127.0.0.1:42032",
   [junit4]   2>   "node_name":"127.0.0.1:42032_",
   [junit4]   2>   "numShards":"1",
   [junit4]   2>   "state":"active",
   [junit4]   2>   "shard":"shard1",
   [junit4]   2>   "collection":"control_collection",
   [junit4]   2>   "operation":"state"} current state version: 2
   [junit4]   2> 1615695 INFO  (OverseerStateUpdate-96141046340452356-127.0.0.1:42032_-n_0000000000) [    ] o.a.s.c.o.ReplicaMutator Update state numShards=1 message={
   [junit4]   2>   "core":"collection1",
   [junit4]   2>   "core_node_name":"core_node1",
   [junit4]   2>   "roles":null,
   [junit4]   2>   "base_url":"http://127.0.0.1:42032",
   [junit4]   2>   "node_name":"127.0.0.1:42032_",
   [junit4]   2>   "numShards":"1",
   [junit4]   2>   "state":"active",
   [junit4]   2>   "shard":"shard1",
   [junit4]   2>   "collection":"control_collection",
   [junit4]   2>   "operation":"state"}
   [junit4]   2> 1615796 INFO  (zkCallback-1959-thread-2) [    ] o.a.s.c.c.ZkStateReader A cluster state change: [WatchedEvent state:SyncConnected type:NodeDataChanged path:/clusterstate.json], has occurred - updating... (live nodes size: [1])
   [junit4]   2> 1615877 INFO  (TEST-HttpPartitionTest.test-seed#[40E288E62AAF1C35]) [    ] o.a.s.c.c.SolrZkClient Using default ZkCredentialsProvider
   [junit4]   2> 1615877 INFO  (TEST-HttpPartitionTest.test-seed#[40E288E62AAF1C35]) [    ] o.a.s.c.c.ConnectionManager Waiting for client to connect to ZooKeeper
   [junit4]   2> 1615878 INFO  (zkCallback-1963-thread-1) [    ] o.a.s.c.c.ConnectionManager Watcher org.apache.solr.common.cloud.ConnectionManager@1a68539 name:ZooKeeperConnection Watcher:127.0.0.1:46250/solr got event WatchedEvent state:SyncConnected type:None path:null path:null type:None
   [junit4]   2> 1615878 INFO  (TEST-HttpPartitionTest.test-seed#[40E288E62AAF1C35]) [    ] o.a.s.c.c.ConnectionManager Client is connected to ZooKeeper
   [junit4]   2> 1615878 INFO  (TEST-HttpPartitionTest.test-seed#[40E288E62AAF1C35]) [    ] o.a.s.c.c.SolrZkClient Using default ZkACLProvider
   [junit4]   2> 1615878 INFO  (TEST-HttpPartitionTest.test-seed#[40E288E62AAF1C35]) [    ] o.a.s.c.c.ZkStateReader Updating cluster state from ZooKeeper... 
   [junit4]   2> 1615879 INFO  (TEST-HttpPartitionTest.test-seed#[40E288E62AAF1C35]) [    ] o.a.s.c.c.ZkStateReader Loaded empty cluster properties
   [junit4]   2> 1615879 INFO  (TEST-HttpPartitionTest.test-seed#[40E288E62AAF1C35]) [    ] o.a.s.c.c.ZkStateReader Updated live nodes from ZooKeeper... (0) -> (1)
   [junit4]   2> 1615880 INFO  (TEST-HttpPartitionTest.test-seed#[40E288E62AAF1C35]) [    ] o.a.s.c.ChaosMonkey monkey: init - expire sessions:false cause connection loss:false
   [junit4]   2> 1615944 INFO  (TEST-HttpPartitionTest.test-seed#[40E288E62AAF1C35]) [    ] o.a.s.SolrTestCaseJ4 Writing core.properties file to /home/jenkins/workspace/Lucene-Solr-6.x-Linux/solr/build/solr-core/test/J1/temp/solr.cloud.HttpPartitionTest_40E288E62AAF1C35-001/shard-1-001/cores/collection1
   [junit4]   2> 1615945 INFO  (TEST-HttpPartitionTest.test-seed#[40E288E62AAF1C35]) [    ] o.a.s.c.AbstractFullDistribZkTestBase create jetty 1 in directory /home/jenkins/workspace/Lucene-Solr-6.x-Linux/solr/build/solr-core/test/J1/temp/solr.cloud.HttpPartitionTest_40E288E62AAF1C35-001/shard-1-001
   [junit4]   2> 1615946 INFO  (TEST-HttpPartitionTest.test-seed#[40E288E62AAF1C35]) [    ] o.e.j.s.Server jetty-9.3.8.v20160314
   [junit4]   2> 1615946 INFO  (TEST-HttpPartitionTest.test-seed#[40E288E62AAF1C35]) [    ] o.e.j.s.h.ContextHandler Started o.e.j.s.ServletContextHandler@55a751{/,null,AVAILABLE}
   [junit4]   2> 1615947 INFO  (TEST-HttpPartitionTest.test-seed#[40E288E62AAF1C35]) [    ] o.e.j.s.ServerConnector Started ServerConnector@1153662{HTTP/1.1,[http/1.1]}{127.0.0.1:42804}
   [junit4]   2> 1615947 INFO  (TEST-HttpPartitionTest.test-seed#[40E288E62AAF1C35]) [    ] o.e.j.s.Server Started @1617270ms
   [junit4]   2> 1615947 INFO  (TEST-HttpPartitionTest.test-seed#[40E288E62AAF1C35]) [    ] o.a.s.c.s.e.JettySolrRunner Jetty properties: {hostContext=/, solrconfig=solrconfig.xml, solr.data.dir=/home/jenkins/workspace/Lucene-Solr-6.x-Linux/solr/build/solr-core/test/J1/temp/solr.cloud.HttpPartitionTest_40E288E62AAF1C35-001/tempDir-001/jetty1, hostPort=38852, coreRootDirectory=/home/jenkins/workspace/Lucene-Solr-6.x-Linux/solr/build/solr-core/test/J1/temp/solr.cloud.HttpPartitionTest_40E288E62AAF1C35-001/shard-1-001/cores}
   [junit4]   2> 1615947 INFO  (TEST-HttpPartitionTest.test-seed#[40E288E62AAF1C35]) [    ] o.a.s.s.SolrDispatchFilter SolrDispatchFilter.init(): jdk.internal.loader.ClassLoaders$AppClassLoader@864e92
   [junit4]   2> 1615947 INFO  (TEST-HttpPartitionTest.test-seed#[40E288E62AAF1C35]) [    ] o.a.s.c.SolrResourceLoader new SolrResourceLoader for directory: '/home/jenkins/workspace/Lucene-Solr-6.x-Linux/solr/build/solr-core/test/J1/temp/solr.cloud.HttpPartitionTest_40E288E62AAF1C35-001/shard-1-001'
   [junit4]   2> 1615948 INFO  (TEST-HttpPartitionTest.test-seed#[40E288E62AAF1C35]) [    ] o.a.s.c.SolrResourceLoader JNDI not configured for solr (NoInitialContextEx)
   [junit4]   2> 1615948 INFO  (TEST-HttpPartitionTest.test-seed#[40E288E62AAF1C35]) [    ] o.a.s.c.SolrResourceLoader solr home defaulted to 'solr/' (could not find system property or JNDI)
   [junit4]   2> 1615948 INFO  (TEST-HttpPartitionTest.test-seed#[40E288E62AAF1C35]) [    ] o.a.s.c.c.SolrZkClient Using default ZkCredentialsProvider
   [junit4]   2> 1615948 INFO  (TEST-HttpPartitionTest.test-seed#[40E288E62AAF1C35]) [    ] o.a.s.c.c.ConnectionManager Waiting for client to connect to ZooKeeper
   [junit4]   2> 1615949 INFO  (zkCallback-1964-thread-1) [    ] o.a.s.c.c.ConnectionManager Watcher org.apache.solr.common.cloud.ConnectionManager@6ba2af name:ZooKeeperConnection Watcher:127.0.0.1:46250/solr got event WatchedEvent state:SyncConnected type:None path:null path:null type:None
   [junit4]   2> 1615949 INFO  (TEST-HttpPartitionTest.test-seed#[40E288E62AAF1C35]) [    ] o.a.s.c.c.ConnectionManager Client is connected to ZooKeeper
   [junit4]   2> 1615950 INFO  (TEST-HttpPartitionTest.test-seed#[40E288E62AAF1C35]) [    ] o.a.s.c.c.SolrZkClient Using default ZkACLProvider
   [junit4]   2> 1615950 INFO  (TEST-HttpPartitionTest.test-seed#[40E288E62AAF1C35]) [    ] o.a.s.s.SolrDispatchFilter Loading solr.xml from SolrHome (not found in ZooKeeper)
   [junit4]   2> 1615950 INFO  (TEST-HttpPartitionTest.test-seed#[40E288E62AAF1C35]) [    ] o.a.s.c.SolrXmlConfig Loading container configuration from /home/jenkins/workspace/Lucene-Solr-6.x-Linux/solr/build/solr-core/test/J1/temp/solr.cloud.HttpPartitionTest_40E288E62AAF1C35-001/shard-1-001/solr.xml
   [junit4]   2> 1615954 INFO  (TEST-HttpPartitionTest.test-seed#[40E288E62AAF1C35]) [    ] o.a.s.c.CorePropertiesLocator Config-defined core root directory: /home/jenkins/workspace/Lucene-Solr-6.x-Linux/solr/build/solr-core/test/J1/temp/solr.cloud.HttpPartitionTest_40E288E62AAF1C35-001/shard-1-001/cores
   [junit4]   2> 1615954 INFO  (TEST-HttpPartitionTest.test-seed#[40E288E62AAF1C35]) [    ] o.a.s.c.CoreContainer New CoreContainer 19671704
   [junit4]   2> 1615954 INFO  (TEST-HttpPartitionTest.test-seed#[40E288E62AAF1C35]) [    ] o.a.s.c.CoreContainer Loading cores into CoreContainer [instanceDir=/home/jenkins/workspace/Lucene-Solr-6.x-Linux/solr/build/solr-core/test/J1/temp/solr.cloud.HttpPartitionTest_40E288E62AAF1C35-001/shard-1-001]
   [junit4]   2> 1615954 WARN  (TEST-HttpPartitionTest.test-seed#[40E288E62AAF1C35]) [    ] o.a.s.c.CoreContainer Couldn't add files from /home/jenkins/workspace/Lucene-Solr-6.x-Linux/solr/build/solr-core/test/J1/temp/solr.cloud.HttpPartitionTest_40E288E62AAF1C35-001/shard-1-001/lib to classpath: /home/jenkins/workspace/Lucene-Solr-6.x-Linux/solr/build/solr-core/test/J1/temp/solr.cloud.HttpPartitionTest_40E288E62AAF1C35-001/shard-1-001/lib
   [junit4]   2> 1615954 INFO  (TEST-HttpPartitionTest.test-seed#[40E288E62AAF1C35]) [    ] o.a.s.h.c.HttpShardHandlerFactory created with socketTimeout : 90000,urlScheme : ,connTimeout : 15000,maxConnectionsPerHost : 20,maxConnections : 10000,corePoolSize : 0,maximumPoolSize : 2147483647,maxThreadIdleTime : 5,sizeOfQueue : -1,fairnessPolicy : false,useRetries : false,
   [junit4]   2> 1615955 INFO  (TEST-HttpPartitionTest.test-seed#[40E288E62AAF1C35]) [    ] o.a.s.u.UpdateShardHandler Creating UpdateShardHandler HTTP client with params: socketTimeout=340000&connTimeout=45000&retry=true
   [junit4]   2> 1615955 INFO  (TEST-HttpPartitionTest.test-seed#[40E288E62AAF1C35]) [    ] o.a.s.l.LogWatcher SLF4J impl is org.slf4j.impl.Log4jLoggerFactory
   [junit4]   2> 1615955 INFO  (TEST-HttpPartitionTest.test-seed#[40E288E62AAF1C35]) [    ] o.a.s.l.LogWatcher Registering Log Listener [Log4j (org.slf4j.impl.Log4jLoggerFactory)]
   [junit4]   2> 1615956 INFO  (TEST-HttpPartitionTest.test-seed#[40E288E62AAF1C35]) [    ] o.a.s.c.ZkContainer Zookeeper client=127.0.0.1:46250/solr
   [junit4]   2> 1615956 INFO  (TEST-HttpPartitionTest.test-seed#[40E288E62AAF1C35]) [    ] o.a.s.c.ZkController zkHost includes chroot
   [junit4]   2> 1615956 INFO  (TEST-HttpPartitionTest.test-seed#[40E288E62AAF1C35]) [    ] o.a.s.c.c.SolrZkClient Using default ZkCredentialsProvider
   [junit4]   2> 1615956 INFO  (TEST-HttpPartitionTest.test-seed#[40E288E62AAF1C35]) [    ] o.a.s.c.c.ConnectionManager Waiting for client to connect to ZooKeeper
   [junit4]   2> 1615957 INFO  (zkCallback-1967-thread-1) [    ] o.a.s.c.c.ConnectionManager Watcher org.apache.solr.common.cloud.ConnectionManager@1dd166c name:ZooKeeperConnection Watcher:127.0.0.1:46250 got event WatchedEvent state:SyncConnected type:None path:null path:null type:None
   [junit4]   2> 1615957 INFO  (TEST-HttpPartitionTest.test-seed#[40E288E62AAF1C35]) [    ] o.a.s.c.c.ConnectionManager Client is connected to ZooKeeper
   [junit4]   2> 1615958 INFO  (TEST-HttpPartitionTest.test-seed#[40E288E62AAF1C35]) [    ] o.a.s.c.c.SolrZkClient Using default ZkACLProvider
   [junit4]   2> 1615958 INFO  (TEST-HttpPartitionTest.test-seed#[40E288E62AAF1C35]) [    ] o.a.s.c.ZkController Added new OnReconnect listener org.apache.solr.cloud.ZkController$$Lambda$183/8568906@fec9fb
   [junit4]   2> 1615959 INFO  (TEST-HttpPartitionTest.test-seed#[40E288E62AAF1C35]) [    ] o.a.s.c.c.ConnectionManager Waiting for client to connect to ZooKeeper
   [junit4]   2> 1615959 INFO  (zkCallback-1968-thread-1) [    ] o.a.s.c.c.ConnectionManager Watcher org.apache.solr.common.cloud.ConnectionManager@8bb6ad name:ZooKeeperConnection Watcher:127.0.0.1:46250/solr got event WatchedEvent state:SyncConnected type:None path:null path:null type:None
   [junit4]   2> 1615959 INFO  (TEST-HttpPartitionTest.test-seed#[40E288E62AAF1C35]) [    ] o.a.s.c.c.ConnectionManager Client is connected to ZooKeeper
   [junit4]   2> 1615962 INFO  (TEST-HttpPartitionTest.test-seed#[40E288E62AAF1C35]) [    ] o.a.s.c.c.ZkStateReader Updating cluster state from ZooKeeper... 
   [junit4]   2> 1615962 INFO  (TEST-HttpPartitionTest.test-seed#[40E288E62AAF1C35]) [    ] o.a.s.c.c.ZkStateReader Loaded empty cluster properties
   [junit4]   2> 1615963 INFO  (TEST-HttpPartitionTest.test-seed#[40E288E62AAF1C35]) [    ] o.a.s.c.c.ZkStateReader Updated live nodes from ZooKeeper... (0) -> (1)
   [junit4]   2> 1615964 INFO  (TEST-HttpPartitionTest.test-seed#[40E288E62AAF1C35]) [    ] o.a.s.c.Overseer Overseer (id=null) closing
   [junit4]   2> 1615964 INFO  (TEST-HttpPartitionTest.test-seed#[40E288E62AAF1C35]) [    ] o.a.s.c.LeaderElector Joined leadership election with path: /overseer_elect/election/96141046340452360-127.0.0.1:38852_-n_0000000001
   [junit4]   2> 1615964 INFO  (TEST-HttpPartitionTest.test-seed#[40E288E62AAF1C35]) [    ] o.a.s.c.LeaderElector Watching path /overseer_elect/election/96141046340452356-127.0.0.1:42032_-n_0000000000 to know if I could be the leader
   [junit4]   2> 1615964 INFO  (TEST-HttpPartitionTest.test-seed#[40E288E62AAF1C35]) [    ] o.a.s.c.ZkController Publish node=127.0.0.1:38852_ as DOWN
   [junit4]   2> 1615965 INFO  (OverseerStateUpdate-96141046340452356-127.0.0.1:42032_-n_0000000000) [    ] o.a.s.c.Overseer processMessage: queueSize: 1, message = {
   [junit4]   2>   "operation":"downnode",
   [junit4]   2>   "node_name":"127.0.0.1:38852_"} current state version: 3
   [junit4]   2> 1615965 INFO  (OverseerStateUpdate-96141046340452356-127.0.0.1:42032_-n_0000000000) [    ] o.a.s.c.o.NodeMutator DownNode state invoked for node: 127.0.0.1:38852_
   [junit4]   2> 1616067 INFO  (zkCallback-1959-thread-2) [    ] o.a.s.c.c.ZkStateReader A cluster state change: [WatchedEvent state:SyncConnected type:NodeDataChanged path:/clusterstate.json], has occurred - updating... (live nodes size: [1])
   [junit4]   2> 1616067 INFO  (zkCallback-1963-thread-1) [    ] o.a.s.c.c.ZkStateReader A cluster state change: [WatchedEvent state:SyncConnected type:NodeDataChanged path:/clusterstate.json], has occurred - updating... (live nodes size: [1])
   [junit4]   2> 1616069 INFO  (zkCallback-1968-thread-1) [    ] o.a.s.c.c.ZkStateReader A cluster state change: [WatchedEvent state:SyncConnected type:NodeDataChanged path:/clusterstate.json], has occurred - updating... (live nodes size: [1])
   [junit4]   2> 1616965 INFO  (TEST-HttpPartitionTest.test-seed#[40E288E62AAF1C35]) [    ] o.a.s.c.ZkController Register node as live in ZooKeeper:/live_nodes/127.0.0.1:38852_
   [junit4]   2> 1616966 INFO  (TEST-HttpPartitionTest.test-seed#[40E288E62AAF1C35]) [    ] o.a.s.c.c.SolrZkClient makePath: /live_nodes/127.0.0.1:38852_
   [junit4]   2> 1616967 INFO  (zkCallback-1959-thread-2) [    ] o.a.s.c.c.ZkStateReader A live node change: [WatchedEvent state:SyncConnected type:NodeChildrenChanged path:/live_nodes], has occurred - updating... (live nodes size: [1])
   [junit4]   2> 1616967 INFO  (zkCallback-1968-thread-1) [    ] o.a.s.c.c.ZkStateReader A live node change: [WatchedEvent state:SyncConnected type:NodeChildrenChanged path:/live_nodes], has occurred - updating... (live nodes size: [1])
   [junit4]   2> 1616967 INFO  (zkCallback-1963-thread-1) [    ] o.a.s.c.c.ZkStateReader A live node change: [WatchedEvent state:SyncConnected type:NodeChildrenChanged path:/live_nodes], has occurred - updating... (live nodes size: [1])
   [junit4]   2> 1616967 INFO  (zkCallback-1959-thread-2) [    ] o.a.s.c.c.ZkStateReader Updated live nodes from ZooKeeper... (1) -> (2)
   [junit4]   2> 1616967 INFO  (zkCallback-1968-thread-1) [    ] o.a.s.c.c.ZkStateReader Updated live nodes from ZooKeeper... (1) -> (2)
   [junit4]   2> 1616967 INFO  (zkCallback-1963-thread-1) [    ] o.a.s.c.c.ZkStateReader Updated live nodes from ZooKeeper... (1) -> (2)
   [junit4]   2> 1616993 INFO  (TEST-HttpPartitionTest.test-seed#[40E288E62AAF1C35]) [    ] o.a.s.c.CoreContainer Security conf doesn't exist. Skipping setup for authorization module.
   [junit4]   2> 1616993 INFO  (TEST-HttpPartitionTest.test-seed#[40E288E62AAF1C35]) [    ] o.a.s.c.CoreContainer No authentication plugin used.
   [junit4]   2> 1616993 INFO  (TEST-HttpPartitionTest.test-seed#[40E288E62AAF1C35]) [    ] o.a.s.c.CorePropertiesLocator Looking for core definitions underneath /home/jenkins/workspace/Lucene-Solr-6.x-Linux/solr/build/solr-core/test/J1/temp/solr.cloud.HttpPartitionTest_40E288E62AAF1C35-001/shard-1-001/cores
   [junit4]   2> 1616994 INFO  (TEST-HttpPartitionTest.test-seed#[40E288E62AAF1C35]) [    ] o.a.s.c.CoreDescriptor Created CoreDescriptor: {schema=schema.xml, dataDir=data/, collection=collection1, loadOnStartup=true, coreNodeName=, transient=false, name=collection1, shard=, config=solrconfig.xml, configSetProperties=configsetprops.json}
   [junit4]   2> 1616994 INFO  (TEST-HttpPartitionTest.test-seed#[40E288E62AAF1C35]) [    ] o.a.s.c.CorePropertiesLocator Found core collection1 in /home/jenkins/workspace/Lucene-Solr-6.x-Linux/solr/build/solr-core/test/J1/temp/solr.cloud.HttpPartitionTest_40E288E62AAF1C35-001/shard-1-001/cores/collection1
   [junit4]   2> 1616994 INFO  (TEST-HttpPartitionTest.test-seed#[40E288E62AAF1C35]) [    ] o.a.s.c.CorePropertiesLocator Found 1 core definitions
   [junit4]   2> 1616995 INFO  (TEST-HttpPartitionTest.test-seed#[40E288E62AAF1C35]) [    ] o.a.s.s.SolrDispatchFilter user.dir=/home/jenkins/workspace/Lucene-Solr-6.x-Linux/solr/build/solr-core/test/J1
   [junit4]   2> 1616995 INFO  (coreLoadExecutor-6337-thread-1) [    ] o.a.s.c.ZkController publishing state=down
   [junit4]   2> 1616995 INFO  (TEST-HttpPartitionTest.test-seed#[40E288E62AAF1C35]) [    ] o.a.s.s.SolrDispatchFilter SolrDispatchFilter.init() done
   [junit4]   2> 1616995 INFO  (coreLoadExecutor-6337-thread-1) [    ] o.a.s.c.ZkController numShards not found on descriptor - reading it from system property
   [junit4]   2> 1616996 INFO  (coreLoadExecutor-6337-thread-1) [    ] o.a.s.c.ZkController Collection collection1 not visible yet, but flagging it so a watch is registered when it becomes visible
   [junit4]   2> 1616997 INFO  (OverseerStateUpdate-96141046340452356-127.0.0.1:42032_-n_0000000000) [    ] o.a.s.c.Overseer processMessage: queueSize: 1, message = {
   [junit4]   2>   "core":"collection1",
   [junit4]   2>   "roles":null,
   [junit4]   2>   "base_url":"http://127.0.0.1:38852",
   [junit4]   2>   "node_name":"127.0.0.1:38852_",
   [junit4]   2>   "numShards":"2",
   [junit4]   2>   "state":"down",
   [junit4]   2>   "shard":null,
   [junit4]   2>   "collection":"collection1",
   [junit4]   2>   "operation":"state"} current state version: 4
   [junit4]   2> 1616997 INFO  (coreLoadExecutor-6337-thread-1) [    ] o.a.s.c.c.ZkStateReader Deleting data for [collection1]
   [junit4]   2> 1616997 INFO  (OverseerStateUpdate-96141046340452356-127.0.0.1:42032_-n_0000000000) [    ] o.a.s.c.o.ReplicaMutator Update state numShards=2 message={
   [junit4]   2>   "core":"collection1",
   [junit4]   2>   "roles":null,
   [junit4]   2>   "base_url":"http://127.0.0.1:38852",
   [junit4]   2>   "node_name":"127.0.0.1:38852_",
   [junit4]   2>   "numShards":"2",
   [junit4]   2>   "state":"down",
   [junit4]   2>   "shard":null,
   [junit4]   2>   "collection":"collection1",
   [junit4]   2>   "operation":"state"}
   [junit4]   2> 1616997 INFO  (OverseerStateUpdate-96141046340452356-127.0.0.1:42032_-n_0000000000) [    ] o.a.s.c.o.ClusterStateMutator building a new cName: collection1
   [junit4]   2> 1616997 INFO  (OverseerStateUpdate-96141046340452356-127.0.0.1:42032_-n_0000000000) [    ] o.a.s.c.o.ReplicaMutator Assigning new node to shard shard=shard2
   [junit4]   2> 1616997 INFO  (coreLoadExecutor-6337-thread-1) [    ] o.a.s.c.ZkController look for our core node name
   [junit4]   2> 1617098 INFO  (zkCallback-1959-thread-1) [    ] o.a.s.c.c.ZkStateReader A cluster state change: [WatchedEvent state:SyncConnected type:NodeDataChanged path:/clusterstate.json], has occurred - updating... (live nodes size: [2])
   [junit4]   2> 1617098 INFO  (zkCallback-1968-thread-1) [    ] o.a.s.c.c.ZkStateReader A cluster state change: [WatchedEvent state:SyncConnected type:NodeDataChanged path:/clusterstate.json], has occurred - updating... (live nodes size: [2])
   [junit4]   2> 1617098 INFO  (zkCallback-1963-thread-1) [    ] o.a.s.c.c.ZkStateReader A cluster state change: [WatchedEvent state:SyncConnected type:NodeDataChanged path:/clusterstate.json], has occurred - updating... (live nodes size: [2])
   [junit4]   2> 1617998 INFO  (coreLoadExecutor-6337-thread-1) [    ] o.a.s.c.ZkController waiting to find shard id in clusterstate for collection1
   [junit4]   2> 1617998 INFO  (coreLoadExecutor-6337-thread-1) [    ] o.a.s.c.ZkController Check for collection zkNode:collection1
   [junit4]   2> 1617998 INFO  (coreLoadExecutor-6337-thread-1) [    ] o.a.s.c.ZkController Collection zkNode exists
   [junit4]   2> 1617998 INFO  (coreLoadExecutor-6337-thread-1) [    ] o.a.s.c.c.ZkStateReader Load collection config from: [/collections/collection1]
   [junit4]   2> 1617998 INFO  (coreLoadExecutor-6337-thread-1) [    ] o.a.s.c.c.ZkStateReader path=[/collections/collection1] [configName]=[conf1] specified config exists in ZooKeeper
   [junit4]   2> 1617998 INFO  (coreLoadExecutor-6337-thread-1) [    ] o.a.s.c.SolrResourceLoader new SolrResourceLoader for directory: '/home/jenkins/workspace/Lucene-Solr-6.x-Linux/solr/build/solr-core/test/J1/temp/solr.cloud.HttpPartitionTest_40E288E62AAF1C35-001/shard-1-001/cores/collection1'
   [junit4]   2> 1617999 INFO  (coreLoadExecutor-6337-thread-1) [    ] o.a.s.c.SolrResourceLoader JNDI not configured for solr (NoInitialContextEx)
   [junit4]   2> 1617999 INFO  (coreLoadExecutor-6337-thread-1) [    ] o.a.s.c.SolrResourceLoader solr home defaulted to 'solr/' (could not find system property or JNDI)
   [junit4]   2> 1618000 INFO  (coreLoadExecutor-6337-thread-1) [    ] o.a.s.c.Config loaded config solrconfig.xml with version 0 
   [junit4]   2> 1618003 INFO  (coreLoadExecutor-6337-thread-1) [    ] o.a.s.c.SolrConfig current version of requestparams : -1
   [junit4]   2> 1618007 INFO  (coreLoadExecutor-6337-thread-1) [    ] o.a.s.c.SolrConfig Using Lucene MatchVersion: 6.2.0
   [junit4]   2> 1618014 INFO  (coreLoadExecutor-6337-thread-1) [    ] o.a.s.c.SolrConfig Loaded SolrConfig: solrconfig.xml
   [junit4]   2> 1618020 INFO  (coreLoadExecutor-6337-thread-1) [    ] o.a.s.s.IndexSchema [collection1] Schema name=test
   [junit4]   2> 1618112 INFO  (coreLoadExecutor-6337-thread-1) [    ] o.a.s.s.OpenExchangeRatesOrgProvider Initialized with rates=open-exchange-rates.json, refreshInterval=1440.
   [junit4]   2> 1618117 INFO  (coreLoadExecutor-6337-thread-1) [    ] o.a.s.s.IndexSchema default search field in schema is text
   [junit4]   2> 1618118 INFO  (coreLoadExecutor-6337-thread-1) [    ] o.a.s.s.IndexSchema unique key field: id
   [junit4]   2> 1618123 INFO  (coreLoadExecutor-6337-thread-1) [    ] o.a.s.s.FileExchangeRateProvider Reloading exchange rates from file currency.xml
   [junit4]   2> 1618125 INFO  (coreLoadExecutor-6337-thread-1) [    ] o.a.s.s.FileExchangeRateProvider Reloading exchange rates from file currency.xml
   [junit4]   2> 1618126 INFO  (coreLoadExecutor-6337-thread-1) [    ] o.a.s.s.OpenExchangeRatesOrgProvider Reloading exchange rates from open-exchange-rates.json
   [junit4]   2> 1618127 INFO  (coreLoadExecutor-6337-thread-1) [    ] o.a.s.s.OpenExchangeRatesOrgProvider Reloading exchange rates from open-exchange-rates.json
   [junit4]   2> 1618128 INFO  (coreLoadExecutor-6337-thread-1) [    ] o.a.s.c.ConfigSetProperties Did not find ConfigSet properties, assuming default properties: Can't find resource 'configsetprops.json' in classpath or '/configs/conf1', cwd=/home/jenkins/workspace/Lucene-Solr-6.x-Linux/solr/build/solr-core/test/J1
   [junit4]   2> 1618128 INFO  (coreLoadExecutor-6337-thread-1) [    ] o.a.s.c.CoreContainer Creating SolrCore 'collection1' using configuration from collection collection1
   [junit4]   2> 1618128 INFO  (coreLoadExecutor-6337-thread-1) [    ] o.a.s.c.SolrCore org.apache.solr.core.MockDirectoryFactory
   [junit4]   2> 1618128 INFO  (coreLoadExecutor-6337-thread-1) [    ] o.a.s.c.SolrCore [[collection1] ] Opening new SolrCore at [/home/jenkins/workspace/Lucene-Solr-6.x-Linux/solr/build/solr-core/test/J1/temp/solr.cloud.HttpPartitionTest_40E288E62AAF1C35-001/shard-1-001/cores/collection1], dataDir=[/home/jenkins/workspace/Lucene-Solr-6.x-Linux/solr/build/solr-core/test/J1/temp/solr.cloud.HttpPartitionTest_40E288E62AAF1C35-001/shard-1-001/cores/collection1/data/]
   [junit4]   2> 1618128 INFO  (coreLoadExecutor-6337-thread-1) [    ] o.a.s.c.JmxMonitoredMap JMX monitoring is enabled. Adding Solr mbeans to JMX Server: com.sun.jmx.mbeanserver.JmxMBeanServer@70c8d8
   [junit4]   2> 1618129 INFO  (coreLoadExecutor-6337-thread-1) [    ] o.a.s.c.CachingDirectoryFactory return new directory for /home/jenkins/workspace/Lucene-Solr-6.x-Linux/solr/build/solr-core/test/J1/temp/solr.cloud.HttpPartitionTest_40E288E62AAF1C35-001/shard-1-001/cores/collection1/data
   [junit4]   2> 1618129 INFO  (coreLoadExecutor-6337-thread-1) [    ] o.a.s.c.SolrCore New index directory detected: old=null new=/home/jenkins/workspace/Lucene-Solr-6.x-Linux/solr/build/solr-core/test/J1/temp/solr.cloud.HttpPartitionTest_40E288E62AAF1C35-001/shard-1-001/cores/collection1/data/index/
   [junit4]   2> 1618129 WARN  (coreLoadExecutor-6337-thread-1) [    ] o.a.s.c.SolrCore [collection1] Solr index directory '/home/jenkins/workspace/Lucene-Solr-6.x-Linux/solr/build/solr-core/test/J1/temp/solr.cloud.HttpPartitionTest_40E288E62AAF1C35-001/shard-1-001/cores/collection1/data/index' doesn't exist. Creating new index...
   [junit4]   2> 1618130 INFO  (coreLoadExecutor-6337-thread-1) [    ] o.a.s.c.CachingDirectoryFactory return new directory for /home/jenkins/workspace/Lucene-Solr-6.x-Linux/solr/build/solr-core/test/J1/temp/solr.cloud.HttpPartitionTest_40E288E62AAF1C35-001/shard-1-001/cores/collection1/data/index
   [junit4]   2> 1618130 INFO  (coreLoadExecutor-6337-thread-1) [    ] o.a.s.u.RandomMergePolicy RandomMergePolicy wrapping class org.apache.lucene.index.LogDocMergePolicy: [LogDocMergePolicy: minMergeSize=1000, mergeFactor=24, maxMergeSize=9223372036854775807, maxMergeSizeForForcedMerge=9223372036854775807, calibrateSizeByDeletes=false, maxMergeDocs=2147483647, maxCFSSegmentSizeMB=8.796093022207999E12, noCFSRatio=0.8887018239915925]
   [junit4]   2> 1618130 INFO  (coreLoadExecutor-6337-thread-1) [    ] o.a.s.c.SolrDeletionPolicy SolrDeletionPolicy.onCommit: commits: num=1
   [junit4]   2> 	commit{dir=MockDirectoryWrapper(RAMDirectory@746f2b lockFactory=org.apache.lucene.store.SingleInstanceLockFactory@f17b74),segFN=segments_1,generation=1}
   [junit4]   2> 1618130 INFO  (coreLoadExecutor-6337-thread-1) [    ] o.a.s.c.SolrDeletionPolicy newest commit generation = 1
   [junit4]   2> 1618131 INFO  (OldIndexDirectoryCleanupThreadForCore-collection1) [    ] o.a.s.c.SolrCore Looking for old index directories to cleanup for core collection1 in /home/jenkins/workspace/Lucene-Solr-6.x-Linux/solr/build/solr-core/test/J1/temp/solr.cloud.HttpPartitionTest_40E288E62AAF1C35-001/shard-1-001/cores/collection1/data/
   [junit4]   2> 1618131 WARN  (OldIndexDirectoryCleanupThreadForCore-collection1) [    ] o.a.s.c.DirectoryFactory /home/jenkins/workspace/Lucene-Solr-6.x-Linux/solr/build/solr-core/test/J1/temp/solr.cloud.HttpPartitionTest_40E288E62AAF1C35-001/shard-1-001/cores/collection1/data/ does not point to a valid data directory; skipping clean-up of old index directories.
   [junit4]   2> 1618134 INFO  (coreLoadExecutor-6337-thread-1) [    ] o.a.s.u.p.UpdateRequestProcessorChain creating updateRequestProcessorChain "nodistrib"
   [junit4]   2> 1618134 INFO  (coreLoadExecutor-6337-thread-1) [    ] o.a.s.u.p.UpdateRequestProcessorChain creating updateRequestProcessorChain "dedupe"
   [junit4]   2> 1618134 INFO  (coreLoadExecutor-6337-thread-1) [    ] o.a.s.u.p.UpdateRequestProcessorChain inserting DistributedUpdateProcessorFactory into updateRequestProcessorChain "dedupe"
   [junit4]   2> 1618134 INFO  (coreLoadExecutor-6337-thread-1) [    ] o.a.s.u.p.UpdateRequestProcessorChain creating updateRequestProcessorChain "stored_sig"
   [junit4]   2> 1618134 INFO  (coreLoadExecutor-6337-thread-1) [    ] o.a.s.u.p.UpdateRequestProcessorChain inserting DistributedUpdateProcessorFactory into updateRequestProcessorChain "stored_sig"
   [junit4]   2> 1618134 INFO  (coreLoadExecutor-6337-thread-1) [    ] o.a.s.u.p.UpdateRequestProcessorChain creating updateRequestProcessorChain "distrib-dup-test-chain-explicit"
   [junit4]   2> 1618134 INFO  (coreLoadExecutor-6337-thread-1) [    ] o.a.s.u.p.UpdateRequestProcessorChain creating updateRequestProcessorChain "distrib-dup-test-chain-implicit"
   [junit4]   2> 1618134 INFO  (coreLoadExecutor-6337-thread-1) [    ] o.a.s.u.p.UpdateRequestProcessorChain inserting DistributedUpdateProcessorFactory into updateRequestProcessorChain "distrib-dup-test-chain-implicit"
   [junit4]   2> 1618134 INFO  (coreLoadExecutor-6337-thread-1) [    ] o.a.s.c.SolrCore no updateRequestProcessorChain defined as default, creating implicit default
   [junit4]   2> 1618134 WARN  (coreLoadExecutor-6337-thread-1) [    ] o.a.s.c.RequestHandlers INVALID paramSet a in requestHandler {type = requestHandler,name = /dump,class = DumpRequestHandler,args = {defaults={a=A,b=B}}}
   [junit4]   2> 1618136 INFO  (coreLoadExecutor-6337-thread-1) [    ] o.a.s.h.l.XMLLoader xsltCacheLifetimeSeconds=60
   [junit4]   2> 1618137 INFO  (coreLoadExecutor-6337-thread-1) [    ] o.a.s.h.l.XMLLoader xsltCacheLifetimeSeconds=60
   [junit4]   2> 1618138 INFO  (coreLoadExecutor-6337-thread-1) [    ] o.a.s.h.l.XMLLoader xsltCacheLifetimeSeconds=60
   [junit4]   2> 1618139 INFO  (coreLoadExecutor-6337-thread-1) [    ] o.a.s.h.l.XMLLoader xsltCacheLifetimeSeconds=60
   [junit4]   2> 1618146 INFO  (coreLoadExecutor-6337-thread-1) [    ] o.a.s.c.RequestHandlers Registered paths: /admin/mbeans,standard,/update/json/docs,/admin/luke,/export,/get,/admin/properties,/update/json,/admin/threads,/dump,/update/csv,/sql,/graph,/admin/segments,/admin/system,/replication,/config,/stream,/schema,/admin/plugins,/admin/logging,/admin/ping,/update,/admin/file
   [junit4]   2> 1618146 INFO  (coreLoadExecutor-6337-thread-1) [    ] o.a.s.c.SolrCore Using default statsCache cache: org.apache.solr.search.stats.LocalStatsCache
   [junit4]   2> 1618146 INFO  (coreLoadExecutor-6337-thread-1) [    ] o.a.s.u.UpdateHandler Using UpdateLog implementation: org.apache.solr.update.UpdateLog
   [junit4]   2> 1618146 INFO  (coreLoadExecutor-6337-thread-1) [    ] o.a.s.u.UpdateLog Initializing UpdateLog: dataDir= defaultSyncLevel=FLUSH numRecordsToKeep=100 maxNumLogsToKeep=10 numVersionBuckets=65536
   [junit4]   2> 1618147 INFO  (coreLoadExecutor-6337-thread-1) [    ] o.a.s.u.CommitTracker Hard AutoCommit: disabled
   [junit4]   2> 1618147 INFO  (coreLoadExecutor-6337-thread-1) [    ] o.a.s.u.CommitTracker Soft AutoCommit: disabled
   [junit4]   2> 1618148 INFO  (coreLoadExecutor-6337-thread-1) [    ] o.a.s.u.RandomMergePolicy RandomMergePolicy wrapping class org.apache.lucene.index.LogByteSizeMergePolicy: [LogByteSizeMergePolicy: minMergeSize=1677721, mergeFactor=19, maxMergeSize=2147483648, maxMergeSizeForForcedMerge=9223372036854775807, calibrateSizeByDeletes=false, maxMergeDocs=2147483647, maxCFSSegmentSizeMB=8.796093022207999E12, noCFSRatio=1.0]
   [junit4]   2> 1618148 INFO  (coreLoadExecutor-6337-thread-1) [    ] o.a.s.c.SolrDeletionPolicy SolrDeletionPolicy.onInit: commits: num=1
   [junit4]   2> 	commit{dir=MockDirectoryWrapper(RAMDirectory@746f2b lockFactory=org.apache.lucene.store.SingleInstanceLockFactory@f17b74),segFN=segments_1,generation=1}
   [junit4]   2> 1618148 INFO  (coreLoadExecutor-6337-thread-1) [    ] o.a.s.c.SolrDeletionPolicy newest commit generation = 1
   [junit4]   2> 1618148 INFO  (coreLoadExecutor-6337-thread-1) [    ] o.a.s.s.SolrIndexSearcher Opening [Searcher@134aeef[collection1] main]
   [junit4]   2> 1618148 INFO  (coreLoadExecutor-6337-thread-1) [    ] o.a.s.c.c.ZkStateReader Load collection config from: [/collections/collection1]
   [junit4]   2> 1618148 INFO  (coreLoadExecutor-6337-thread-1) [    ] o.a.s.c.c.ZkStateReader path=[/collections/collection1] [configName]=[conf1] specified config exists in ZooKeeper
   [junit4]   2> 1618148 INFO  (coreLoadExecutor-6337-thread-1) [    ] o.a.s.r.ManagedResourceStorage Setting up ZooKeeper-based storage for the RestManager with znodeBase: /configs/conf1
   [junit4]   2> 1618149 INFO  (coreLoadExecutor-6337-thread-1) [    ] o.a.s.r.ManagedResourceStorage Configured ZooKeeperStorageIO with znodeBase: /configs/conf1
   [junit4]   2> 1618149 INFO  (coreLoadExecutor-6337-thread-1) [    ] o.a.s.r.RestManager Initializing RestManager with initArgs: {}
   [junit4]   2> 1618149 INFO  (coreLoadExecutor-6337-thread-1) [    ] o.a.s.r.ManagedResourceStorage Reading _rest_managed.json using ZooKeeperStorageIO:path=/configs/conf1
   [junit4]   2> 1618149 INFO  (coreLoadExecutor-6337-thread-1) [    ] o.a.s.r.ManagedResourceStorage No data found for znode /configs/conf1/_rest_managed.json
   [junit4]   2> 1618149 INFO  (coreLoadExecutor-6337-thread-1) [    ] o.a.s.r.ManagedResourceStorage Loaded null at path _rest_managed.json using ZooKeeperStorageIO:path=/configs/conf1
   [junit4]   2> 1618149 INFO  (coreLoadExecutor-6337-thread-1) [    ] o.a.s.r.RestManager Initializing 0 registered ManagedResources
   [junit4]   2> 1618149 INFO  (coreLoadExecutor-6337-thread-1) [    ] o.a.s.h.ReplicationHandler Commits will be reserved for  10000
   [junit4]   2> 1618151 INFO  (searcherExecutor-6338-thread-1) [    ] o.a.s.c.SolrCore [collection1] Registered new searcher Searcher@134aeef[collection1] main{ExitableDirectoryReader(UninvertingDirectoryReader())}
   [junit4]   2> 1618151 INFO  (coreLoadExecutor-6337-thread-1) [    ] o.a.s.u.UpdateLog Looking up max value of version field to seed version buckets
   [junit4]   2> 1618151 INFO  (coreLoadExecutor-6337-thread-1) [    ] o.a.s.u.VersionInfo Refreshing highest value of _version_ for 65536 version buckets from index
   [junit4]   2> 1618151 INFO  (coreLoadExecutor-6337-thread-1) [    ] o.a.s.u.VersionInfo No terms found for _version_, cannot seed version bucket highest value from index
   [junit4]   2> 1618151 INFO  (coreLoadExecutor-6337-thread-1) [    ] o.a.s.u.UpdateLog Could not find max version in index or recent updates, using new clock 1538256745676144640
   [junit4]   2> 1618153 INFO  (coreLoadExecutor-6337-thread-1) [    ] o.a.s.u.UpdateLog Took 1.0ms to seed version buckets with highest version 1538256745676144640
   [junit4]   2> 1618153 INFO  (coreLoadExecutor-6337-thread-1) [    ] o.a.s.c.ZkController watch zkdir /configs/conf1
   [junit4]   2> 1618153 INFO  (coreLoadExecutor-6337-thread-1) [    ] o.a.s.c.CoreContainer registering core: collection1
   [junit4]   2> 1618154 INFO  (coreZkRegister-6332-thread-1) [    ] o.a.s.c.ZkController Register replica - core:collection1 address:http://127.0.0.1:38852 collection:collection1 shard:shard2
   [junit4]   2> 1618154 INFO  (coreZkRegister-6332-thread-1) [    ] o.a.s.c.c.SolrZkClient makePath: /collections/collection1/leader_elect/shard2/election
   [junit4]   2> 1618155 INFO  (coreZkRegister-6332-thread-1) [    ] o.a.s.c.LeaderElector Joined leadership election with path: /collections/collection1/leader_elect/shard2/election/96141046340452360-core_node1-n_0000000000
   [junit4]   2> 1618155 INFO  (coreZkRegister-6332-thread-1) [    ] o.a.s.c.ShardLeaderElectionContext Running the leader process for shard=shard2 and weAreReplacement=false and leaderVoteWait=10000
   [junit4]   2> 1618156 INFO  (coreZkRegister-6332-thread-1) [    ] o.a.s.c.ShardLeaderElectionContext Enough replicas found to continue.
   [junit4]   2> 1618156 INFO  (coreZkRegister-6332-thread-1) [    ] o.a.s.c.ShardLeaderElectionContext I may be the new leader - try and sync
   [junit4]   2> 1618156 INFO  (coreZkRegister-6332-thread-1) [    ] o.a.s.c.SyncStrategy Sync replicas to http://127.0.0.1:38852/collection1/
   [junit4]   2> 1618156 INFO  (coreZkRegister-6332-thread-1) [    ] o.a.s.c.SyncStrategy Sync Success - now sync replicas to me
   [junit4]   2> 1618156 INFO  (OverseerStateUpdate-96141046340452356-127.0.0.1:42032_-n_0000000000) [    ] o.a.s.c.Overseer processMessage: queueSize: 1, message = {
   [junit4]   2>   "operation":"leader",
   [junit4]   2>   "shard":"shard2",
   [junit4]   2>   "collection":"collection1"} current state version: 5
   [junit4]   2> 1618156 INFO  (coreZkRegister-6332-thread-1) [    ] o.a.s.c.SyncStrategy http://127.0.0.1:38852/collection1/ has no replicas
   [junit4]   2> 1618157 INFO  (coreZkRegister-6332-thread-1) [    ] o.a.s.c.c.SolrZkClient makePath: /collections/collection1/leaders/shard2
   [junit4]   2> 1618158 INFO  (coreZkRegister-6332-thread-1) [    ] o.a.s.c.ShardLeaderElectionContextBase Creating leader registration node /collections/collection1/leaders/shard2/leader after winning as /collections/collection1/leader_elect/shard2/election/96141046340452360-core_node1-n_0000000000
   [junit4]   2> 1618159 INFO  (coreZkRegister-6332-thread-1) [    ] o.a.s.c.ShardLeaderElectionContext I am the new leader: http://127.0.0.1:38852/collection1/ shard2
   [junit4]   2> 1618159 INFO  (OverseerStateUpdate-96141046340452356-127.0.0.1:42032_-n_0000000000) [    ] o.a.s.c.Overseer processMessage: queueSize: 1, message = {
   [junit4]   2>   "operation":"leader",
   [junit4]   2>   "shard":"shard2",
   [junit4]   2>   "collection":"collection1",
   [junit4]   2>   "base_url":"http://127.0.0.1:38852",
   [junit4]   2>   "core":"collection1",
   [junit4]   2>   "state":"active"} current state version: 5
   [junit4]   2> 1618261 INFO  (zkCallback-1959-thread-2) [    ] o.a.s.c.c.ZkStateReader A cluster state change: [WatchedEvent state:SyncConnected type:NodeDataChanged path:/clusterstate.json], has occurred - updating... (live nodes size: [2])
   [junit4]   2> 1618261 INFO  (zkCallback-1968-thread-1) [    ] o.a.s.c.c.ZkStateReader A cluster state change: [WatchedEvent state:SyncConnected type:NodeDataChanged path:/clusterstate.json], has occurred - updating... (live nodes size: [2])
   [junit4]   2> 1618261 INFO  (zkCallback-1963-thread-1) [    ] o.a.s.c.c.ZkStateReader A cluster state change: [WatchedEvent state:SyncConnected type:NodeDataChanged path:/clusterstate.json], has occurred - updating... (live nodes size: [2])
   [junit4]   2> 1618310 INFO  (coreZkRegister-6332-thread-1) [    ] o.a.s.c.ZkController We are http://127.0.0.1:38852/collection1/ and leader is http://127.0.0.1:38852/collection1/
   [junit4]   2> 1618310 INFO  (coreZkRegister-6332-thread-1) [    ] o.a.s.c.ZkController No LogReplay needed for core=collection1 baseURL=http://127.0.0.1:38852
   [junit4]   2> 1618310 INFO  (coreZkRegister-6332-thread-1) [    ] o.a.s.c.ZkController I am the leader, no recovery necessary
   [junit4]   2> 1618310 INFO  (coreZkRegister-6332-thread-1) [    ] o.a.s.c.ZkController publishing state=active
   [junit4]   2> 1618310 INFO  (coreZkRegister-6332-thread-1) [    ] o.a.s.c.ZkController numShards not found on descriptor - reading it from system property
   [junit4]   2> 1618311 INFO  (OverseerStateUpdate-96141046340452356-127.0.0.1:42032_-n_0000000000) [    ] o.a.s.c.Overseer processMessage: queueSize: 1, message = {
   [junit4]   2>   "core":"collection1",
   [junit4]   2>   "core_node_name":"core_node1",
   [junit4]   2>   "roles":null,
   [junit4]   2>   "base_url":"http://127.0.0.1:38852",
   [junit4]   2>   "node_name":"127.0.0.1:38852_",
   [junit4]   2>   "numShards":"2",
   [junit4]   2>   "state":"active",
   [junit4]   2>   "shard":"shard2",
   [junit4]   2>   "collection":"collection1",
   [junit4]   2>   "operation":"state"} current state version: 6
   [junit4]   2> 1618311 INFO  (OverseerStateUpdate-96141046340452356-127.0.0.1:42032_-n_0000000000) [    ] o.a.s.c.o.ReplicaMutator Update state numShards=2 message={
   [junit4]   2>   "core":"collection1",
   [junit4]   2>   "core_node_name":"core_node1",
   [junit4]   2>   "roles":null,
   [junit4]   2>   "base_url":"http://127.0.0.1:38852",
   [junit4]   2>   "node_name":"127.0.0.1:38852_",
   [junit4]   2>   "numShards":"2",
   [junit4]   2>   "state":"active",
   [junit4]   2>   "shard":"shard2",
   [junit4]   2>   "collection":"collection1",
   [junit4]   2>   "operation":"state"}
   [junit4]   2> 1618413 INFO  (zkCallback-1959-thread-1) [    ] o.a.s.c.c.ZkStateReader A cluster state change: [WatchedEvent state:SyncConnected type:NodeDataChanged path:/clusterstate.json], has occurred - updating... (live nodes size: [2])
   [junit4]   2> 1618413 INFO  (zkCallback-1963-thread-1) [    ] o.a.s.c.c.ZkStateReader A cluster state change: [WatchedEvent state:SyncConnected type:NodeDataChanged path:/clusterstate.json], has occurred - updating... (live nodes size: [2])
   [junit4]   2> 1618413 INFO  (zkCallback-1968-thread-1) [    ] o.a.s.c.c.ZkStateReader A cluster state change: [WatchedEvent state:SyncConnected type:NodeDataChanged path:/clusterstate.json], has occurred - updating... (live nodes size: [2])
   [junit4]   2> 1618559 INFO  (TEST-HttpPartitionTest.test-seed#[40E288E62AAF1C35]) [    ] o.a.s.SolrTestCaseJ4 Writing core.properties file to /home/jenkins/workspace/Lucene-Solr-6.x-Linux/solr/build/solr-core/test/J1/temp/solr.cloud.HttpPartitionTest_40E288E62AAF1C35-001/shard-2-001/cores/collection1
   [junit4]   2> 1618560 INFO  (TEST-HttpPartitionTest.test-seed#[40E288E62AAF1C35]) [    ] o.a.s.c.AbstractFullDistribZkTestBase create jetty 2 in directory /home/jenkins/workspace/Lucene-Solr-6.x-Linux/solr/build/solr-core/test/J1/temp/solr.cloud.HttpPartitionTest_40E288E62AAF1C35-001/shard-2-001
   [junit4]   2> 1618560 INFO  (TEST-HttpPartitionTest.test-seed#[40E288E62AAF1C35]) [    ] o.e.j.s.Server jetty-

[...truncated too long message...]

  2> 	2	/solr/collections/c8n_1x2/state.json
   [junit4]   2> 	2	/solr/collections/c8n_crud_1x2/state.json
   [junit4]   2> 	2	/solr/collections/c8n_1x2_leader_session_loss/state.json
   [junit4]   2> 
   [junit4]   2> Maximum concurrent data watches above limit:
   [junit4]   2> 
   [junit4]   2> 	5	/solr/clusterstate.json
   [junit4]   2> 
   [junit4]   2> Maximum concurrent children watches above limit:
   [junit4]   2> 
   [junit4]   2> 	140	/solr/overseer/collection-queue-work
   [junit4]   2> 	67	/solr/overseer/queue
   [junit4]   2> 	23	/solr/overseer/queue-work
   [junit4]   2> 	5	/solr/live_nodes
   [junit4]   2> 	5	/solr/collections
   [junit4]   2> 
   [junit4]   2> 1777306 WARN  (TEST-HttpPartitionTest.test-seed#[40E288E62AAF1C35]) [    ] o.a.s.c.SocketProxy Closing 5 connections to: http://127.0.0.1:37319/, target: http://127.0.0.1:33243/
   [junit4]   2> 1777306 WARN  (TEST-HttpPartitionTest.test-seed#[40E288E62AAF1C35]) [    ] o.a.s.c.SocketProxy Closing 15 connections to: http://127.0.0.1:38852/, target: http://127.0.0.1:42804/
   [junit4]   2> 1777306 WARN  (TEST-HttpPartitionTest.test-seed#[40E288E62AAF1C35]) [    ] o.a.s.c.SocketProxy Closing 18 connections to: http://127.0.0.1:42032/, target: http://127.0.0.1:35877/
   [junit4]   2> 1777306 WARN  (TEST-HttpPartitionTest.test-seed#[40E288E62AAF1C35]) [    ] o.a.s.c.SocketProxy Closing 5 connections to: http://127.0.0.1:34223/, target: http://127.0.0.1:40822/
   [junit4]   2> NOTE: reproduce with: ant test  -Dtestcase=HttpPartitionTest -Dtests.method=test -Dtests.seed=40E288E62AAF1C35 -Dtests.multiplier=3 -Dtests.slow=true -Dtests.locale=ln-CG -Dtests.timezone=America/Cayenne -Dtests.asserts=true -Dtests.file.encoding=ISO-8859-1
   [junit4] FAILURE  163s J1 | HttpPartitionTest.test <<<
   [junit4]    > Throwable #1: java.lang.AssertionError: Doc with id=2 not found in http://127.0.0.1:42032/c8n_1x2_leader_session_loss due to: Path not found: /id; rsp={doc=null}
   [junit4]    > 	at __randomizedtesting.SeedInfo.seed([40E288E62AAF1C35:C8B6B73C845371CD]:0)
   [junit4]    > 	at org.apache.solr.cloud.HttpPartitionTest.assertDocExists(HttpPartitionTest.java:603)
   [junit4]    > 	at org.apache.solr.cloud.HttpPartitionTest.assertDocsExistInAllReplicas(HttpPartitionTest.java:558)
   [junit4]    > 	at org.apache.solr.cloud.HttpPartitionTest.testLeaderZkSessionLoss(HttpPartitionTest.java:506)
   [junit4]    > 	at org.apache.solr.cloud.HttpPartitionTest.test(HttpPartitionTest.java:119)
   [junit4]    > 	at jdk.internal.reflect.NativeMethodAccessorImpl.invoke0(java.base@9-ea/Native Method)
   [junit4]    > 	at jdk.internal.reflect.NativeMethodAccessorImpl.invoke(java.base@9-ea/NativeMethodAccessorImpl.java:62)
   [junit4]    > 	at jdk.internal.reflect.DelegatingMethodAccessorImpl.invoke(java.base@9-ea/DelegatingMethodAccessorImpl.java:43)
   [junit4]    > 	at org.apache.solr.BaseDistributedSearchTestCase$ShardsRepeatRule$ShardsFixedStatement.callStatement(BaseDistributedSearchTestCase.java:992)
   [junit4]    > 	at org.apache.solr.BaseDistributedSearchTestCase$ShardsRepeatRule$ShardsStatement.evaluate(BaseDistributedSearchTestCase.java:967)
   [junit4]    > 	at java.lang.Thread.run(java.base@9-ea/Thread.java:843)
   [junit4]   2> 1777309 INFO  (SUITE-HttpPartitionTest-seed#[40E288E62AAF1C35]-worker) [    ] o.a.s.SolrTestCaseJ4 ###deleteCore
   [junit4]   2> NOTE: leaving temporary files on disk at: /home/jenkins/workspace/Lucene-Solr-6.x-Linux/solr/build/solr-core/test/J1/temp/solr.cloud.HttpPartitionTest_40E288E62AAF1C35-001
   [junit4]   2> NOTE: test params are: codec=Asserting(Lucene62): {range_facet_l_dv=FSTOrd50, _version_=PostingsFormat(name=Memory doPackFST= true), multiDefault=PostingsFormat(name=LuceneVarGapFixedInterval), a_t=PostingsFormat(name=LuceneVarGapFixedInterval), intDefault=PostingsFormat(name=Memory doPackFST= true), id=FSTOrd50, range_facet_i_dv=PostingsFormat(name=LuceneVarGapFixedInterval), text=FST50, range_facet_l=PostingsFormat(name=LuceneVarGapFixedInterval), timestamp=PostingsFormat(name=LuceneVarGapFixedInterval)}, docValues:{range_facet_l_dv=DocValuesFormat(name=Asserting), range_facet_i_dv=DocValuesFormat(name=Direct), timestamp=DocValuesFormat(name=Direct)}, maxPointsInLeafNode=1623, maxMBSortInHeap=6.83860260924867, sim=RandomSimilarity(queryNorm=false,coord=yes): {}, locale=ln-CG, timezone=America/Cayenne
   [junit4]   2> NOTE: Linux 4.4.0-24-generic i386/Oracle Corporation 9-ea (32-bit)/cpus=12,threads=1,free=124591896,total=317825024
   [junit4]   2> NOTE: All tests run in this JVM: [SortByFunctionTest, HdfsDirectoryTest, TestIntervalFaceting, BlockJoinFacetDistribTest, CollectionReloadTest, TestRestoreCore, HdfsCollectionsAPIDistributedZkTest, SpellCheckCollatorTest, ConvertedLegacyTest, DistribCursorPagingTest, ConjunctionSolrSpellCheckerTest, OpenCloseCoreStressTest, FullHLLTest, TestUniqueKeyFieldResource, TestSubQueryTransformerDistrib, DirectSolrSpellCheckerTest, CSVRequestHandlerTest, TestLFUCache, TestBackupRepositoryFactory, TestDownShardTolerantSearch, DocumentBuilderTest, SolrInfoMBeanTest, AsyncMigrateRouteKeyTest, MultiTermTest, CdcrReplicationHandlerTest, TestQuerySenderListener, TestMaxScoreQueryParser, BadCopyFieldTest, HdfsThreadLeakTest, TestStressVersions, TestDistributedStatsComponentCardinality, TestOnReconnectListenerSupport, TestSolrCLIRunExample, DeleteReplicaTest, SpatialHeatmapFacetsTest, SaslZkACLProviderTest, TestManagedSchema, HighlighterTest, TestSolrDeletionPolicy2, TestBM25SimilarityFactory, TestSmileRequest, DateRangeFieldTest, ZkCLITest, TestCloudDeleteByQuery, OpenExchangeRatesOrgProviderTest, SpellingQueryConverterTest, ZkSolrClientTest, SimplePostToolTest, TermsComponentTest, TestNamedUpdateProcessors, DistributedIntervalFacetingTest, RuleEngineTest, TestPartialUpdateDeduplication, OutOfBoxZkACLAndCredentialsProvidersTest, TestConfigSetProperties, MBeansHandlerTest, TestCollectionAPI, TestExactStatsCache, TestSystemIdResolver, TriLevelCompositeIdRoutingTest, TestFieldCacheWithThreads, WordBreakSolrSpellCheckerTest, FastVectorHighlighterTest, ConfigSetsAPITest, TestFieldCacheSort, TestQueryUtils, DistributedTermsComponentTest, AliasIntegrationTest, TestSSLRandomization, DOMUtilTest, TestNRTOpen, TestSerializedLuceneMatchVersion, TestOverriddenPrefixQueryForCustomFieldType, TestXmlQParser, TestStandardQParsers, TestSolrConfigHandler, TestTolerantUpdateProcessorCloud, MinimalSchemaTest, TestFileDictionaryLookup, DistributedFacetPivotLargeTest, TestReplicaProperties, IgnoreCommitOptimizeUpdateProcessorFactoryTest, TestCodecSupport, LeaderInitiatedRecoveryOnShardRestartTest, TestQueryTypes, TestGraphTermsQParserPlugin, ShardRoutingCustomTest, TestDocBasedVersionConstraints, TestDFRSimilarityFactory, AnalyticsQueryTest, TestDynamicFieldResource, TestGeoJSONResponseWriter, HdfsBasicDistributedZkTest, MoreLikeThisHandlerTest, RequestLoggingTest, TestMiniSolrCloudClusterBase, LeaderElectionIntegrationTest, ShardRoutingTest, FullSolrCloudDistribCmdsTest, ClusterStateUpdateTest, TestRandomFaceting, AutoCommitTest, TestDistributedGrouping, TestFaceting, TestHashPartitioner, TermVectorComponentDistributedTest, ZkControllerTest, TestRealTimeGet, HardAutoCommitTest, TestCoreContainer, TestSolr4Spatial, StatsComponentTest, TestGroupingSearch, QueryElevationComponentTest, BasicFunctionalityTest, TestLazyCores, DirectUpdateHandlerTest, SoftAutoCommitTest, ShowFileRequestHandlerTest, DistributedQueryElevationComponentTest, SolrIndexSplitterTest, SignatureUpdateProcessorFactoryTest, CoreAdminHandlerTest, TestStressLucene, TestTrie, SpatialFilterTest, TestCSVLoader, NoCacheHeaderTest, SchemaVersionSpecificBehaviorTest, TestUpdate, TestWordDelimiterFilterFactory, DefaultValueUpdateProcessorTest, StatelessScriptUpdateProcessorFactoryTest, DocValuesMultiTest, DistanceFunctionTest, TestSolrDeletionPolicy1, IndexBasedSpellCheckerTest, TestWriterPerf, TestOmitPositions, TestValueSourceCache, TestIndexingPerformance, TestSolrQueryParser, SolrPluginUtilsTest, UpdateRequestProcessorFactoryTest, TestAnalyzedSuggestions, SearchHandlerTest, TestPostingsSolrHighlighter, TestLuceneMatchVersion, SpellPossibilityIteratorTest, TestCharFilters, TestXIncludeConfig, TestLMDirichletSimilarityFactory, TimeZoneUtilsTest, PluginInfoTest, DateMathParserTest, TestSuggestSpellingConverter, DateFieldTest, ClusterStateTest, TestLRUCache, TestUtils, TestDocumentBuilder, SliceStateTest, SystemInfoHandlerTest, UUIDFieldTest, FileUtilsTest, DistributedMLTComponentTest, TestHighlightDedupGrouping, TestSimpleTrackingShardHandler, CollectionStateFormat2Test, CollectionsAPISolrJTest, DistributedVersionInfoTest, HttpPartitionTest]
   [junit4] Completed [473/617 (1!)] on J1 in 163.22s, 1 test, 1 failure <<< FAILURES!

[...truncated 493 lines...]
BUILD FAILED
/home/jenkins/workspace/Lucene-Solr-6.x-Linux/build.xml:740: The following error occurred while executing this line:
/home/jenkins/workspace/Lucene-Solr-6.x-Linux/build.xml:684: The following error occurred while executing this line:
/home/jenkins/workspace/Lucene-Solr-6.x-Linux/build.xml:59: The following error occurred while executing this line:
/home/jenkins/workspace/Lucene-Solr-6.x-Linux/solr/build.xml:233: The following error occurred while executing this line:
/home/jenkins/workspace/Lucene-Solr-6.x-Linux/solr/common-build.xml:530: The following error occurred while executing this line:
/home/jenkins/workspace/Lucene-Solr-6.x-Linux/lucene/common-build.xml:1427: The following error occurred while executing this line:
/home/jenkins/workspace/Lucene-Solr-6.x-Linux/lucene/common-build.xml:984: There were test failures: 617 suites (10 ignored), 2597 tests, 1 failure, 119 ignored (72 assumptions) [seed: 40E288E62AAF1C35]

Total time: 65 minutes 26 seconds
Build step 'Invoke Ant' marked build as failure
Archiving artifacts
[WARNINGS] Skipping publisher since build result is FAILURE
Recording test results
Email was triggered for: Failure - Any
Sending email for trigger: Failure - Any



Mime
View raw message