lucene-dev mailing list archives

Site index · List index
Message view « Date » · « Thread »
Top « Date » · « Thread »
From Policeman Jenkins Server <jenk...@thetaphi.de>
Subject [JENKINS] Lucene-Solr-master-Solaris (64bit/jdk1.8.0) - Build # 667 - Still Failing!
Date Thu, 23 Jun 2016 16:49:56 GMT
Build: http://jenkins.thetaphi.de/job/Lucene-Solr-master-Solaris/667/
Java: 64bit/jdk1.8.0 -XX:-UseCompressedOops -XX:+UseParallelGC

2 tests failed.
FAILED:  org.apache.solr.core.TestDynamicLoading.testDynamicLoading

Error Message:
Could not find collection:.system

Stack Trace:
java.lang.AssertionError: Could not find collection:.system
	at __randomizedtesting.SeedInfo.seed([EAA29D29CB38C1CE:32EFB07E3CE5646E]:0)
	at org.junit.Assert.fail(Assert.java:93)
	at org.junit.Assert.assertTrue(Assert.java:43)
	at org.junit.Assert.assertNotNull(Assert.java:526)
	at org.apache.solr.cloud.AbstractDistribZkTestBase.waitForRecoveriesToFinish(AbstractDistribZkTestBase.java:154)
	at org.apache.solr.cloud.AbstractDistribZkTestBase.waitForRecoveriesToFinish(AbstractDistribZkTestBase.java:139)
	at org.apache.solr.cloud.AbstractDistribZkTestBase.waitForRecoveriesToFinish(AbstractDistribZkTestBase.java:134)
	at org.apache.solr.cloud.AbstractFullDistribZkTestBase.waitForRecoveriesToFinish(AbstractFullDistribZkTestBase.java:856)
	at org.apache.solr.core.TestDynamicLoading.testDynamicLoading(TestDynamicLoading.java:110)
	at sun.reflect.NativeMethodAccessorImpl.invoke0(Native Method)
	at sun.reflect.NativeMethodAccessorImpl.invoke(NativeMethodAccessorImpl.java:62)
	at sun.reflect.DelegatingMethodAccessorImpl.invoke(DelegatingMethodAccessorImpl.java:43)
	at java.lang.reflect.Method.invoke(Method.java:498)
	at com.carrotsearch.randomizedtesting.RandomizedRunner.invoke(RandomizedRunner.java:1764)
	at com.carrotsearch.randomizedtesting.RandomizedRunner$8.evaluate(RandomizedRunner.java:871)
	at com.carrotsearch.randomizedtesting.RandomizedRunner$9.evaluate(RandomizedRunner.java:907)
	at com.carrotsearch.randomizedtesting.RandomizedRunner$10.evaluate(RandomizedRunner.java:921)
	at org.apache.solr.BaseDistributedSearchTestCase$ShardsRepeatRule$ShardsFixedStatement.callStatement(BaseDistributedSearchTestCase.java:985)
	at org.apache.solr.BaseDistributedSearchTestCase$ShardsRepeatRule$ShardsStatement.evaluate(BaseDistributedSearchTestCase.java:960)
	at com.carrotsearch.randomizedtesting.rules.SystemPropertiesRestoreRule$1.evaluate(SystemPropertiesRestoreRule.java:57)
	at org.apache.lucene.util.TestRuleSetupTeardownChained$1.evaluate(TestRuleSetupTeardownChained.java:49)
	at org.apache.lucene.util.AbstractBeforeAfterRule$1.evaluate(AbstractBeforeAfterRule.java:45)
	at org.apache.lucene.util.TestRuleThreadAndTestName$1.evaluate(TestRuleThreadAndTestName.java:48)
	at org.apache.lucene.util.TestRuleIgnoreAfterMaxFailures$1.evaluate(TestRuleIgnoreAfterMaxFailures.java:64)
	at org.apache.lucene.util.TestRuleMarkFailure$1.evaluate(TestRuleMarkFailure.java:47)
	at com.carrotsearch.randomizedtesting.rules.StatementAdapter.evaluate(StatementAdapter.java:36)
	at com.carrotsearch.randomizedtesting.ThreadLeakControl$StatementRunner.run(ThreadLeakControl.java:367)
	at com.carrotsearch.randomizedtesting.ThreadLeakControl.forkTimeoutingTask(ThreadLeakControl.java:809)
	at com.carrotsearch.randomizedtesting.ThreadLeakControl$3.evaluate(ThreadLeakControl.java:460)
	at com.carrotsearch.randomizedtesting.RandomizedRunner.runSingleTest(RandomizedRunner.java:880)
	at com.carrotsearch.randomizedtesting.RandomizedRunner$5.evaluate(RandomizedRunner.java:781)
	at com.carrotsearch.randomizedtesting.RandomizedRunner$6.evaluate(RandomizedRunner.java:816)
	at com.carrotsearch.randomizedtesting.RandomizedRunner$7.evaluate(RandomizedRunner.java:827)
	at com.carrotsearch.randomizedtesting.rules.StatementAdapter.evaluate(StatementAdapter.java:36)
	at com.carrotsearch.randomizedtesting.rules.SystemPropertiesRestoreRule$1.evaluate(SystemPropertiesRestoreRule.java:57)
	at org.apache.lucene.util.AbstractBeforeAfterRule$1.evaluate(AbstractBeforeAfterRule.java:45)
	at com.carrotsearch.randomizedtesting.rules.StatementAdapter.evaluate(StatementAdapter.java:36)
	at org.apache.lucene.util.TestRuleStoreClassName$1.evaluate(TestRuleStoreClassName.java:41)
	at com.carrotsearch.randomizedtesting.rules.NoShadowingOrOverridesOnMethodsRule$1.evaluate(NoShadowingOrOverridesOnMethodsRule.java:40)
	at com.carrotsearch.randomizedtesting.rules.NoShadowingOrOverridesOnMethodsRule$1.evaluate(NoShadowingOrOverridesOnMethodsRule.java:40)
	at com.carrotsearch.randomizedtesting.rules.StatementAdapter.evaluate(StatementAdapter.java:36)
	at com.carrotsearch.randomizedtesting.rules.StatementAdapter.evaluate(StatementAdapter.java:36)
	at com.carrotsearch.randomizedtesting.rules.StatementAdapter.evaluate(StatementAdapter.java:36)
	at org.apache.lucene.util.TestRuleAssertionsRequired$1.evaluate(TestRuleAssertionsRequired.java:53)
	at org.apache.lucene.util.TestRuleMarkFailure$1.evaluate(TestRuleMarkFailure.java:47)
	at org.apache.lucene.util.TestRuleIgnoreAfterMaxFailures$1.evaluate(TestRuleIgnoreAfterMaxFailures.java:64)
	at org.apache.lucene.util.TestRuleIgnoreTestSuites$1.evaluate(TestRuleIgnoreTestSuites.java:54)
	at com.carrotsearch.randomizedtesting.rules.StatementAdapter.evaluate(StatementAdapter.java:36)
	at com.carrotsearch.randomizedtesting.ThreadLeakControl$StatementRunner.run(ThreadLeakControl.java:367)
	at java.lang.Thread.run(Thread.java:745)


FAILED:  org.apache.solr.handler.TestReqParamsAPI.test

Error Message:
Could not get expected value  'CY val modified' for path 'response/params/y/c' full output: {   "responseHeader":{     "status":0,     "QTime":0},   "response":{     "znodeVersion":0,     "params":{"x":{         "a":"A val",         "b":"B val",         "":{"v":0}}}}},  from server:  http://127.0.0.1:64580/goh/rz/collection1

Stack Trace:
java.lang.AssertionError: Could not get expected value  'CY val modified' for path 'response/params/y/c' full output: {
  "responseHeader":{
    "status":0,
    "QTime":0},
  "response":{
    "znodeVersion":0,
    "params":{"x":{
        "a":"A val",
        "b":"B val",
        "":{"v":0}}}}},  from server:  http://127.0.0.1:64580/goh/rz/collection1
	at __randomizedtesting.SeedInfo.seed([EAA29D29CB38C1CE:62F6A2F365C4AC36]:0)
	at org.junit.Assert.fail(Assert.java:93)
	at org.junit.Assert.assertTrue(Assert.java:43)
	at org.apache.solr.core.TestSolrConfigHandler.testForResponseElement(TestSolrConfigHandler.java:481)
	at org.apache.solr.handler.TestReqParamsAPI.testReqParams(TestReqParamsAPI.java:194)
	at org.apache.solr.handler.TestReqParamsAPI.test(TestReqParamsAPI.java:61)
	at sun.reflect.NativeMethodAccessorImpl.invoke0(Native Method)
	at sun.reflect.NativeMethodAccessorImpl.invoke(NativeMethodAccessorImpl.java:62)
	at sun.reflect.DelegatingMethodAccessorImpl.invoke(DelegatingMethodAccessorImpl.java:43)
	at java.lang.reflect.Method.invoke(Method.java:498)
	at com.carrotsearch.randomizedtesting.RandomizedRunner.invoke(RandomizedRunner.java:1764)
	at com.carrotsearch.randomizedtesting.RandomizedRunner$8.evaluate(RandomizedRunner.java:871)
	at com.carrotsearch.randomizedtesting.RandomizedRunner$9.evaluate(RandomizedRunner.java:907)
	at com.carrotsearch.randomizedtesting.RandomizedRunner$10.evaluate(RandomizedRunner.java:921)
	at org.apache.solr.BaseDistributedSearchTestCase$ShardsRepeatRule$ShardsFixedStatement.callStatement(BaseDistributedSearchTestCase.java:985)
	at org.apache.solr.BaseDistributedSearchTestCase$ShardsRepeatRule$ShardsStatement.evaluate(BaseDistributedSearchTestCase.java:960)
	at com.carrotsearch.randomizedtesting.rules.SystemPropertiesRestoreRule$1.evaluate(SystemPropertiesRestoreRule.java:57)
	at org.apache.lucene.util.TestRuleSetupTeardownChained$1.evaluate(TestRuleSetupTeardownChained.java:49)
	at org.apache.lucene.util.AbstractBeforeAfterRule$1.evaluate(AbstractBeforeAfterRule.java:45)
	at org.apache.lucene.util.TestRuleThreadAndTestName$1.evaluate(TestRuleThreadAndTestName.java:48)
	at org.apache.lucene.util.TestRuleIgnoreAfterMaxFailures$1.evaluate(TestRuleIgnoreAfterMaxFailures.java:64)
	at org.apache.lucene.util.TestRuleMarkFailure$1.evaluate(TestRuleMarkFailure.java:47)
	at com.carrotsearch.randomizedtesting.rules.StatementAdapter.evaluate(StatementAdapter.java:36)
	at com.carrotsearch.randomizedtesting.ThreadLeakControl$StatementRunner.run(ThreadLeakControl.java:367)
	at com.carrotsearch.randomizedtesting.ThreadLeakControl.forkTimeoutingTask(ThreadLeakControl.java:809)
	at com.carrotsearch.randomizedtesting.ThreadLeakControl$3.evaluate(ThreadLeakControl.java:460)
	at com.carrotsearch.randomizedtesting.RandomizedRunner.runSingleTest(RandomizedRunner.java:880)
	at com.carrotsearch.randomizedtesting.RandomizedRunner$5.evaluate(RandomizedRunner.java:781)
	at com.carrotsearch.randomizedtesting.RandomizedRunner$6.evaluate(RandomizedRunner.java:816)
	at com.carrotsearch.randomizedtesting.RandomizedRunner$7.evaluate(RandomizedRunner.java:827)
	at com.carrotsearch.randomizedtesting.rules.StatementAdapter.evaluate(StatementAdapter.java:36)
	at com.carrotsearch.randomizedtesting.rules.SystemPropertiesRestoreRule$1.evaluate(SystemPropertiesRestoreRule.java:57)
	at org.apache.lucene.util.AbstractBeforeAfterRule$1.evaluate(AbstractBeforeAfterRule.java:45)
	at com.carrotsearch.randomizedtesting.rules.StatementAdapter.evaluate(StatementAdapter.java:36)
	at org.apache.lucene.util.TestRuleStoreClassName$1.evaluate(TestRuleStoreClassName.java:41)
	at com.carrotsearch.randomizedtesting.rules.NoShadowingOrOverridesOnMethodsRule$1.evaluate(NoShadowingOrOverridesOnMethodsRule.java:40)
	at com.carrotsearch.randomizedtesting.rules.NoShadowingOrOverridesOnMethodsRule$1.evaluate(NoShadowingOrOverridesOnMethodsRule.java:40)
	at com.carrotsearch.randomizedtesting.rules.StatementAdapter.evaluate(StatementAdapter.java:36)
	at com.carrotsearch.randomizedtesting.rules.StatementAdapter.evaluate(StatementAdapter.java:36)
	at com.carrotsearch.randomizedtesting.rules.StatementAdapter.evaluate(StatementAdapter.java:36)
	at org.apache.lucene.util.TestRuleAssertionsRequired$1.evaluate(TestRuleAssertionsRequired.java:53)
	at org.apache.lucene.util.TestRuleMarkFailure$1.evaluate(TestRuleMarkFailure.java:47)
	at org.apache.lucene.util.TestRuleIgnoreAfterMaxFailures$1.evaluate(TestRuleIgnoreAfterMaxFailures.java:64)
	at org.apache.lucene.util.TestRuleIgnoreTestSuites$1.evaluate(TestRuleIgnoreTestSuites.java:54)
	at com.carrotsearch.randomizedtesting.rules.StatementAdapter.evaluate(StatementAdapter.java:36)
	at com.carrotsearch.randomizedtesting.ThreadLeakControl$StatementRunner.run(ThreadLeakControl.java:367)
	at java.lang.Thread.run(Thread.java:745)




Build Log:
[...truncated 10675 lines...]
   [junit4] Suite: org.apache.solr.handler.TestReqParamsAPI
   [junit4]   2> Creating dataDir: /export/home/jenkins/workspace/Lucene-Solr-master-Solaris/solr/build/solr-core/test/J0/temp/solr.handler.TestReqParamsAPI_EAA29D29CB38C1CE-001/init-core-data-001
   [junit4]   2> 413357 INFO  (SUITE-TestReqParamsAPI-seed#[EAA29D29CB38C1CE]-worker) [    ] o.a.s.SolrTestCaseJ4 Randomized ssl (false) and clientAuth (false) via: @org.apache.solr.util.RandomizeSSL(reason=, value=NaN, ssl=NaN, clientAuth=NaN)
   [junit4]   2> 413357 INFO  (SUITE-TestReqParamsAPI-seed#[EAA29D29CB38C1CE]-worker) [    ] o.a.s.BaseDistributedSearchTestCase Setting hostContext system property: /goh/rz
   [junit4]   2> 413375 INFO  (TEST-TestReqParamsAPI.test-seed#[EAA29D29CB38C1CE]) [    ] o.a.s.c.ZkTestServer STARTING ZK TEST SERVER
   [junit4]   2> 413375 INFO  (Thread-1338) [    ] o.a.s.c.ZkTestServer client port:0.0.0.0/0.0.0.0:0
   [junit4]   2> 413375 INFO  (Thread-1338) [    ] o.a.s.c.ZkTestServer Starting server
   [junit4]   2> 413475 INFO  (TEST-TestReqParamsAPI.test-seed#[EAA29D29CB38C1CE]) [    ] o.a.s.c.ZkTestServer start zk server on port:64384
   [junit4]   2> 413475 INFO  (TEST-TestReqParamsAPI.test-seed#[EAA29D29CB38C1CE]) [    ] o.a.s.c.c.SolrZkClient Using default ZkCredentialsProvider
   [junit4]   2> 413475 INFO  (TEST-TestReqParamsAPI.test-seed#[EAA29D29CB38C1CE]) [    ] o.a.s.c.c.ConnectionManager Waiting for client to connect to ZooKeeper
   [junit4]   2> 413478 INFO  (zkCallback-494-thread-1) [    ] o.a.s.c.c.ConnectionManager Watcher org.apache.solr.common.cloud.ConnectionManager@52922d08 name:ZooKeeperConnection Watcher:127.0.0.1:64384 got event WatchedEvent state:SyncConnected type:None path:null path:null type:None
   [junit4]   2> 413479 INFO  (TEST-TestReqParamsAPI.test-seed#[EAA29D29CB38C1CE]) [    ] o.a.s.c.c.ConnectionManager Client is connected to ZooKeeper
   [junit4]   2> 413479 INFO  (TEST-TestReqParamsAPI.test-seed#[EAA29D29CB38C1CE]) [    ] o.a.s.c.c.SolrZkClient Using default ZkACLProvider
   [junit4]   2> 413479 INFO  (TEST-TestReqParamsAPI.test-seed#[EAA29D29CB38C1CE]) [    ] o.a.s.c.c.SolrZkClient makePath: /solr
   [junit4]   2> 413483 INFO  (TEST-TestReqParamsAPI.test-seed#[EAA29D29CB38C1CE]) [    ] o.a.s.c.c.SolrZkClient Using default ZkCredentialsProvider
   [junit4]   2> 413484 INFO  (TEST-TestReqParamsAPI.test-seed#[EAA29D29CB38C1CE]) [    ] o.a.s.c.c.ConnectionManager Waiting for client to connect to ZooKeeper
   [junit4]   2> 413485 INFO  (zkCallback-495-thread-1) [    ] o.a.s.c.c.ConnectionManager Watcher org.apache.solr.common.cloud.ConnectionManager@129f66ab name:ZooKeeperConnection Watcher:127.0.0.1:64384/solr got event WatchedEvent state:SyncConnected type:None path:null path:null type:None
   [junit4]   2> 413486 INFO  (TEST-TestReqParamsAPI.test-seed#[EAA29D29CB38C1CE]) [    ] o.a.s.c.c.ConnectionManager Client is connected to ZooKeeper
   [junit4]   2> 413486 INFO  (TEST-TestReqParamsAPI.test-seed#[EAA29D29CB38C1CE]) [    ] o.a.s.c.c.SolrZkClient Using default ZkACLProvider
   [junit4]   2> 413486 INFO  (TEST-TestReqParamsAPI.test-seed#[EAA29D29CB38C1CE]) [    ] o.a.s.c.c.SolrZkClient makePath: /collections/collection1
   [junit4]   2> 413489 INFO  (TEST-TestReqParamsAPI.test-seed#[EAA29D29CB38C1CE]) [    ] o.a.s.c.c.SolrZkClient makePath: /collections/collection1/shards
   [junit4]   2> 413492 INFO  (TEST-TestReqParamsAPI.test-seed#[EAA29D29CB38C1CE]) [    ] o.a.s.c.c.SolrZkClient makePath: /collections/control_collection
   [junit4]   2> 413494 INFO  (TEST-TestReqParamsAPI.test-seed#[EAA29D29CB38C1CE]) [    ] o.a.s.c.c.SolrZkClient makePath: /collections/control_collection/shards
   [junit4]   2> 413497 INFO  (TEST-TestReqParamsAPI.test-seed#[EAA29D29CB38C1CE]) [    ] o.a.s.c.AbstractZkTestCase put /export/home/jenkins/workspace/Lucene-Solr-master-Solaris/solr/core/src/test-files/solr/collection1/conf/solrconfig-tlog.xml to /configs/conf1/solrconfig.xml
   [junit4]   2> 413497 INFO  (TEST-TestReqParamsAPI.test-seed#[EAA29D29CB38C1CE]) [    ] o.a.s.c.c.SolrZkClient makePath: /configs/conf1/solrconfig.xml
   [junit4]   2> 413501 INFO  (TEST-TestReqParamsAPI.test-seed#[EAA29D29CB38C1CE]) [    ] o.a.s.c.AbstractZkTestCase put /export/home/jenkins/workspace/Lucene-Solr-master-Solaris/solr/core/src/test-files/solr/collection1/conf/schema.xml to /configs/conf1/schema.xml
   [junit4]   2> 413501 INFO  (TEST-TestReqParamsAPI.test-seed#[EAA29D29CB38C1CE]) [    ] o.a.s.c.c.SolrZkClient makePath: /configs/conf1/schema.xml
   [junit4]   2> 413504 INFO  (TEST-TestReqParamsAPI.test-seed#[EAA29D29CB38C1CE]) [    ] o.a.s.c.AbstractZkTestCase put /export/home/jenkins/workspace/Lucene-Solr-master-Solaris/solr/core/src/test-files/solr/collection1/conf/solrconfig.snippet.randomindexconfig.xml to /configs/conf1/solrconfig.snippet.randomindexconfig.xml
   [junit4]   2> 413505 INFO  (TEST-TestReqParamsAPI.test-seed#[EAA29D29CB38C1CE]) [    ] o.a.s.c.c.SolrZkClient makePath: /configs/conf1/solrconfig.snippet.randomindexconfig.xml
   [junit4]   2> 413507 INFO  (TEST-TestReqParamsAPI.test-seed#[EAA29D29CB38C1CE]) [    ] o.a.s.c.AbstractZkTestCase put /export/home/jenkins/workspace/Lucene-Solr-master-Solaris/solr/core/src/test-files/solr/collection1/conf/stopwords.txt to /configs/conf1/stopwords.txt
   [junit4]   2> 413508 INFO  (TEST-TestReqParamsAPI.test-seed#[EAA29D29CB38C1CE]) [    ] o.a.s.c.c.SolrZkClient makePath: /configs/conf1/stopwords.txt
   [junit4]   2> 413510 INFO  (TEST-TestReqParamsAPI.test-seed#[EAA29D29CB38C1CE]) [    ] o.a.s.c.AbstractZkTestCase put /export/home/jenkins/workspace/Lucene-Solr-master-Solaris/solr/core/src/test-files/solr/collection1/conf/protwords.txt to /configs/conf1/protwords.txt
   [junit4]   2> 413510 INFO  (TEST-TestReqParamsAPI.test-seed#[EAA29D29CB38C1CE]) [    ] o.a.s.c.c.SolrZkClient makePath: /configs/conf1/protwords.txt
   [junit4]   2> 413513 INFO  (TEST-TestReqParamsAPI.test-seed#[EAA29D29CB38C1CE]) [    ] o.a.s.c.AbstractZkTestCase put /export/home/jenkins/workspace/Lucene-Solr-master-Solaris/solr/core/src/test-files/solr/collection1/conf/currency.xml to /configs/conf1/currency.xml
   [junit4]   2> 413513 INFO  (TEST-TestReqParamsAPI.test-seed#[EAA29D29CB38C1CE]) [    ] o.a.s.c.c.SolrZkClient makePath: /configs/conf1/currency.xml
   [junit4]   2> 413517 INFO  (TEST-TestReqParamsAPI.test-seed#[EAA29D29CB38C1CE]) [    ] o.a.s.c.AbstractZkTestCase put /export/home/jenkins/workspace/Lucene-Solr-master-Solaris/solr/core/src/test-files/solr/collection1/conf/enumsConfig.xml to /configs/conf1/enumsConfig.xml
   [junit4]   2> 413517 INFO  (TEST-TestReqParamsAPI.test-seed#[EAA29D29CB38C1CE]) [    ] o.a.s.c.c.SolrZkClient makePath: /configs/conf1/enumsConfig.xml
   [junit4]   2> 413520 INFO  (TEST-TestReqParamsAPI.test-seed#[EAA29D29CB38C1CE]) [    ] o.a.s.c.AbstractZkTestCase put /export/home/jenkins/workspace/Lucene-Solr-master-Solaris/solr/core/src/test-files/solr/collection1/conf/open-exchange-rates.json to /configs/conf1/open-exchange-rates.json
   [junit4]   2> 413520 INFO  (TEST-TestReqParamsAPI.test-seed#[EAA29D29CB38C1CE]) [    ] o.a.s.c.c.SolrZkClient makePath: /configs/conf1/open-exchange-rates.json
   [junit4]   2> 413523 INFO  (TEST-TestReqParamsAPI.test-seed#[EAA29D29CB38C1CE]) [    ] o.a.s.c.AbstractZkTestCase put /export/home/jenkins/workspace/Lucene-Solr-master-Solaris/solr/core/src/test-files/solr/collection1/conf/mapping-ISOLatin1Accent.txt to /configs/conf1/mapping-ISOLatin1Accent.txt
   [junit4]   2> 413523 INFO  (TEST-TestReqParamsAPI.test-seed#[EAA29D29CB38C1CE]) [    ] o.a.s.c.c.SolrZkClient makePath: /configs/conf1/mapping-ISOLatin1Accent.txt
   [junit4]   2> 413525 INFO  (TEST-TestReqParamsAPI.test-seed#[EAA29D29CB38C1CE]) [    ] o.a.s.c.AbstractZkTestCase put /export/home/jenkins/workspace/Lucene-Solr-master-Solaris/solr/core/src/test-files/solr/collection1/conf/old_synonyms.txt to /configs/conf1/old_synonyms.txt
   [junit4]   2> 413526 INFO  (TEST-TestReqParamsAPI.test-seed#[EAA29D29CB38C1CE]) [    ] o.a.s.c.c.SolrZkClient makePath: /configs/conf1/old_synonyms.txt
   [junit4]   2> 413528 INFO  (TEST-TestReqParamsAPI.test-seed#[EAA29D29CB38C1CE]) [    ] o.a.s.c.AbstractZkTestCase put /export/home/jenkins/workspace/Lucene-Solr-master-Solaris/solr/core/src/test-files/solr/collection1/conf/synonyms.txt to /configs/conf1/synonyms.txt
   [junit4]   2> 413528 INFO  (TEST-TestReqParamsAPI.test-seed#[EAA29D29CB38C1CE]) [    ] o.a.s.c.c.SolrZkClient makePath: /configs/conf1/synonyms.txt
   [junit4]   2> 413674 INFO  (TEST-TestReqParamsAPI.test-seed#[EAA29D29CB38C1CE]) [    ] o.a.s.SolrTestCaseJ4 Writing core.properties file to /export/home/jenkins/workspace/Lucene-Solr-master-Solaris/solr/build/solr-core/test/J0/temp/solr.handler.TestReqParamsAPI_EAA29D29CB38C1CE-001/control-001/cores/collection1
   [junit4]   2> 413676 INFO  (TEST-TestReqParamsAPI.test-seed#[EAA29D29CB38C1CE]) [    ] o.e.j.s.Server jetty-9.3.8.v20160314
   [junit4]   2> 413678 INFO  (TEST-TestReqParamsAPI.test-seed#[EAA29D29CB38C1CE]) [    ] o.e.j.s.h.ContextHandler Started o.e.j.s.ServletContextHandler@f4dada4{/goh/rz,null,AVAILABLE}
   [junit4]   2> 413679 INFO  (TEST-TestReqParamsAPI.test-seed#[EAA29D29CB38C1CE]) [    ] o.e.j.s.ServerConnector Started ServerConnector@11d4a41{HTTP/1.1,[http/1.1]}{127.0.0.1:58958}
   [junit4]   2> 413679 INFO  (TEST-TestReqParamsAPI.test-seed#[EAA29D29CB38C1CE]) [    ] o.e.j.s.Server Started @417349ms
   [junit4]   2> 413679 INFO  (TEST-TestReqParamsAPI.test-seed#[EAA29D29CB38C1CE]) [    ] o.a.s.c.s.e.JettySolrRunner Jetty properties: {solr.data.dir=/export/home/jenkins/workspace/Lucene-Solr-master-Solaris/solr/build/solr-core/test/J0/temp/solr.handler.TestReqParamsAPI_EAA29D29CB38C1CE-001/tempDir-001/control/data, hostContext=/goh/rz, hostPort=58958, coreRootDirectory=/export/home/jenkins/workspace/Lucene-Solr-master-Solaris/solr/build/solr-core/test/J0/../../../../../../../../../../export/home/jenkins/workspace/Lucene-Solr-master-Solaris/solr/build/solr-core/test/J0/temp/solr.handler.TestReqParamsAPI_EAA29D29CB38C1CE-001/control-001/cores}
   [junit4]   2> 413680 INFO  (TEST-TestReqParamsAPI.test-seed#[EAA29D29CB38C1CE]) [    ] o.a.s.s.SolrDispatchFilter SolrDispatchFilter.init(): sun.misc.Launcher$AppClassLoader@6d06d69c
   [junit4]   2> 413680 INFO  (TEST-TestReqParamsAPI.test-seed#[EAA29D29CB38C1CE]) [    ] o.a.s.c.SolrResourceLoader new SolrResourceLoader for directory: '/export/home/jenkins/workspace/Lucene-Solr-master-Solaris/solr/build/solr-core/test/J0/temp/solr.handler.TestReqParamsAPI_EAA29D29CB38C1CE-001/control-001'
   [junit4]   2> 413680 INFO  (TEST-TestReqParamsAPI.test-seed#[EAA29D29CB38C1CE]) [    ] o.a.s.c.SolrResourceLoader JNDI not configured for solr (NoInitialContextEx)
   [junit4]   2> 413680 INFO  (TEST-TestReqParamsAPI.test-seed#[EAA29D29CB38C1CE]) [    ] o.a.s.c.SolrResourceLoader solr home defaulted to 'solr/' (could not find system property or JNDI)
   [junit4]   2> 413680 INFO  (TEST-TestReqParamsAPI.test-seed#[EAA29D29CB38C1CE]) [    ] o.a.s.c.c.SolrZkClient Using default ZkCredentialsProvider
   [junit4]   2> 413681 INFO  (TEST-TestReqParamsAPI.test-seed#[EAA29D29CB38C1CE]) [    ] o.a.s.c.c.ConnectionManager Waiting for client to connect to ZooKeeper
   [junit4]   2> 413684 INFO  (zkCallback-496-thread-1) [    ] o.a.s.c.c.ConnectionManager Watcher org.apache.solr.common.cloud.ConnectionManager@78231c9 name:ZooKeeperConnection Watcher:127.0.0.1:64384/solr got event WatchedEvent state:SyncConnected type:None path:null path:null type:None
   [junit4]   2> 413684 INFO  (TEST-TestReqParamsAPI.test-seed#[EAA29D29CB38C1CE]) [    ] o.a.s.c.c.ConnectionManager Client is connected to ZooKeeper
   [junit4]   2> 413685 INFO  (TEST-TestReqParamsAPI.test-seed#[EAA29D29CB38C1CE]) [    ] o.a.s.c.c.SolrZkClient Using default ZkACLProvider
   [junit4]   2> 413686 INFO  (TEST-TestReqParamsAPI.test-seed#[EAA29D29CB38C1CE]) [    ] o.a.s.s.SolrDispatchFilter Loading solr.xml from SolrHome (not found in ZooKeeper)
   [junit4]   2> 413686 INFO  (TEST-TestReqParamsAPI.test-seed#[EAA29D29CB38C1CE]) [    ] o.a.s.c.SolrXmlConfig Loading container configuration from /export/home/jenkins/workspace/Lucene-Solr-master-Solaris/solr/build/solr-core/test/J0/temp/solr.handler.TestReqParamsAPI_EAA29D29CB38C1CE-001/control-001/solr.xml
   [junit4]   2> 413691 INFO  (TEST-TestReqParamsAPI.test-seed#[EAA29D29CB38C1CE]) [    ] o.a.s.c.CorePropertiesLocator Config-defined core root directory: /export/home/jenkins/workspace/Lucene-Solr-master-Solaris/solr/build/solr-core/test/J0/../../../../../../../../../../export/home/jenkins/workspace/Lucene-Solr-master-Solaris/solr/build/solr-core/test/J0/temp/solr.handler.TestReqParamsAPI_EAA29D29CB38C1CE-001/control-001/cores
   [junit4]   2> 413691 INFO  (TEST-TestReqParamsAPI.test-seed#[EAA29D29CB38C1CE]) [    ] o.a.s.c.CoreContainer New CoreContainer 499553892
   [junit4]   2> 413691 INFO  (TEST-TestReqParamsAPI.test-seed#[EAA29D29CB38C1CE]) [    ] o.a.s.c.CoreContainer Loading cores into CoreContainer [instanceDir=/export/home/jenkins/workspace/Lucene-Solr-master-Solaris/solr/build/solr-core/test/J0/temp/solr.handler.TestReqParamsAPI_EAA29D29CB38C1CE-001/control-001]
   [junit4]   2> 413691 WARN  (TEST-TestReqParamsAPI.test-seed#[EAA29D29CB38C1CE]) [    ] o.a.s.c.CoreContainer Couldn't add files from /export/home/jenkins/workspace/Lucene-Solr-master-Solaris/solr/build/solr-core/test/J0/temp/solr.handler.TestReqParamsAPI_EAA29D29CB38C1CE-001/control-001/lib to classpath: /export/home/jenkins/workspace/Lucene-Solr-master-Solaris/solr/build/solr-core/test/J0/temp/solr.handler.TestReqParamsAPI_EAA29D29CB38C1CE-001/control-001/lib
   [junit4]   2> 413692 INFO  (TEST-TestReqParamsAPI.test-seed#[EAA29D29CB38C1CE]) [    ] o.a.s.h.c.HttpShardHandlerFactory created with socketTimeout : 90000,urlScheme : ,connTimeout : 15000,maxConnectionsPerHost : 20,maxConnections : 10000,corePoolSize : 0,maximumPoolSize : 2147483647,maxThreadIdleTime : 5,sizeOfQueue : -1,fairnessPolicy : false,
   [junit4]   2> 413694 INFO  (TEST-TestReqParamsAPI.test-seed#[EAA29D29CB38C1CE]) [    ] o.a.s.u.UpdateShardHandler Creating UpdateShardHandler HTTP client with params: 
   [junit4]   2> 413696 INFO  (TEST-TestReqParamsAPI.test-seed#[EAA29D29CB38C1CE]) [    ] o.a.s.l.LogWatcher SLF4J impl is org.slf4j.impl.Log4jLoggerFactory
   [junit4]   2> 413696 INFO  (TEST-TestReqParamsAPI.test-seed#[EAA29D29CB38C1CE]) [    ] o.a.s.l.LogWatcher Registering Log Listener [Log4j (org.slf4j.impl.Log4jLoggerFactory)]
   [junit4]   2> 413696 INFO  (TEST-TestReqParamsAPI.test-seed#[EAA29D29CB38C1CE]) [    ] o.a.s.c.ZkContainer Zookeeper client=127.0.0.1:64384/solr
   [junit4]   2> 413696 INFO  (TEST-TestReqParamsAPI.test-seed#[EAA29D29CB38C1CE]) [    ] o.a.s.c.ZkController zkHost includes chroot
   [junit4]   2> 413696 INFO  (TEST-TestReqParamsAPI.test-seed#[EAA29D29CB38C1CE]) [    ] o.a.s.c.c.SolrZkClient Using default ZkCredentialsProvider
   [junit4]   2> 413697 INFO  (TEST-TestReqParamsAPI.test-seed#[EAA29D29CB38C1CE]) [    ] o.a.s.c.c.ConnectionManager Waiting for client to connect to ZooKeeper
   [junit4]   2> 413699 INFO  (zkCallback-499-thread-1) [    ] o.a.s.c.c.ConnectionManager Watcher org.apache.solr.common.cloud.ConnectionManager@6463a497 name:ZooKeeperConnection Watcher:127.0.0.1:64384 got event WatchedEvent state:SyncConnected type:None path:null path:null type:None
   [junit4]   2> 413702 INFO  (TEST-TestReqParamsAPI.test-seed#[EAA29D29CB38C1CE]) [    ] o.a.s.c.c.ConnectionManager Client is connected to ZooKeeper
   [junit4]   2> 413703 INFO  (TEST-TestReqParamsAPI.test-seed#[EAA29D29CB38C1CE]) [    ] o.a.s.c.c.SolrZkClient Using default ZkACLProvider
   [junit4]   2> 413705 INFO  (TEST-TestReqParamsAPI.test-seed#[EAA29D29CB38C1CE]) [n:127.0.0.1:58958_goh%2Frz    ] o.a.s.c.ZkController Added new OnReconnect listener org.apache.solr.cloud.ZkController$$Lambda$40/814145296@4f2ba2a3
   [junit4]   2> 413706 INFO  (TEST-TestReqParamsAPI.test-seed#[EAA29D29CB38C1CE]) [n:127.0.0.1:58958_goh%2Frz    ] o.a.s.c.c.ConnectionManager Waiting for client to connect to ZooKeeper
   [junit4]   2> 413708 INFO  (zkCallback-500-thread-1-processing-n:127.0.0.1:58958_goh%2Frz) [n:127.0.0.1:58958_goh%2Frz    ] o.a.s.c.c.ConnectionManager Watcher org.apache.solr.common.cloud.ConnectionManager@95a95fb name:ZooKeeperConnection Watcher:127.0.0.1:64384/solr got event WatchedEvent state:SyncConnected type:None path:null path:null type:None
   [junit4]   2> 413709 INFO  (TEST-TestReqParamsAPI.test-seed#[EAA29D29CB38C1CE]) [n:127.0.0.1:58958_goh%2Frz    ] o.a.s.c.c.ConnectionManager Client is connected to ZooKeeper
   [junit4]   2> 413710 INFO  (TEST-TestReqParamsAPI.test-seed#[EAA29D29CB38C1CE]) [n:127.0.0.1:58958_goh%2Frz    ] o.a.s.c.c.SolrZkClient makePath: /overseer/queue
   [junit4]   2> 413713 INFO  (TEST-TestReqParamsAPI.test-seed#[EAA29D29CB38C1CE]) [n:127.0.0.1:58958_goh%2Frz    ] o.a.s.c.c.SolrZkClient makePath: /overseer/collection-queue-work
   [junit4]   2> 413718 INFO  (TEST-TestReqParamsAPI.test-seed#[EAA29D29CB38C1CE]) [n:127.0.0.1:58958_goh%2Frz    ] o.a.s.c.c.SolrZkClient makePath: /overseer/collection-map-running
   [junit4]   2> 413721 INFO  (TEST-TestReqParamsAPI.test-seed#[EAA29D29CB38C1CE]) [n:127.0.0.1:58958_goh%2Frz    ] o.a.s.c.c.SolrZkClient makePath: /overseer/collection-map-completed
   [junit4]   2> 413724 INFO  (TEST-TestReqParamsAPI.test-seed#[EAA29D29CB38C1CE]) [n:127.0.0.1:58958_goh%2Frz    ] o.a.s.c.c.SolrZkClient makePath: /overseer/collection-map-failure
   [junit4]   2> 413727 INFO  (TEST-TestReqParamsAPI.test-seed#[EAA29D29CB38C1CE]) [n:127.0.0.1:58958_goh%2Frz    ] o.a.s.c.c.SolrZkClient makePath: /live_nodes
   [junit4]   2> 413729 INFO  (TEST-TestReqParamsAPI.test-seed#[EAA29D29CB38C1CE]) [n:127.0.0.1:58958_goh%2Frz    ] o.a.s.c.c.SolrZkClient makePath: /aliases.json
   [junit4]   2> 413731 INFO  (TEST-TestReqParamsAPI.test-seed#[EAA29D29CB38C1CE]) [n:127.0.0.1:58958_goh%2Frz    ] o.a.s.c.c.SolrZkClient makePath: /clusterstate.json
   [junit4]   2> 413733 INFO  (TEST-TestReqParamsAPI.test-seed#[EAA29D29CB38C1CE]) [n:127.0.0.1:58958_goh%2Frz    ] o.a.s.c.c.SolrZkClient makePath: /security.json
   [junit4]   2> 413735 INFO  (TEST-TestReqParamsAPI.test-seed#[EAA29D29CB38C1CE]) [n:127.0.0.1:58958_goh%2Frz    ] o.a.s.c.c.ZkStateReader Updating cluster state from ZooKeeper... 
   [junit4]   2> 413737 INFO  (TEST-TestReqParamsAPI.test-seed#[EAA29D29CB38C1CE]) [n:127.0.0.1:58958_goh%2Frz    ] o.a.s.c.c.ZkStateReader Loaded empty cluster properties
   [junit4]   2> 413738 INFO  (TEST-TestReqParamsAPI.test-seed#[EAA29D29CB38C1CE]) [n:127.0.0.1:58958_goh%2Frz    ] o.a.s.c.c.ZkStateReader Updated live nodes from ZooKeeper... (0) -> (0)
   [junit4]   2> 413744 INFO  (TEST-TestReqParamsAPI.test-seed#[EAA29D29CB38C1CE]) [n:127.0.0.1:58958_goh%2Frz    ] o.a.s.c.c.SolrZkClient makePath: /overseer_elect
   [junit4]   2> 413761 INFO  (TEST-TestReqParamsAPI.test-seed#[EAA29D29CB38C1CE]) [n:127.0.0.1:58958_goh%2Frz    ] o.a.s.c.c.SolrZkClient makePath: /overseer_elect/election
   [junit4]   2> 413776 INFO  (TEST-TestReqParamsAPI.test-seed#[EAA29D29CB38C1CE]) [n:127.0.0.1:58958_goh%2Frz    ] o.a.s.c.Overseer Overseer (id=null) closing
   [junit4]   2> 413782 INFO  (TEST-TestReqParamsAPI.test-seed#[EAA29D29CB38C1CE]) [n:127.0.0.1:58958_goh%2Frz    ] o.a.s.c.LeaderElector Joined leadership election with path: /overseer_elect/election/96121502575951876-127.0.0.1:58958_goh%2Frz-n_0000000000
   [junit4]   2> 413793 INFO  (TEST-TestReqParamsAPI.test-seed#[EAA29D29CB38C1CE]) [n:127.0.0.1:58958_goh%2Frz    ] o.a.s.c.OverseerElectionContext I am going to be the leader 127.0.0.1:58958_goh%2Frz
   [junit4]   2> 413793 INFO  (TEST-TestReqParamsAPI.test-seed#[EAA29D29CB38C1CE]) [n:127.0.0.1:58958_goh%2Frz    ] o.a.s.c.c.SolrZkClient makePath: /overseer_elect/leader
   [junit4]   2> 413815 INFO  (TEST-TestReqParamsAPI.test-seed#[EAA29D29CB38C1CE]) [n:127.0.0.1:58958_goh%2Frz    ] o.a.s.c.Overseer Overseer (id=96121502575951876-127.0.0.1:58958_goh%2Frz-n_0000000000) starting
   [junit4]   2> 413818 INFO  (TEST-TestReqParamsAPI.test-seed#[EAA29D29CB38C1CE]) [n:127.0.0.1:58958_goh%2Frz    ] o.a.s.c.c.SolrZkClient makePath: /overseer/queue-work
   [junit4]   2> 413847 INFO  (TEST-TestReqParamsAPI.test-seed#[EAA29D29CB38C1CE]) [n:127.0.0.1:58958_goh%2Frz    ] o.a.s.c.OverseerAutoReplicaFailoverThread Starting OverseerAutoReplicaFailoverThread autoReplicaFailoverWorkLoopDelay=10000 autoReplicaFailoverWaitAfterExpiration=30000 autoReplicaFailoverBadNodeExpiration=60000
   [junit4]   2> 413848 INFO  (TEST-TestReqParamsAPI.test-seed#[EAA29D29CB38C1CE]) [n:127.0.0.1:58958_goh%2Frz    ] o.a.s.c.ZkController Register node as live in ZooKeeper:/live_nodes/127.0.0.1:58958_goh%2Frz
   [junit4]   2> 413848 INFO  (TEST-TestReqParamsAPI.test-seed#[EAA29D29CB38C1CE]) [n:127.0.0.1:58958_goh%2Frz    ] o.a.s.c.c.SolrZkClient makePath: /live_nodes/127.0.0.1:58958_goh%2Frz
   [junit4]   2> 413851 INFO  (zkCallback-500-thread-1-processing-n:127.0.0.1:58958_goh%2Frz) [n:127.0.0.1:58958_goh%2Frz    ] o.a.s.c.c.ZkStateReader A live node change: [WatchedEvent state:SyncConnected type:NodeChildrenChanged path:/live_nodes], has occurred - updating... (live nodes size: [0])
   [junit4]   2> 413929 INFO  (zkCallback-500-thread-1-processing-n:127.0.0.1:58958_goh%2Frz) [n:127.0.0.1:58958_goh%2Frz    ] o.a.s.c.c.ZkStateReader Updated live nodes from ZooKeeper... (0) -> (1)
   [junit4]   2> 413930 INFO  (OverseerCollectionConfigSetProcessor-96121502575951876-127.0.0.1:58958_goh%2Frz-n_0000000000) [n:127.0.0.1:58958_goh%2Frz    ] o.a.s.c.OverseerTaskProcessor Process current queue of overseer operations
   [junit4]   2> 413944 INFO  (OverseerStateUpdate-96121502575951876-127.0.0.1:58958_goh%2Frz-n_0000000000) [n:127.0.0.1:58958_goh%2Frz    ] o.a.s.c.Overseer Starting to work on the main queue
   [junit4]   2> 413949 INFO  (OverseerStateUpdate-96121502575951876-127.0.0.1:58958_goh%2Frz-n_0000000000) [n:127.0.0.1:58958_goh%2Frz    ] o.a.s.c.c.ZkStateReader Updated live nodes from ZooKeeper... (1) -> (1)
   [junit4]   2> 413952 INFO  (TEST-TestReqParamsAPI.test-seed#[EAA29D29CB38C1CE]) [n:127.0.0.1:58958_goh%2Frz    ] o.a.s.c.CoreContainer Security conf doesn't exist. Skipping setup for authorization module.
   [junit4]   2> 413952 INFO  (TEST-TestReqParamsAPI.test-seed#[EAA29D29CB38C1CE]) [n:127.0.0.1:58958_goh%2Frz    ] o.a.s.c.CoreContainer No authentication plugin used.
   [junit4]   2> 413953 INFO  (TEST-TestReqParamsAPI.test-seed#[EAA29D29CB38C1CE]) [n:127.0.0.1:58958_goh%2Frz    ] o.a.s.c.CorePropertiesLocator Looking for core definitions underneath /export/home/jenkins/workspace/Lucene-Solr-master-Solaris/solr/build/solr-core/test/J0/../../../../../../../../../../export/home/jenkins/workspace/Lucene-Solr-master-Solaris/solr/build/solr-core/test/J0/temp/solr.handler.TestReqParamsAPI_EAA29D29CB38C1CE-001/control-001/cores
   [junit4]   2> 413954 INFO  (TEST-TestReqParamsAPI.test-seed#[EAA29D29CB38C1CE]) [n:127.0.0.1:58958_goh%2Frz    ] o.a.s.c.CoreDescriptor Created CoreDescriptor: {name=collection1, config=solrconfig.xml, transient=false, schema=schema.xml, loadOnStartup=true, configSetProperties=configsetprops.json, collection=control_collection, coreNodeName=, dataDir=data/, shard=}
   [junit4]   2> 413955 INFO  (TEST-TestReqParamsAPI.test-seed#[EAA29D29CB38C1CE]) [n:127.0.0.1:58958_goh%2Frz    ] o.a.s.c.CorePropertiesLocator Found core collection1 in /export/home/jenkins/workspace/Lucene-Solr-master-Solaris/solr/build/solr-core/test/J0/../../../../../../../../../../export/home/jenkins/workspace/Lucene-Solr-master-Solaris/solr/build/solr-core/test/J0/temp/solr.handler.TestReqParamsAPI_EAA29D29CB38C1CE-001/control-001/cores/collection1
   [junit4]   2> 413955 INFO  (TEST-TestReqParamsAPI.test-seed#[EAA29D29CB38C1CE]) [n:127.0.0.1:58958_goh%2Frz    ] o.a.s.c.CorePropertiesLocator Found 1 core definitions
   [junit4]   2> 413956 INFO  (TEST-TestReqParamsAPI.test-seed#[EAA29D29CB38C1CE]) [n:127.0.0.1:58958_goh%2Frz    ] o.a.s.s.SolrDispatchFilter user.dir=/export/home/jenkins/workspace/Lucene-Solr-master-Solaris/solr/build/solr-core/test/J0
   [junit4]   2> 413956 INFO  (TEST-TestReqParamsAPI.test-seed#[EAA29D29CB38C1CE]) [n:127.0.0.1:58958_goh%2Frz    ] o.a.s.s.SolrDispatchFilter SolrDispatchFilter.init() done
   [junit4]   2> 413956 INFO  (coreLoadExecutor-1014-thread-1-processing-n:127.0.0.1:58958_goh%2Frz) [n:127.0.0.1:58958_goh%2Frz c:control_collection   x:collection1] o.a.s.c.ZkController publishing state=down
   [junit4]   2> 413957 INFO  (coreLoadExecutor-1014-thread-1-processing-n:127.0.0.1:58958_goh%2Frz) [n:127.0.0.1:58958_goh%2Frz c:control_collection   x:collection1] o.a.s.c.ZkController numShards not found on descriptor - reading it from system property
   [junit4]   2> 413959 INFO  (coreLoadExecutor-1014-thread-1-processing-n:127.0.0.1:58958_goh%2Frz) [n:127.0.0.1:58958_goh%2Frz c:control_collection   x:collection1] o.a.s.c.ZkController Collection control_collection not visible yet, but flagging it so a watch is registered when it becomes visible
   [junit4]   2> 413961 INFO  (coreLoadExecutor-1014-thread-1-processing-n:127.0.0.1:58958_goh%2Frz) [n:127.0.0.1:58958_goh%2Frz c:control_collection   x:collection1] o.a.s.c.c.ZkStateReader Deleting data for [control_collection]
   [junit4]   2> 413961 INFO  (OverseerStateUpdate-96121502575951876-127.0.0.1:58958_goh%2Frz-n_0000000000) [n:127.0.0.1:58958_goh%2Frz    ] o.a.s.c.Overseer processMessage: queueSize: 1, message = {
   [junit4]   2>   "core":"collection1",
   [junit4]   2>   "roles":null,
   [junit4]   2>   "base_url":"http://127.0.0.1:58958/goh/rz",
   [junit4]   2>   "node_name":"127.0.0.1:58958_goh%2Frz",
   [junit4]   2>   "numShards":"1",
   [junit4]   2>   "state":"down",
   [junit4]   2>   "shard":null,
   [junit4]   2>   "collection":"control_collection",
   [junit4]   2>   "operation":"state"} current state version: 0
   [junit4]   2> 413961 INFO  (OverseerStateUpdate-96121502575951876-127.0.0.1:58958_goh%2Frz-n_0000000000) [n:127.0.0.1:58958_goh%2Frz    ] o.a.s.c.o.ReplicaMutator Update state numShards=1 message={
   [junit4]   2>   "core":"collection1",
   [junit4]   2>   "roles":null,
   [junit4]   2>   "base_url":"http://127.0.0.1:58958/goh/rz",
   [junit4]   2>   "node_name":"127.0.0.1:58958_goh%2Frz",
   [junit4]   2>   "numShards":"1",
   [junit4]   2>   "state":"down",
   [junit4]   2>   "shard":null,
   [junit4]   2>   "collection":"control_collection",
   [junit4]   2>   "operation":"state"}
   [junit4]   2> 413962 INFO  (OverseerStateUpdate-96121502575951876-127.0.0.1:58958_goh%2Frz-n_0000000000) [n:127.0.0.1:58958_goh%2Frz    ] o.a.s.c.o.ClusterStateMutator building a new cName: control_collection
   [junit4]   2> 413962 INFO  (OverseerStateUpdate-96121502575951876-127.0.0.1:58958_goh%2Frz-n_0000000000) [n:127.0.0.1:58958_goh%2Frz    ] o.a.s.c.o.ReplicaMutator Assigning new node to shard shard=shard1
   [junit4]   2> 413963 INFO  (coreLoadExecutor-1014-thread-1-processing-n:127.0.0.1:58958_goh%2Frz) [n:127.0.0.1:58958_goh%2Frz c:control_collection   x:collection1] o.a.s.c.ZkController look for our core node name
   [junit4]   2> 413965 INFO  (zkCallback-500-thread-1-processing-n:127.0.0.1:58958_goh%2Frz) [n:127.0.0.1:58958_goh%2Frz    ] o.a.s.c.c.ZkStateReader A cluster state change: [WatchedEvent state:SyncConnected type:NodeDataChanged path:/clusterstate.json], has occurred - updating... (live nodes size: [1])
   [junit4]   2> 414964 INFO  (coreLoadExecutor-1014-thread-1-processing-n:127.0.0.1:58958_goh%2Frz) [n:127.0.0.1:58958_goh%2Frz c:control_collection   x:collection1] o.a.s.c.ZkController waiting to find shard id in clusterstate for collection1
   [junit4]   2> 414964 INFO  (coreLoadExecutor-1014-thread-1-processing-n:127.0.0.1:58958_goh%2Frz) [n:127.0.0.1:58958_goh%2Frz c:control_collection   x:collection1] o.a.s.c.ZkController Check for collection zkNode:control_collection
   [junit4]   2> 414965 INFO  (coreLoadExecutor-1014-thread-1-processing-n:127.0.0.1:58958_goh%2Frz) [n:127.0.0.1:58958_goh%2Frz c:control_collection   x:collection1] o.a.s.c.ZkController Collection zkNode exists
   [junit4]   2> 414965 INFO  (coreLoadExecutor-1014-thread-1-processing-n:127.0.0.1:58958_goh%2Frz) [n:127.0.0.1:58958_goh%2Frz c:control_collection   x:collection1] o.a.s.c.c.ZkStateReader Load collection config from: [/collections/control_collection]
   [junit4]   2> 414966 INFO  (coreLoadExecutor-1014-thread-1-processing-n:127.0.0.1:58958_goh%2Frz) [n:127.0.0.1:58958_goh%2Frz c:control_collection   x:collection1] o.a.s.c.c.ZkStateReader path=[/collections/control_collection] [configName]=[conf1] specified config exists in ZooKeeper
   [junit4]   2> 414966 INFO  (coreLoadExecutor-1014-thread-1-processing-n:127.0.0.1:58958_goh%2Frz) [n:127.0.0.1:58958_goh%2Frz c:control_collection   x:collection1] o.a.s.c.SolrResourceLoader new SolrResourceLoader for directory: '/export/home/jenkins/workspace/Lucene-Solr-master-Solaris/solr/build/solr-core/test/J0/temp/solr.handler.TestReqParamsAPI_EAA29D29CB38C1CE-001/control-001/cores/collection1'
   [junit4]   2> 414966 INFO  (coreLoadExecutor-1014-thread-1-processing-n:127.0.0.1:58958_goh%2Frz) [n:127.0.0.1:58958_goh%2Frz c:control_collection   x:collection1] o.a.s.c.SolrResourceLoader JNDI not configured for solr (NoInitialContextEx)
   [junit4]   2> 414966 INFO  (coreLoadExecutor-1014-thread-1-processing-n:127.0.0.1:58958_goh%2Frz) [n:127.0.0.1:58958_goh%2Frz c:control_collection   x:collection1] o.a.s.c.SolrResourceLoader solr home defaulted to 'solr/' (could not find system property or JNDI)
   [junit4]   2> 414968 INFO  (coreLoadExecutor-1014-thread-1-processing-n:127.0.0.1:58958_goh%2Frz) [n:127.0.0.1:58958_goh%2Frz c:control_collection   x:collection1] o.a.s.c.Config loaded config solrconfig.xml with version 0 
   [junit4]   2> 414981 INFO  (coreLoadExecutor-1014-thread-1-processing-n:127.0.0.1:58958_goh%2Frz) [n:127.0.0.1:58958_goh%2Frz c:control_collection   x:collection1] o.a.s.c.SolrConfig current version of requestparams : -1
   [junit4]   2> 414984 INFO  (coreLoadExecutor-1014-thread-1-processing-n:127.0.0.1:58958_goh%2Frz) [n:127.0.0.1:58958_goh%2Frz c:control_collection   x:collection1] o.a.s.c.SolrConfig Using Lucene MatchVersion: 7.0.0
   [junit4]   2> 414991 INFO  (coreLoadExecutor-1014-thread-1-processing-n:127.0.0.1:58958_goh%2Frz) [n:127.0.0.1:58958_goh%2Frz c:control_collection   x:collection1] o.a.s.c.SolrConfig Loaded SolrConfig: solrconfig.xml
   [junit4]   2> 414996 INFO  (coreLoadExecutor-1014-thread-1-processing-n:127.0.0.1:58958_goh%2Frz) [n:127.0.0.1:58958_goh%2Frz c:control_collection   x:collection1] o.a.s.s.IndexSchema [collection1] Schema name=test
   [junit4]   2> 415062 INFO  (coreLoadExecutor-1014-thread-1-processing-n:127.0.0.1:58958_goh%2Frz) [n:127.0.0.1:58958_goh%2Frz c:control_collection   x:collection1] o.a.s.s.OpenExchangeRatesOrgProvider Initialized with rates=open-exchange-rates.json, refreshInterval=1440.
   [junit4]   2> 415067 INFO  (coreLoadExecutor-1014-thread-1-processing-n:127.0.0.1:58958_goh%2Frz) [n:127.0.0.1:58958_goh%2Frz c:control_collection   x:collection1] o.a.s.s.IndexSchema default search field in schema is text
   [junit4]   2> 415068 INFO  (coreLoadExecutor-1014-thread-1-processing-n:127.0.0.1:58958_goh%2Frz) [n:127.0.0.1:58958_goh%2Frz c:control_collection   x:collection1] o.a.s.s.IndexSchema unique key field: id
   [junit4]   2> 415080 INFO  (coreLoadExecutor-1014-thread-1-processing-n:127.0.0.1:58958_goh%2Frz) [n:127.0.0.1:58958_goh%2Frz c:control_collection   x:collection1] o.a.s.s.FileExchangeRateProvider Reloading exchange rates from file currency.xml
   [junit4]   2> 415082 INFO  (coreLoadExecutor-1014-thread-1-processing-n:127.0.0.1:58958_goh%2Frz) [n:127.0.0.1:58958_goh%2Frz c:control_collection   x:collection1] o.a.s.s.FileExchangeRateProvider Reloading exchange rates from file currency.xml
   [junit4]   2> 415084 INFO  (coreLoadExecutor-1014-thread-1-processing-n:127.0.0.1:58958_goh%2Frz) [n:127.0.0.1:58958_goh%2Frz c:control_collection   x:collection1] o.a.s.s.OpenExchangeRatesOrgProvider Reloading exchange rates from open-exchange-rates.json
   [junit4]   2> 415085 INFO  (coreLoadExecutor-1014-thread-1-processing-n:127.0.0.1:58958_goh%2Frz) [n:127.0.0.1:58958_goh%2Frz c:control_collection   x:collection1] o.a.s.s.OpenExchangeRatesOrgProvider Reloading exchange rates from open-exchange-rates.json
   [junit4]   2> 415087 INFO  (coreLoadExecutor-1014-thread-1-processing-n:127.0.0.1:58958_goh%2Frz) [n:127.0.0.1:58958_goh%2Frz c:control_collection   x:collection1] o.a.s.c.ConfigSetProperties Did not find ConfigSet properties, assuming default properties: Can't find resource 'configsetprops.json' in classpath or '/configs/conf1', cwd=/export/home/jenkins/workspace/Lucene-Solr-master-Solaris/solr/build/solr-core/test/J0
   [junit4]   2> 415087 INFO  (coreLoadExecutor-1014-thread-1-processing-n:127.0.0.1:58958_goh%2Frz) [n:127.0.0.1:58958_goh%2Frz c:control_collection   x:collection1] o.a.s.c.CoreContainer Creating SolrCore 'collection1' using configuration from collection control_collection
   [junit4]   2> 415087 INFO  (coreLoadExecutor-1014-thread-1-processing-n:127.0.0.1:58958_goh%2Frz) [n:127.0.0.1:58958_goh%2Frz c:control_collection s:shard1 r:core_node1 x:collection1] o.a.s.c.SolrCore org.apache.solr.core.MockDirectoryFactory
   [junit4]   2> 415088 INFO  (coreLoadExecutor-1014-thread-1-processing-n:127.0.0.1:58958_goh%2Frz) [n:127.0.0.1:58958_goh%2Frz c:control_collection s:shard1 r:core_node1 x:collection1] o.a.s.c.SolrCore [[collection1] ] Opening new SolrCore at [/export/home/jenkins/workspace/Lucene-Solr-master-Solaris/solr/build/solr-core/test/J0/temp/solr.handler.TestReqParamsAPI_EAA29D29CB38C1CE-001/control-001/cores/collection1], dataDir=[/export/home/jenkins/workspace/Lucene-Solr-master-Solaris/solr/build/solr-core/test/J0/../../../../../../../../../../export/home/jenkins/workspace/Lucene-Solr-master-Solaris/solr/build/solr-core/test/J0/temp/solr.handler.TestReqParamsAPI_EAA29D29CB38C1CE-001/control-001/cores/collection1/data/]
   [junit4]   2> 415088 INFO  (coreLoadExecutor-1014-thread-1-processing-n:127.0.0.1:58958_goh%2Frz) [n:127.0.0.1:58958_goh%2Frz c:control_collection s:shard1 r:core_node1 x:collection1] o.a.s.c.JmxMonitoredMap JMX monitoring is enabled. Adding Solr mbeans to JMX Server: com.sun.jmx.mbeanserver.JmxMBeanServer@69df3bd4
   [junit4]   2> 415088 INFO  (coreLoadExecutor-1014-thread-1-processing-n:127.0.0.1:58958_goh%2Frz) [n:127.0.0.1:58958_goh%2Frz c:control_collection s:shard1 r:core_node1 x:collection1] o.a.s.c.CachingDirectoryFactory return new directory for /export/home/jenkins/workspace/Lucene-Solr-master-Solaris/solr/build/solr-core/test/J0/../../../../../../../../../../export/home/jenkins/workspace/Lucene-Solr-master-Solaris/solr/build/solr-core/test/J0/temp/solr.handler.TestReqParamsAPI_EAA29D29CB38C1CE-001/control-001/cores/collection1/data
   [junit4]   2> 415088 INFO  (coreLoadExecutor-1014-thread-1-processing-n:127.0.0.1:58958_goh%2Frz) [n:127.0.0.1:58958_goh%2Frz c:control_collection s:shard1 r:core_node1 x:collection1] o.a.s.c.SolrCore New index directory detected: old=null new=/export/home/jenkins/workspace/Lucene-Solr-master-Solaris/solr/build/solr-core/test/J0/../../../../../../../../../../export/home/jenkins/workspace/Lucene-Solr-master-Solaris/solr/build/solr-core/test/J0/temp/solr.handler.TestReqParamsAPI_EAA29D29CB38C1CE-001/control-001/cores/collection1/data/index/
   [junit4]   2> 415088 WARN  (coreLoadExecutor-1014-thread-1-processing-n:127.0.0.1:58958_goh%2Frz) [n:127.0.0.1:58958_goh%2Frz c:control_collection s:shard1 r:core_node1 x:collection1] o.a.s.c.SolrCore [collection1] Solr index directory '/export/home/jenkins/workspace/Lucene-Solr-master-Solaris/solr/build/solr-core/test/J0/../../../../../../../../../../export/home/jenkins/workspace/Lucene-Solr-master-Solaris/solr/build/solr-core/test/J0/temp/solr.handler.TestReqParamsAPI_EAA29D29CB38C1CE-001/control-001/cores/collection1/data/index' doesn't exist. Creating new index...
   [junit4]   2> 415089 INFO  (coreLoadExecutor-1014-thread-1-processing-n:127.0.0.1:58958_goh%2Frz) [n:127.0.0.1:58958_goh%2Frz c:control_collection s:shard1 r:core_node1 x:collection1] o.a.s.c.CachingDirectoryFactory return new directory for /export/home/jenkins/workspace/Lucene-Solr-master-Solaris/solr/build/solr-core/test/J0/../../../../../../../../../../export/home/jenkins/workspace/Lucene-Solr-master-Solaris/solr/build/solr-core/test/J0/temp/solr.handler.TestReqParamsAPI_EAA29D29CB38C1CE-001/control-001/cores/collection1/data/index
   [junit4]   2> 415089 INFO  (coreLoadExecutor-1014-thread-1-processing-n:127.0.0.1:58958_goh%2Frz) [n:127.0.0.1:58958_goh%2Frz c:control_collection s:shard1 r:core_node1 x:collection1] o.a.s.u.RandomMergePolicy RandomMergePolicy wrapping class org.apache.lucene.index.AlcoholicMergePolicy: [AlcoholicMergePolicy: minMergeSize=0, mergeFactor=10, maxMergeSize=2045479150, maxMergeSizeForForcedMerge=9223372036854775807, calibrateSizeByDeletes=true, maxMergeDocs=2147483647, maxCFSSegmentSizeMB=8.796093022207999E12, noCFSRatio=0.1]
   [junit4]   2> 415090 INFO  (coreLoadExecutor-1014-thread-1-processing-n:127.0.0.1:58958_goh%2Frz) [n:127.0.0.1:58958_goh%2Frz c:control_collection s:shard1 r:core_node1 x:collection1] o.a.s.c.SolrDeletionPolicy SolrDeletionPolicy.onCommit: commits: num=1
   [junit4]   2> 	commit{dir=MockDirectoryWrapper(RAMDirectory@78e3bea4 lockFactory=org.apache.lucene.store.SingleInstanceLockFactory@6070d4c1),segFN=segments_1,generation=1}
   [junit4]   2> 415090 INFO  (coreLoadExecutor-1014-thread-1-processing-n:127.0.0.1:58958_goh%2Frz) [n:127.0.0.1:58958_goh%2Frz c:control_collection s:shard1 r:core_node1 x:collection1] o.a.s.c.SolrDeletionPolicy newest commit generation = 1
   [junit4]   2> 415091 INFO  (OldIndexDirectoryCleanupThreadForCore-collection1) [n:127.0.0.1:58958_goh%2Frz c:control_collection s:shard1 r:core_node1 x:collection1] o.a.s.c.SolrCore Looking for old index directories to cleanup for core collection1 in /export/home/jenkins/workspace/Lucene-Solr-master-Solaris/solr/build/solr-core/test/J0/../../../../../../../../../../export/home/jenkins/workspace/Lucene-Solr-master-Solaris/solr/build/solr-core/test/J0/temp/solr.handler.TestReqParamsAPI_EAA29D29CB38C1CE-001/control-001/cores/collection1/data/
   [junit4]   2> 415091 WARN  (OldIndexDirectoryCleanupThreadForCore-collection1) [n:127.0.0.1:58958_goh%2Frz c:control_collection s:shard1 r:core_node1 x:collection1] o.a.s.c.DirectoryFactory /export/home/jenkins/workspace/Lucene-Solr-master-Solaris/solr/build/solr-core/test/J0/../../../../../../../../../../export/home/jenkins/workspace/Lucene-Solr-master-Solaris/solr/build/solr-core/test/J0/temp/solr.handler.TestReqParamsAPI_EAA29D29CB38C1CE-001/control-001/cores/collection1/data/ does not point to a valid data directory; skipping clean-up of old index directories.
   [junit4]   2> 415093 INFO  (coreLoadExecutor-1014-thread-1-processing-n:127.0.0.1:58958_goh%2Frz) [n:127.0.0.1:58958_goh%2Frz c:control_collection s:shard1 r:core_node1 x:collection1] o.a.s.u.p.UpdateRequestProcessorChain creating updateRequestProcessorChain "nodistrib"
   [junit4]   2> 415094 INFO  (coreLoadExecutor-1014-thread-1-processing-n:127.0.0.1:58958_goh%2Frz) [n:127.0.0.1:58958_goh%2Frz c:control_collection s:shard1 r:core_node1 x:collection1] o.a.s.u.p.UpdateRequestProcessorChain creating updateRequestProcessorChain "dedupe"
   [junit4]   2> 415094 INFO  (coreLoadExecutor-1014-thread-1-processing-n:127.0.0.1:58958_goh%2Frz) [n:127.0.0.1:58958_goh%2Frz c:control_collection s:shard1 r:core_node1 x:collection1] o.a.s.u.p.UpdateRequestProcessorChain inserting DistributedUpdateProcessorFactory into updateRequestProcessorChain "dedupe"
   [junit4]   2> 415094 INFO  (coreLoadExecutor-1014-thread-1-processing-n:127.0.0.1:58958_goh%2Frz) [n:127.0.0.1:58958_goh%2Frz c:control_collection s:shard1 r:core_node1 x:collection1] o.a.s.u.p.UpdateRequestProcessorChain creating updateRequestProcessorChain "stored_sig"
   [junit4]   2> 415094 INFO  (coreLoadExecutor-1014-thread-1-processing-n:127.0.0.1:58958_goh%2Frz) [n:127.0.0.1:58958_goh%2Frz c:control_collection s:shard1 r:core_node1 x:collection1] o.a.s.u.p.UpdateRequestProcessorChain inserting DistributedUpdateProcessorFactory into updateRequestProcessorChain "stored_sig"
   [junit4]   2> 415094 INFO  (coreLoadExecutor-1014-thread-1-processing-n:127.0.0.1:58958_goh%2Frz) [n:127.0.0.1:58958_goh%2Frz c:control_collection s:shard1 r:core_node1 x:collection1] o.a.s.u.p.UpdateRequestProcessorChain creating updateRequestProcessorChain "distrib-dup-test-chain-explicit"
   [junit4]   2> 415094 INFO  (coreLoadExecutor-1014-thread-1-processing-n:127.0.0.1:58958_goh%2Frz) [n:127.0.0.1:58958_goh%2Frz c:control_collection s:shard1 r:core_node1 x:collection1] o.a.s.u.p.UpdateRequestProcessorChain creating updateRequestProcessorChain "distrib-dup-test-chain-implicit"
   [junit4]   2> 415094 INFO  (coreLoadExecutor-1014-thread-1-processing-n:127.0.0.1:58958_goh%2Frz) [n:127.0.0.1:58958_goh%2Frz c:control_collection s:shard1 r:core_node1 x:collection1] o.a.s.u.p.UpdateRequestProcessorChain inserting DistributedUpdateProcessorFactory into updateRequestProcessorChain "distrib-dup-test-chain-implicit"
   [junit4]   2> 415094 INFO  (coreLoadExecutor-1014-thread-1-processing-n:127.0.0.1:58958_goh%2Frz) [n:127.0.0.1:58958_goh%2Frz c:control_collection s:shard1 r:core_node1 x:collection1] o.a.s.c.SolrCore no updateRequestProcessorChain defined as default, creating implicit default
   [junit4]   2> 415094 WARN  (coreLoadExecutor-1014-thread-1-processing-n:127.0.0.1:58958_goh%2Frz) [n:127.0.0.1:58958_goh%2Frz c:control_collection s:shard1 r:core_node1 x:collection1] o.a.s.c.RequestHandlers INVALID paramSet a in requestHandler {type = requestHandler,name = /dump,class = DumpRequestHandler,args = {defaults={a=A,b=B}}}
   [junit4]   2> 415096 INFO  (coreLoadExecutor-1014-thread-1-processing-n:127.0.0.1:58958_goh%2Frz) [n:127.0.0.1:58958_goh%2Frz c:control_collection s:shard1 r:core_node1 x:collection1] o.a.s.h.l.XMLLoader xsltCacheLifetimeSeconds=60
   [junit4]   2> 415097 INFO  (coreLoadExecutor-1014-thread-1-processing-n:127.0.0.1:58958_goh%2Frz) [n:127.0.0.1:58958_goh%2Frz c:control_collection s:shard1 r:core_node1 x:collection1] o.a.s.h.l.XMLLoader xsltCacheLifetimeSeconds=60
   [junit4]   2> 415097 INFO  (coreLoadExecutor-1014-thread-1-processing-n:127.0.0.1:58958_goh%2Frz) [n:127.0.0.1:58958_goh%2Frz c:control_collection s:shard1 r:core_node1 x:collection1] o.a.s.h.l.XMLLoader xsltCacheLifetimeSeconds=60
   [junit4]   2> 415099 INFO  (coreLoadExecutor-1014-thread-1-processing-n:127.0.0.1:58958_goh%2Frz) [n:127.0.0.1:58958_goh%2Frz c:control_collection s:shard1 r:core_node1 x:collection1] o.a.s.h.l.XMLLoader xsltCacheLifetimeSeconds=60
   [junit4]   2> 415102 INFO  (coreLoadExecutor-1014-thread-1-processing-n:127.0.0.1:58958_goh%2Frz) [n:127.0.0.1:58958_goh%2Frz c:control_collection s:shard1 r:core_node1 x:collection1] o.a.s.c.RequestHandlers Registered paths: /admin/mbeans,standard,/update/json/docs,/admin/luke,/export,/get,/admin/properties,/update/json,/admin/threads,/dump,/update/csv,/sql,/graph,/admin/segments,/admin/system,/replication,/config,/stream,/schema,/admin/plugins,/admin/logging,/admin/ping,/update,/admin/file
   [junit4]   2> 415102 INFO  (coreLoadExecutor-1014-thread-1-processing-n:127.0.0.1:58958_goh%2Frz) [n:127.0.0.1:58958_goh%2Frz c:control_collection s:shard1 r:core_node1 x:collection1] o.a.s.c.SolrCore Using default statsCache cache: org.apache.solr.search.stats.LocalStatsCache
   [junit4]   2> 415103 INFO  (coreLoadExecutor-1014-thread-1-processing-n:127.0.0.1:58958_goh%2Frz) [n:127.0.0.1:58958_goh%2Frz c:control_collection s:shard1 r:core_node1 x:collection1] o.a.s.u.UpdateHandler Using UpdateLog implementation: org.apache.solr.update.UpdateLog
   [junit4]   2> 415103 INFO  (coreLoadExecutor-1014-thread-1-processing-n:127.0.0.1:58958_goh%2Frz) [n:127.0.0.1:58958_goh%2Frz c:control_collection s:shard1 r:core_node1 x:collection1] o.a.s.u.UpdateLog Initializing UpdateLog: dataDir= defaultSyncLevel=FLUSH numRecordsToKeep=100 maxNumLogsToKeep=10 numVersionBuckets=65536
   [junit4]   2> 415104 INFO  (coreLoadExecutor-1014-thread-1-processing-n:127.0.0.1:58958_goh%2Frz) [n:127.0.0.1:58958_goh%2Frz c:control_collection s:shard1 r:core_node1 x:collection1] o.a.s.u.CommitTracker Hard AutoCommit: disabled
   [junit4]   2> 415104 INFO  (coreLoadExecutor-1014-thread-1-processing-n:127.0.0.1:58958_goh%2Frz) [n:127.0.0.1:58958_goh%2Frz c:control_collection s:shard1 r:core_node1 x:collection1] o.a.s.u.CommitTracker Soft AutoCommit: disabled
   [junit4]   2> 415104 INFO  (coreLoadExecutor-1014-thread-1-processing-n:127.0.0.1:58958_goh%2Frz) [n:127.0.0.1:58958_goh%2Frz c:control_collection s:shard1 r:core_node1 x:collection1] o.a.s.u.RandomMergePolicy RandomMergePolicy wrapping class org.apache.lucene.index.TieredMergePolicy: [TieredMergePolicy: maxMergeAtOnce=31, maxMergeAtOnceExplicit=32, maxMergedSegmentMB=92.451171875, floorSegmentMB=1.0859375, forceMergeDeletesPctAllowed=18.431533852277795, segmentsPerTier=44.0, maxCFSSegmentSizeMB=8.796093022207999E12, noCFSRatio=1.0
   [junit4]   2> 415104 INFO  (coreLoadExecutor-1014-thread-1-processing-n:127.0.0.1:58958_goh%2Frz) [n:127.0.0.1:58958_goh%2Frz c:control_collection s:shard1 r:core_node1 x:collection1] o.a.s.c.SolrDeletionPolicy SolrDeletionPolicy.onInit: commits: num=1
   [junit4]   2> 	commit{dir=MockDirectoryWrapper(RAMDirectory@78e3bea4 lockFactory=org.apache.lucene.store.SingleInstanceLockFactory@6070d4c1),segFN=segments_1,generation=1}
   [junit4]   2> 415104 INFO  (coreLoadExecutor-1014-thread-1-processing-n:127.0.0.1:58958_goh%2Frz) [n:127.0.0.1:58958_goh%2Frz c:control_collection s:shard1 r:core_node1 x:collection1] o.a.s.c.SolrDeletionPolicy newest commit generation = 1
   [junit4]   2> 415104 INFO  (coreLoadExecutor-1014-thread-1-processing-n:127.0.0.1:58958_goh%2Frz) [n:127.0.0.1:58958_goh%2Frz c:control_collection s:shard1 r:core_node1 x:collection1] o.a.s.s.SolrIndexSearcher Opening [Searcher@3a3399c6[collection1] main]
   [junit4]   2> 415105 INFO  (coreLoadExecutor-1014-thread-1-processing-n:127.0.0.1:58958_goh%2Frz) [n:127.0.0.1:58958_goh%2Frz c:control_collection s:shard1 r:core_node1 x:collection1] o.a.s.c.c.ZkStateReader Load collection config from: [/collections/control_collection]
   [junit4]   2> 415106 INFO  (coreLoadExecutor-1014-thread-1-processing-n:127.0.0.1:58958_goh%2Frz) [n:127.0.0.1:58958_goh%2Frz c:control_collection s:shard1 r:core_node1 x:collection1] o.a.s.c.c.ZkStateReader path=[/collections/control_collection] [configName]=[conf1] specified config exists in ZooKeeper
   [junit4]   2> 415106 INFO  (coreLoadExecutor-1014-thread-1-processing-n:127.0.0.1:58958_goh%2Frz) [n:127.0.0.1:58958_goh%2Frz c:control_collection s:shard1 r:core_node1 x:collection1] o.a.s.r.ManagedResourceStorage Setting up ZooKeeper-based storage for the RestManager with znodeBase: /configs/conf1
   [junit4]   2> 415106 INFO  (coreLoadExecutor-1014-thread-1-processing-n:127.0.0.1:58958_goh%2Frz) [n:127.0.0.1:58958_goh%2Frz c:control_collection s:shard1 r:core_node1 x:collection1] o.a.s.r.ManagedResourceStorage Configured ZooKeeperStorageIO with znodeBase: /configs/conf1
   [junit4]   2> 415107 INFO  (coreLoadExecutor-1014-thread-1-processing-n:127.0.0.1:58958_goh%2Frz) [n:127.0.0.1:58958_goh%2Frz c:control_collection s:shard1 r:core_node1 x:collection1] o.a.s.r.RestManager Initializing RestManager with initArgs: {}
   [junit4]   2> 415107 INFO  (coreLoadExecutor-1014-thread-1-processing-n:127.0.0.1:58958_goh%2Frz) [n:127.0.0.1:58958_goh%2Frz c:control_collection s:shard1 r:core_node1 x:collection1] o.a.s.r.ManagedResourceStorage Reading _rest_managed.json using ZooKeeperStorageIO:path=/configs/conf1
   [junit4]   2> 415107 INFO  (coreLoadExecutor-1014-thread-1-processing-n:127.0.0.1:58958_goh%2Frz) [n:127.0.0.1:58958_goh%2Frz c:control_collection s:shard1 r:core_node1 x:collection1] o.a.s.r.ManagedResourceStorage No data found for znode /configs/conf1/_rest_managed.json
   [junit4]   2> 415107 INFO  (coreLoadExecutor-1014-thread-1-processing-n:127.0.0.1:58958_goh%2Frz) [n:127.0.0.1:58958_goh%2Frz c:control_collection s:shard1 r:core_node1 x:collection1] o.a.s.r.ManagedResourceStorage Loaded null at path _rest_managed.json using ZooKeeperStorageIO:path=/configs/conf1
   [junit4]   2> 415107 INFO  (coreLoadExecutor-1014-thread-1-processing-n:127.0.0.1:58958_goh%2Frz) [n:127.0.0.1:58958_goh%2Frz c:control_collection s:shard1 r:core_node1 x:collection1] o.a.s.r.RestManager Initializing 0 registered ManagedResources
   [junit4]   2> 415107 INFO  (coreLoadExecutor-1014-thread-1-processing-n:127.0.0.1:58958_goh%2Frz) [n:127.0.0.1:58958_goh%2Frz c:control_collection s:shard1 r:core_node1 x:collection1] o.a.s.h.ReplicationHandler Commits will be reserved for  10000
   [junit4]   2> 415108 INFO  (searcherExecutor-1015-thread-1-processing-n:127.0.0.1:58958_goh%2Frz x:collection1 s:shard1 c:control_collection r:core_node1) [n:127.0.0.1:58958_goh%2Frz c:control_collection s:shard1 r:core_node1 x:collection1] o.a.s.c.SolrCore [collection1] Registered new searcher Searcher@3a3399c6[collection1] main{ExitableDirectoryReader(UninvertingDirectoryReader())}
   [junit4]   2> 415108 INFO  (coreLoadExecutor-1014-thread-1-processing-n:127.0.0.1:58958_goh%2Frz) [n:127.0.0.1:58958_goh%2Frz c:control_collection s:shard1 r:core_node1 x:collection1] o.a.s.u.UpdateLog Looking up max value of version field to seed version buckets
   [junit4]   2> 415108 INFO  (coreLoadExecutor-1014-thread-1-processing-n:127.0.0.1:58958_goh%2Frz) [n:127.0.0.1:58958_goh%2Frz c:control_collection s:shard1 r:core_node1 x:collection1] o.a.s.u.VersionInfo Refreshing highest value of _version_ for 65536 version buckets from index
   [junit4]   2> 415108 INFO  (coreLoadExecutor-1014-thread-1-processing-n:127.0.0.1:58958_goh%2Frz) [n:127.0.0.1:58958_goh%2Frz c:control_collection s:shard1 r:core_node1 x:collection1] o.a.s.u.VersionInfo No terms found for _version_, cannot seed version bucket highest value from index
   [junit4]   2> 415108 INFO  (coreLoadExecutor-1014-thread-1-processing-n:127.0.0.1:58958_goh%2Frz) [n:127.0.0.1:58958_goh%2Frz c:control_collection s:shard1 r:core_node1 x:collection1] o.a.s.u.UpdateLog Could not find max version in index or recent updates, using new clock 1537944043031363584
   [junit4]   2> 415110 INFO  (coreLoadExecutor-1014-thread-1-processing-n:127.0.0.1:58958_goh%2Frz) [n:127.0.0.1:58958_goh%2Frz c:control_collection s:shard1 r:core_node1 x:collection1] o.a.s.u.UpdateLog Took 1.0ms to seed version buckets with highest version 1537944043031363584
   [junit4]   2> 415110 INFO  (coreLoadExecutor-1014-thread-1-processing-n:127.0.0.1:58958_goh%2Frz) [n:127.0.0.1:58958_goh%2Frz c:control_collection s:shard1 r:core_node1 x:collection1] o.a.s.c.ZkController watch zkdir /configs/conf1
   [junit4]   2> 415111 INFO  (coreLoadExecutor-1014-thread-1-processing-n:127.0.0.1:58958_goh%2Frz) [n:127.0.0.1:58958_goh%2Frz c:control_collection s:shard1 r:core_node1 x:collection1] o.a.s.c.CoreContainer registering core: collection1
   [junit4]   2> 415112 INFO  (coreZkRegister-1008-thread-1-processing-n:127.0.0.1:58958_goh%2Frz x:collection1 s:shard1 c:control_collection r:core_node1) [n:127.0.0.1:58958_goh%2Frz c:control_collection s:shard1 r:core_node1 x:collection1] o.a.s.c.ZkController Register replica - core:collection1 address:http://127.0.0.1:58958/goh/rz collection:control_collection shard:shard1
   [junit4]   2> 415113 INFO  (coreZkRegister-1008-thread-1-processing-n:127.0.0.1:58958_goh%2Frz x:collection1 s:shard1 c:control_collection r:core_node1) [n:127.0.0.1:58958_goh%2Frz c:control_collection s:shard1 r:core_node1 x:collection1] o.a.s.c.c.SolrZkClient makePath: /collections/control_collection/leader_elect/shard1/election
   [junit4]   2> 415119 INFO  (coreZkRegister-1008-thread-1-processing-n:127.0.0.1:58958_goh%2Frz x:collection1 s:shard1 c:control_collection r:core_node1) [n:127.0.0.1:58958_goh%2Frz c:control_collection s:shard1 r:core_node1 x:collection1] o.a.s.c.LeaderElector Joined leadership election with path: /collections/control_collection/leader_elect/shard1/election/96121502575951876-core_node1-n_0000000000
   [junit4]   2> 415119 INFO  (coreZkRegister-1008-thread-1-processing-n:127.0.0.1:58958_goh%2Frz x:collection1 s:shard1 c:control_collection r:core_node1) [n:127.0.0.1:58958_goh%2Frz c:control_collection s:shard1 r:core_node1 x:collection1] o.a.s.c.ShardLeaderElectionContext Running the leader process for shard=shard1 and weAreReplacement=false and leaderVoteWait=10000
   [junit4]   2> 415121 INFO  (coreZkRegister-1008-thread-1-processing-n:127.0.0.1:58958_goh%2Frz x:collection1 s:shard1 c:control_collection r:core_node1) [n:127.0.0.1:58958_goh%2Frz c:control_collection s:shard1 r:core_node1 x:collection1] o.a.s.c.ShardLeaderElectionContext Enough replicas found to continue.
   [junit4]   2> 415121 INFO  (coreZkRegister-1008-thread-1-processing-n:127.0.0.1:58958_goh%2Frz x:collection1 s:shard1 c:control_collection r:core_node1) [n:127.0.0.1:58958_goh%2Frz c:control_collection s:shard1 r:core_node1 x:collection1] o.a.s.c.ShardLeaderElectionContext I may be the new leader - try and sync
   [junit4]   2> 415121 INFO  (coreZkRegister-1008-thread-1-processing-n:127.0.0.1:58958_goh%2Frz x:collection1 s:shard1 c:control_collection r:core_node1) [n:127.0.0.1:58958_goh%2Frz c:control_collection s:shard1 r:core_node1 x:collection1] o.a.s.c.SyncStrategy Sync replicas to http://127.0.0.1:58958/goh/rz/collection1/
   [junit4]   2> 415121 INFO  (coreZkRegister-1008-thread-1-processing-n:127.0.0.1:58958_goh%2Frz x:collection1 s:shard1 c:control_collection r:core_node1) [n:127.0.0.1:58958_goh%2Frz c:control_collection s:shard1 r:core_node1 x:collection1] o.a.s.c.SyncStrategy Sync Success - now sync replicas to me
   [junit4]   2> 415121 INFO  (coreZkRegister-1008-thread-1-processing-n:127.0.0.1:58958_goh%2Frz x:collection1 s:shard1 c:control_collection r:core_node1) [n:127.0.0.1:58958_goh%2Frz c:control_collection s:shard1 r:core_node1 x:collection1] o.a.s.c.SyncStrategy http://127.0.0.1:58958/goh/rz/collection1/ has no replicas
   [junit4]   2> 415123 INFO  (OverseerStateUpdate-96121502575951876-127.0.0.1:58958_goh%2Frz-n_0000000000) [n:127.0.0.1:58958_goh%2Frz    ] o.a.s.c.Overseer processMessage: queueSize: 1, message = {
   [junit4]   2>   "operation":"leader",
   [junit4]   2>   "shard":"shard1",
   [junit4]   2>   "collection":"control_collection"} current state version: 1
   [junit4]   2> 415123 INFO  (coreZkRegister-1008-thread-1-processing-n:127.0.0.1:58958_goh%2Frz x:collection1 s:shard1 c:control_collection r:core_node1) [n:127.0.0.1:58958_goh%2Frz c:control_collection s:shard1 r:core_node1 x:collection1] o.a.s.c.c.SolrZkClient makePath: /collections/control_collection/leaders/shard1
   [junit4]   2> 415128 INFO  (coreZkRegister-1008-thread-1-processing-n:127.0.0.1:58958_goh%2Frz x:collection1 s:shard1 c:control_collection r:core_node1) [n:127.0.0.1:58958_goh%2Frz c:control_collection s:shard1 r:core_node1 x:collection1] o.a.s.c.ShardLeaderElectionContextBase Creating leader registration node /collections/control_collection/leaders/shard1/leader after winning as /collections/control_collection/leader_elect/shard1/election/96121502575951876-core_node1-n_0000000000
   [junit4]   2> 415130 INFO  (coreZkRegister-1008-thread-1-processing-n:127.0.0.1:58958_goh%2Frz x:collection1 s:shard1 c:control_collection r:core_node1) [n:127.0.0.1:58958_goh%2Frz c:control_collection s:shard1 r:core_node1 x:collection1] o.a.s.c.ShardLeaderElectionContext I am the new leader: http://127.0.0.1:58958/goh/rz/collection1/ shard1
   [junit4]   2> 415131 INFO  (OverseerStateUpdate-96121502575951876-127.0.0.1:58958_goh%2Frz-n_0000000000) [n:127.0.0.1:58958_goh%2Frz    ] o.a.s.c.Overseer processMessage: queueSize: 1, message = {
   [junit4]   2>   "operation":"leader",
   [junit4]   2>   "shard":"shard1",
   [junit4]   2>   "collection":"control_collection",
   [junit4]   2>   "base_url":"http://127.0.0.1:58958/goh/rz",
   [junit4]   2>   "core":"collection1",
   [junit4]   2>   "state":"active"} current state version: 1
   [junit4]   2> 415242 INFO  (zkCallback-500-thread-2-processing-n:127.0.0.1:58958_goh%2Frz) [n:127.0.0.1:58958_goh%2Frz    ] o.a.s.c.c.ZkStateReader A cluster state change: [WatchedEvent state:SyncConnected type:NodeDataChanged path:/clusterstate.json], has occurred - updating... (live nodes size: [1])
   [junit4]   2> 415282 INFO  (coreZkRegister-1008-thread-1-processing-n:127.0.0.1:58958_goh%2Frz x:collection1 s:shard1 c:control_collection r:core_node1) [n:127.0.0.1:58958_goh%2Frz c:control_collection s:shard1 r:core_node1 x:collection1] o.a.s.c.ZkController We are http://127.0.0.1:58958/goh/rz/collection1/ and leader is http://127.0.0.1:58958/goh/rz/collection1/
   [junit4]   2> 415282 INFO  (coreZkRegister-1008-thread-1-processing-n:127.0.0.1:58958_goh%2Frz x:collection1 s:shard1 c:control_collection r:core_node1) [n:127.0.0.1:58958_goh%2Frz c:control_collection s:shard1 r:core_node1 x:collection1] o.a.s.c.ZkController No LogReplay needed for core=collection1 baseURL=http://127.0.0.1:58958/goh/rz
   [junit4]   2> 415282 INFO  (coreZkRegister-1008-thread-1-processing-n:127.0.0.1:58958_goh%2Frz x:collection1 s:shard1 c:control_collection r:core_node1) [n:127.0.0.1:58958_goh%2Frz c:control_collection s:shard1 r:core_node1 x:collection1] o.a.s.c.ZkController I am the leader, no recovery necessary
   [junit4]   2> 415282 INFO  (coreZkRegister-1008-thread-1-processing-n:127.0.0.1:58958_goh%2Frz x:collection1 s:shard1 c:control_collection r:core_node1) [n:127.0.0.1:58958_goh%2Frz c:control_collection s:shard1 r:core_node1 x:collection1] o.a.s.c.ZkController publishing state=active
   [junit4]   2> 415282 INFO  (coreZkRegister-1008-thread-1-processing-n:127.0.0.1:58958_goh%2Frz x:collection1 s:shard1 c:control_collection r:core_node1) [n:127.0.0.1:58958_goh%2Frz c:control_collection s:shard1 r:core_node1 x:collection1] o.a.s.c.ZkController numShards not found on descriptor - reading it from system property
   [junit4]   2> 415285 INFO  (OverseerStateUpdate-96121502575951876-127.0.0.1:58958_goh%2Frz-n_0000000000) [n:127.0.0.1:58958_goh%2Frz    ] o.a.s.c.Overseer processMessage: queueSize: 1, message = {
   [junit4]   2>   "core":"collection1",
   [junit4]   2>   "core_node_name":"core_node1",
   [junit4]   2>   "roles":null,
   [junit4]   2>   "base_url":"http://127.0.0.1:58958/goh/rz",
   [junit4]   2>   "node_name":"127.0.0.1:58958_goh%2Frz",
   [junit4]   2>   "numShards":"1",
   [junit4]   2>   "state":"active",
   [junit4]   2>   "shard":"shard1",
   [junit4]   2>   "collection":"control_collection",
   [junit4]   2>   "operation":"state"} current state version: 2
   [junit4]   2> 415285 INFO  (OverseerStateUpdate-96121502575951876-127.0.0.1:58958_goh%2Frz-n_0000000000) [n:127.0.0.1:58958_goh%2Frz    ] o.a.s.c.o.ReplicaMutator Update state numShards=1 message={
   [junit4]   2>   "core":"collection1",
   [junit4]   2>   "core_node_name":"core_node1",
   [junit4]   2>   "roles":null,
   [junit4]   2>   "base_url":"http://127.0.0.1:58958/goh/rz",
   [junit4]   2>   "node_name":"127.0.0.1:58958_goh%2Frz",
   [junit4]   2>   "numShards":"1",
   [junit4]   2>   "state":"active",
   [junit4]   2>   "shard":"shard1",
   [junit4]   2>   "collection":"control_collection",
   [junit4]   2>   "operation":"state"}
   [junit4]   2> 415389 INFO  (zkCallback-500-thread-3-processing-n:127.0.0.1:58958_goh%2Frz) [n:127.0.0.1:58958_goh%2Frz    ] o.a.s.c.c.ZkStateReader A cluster state change: [WatchedEvent state:SyncConnected type:NodeDataChanged path:/clusterstate.json], has occurred - updating... (live nodes size: [1])
   [junit4]   2> 415465 INFO  (TEST-TestReqParamsAPI.test-seed#[EAA29D29CB38C1CE]) [    ] o.a.s.c.c.SolrZkClient Using default ZkCredentialsProvider
   [junit4]   2> 415465 INFO  (TEST-TestReqParamsAPI.test-seed#[EAA29D29CB38C1CE]) [    ] o.a.s.c.c.ConnectionManager Waiting for client to connect to ZooKeeper
   [junit4]   2> 415468 INFO  (zkCallback-504-thread-1) [    ] o.a.s.c.c.ConnectionManager Watcher org.apache.solr.common.cloud.ConnectionManager@2a20c220 name:ZooKeeperConnection Watcher:127.0.0.1:64384/solr got event WatchedEvent state:SyncConnected type:None path:null path:null type:None
   [junit4]   2> 415468 INFO  (TEST-TestReqParamsAPI.test-seed#[EAA29D29CB38C1CE]) [    ] o.a.s.c.c.ConnectionManager Client is connected to ZooKeeper
   [junit4]   2> 415468 INFO  (TEST-TestReqParamsAPI.test-seed#[EAA29D29CB38C1CE]) [    ] o.a.s.c.c.SolrZkClient Using default ZkACLProvider
   [junit4]   2> 415468 INFO  (TEST-TestReqParamsAPI.test-seed#[EAA29D29CB38C1CE]) [    ] o.a.s.c.c.ZkStateReader Updating cluster state from ZooKeeper... 
   [junit4]   2> 415469 INFO  (TEST-TestReqParamsAPI.test-seed#[EAA29D29CB38C1CE]) [    ] o.a.s.c.c.ZkStateReader Loaded empty cluster properties
   [junit4]   2> 415470 INFO  (TEST-TestReqParamsAPI.test-seed#[EAA29D29CB38C1CE]) [    ] o.a.s.c.c.ZkStateReader Updated live nodes from ZooKeeper... (0) -> (1)
   [junit4]   2> 415472 INFO  (TEST-TestReqParamsAPI.test-seed#[EAA29D29CB38C1CE]) [    ] o.a.s.c.ChaosMonkey monkey: init - expire sessions:false cause connection loss:false
   [junit4]   2> 415472 INFO  (TEST-TestReqParamsAPI.test-seed#[EAA29D29CB38C1CE]) [    ] o.a.s.c.AbstractFullDistribZkTestBase Creating collection1 with stateFormat=2
   [junit4]   2> 415472 INFO  (TEST-TestReqParamsAPI.test-seed#[EAA29D29CB38C1CE]) [    ] o.a.s.c.c.SolrZkClient Using default ZkCredentialsProvider
   [junit4]   2> 415473 INFO  (TEST-TestReqParamsAPI.test-seed#[EAA29D29CB38C1CE]) [    ] o.a.s.c.c.ConnectionManager Waiting for client to connect to ZooKeeper
   [junit4]   2> 415475 INFO  (zkCallback-505-thread-1) [    ] o.a.s.c.c.ConnectionManager Watcher org.apache.solr.common.cloud.ConnectionManager@23000cb8 name:ZooKeeperConnection Watcher:127.0.0.1:64384/solr got event WatchedEvent state:SyncConnected type:None path:null path:null type:None
   [junit4]   2> 415475 INFO  (TEST-TestReqParamsAPI.test-seed#[EAA29D29CB38C1CE]) [    ] o.a.s.c.c.ConnectionManager Client is connected to ZooKeeper
   [junit4]   2> 415475 INFO  (TEST-TestReqParamsAPI.test-seed#[EAA29D29CB38C1CE]) [    ] o.a.s.c.c.SolrZkClient Using default ZkACLProvider
   [junit4]   2> 415478 WARN  (NIOServerCxn.Factory:0.0.0.0/0.0.0.0:0) [    ] o.a.z.s.NIOServerCnxn caught end of stream exception
   [junit4]   2> EndOfStreamException: Unable to read additional data from client sessionid 0x1557dff50510006, likely client has closed socket
   [junit4]   2> 	at org.apache.zookeeper.server.NIOServerCnxn.doIO(NIOServerCnxn.java:228)
   [junit4]   2> 	at org.apache.zookeeper.server.NIOServerCnxnFactory.run(NIOServerCnxnFactory.java:208)
   [junit4]   2> 	at java.lang.Thread.run(Thread.java:745)
   [junit4]   2> 415479 INFO  (OverseerStateUpdate-96121502575951876-127.0.0.1:58958_goh%2Frz-n_0000000000) [n:127.0.0.1:58958_goh%2Frz    ] o.a.s.c.Overseer processMessage: queueSize: 1, message = {
   [junit4]   2>   "operation":"create",
   [junit4]   2>   "name":"collection1",
   [junit4]   2>   "numShards":"2",
   [junit4]   2>   "stateFormat":"2"} current state version: 3
   [junit4]   2> 415479 INFO  (OverseerStateUpdate-96121502575951876-127.0.0.1:58958_goh%2Frz-n_0000000000) [n:127.0.0.1:58958_goh%2Frz    ] o.a.s.c.o.ClusterStateMutator building a new cName: collection1
   [junit4]   2> 415582 INFO  (OverseerStateUpdate-96121502575951876-127.0.0.1:58958_goh%2Frz-n_0000000000) [n:127.0.0.1:58958_goh%2Frz    ] o.a.s.c.o.ZkStateWriter going to create_collection /collections/collection1/state.json
   [junit4]   2> 415649 INFO  (TEST-TestReqParamsAPI.test-seed#[EAA29D29CB38C1CE]) [    ] o.a.s.SolrTestCaseJ4 Writing core.properties file to /export/home/jenkins/workspace/Lucene-Solr-master-Solaris/solr/build/solr-core/test/J0/temp/solr.handler.TestReqParamsAPI_EAA29D29CB38C1CE-001/shard-1-001/cores/collection1
   [junit4]   2> 415650 INFO  (TEST-TestReqParamsAPI.test-seed#[EAA29D29CB38C1CE]) [    ] o.a.s.c.AbstractFullDistribZkTestBase create jetty 1 in directory /export/home/jenkins/workspace/Lucene-Solr-master-Solaris/solr/build/solr-core/test/J0/temp/solr.handler.TestReqParamsAPI_EAA29D29CB38C1CE-001/shard-1-001
   [junit4]   2> 415654 INFO  (TEST-TestReqParamsAPI.test-seed#[EAA29D29CB38C1CE]) [    ] o.e.j.s.Server jetty-9.3.8.v20160314
   [junit4]   2> 415658 INFO  (TEST-TestReqParamsAPI.test-seed#[EAA29D29CB38C1CE]) [    ] o.e.j.s.h.ContextHandler Started o.e.j.s.ServletContextHandler@138b52c3{/goh/rz,null,AVAILABLE}
   [junit4]   2> 415658 INFO  (TEST-TestReqParamsAPI.test-seed#[EAA29D29CB38C1CE]) [    ] o.e.j.s.ServerConnector Started ServerConnector@5e9cd25f{HTTP/1.1,[http/1.1]}{127.0.0.1:64027}
   [junit4]   2> 415658 INFO  (TEST-TestReqParamsAPI.test-seed#[EAA29D29CB38C1CE]) [    ] o.e.j.s.Server Started @419330ms
   [junit4]   2> 415658 INFO  (TEST-TestReqParamsAPI.test-seed#[EAA29D29CB38C1CE]) [    ] o.a.s.c.s.e.JettySolrRunner Jetty properties: {solr.data.dir=/export/home/jenkins/workspace/Lucene-Solr-master-Solaris/solr/build/solr-core/test/J0/temp/solr.handler.TestReqParamsAPI_EAA29D29CB38C1CE-001/tempDir-001/jetty1, solrconfig=solrconfig.xml, hostContext=/goh/rz, hostPort=64027, coreRootDirectory=/export/home/jenkins/workspace/Lucene-Solr-master-Solaris/solr/build/solr-core/test/J0/../../../../../../../../../../export/home/jenkins/workspace/Lucene-Solr-master-Solaris/solr/build/solr-core/test/J0/temp/solr.handler.TestReqParamsAPI_EAA29D29CB38C1CE-001/shard-1-001/cores}
   [junit4]   2> 415658 INFO  (TEST-TestReqParamsAPI.test-seed#[EAA29D29CB38C1CE]) [    ] o.a.s.s.SolrDispatchFilter SolrDispatchFilter.init(): sun.misc.Launcher$AppClassLoader@6d06d69c
   [junit4]   2> 415659 INFO  (TEST-TestReqParamsAPI.test-seed#[EAA29D29CB38C1CE]) [    ] o.a.s.c.SolrResourceLoader new SolrResourceLoader for directory: '/export/home/jenkins/workspace/Lucene-Solr-master-Solaris/solr/build/solr-core/test/J0/temp/solr.handler.TestReqParamsAPI_EAA29D29CB38C1CE-001/shard-1-001'
   [junit4]   2> 415659 INFO  (TEST-TestReqParamsAPI.test-seed#[EAA29D29CB38C1CE]) [    ] o.a.s.c.SolrResourceLoader JNDI not configured for solr (NoInitialContextEx)
   [junit4]   2> 415659 INFO  (TEST-TestReqParamsAPI.test-seed#[EAA29D29CB38C1CE]) [    ] o.a.s.c.SolrResourceLoader solr home defaulted to 'solr/' (could not find system property or JNDI)
   [junit4]   2> 415659 INFO  (TEST-TestReqParamsAPI.test-seed#[EAA29D29CB38C1CE]) [    ] o.a.s.c.c.SolrZkClient Using default ZkCredentialsProvider
   [junit4]   2> 415659 INFO  (TEST-TestReqParamsAPI.test-seed#[EAA29D29CB38C1CE]) [    ] o.a.s.c.c.ConnectionManager Waiting for client to connect to ZooKeeper
   [junit4]   2> 415676 INFO  (zkCallback-506-thread-1) [    ] o.a.s.c.c.ConnectionManager Watcher org.apache.solr.common.cloud.ConnectionManager@30948bfa name:ZooKeeperConnection Watcher:127.0.0.1:64384/solr got event WatchedEvent state:SyncConnected type:None path:null path:null type:None
   [junit4]   2> 415676 INFO  (TEST-TestReqParamsAPI.test-seed#[EAA29D29CB38C1CE]) [    ] o.a.s.c.c.ConnectionManager Client is connected to ZooKeeper
   [junit4]   2> 415677 INFO  (TEST-TestReqParamsAPI.test-seed#[EAA29D29CB38C1CE]) [    ] o.a.s.c.c.SolrZkClient Using default ZkACLProvider
   [junit4]   2> 415679 INFO  (TEST-TestReqParamsAPI.test-seed#[EAA29D29CB38C1CE]) [    ] o.a.s.s.SolrDispatchFilter Loading solr.xml from SolrHome (not found in ZooKeeper)
   [junit4]   2> 415679 INFO  (TEST-TestReqParamsAPI.test-seed#[EAA29D29CB38C1CE]) [    ] o.a.s.c.SolrXmlConfig Loading container configuration from /export/home/jenkins/workspace/Lucene-Solr-master-Solaris/solr/build/solr-core/test/J0/temp/solr.handler.TestReqParamsAPI_EAA29D29CB38C1CE-001/shard-1-001/solr.xml
   [junit4]   2> 415683 INFO  (TEST-TestReqParamsAPI.test-seed#[EAA29D29CB38C1CE]) [    ] o.a.s.c.CorePropertiesLocator Config-defined core root directory: /export/home/jenkins/workspace/Lucene-Solr-master-Solaris/solr/build/solr-core/test/J0/../../../../../../../../../../export/home/jenkins/workspace/Lucene-Solr-master-Solaris/solr/build/solr-core/test/J0/temp/solr.handler.TestReqParamsAPI_EAA29D29CB38C1CE-001/shard-1-001/cores
   [junit4]   2> 415683 INFO  (TEST-TestReqParamsAPI.test-seed#[EAA29D29CB38C1CE]) [    ] o.a.s.c.CoreContainer New CoreContainer 920327819
   [junit4]   2> 415683 INFO  (TEST-TestReqParamsAPI.test-seed#[EAA29D29CB38C1CE]) [    ] o.a.s.c.CoreContainer Loading cores into CoreContainer [instanceDir=/export/home/jenkins/workspace/Lucene-Solr-master-Solaris/solr/build/solr-core/test/J0/temp/solr.handler.TestReqParamsAPI_EAA29D29CB38C1CE-001/shard-1-001]
   [junit4]   2> 415683 WARN  (TEST-TestReqParamsAPI.test-seed#[EAA29D29CB38C1CE]) [    ] o.a.s.c.CoreContainer Couldn't add files from /export/home/jenkins/workspace/Lucene-Solr-master-Solaris/solr/build/solr-core/test/J0/temp/solr.handler.TestReqParamsAPI_EAA29D29CB38C1CE-001/shard-1-001/lib to classpath: /export/home/jenkins/workspace/Lucene-Solr-master-Solaris/solr/build/solr-core/test/J0/temp/solr.handler.TestReqParamsAPI_EAA29D29CB38C1CE-001/shard-1-001/lib
   [junit4]   2> 415683 INFO  (TEST-TestReqParamsAPI.test-seed#[EAA29D29CB38C1CE]) [    ] o.a.s.h.c.HttpShardHandlerFactory created with socketTimeout : 90000,urlScheme : ,connTimeout : 15000,maxConnectionsPerHost : 20,maxConnections : 10000,corePoolSize : 0,maximumPoolSize : 2147483647,maxThreadIdleTime : 5,sizeOfQueue : -1,fairnessPolicy : false,
   [junit4]   2> 415685 INFO  (TEST-TestReqParamsAPI.test-seed#[EAA29D29CB38C1CE]) [    ] o.a.s.u.UpdateShardHandler Creating UpdateShardHandler HTTP client with params: 
   [junit4]   2> 415686 INFO  (TEST-TestReqParamsAPI.test-seed#[EAA29D29CB38C1CE]) [    ] o.a.s.l.LogWatcher SLF4J impl is org.slf4j.impl.Log4jLoggerFactory
   [junit4]   2> 415686 INFO  (TEST-TestReqParamsAPI.test-seed#[EAA29D29CB38C1CE]) [    ] o.a.s.l.LogWatcher Registering Log Listener [Log4j (org.slf4j.impl.Log4jLoggerFactory)]
   [junit4]   2> 415686 INFO  (TEST-TestReqParamsAPI.test-seed#[EAA29D29CB38C1CE]) [    ] o.a.s.c.ZkContainer Zookeeper client=127.0.0.1:64384/solr
   [junit4]   2> 415686 INFO  (TEST-TestReqParamsAPI.test-seed#[EAA29D29CB38C1CE]) [    ] o.a.s.c.ZkController zkHost includes chroot
   [junit4]   2> 415686 INFO  (TEST-TestReqParamsAPI.test-seed#[EAA29D29CB38C1CE]) [    ] o.a.s.c.c.SolrZkClient Using default ZkCredentialsProvider
   [junit4]   2> 415687 INFO  (TEST-TestReqParamsAPI.test-seed#[EAA29D29CB38C1CE]) [    ] o.a.s.c.c.ConnectionManager Waiting for client to connect to ZooKeeper
   [junit4]   2> 415690 INFO  (zkCallback-509-thread-1) [    ] o.a.s.c.c.ConnectionManager Watcher org.apache.solr.common.cloud.ConnectionManager@5e5e75e7 name:ZooKeeperConnection Watcher:127.0.0.1:64384 got event WatchedEvent state:SyncConnected type:None path:null path:null type:None
   [junit4]   2> 415690 INFO  (TEST-TestReqParamsAPI.test-seed#[EAA29D29CB38C1CE]) [    ] o.a.s.c.c.ConnectionManager Client is connected to ZooKeeper
   [junit4]   2> 415691 INFO  (TEST-TestReqParamsAPI.test-seed#[EAA29D29CB38C1CE]) [    ] o.a.s.c.c.SolrZkClient Using default ZkACLProvider
   [junit4]   2> 415692 INFO  (TEST-TestReqParamsAPI.test-seed#[EAA29D29CB38C1CE]) [n:127.0.0.1:64027_goh%2Frz    ] o.a.s.c.ZkController Added new OnReconnect listener org.apache.solr.cloud.ZkController$$Lambda$40/814145296@300c821
   [junit4]   2> 415693 INFO  (TEST-TestReqParamsAPI.test-seed#[EAA29D29CB38C1CE]) [n:127.0.0.1:64027_goh%2Frz    ] o.a.s.c.c.ConnectionManager Waiting for client to connect to ZooKeeper
   [junit4]   2> 415695 INFO  (zkCallback-510-thread-1-processing-n:127.0.0.1:64027_goh%2Frz) [n:127.0.0.1:64027_goh%2Frz    ] o.a.s.c.c.ConnectionManager Watcher org.apache.solr.common.cloud.ConnectionManager@68d79db9 name:ZooKeeperConnection Watcher:127.0.0.1:64384/solr got event WatchedEvent state:SyncConnected type:None path:null path:null type:None
   [junit4]   2> 415695 INFO  (TEST-TestReqParamsAPI.test-seed#[EAA29D29CB38C1CE]) [n:127.0.0.1:64027_goh%2Frz    ] o.a.s.c.c.ConnectionManager Client is connected to ZooKeeper
   [junit4]   2> 415709 INFO  (TEST-TestReqParamsAPI.test-seed#[EAA29D29CB38C1CE]) [n:127.0.0.1:64027_goh%2Frz    ] o.a.s.c.c.ZkStateReader Updating cluster state from ZooKeeper... 
   [junit4]   2> 415711 INFO  (TEST-TestReqParamsAPI.test-seed#[EAA29D29CB38C1CE]) [n:127.0.0.1:64027_goh%2Frz    ] o.a.s.c.c.ZkStateReader Loaded empty cluster properties
   [junit4]   2> 415712 INFO  (TEST-TestReqParamsAPI.test-seed#[EAA29D29CB38C1CE]) [n:127.0.0.1:64027_goh%2Frz    ] o.a.s.c.c.ZkStateReader Updated live nodes from ZooKeeper... (0) -> (1)
   [junit4]   2> 415719 INFO  (TEST-TestReqParamsAPI.test-seed#[EAA29D29CB38C1CE]) [n:127.0.0.1:64027_goh%2Frz    ] o.a.s.c.Overseer Overseer (id=null) closing
   [junit4]   2> 415720 INFO  (TEST-TestReqParamsAPI.test-seed#[EAA29D29CB38C1CE]) [n:127.0.0.1:64027_goh%2Frz    ] o.a.s.c.LeaderElector Joined leadership election with path: /overseer_elect/election/96121502575951881-127.0.0.1:64027_goh%2Frz-n_0000000001
   [junit4]   2> 415723 INFO  (TEST-TestReqParamsAPI.test-seed#[EAA29D29CB38C1CE]) [n:127.0.0.1:64027_goh%2Frz    ] o.a.s.c.LeaderElector Watching path /overseer_elect/election/96121502575951876-127.0.0.1:58958_goh%2Frz-n_0000000000 to know if I could be the leader
   [junit4]   2> 415725 INFO  (TEST-TestReqParamsAPI.test-seed#[EAA29D29CB38C1CE]) [n:127.0.0.1:64027_goh%2Frz    ] o.a.s.c.ZkController Publish node=127.0.0.1:64027_goh%2Frz as DOWN
   [junit4]   2> 415731 INFO  (OverseerStateUpdate-96121502575951876-127.0.0.1:58958_goh%2Frz-n_0000000000) [n:127.0.0.1:58958_goh%2Frz    ] o.a.s.c.Overseer processMessage: queueSize: 1, message = {
   [junit4]   2>   "operation":"downnode",
   [junit4]   2>   "node_name":"127.0.0.1:64027_goh%2Frz"} current state version: 3
   [junit4]   2> 415731 INFO  (OverseerStateUpdate-96121502575951876-127.0.0.1:58958_goh%2Frz-n_0000000000) [n:127.0.0.1:58958_goh%2Frz    ] o.a.s.c.o.NodeMutator DownNode state invoked for node: 127.0.0.1:64027_goh%2Frz
   [junit4]   2> 415733 INFO  (zkCallback-500-thread-3-processing-n:127.0.0.1:58958_goh%2Frz) [n:127.0.0.1:58958_goh%2Frz    ] o.a.s.c.c.ZkStateReader A cluster state change: [WatchedEvent state:SyncConnected type:NodeDataChanged path:/clusterstate.json], has occurred - updating... (live nodes size: [1])
   [junit4]   2> 415735 INFO  (zkCallback-504-thread-1) [    ] o.a.s.c.c.ZkStateReader A cluster state change: [WatchedEvent state:SyncConnected type:NodeDataChanged path:/clusterstate.json], has occurred - updating... (live nodes size: [1])
   [junit4]   2> 415735 INFO  (zkCallback-510-thread-1-processing-n:127.0.0.1:64027_goh%2Frz) [n:127.0.0.1:64027_goh%2Frz    ] o.a.s.c.c.ZkStateReader A cluster state change: [WatchedEvent state:SyncConnected type:NodeDataChanged path:/clusterstate.json], has occurred - updating... (live nodes size: [1])
   [junit4]   2> 415841 INFO  (OverseerStateUpdate-96121502575951876-127.0.0.1:58958_goh%2Frz-n_0000000000) [n:127.0.0.1:58958_goh%2Frz    ] o.a.s.c.o.ZkStateWriter going to update_collection /collections/collection1/state.json version: 0
   [junit4]   2> 416741 INFO  (TEST-TestReqParamsAPI.test-seed#[EAA29D29CB38C1CE]) [n:127.0.0.1:64027_goh%2Frz    ] o.a.s.c.ZkController Register node as live in ZooKeeper:/live_nodes/127.0.0.1:64027_goh%2Frz
   [junit4]   2> 416743 INFO  (TEST-TestReqParamsAPI.test-seed#[EAA29D29CB38C1CE]) [n:127.0.0.1:64027_goh%2Frz    ] o.a.s.c.c.SolrZkClient makePath: /live_nodes/127.0.0.1:64027_goh%2Frz
   [junit4]   2> 416744 INFO  (zkCallback-504-thread-1) [    ] o.a.s.c.c.ZkStateReader A live node change: [WatchedEvent state:SyncConnected type:NodeChildrenChanged path:/live_nodes], has occurred - updating... (live nodes size: [1])
   [junit4]   2> 416744 INFO  (zkCallback-500-thread-3-processing-n:127.0.0.1:58958_goh%2Frz) [n:127.0.0.1:58958_goh%2Frz    ] o.a.s.c.c.ZkStateReader A live node change: [WatchedEvent state:SyncConnected type:NodeChildrenChanged path:/live_nodes], has occurred - updating... (live nodes size: [1])
   [junit4]   2> 416744 INFO  (zkCallback-510-thread-1-processing-n:127.0.0.1:64027_goh%2Frz) [n:127.0.0.1:64027_goh%2Frz    ] o.a.s.c.c.ZkStateReader A live node change: [WatchedEvent state:SyncConnected type:NodeChildrenChanged path:/live_nodes], has occurred - updating... (live nodes size: [1])
   [junit4]   2> 416745 INFO  (zkCallback-500-thread-3-processing-n:127.0.0.1:58958_goh%2Frz) [n:127.0.0.1:58958_goh%2Frz    ] o.a.s.c.c.ZkStateReader Updated live nodes from ZooKeeper... (1) -> (2)
   [junit4]   2> 416745 INFO  (zkCallback-504-thread-1) [    ] o.a.s.c.c.ZkStateReader Updated live nodes from ZooKeeper... (1) -> (2)
   [junit4]   2> 416746 INFO  (zkCallback-510-thread-1-processing-n:127.0.0.1:64027_goh%2Frz) [n:127.0.0.1:64027_goh%2Frz    ] o.a.s.c.c.ZkStateReader Updated live nodes from ZooKeeper... (1) -> (2)
   [junit4]   2> 416766 INFO  (TEST-TestReqParamsAPI.test-seed#[EAA29D29CB38C1CE]) [n:127.0.0.1:64027_goh%2Frz    ] o.a.s.c.CoreContainer Security conf doesn't exist. Skipping setup for authorization module.
   [junit4]   2> 416766 INFO  (TEST-TestReqParamsAPI.test-seed#[EAA29D29CB38C1CE]) [n:127.0.0.1:64027_goh%2Frz    ] o.a.s.c.CoreContainer No authentication plugin used.
   [junit4]   2> 416767 INFO  (TEST-TestReqParamsAPI.test-seed#[EAA29D29CB38C1CE]) [n:127.0.0.1:64027_goh%2Frz    ] o.a.s.c.CorePropertiesLocator Looking for core definitions underneath /export/home/jenkins/workspace/Lucene-Solr-master-Solaris/solr/build/solr-core/test/J0/../../../../../../../../../../export/home/jenkins/workspace/Lucene-Solr-master-Solaris/solr/build/solr-core/test/J0/temp/solr.handler.TestReqParamsAPI_EAA29D29CB38C1CE-001/shard-1-001/cores
   [junit4]   2> 416769 INFO  (TEST-TestReqParamsAPI.test-seed#[EAA29D29CB38C1CE]) [n:127.0.0.1:64027_goh%2Frz    ] o.a.s.c.CoreDescriptor Created CoreDescriptor: {name=collection1, config=solrconfig.xml, transient=false, schema=schema.xml, loadOnStartup=true, configSetProperties=configsetprops.json, collection=collection1, coreNodeName=, dataDir=data/, shard=}
   [junit4]   2> 416769 INFO  (TEST-TestReqParamsAPI.test-seed#[EAA29D29CB38C1CE]) [n:127.0.0.1:64027_goh%2Frz    ] o.a.s.c.CorePropertiesLocator Found core collection1 in /export/home/jenkins/workspace/Lucene-Solr-master-Solaris/solr/build/solr-core/test/J0/../../../../../../../../../../export/home/jenkins/workspace/Lucene-Solr-master-Solaris/solr/build/solr-core/test/J0/temp/solr.handler.TestReqParamsAPI_EAA29D29CB38C1CE-001/shard-1-001/cores/collection1
   [junit4]   2> 416769 INFO  (TEST-TestReqParamsAPI.test-seed#[EAA29D29CB38C1CE]) [n:127.0.0.1:64027_goh%2Frz    ] o.a.s.c.CorePropertiesLocator Found 1 core definitions
   [junit4]   2> 416770 INFO  (TEST-TestReqParamsAPI.test-seed#[EAA29D29CB38C1CE]) [n:127.0.0.1:64027_goh%2Frz    ] o.a.s.s.SolrDispatchFilter user.dir=/export/home/jenkins/workspace/Lucene-Solr-master-Solaris/solr/build/solr-core/test/J0
   [junit4]   2> 416771 INFO  (TEST-TestReqParamsAPI.test-seed#[EAA29D29CB38C1CE]) [n:127.0.0.1:64027_goh%2Frz    ] o.a.s.s.SolrDispatchFilter SolrDispatchFilter.init() done
   [junit4]   2> 416771 INFO  (coreLoadExecuto

[...truncated too long message...]

unit4]   2> 	49	/solr/overseer/collection-queue-work
   [junit4]   2> 	42	/solr/overseer/queue
   [junit4]   2> 	14	/solr/overseer/queue-work
   [junit4]   2> 	6	/solr/live_nodes
   [junit4]   2> 	6	/solr/collections
   [junit4]   2> 
   [junit4]   2> NOTE: reproduce with: ant test  -Dtestcase=TestDynamicLoading -Dtests.method=testDynamicLoading -Dtests.seed=EAA29D29CB38C1CE -Dtests.slow=true -Dtests.locale=sq -Dtests.timezone=Asia/Amman -Dtests.asserts=true -Dtests.file.encoding=UTF-8
   [junit4] FAILURE 54.8s J0 | TestDynamicLoading.testDynamicLoading <<<
   [junit4]    > Throwable #1: java.lang.AssertionError: Could not find collection:.system
   [junit4]    > 	at __randomizedtesting.SeedInfo.seed([EAA29D29CB38C1CE:32EFB07E3CE5646E]:0)
   [junit4]    > 	at org.apache.solr.cloud.AbstractDistribZkTestBase.waitForRecoveriesToFinish(AbstractDistribZkTestBase.java:154)
   [junit4]    > 	at org.apache.solr.cloud.AbstractDistribZkTestBase.waitForRecoveriesToFinish(AbstractDistribZkTestBase.java:139)
   [junit4]    > 	at org.apache.solr.cloud.AbstractDistribZkTestBase.waitForRecoveriesToFinish(AbstractDistribZkTestBase.java:134)
   [junit4]    > 	at org.apache.solr.cloud.AbstractFullDistribZkTestBase.waitForRecoveriesToFinish(AbstractFullDistribZkTestBase.java:856)
   [junit4]    > 	at org.apache.solr.core.TestDynamicLoading.testDynamicLoading(TestDynamicLoading.java:110)
   [junit4]    > 	at org.apache.solr.BaseDistributedSearchTestCase$ShardsRepeatRule$ShardsFixedStatement.callStatement(BaseDistributedSearchTestCase.java:985)
   [junit4]    > 	at org.apache.solr.BaseDistributedSearchTestCase$ShardsRepeatRule$ShardsStatement.evaluate(BaseDistributedSearchTestCase.java:960)
   [junit4]    > 	at java.lang.Thread.run(Thread.java:745)
   [junit4]   2> 2954040 INFO  (SUITE-TestDynamicLoading-seed#[EAA29D29CB38C1CE]-worker) [    ] o.a.s.SolrTestCaseJ4 ###deleteCore
   [junit4]   2> NOTE: leaving temporary files on disk at: /export/home/jenkins/workspace/Lucene-Solr-master-Solaris/solr/build/solr-core/test/J0/temp/solr.core.TestDynamicLoading_EAA29D29CB38C1CE-001
   [junit4]   2> Jun 23, 2016 4:44:32 PM com.carrotsearch.randomizedtesting.ThreadLeakControl checkThreadLeaks
   [junit4]   2> WARNING: Will linger awaiting termination of 1 leaked thread(s).
   [junit4]   2> NOTE: test params are: codec=Asserting(Lucene62): {}, docValues:{}, maxPointsInLeafNode=135, maxMBSortInHeap=5.679384229622148, sim=ClassicSimilarity, locale=sq, timezone=Asia/Amman
   [junit4]   2> NOTE: SunOS 5.11 amd64/Oracle Corporation 1.8.0_92 (64-bit)/cpus=3,threads=1,free=251620776,total=522190848
   [junit4]   2> NOTE: All tests run in this JVM: [BadComponentTest, DistributedSuggestComponentTest, TimeZoneUtilsTest, CollectionStateFormat2Test, DistribJoinFromCollectionTest, TestSolrDynamicMBean, TestRandomRequestDistribution, TestHighlightDedupGrouping, AsyncMigrateRouteKeyTest, IgnoreCommitOptimizeUpdateProcessorFactoryTest, TestFieldTypeResource, ClusterStateUpdateTest, TestRandomDVFaceting, TestTestInjection, RegexBoostProcessorTest, TestExpandComponent, XsltUpdateRequestHandlerTest, HLLSerializationTest, LeaderElectionTest, CoreAdminRequestStatusTest, TestGroupingSearch, TestSolrConfigHandlerConcurrent, TestCursorMarkWithoutUniqueKey, ShardRoutingTest, TestExceedMaxTermLength, TestUninvertingReader, ActionThrottleTest, StressHdfsTest, TestManagedResource, TestStressLucene, TestSolrCloudWithKerberosAlt, TestCloudInspectUtil, MBeansHandlerTest, TestReqParamsAPI, TestLMDirichletSimilarityFactory, EnumFieldTest, TestJsonRequest, TestChildDocTransformer, TestHashQParserPlugin, HighlighterMaxOffsetTest, TestCoreContainer, HdfsThreadLeakTest, SOLR749Test, DirectUpdateHandlerTest, HdfsRestartWhileUpdatingTest, TestLockTree, ScriptEngineTest, ZkControllerTest, BufferStoreTest, RollingRestartTest, PathHierarchyTokenizerFactoryTest, PingRequestHandlerTest, TestSolrQueryParserDefaultOperatorResource, OverseerStatusTest, TolerantUpdateProcessorTest, TestSolrQueryResponse, TestFieldCacheSortRandom, SpatialFilterTest, TestFaceting, TestDefaultSearchFieldResource, DisMaxRequestHandlerTest, UpdateParamsTest, TestRawResponseWriter, SolrTestCaseJ4Test, TestLuceneMatchVersion, TestTolerantSearch, TestManagedSchemaAPI, HdfsCollectionsAPIDistributedZkTest, TestConfigSetsAPIExclusivity, RulesTest, TestNRTOpen, LeaderInitiatedRecoveryOnCommitTest, PreAnalyzedUpdateProcessorTest, TestSearcherReuse, TestFreeTextSuggestions, FastVectorHighlighterTest, TestMaxScoreQueryParser, BooleanFieldTest, DistributedQueryComponentCustomSortTest, CircularListTest, PolyFieldTest, TestLeaderElectionZkExpiry, CursorMarkTest, ConnectionManagerTest, TestQueryWrapperFilter, TestSQLHandler, TestGeoJSONResponseWriter, SyncSliceTest, TestFilteredDocIdSet, HighlighterTest, TestLFUCache, HdfsDirectoryFactoryTest, ZkCLITest, TestMiniSolrCloudClusterSSL, ReturnFieldsTest, TestRequestStatusCollectionAPI, UnloadDistributedZkTest, TestIBSimilarityFactory, BlockCacheTest, TestArbitraryIndexDir, CdcrReplicationDistributedZkTest, TestSearchPerf, DistributedFacetPivotSmallTest, TestMiniSolrCloudClusterBase, TestFieldCacheWithThreads, AnalysisErrorHandlingTest, DocValuesTest, IndexSchemaTest, TestPseudoReturnFields, TestExactSharedStatsCache, HdfsUnloadDistributedZkTest, TestScoreJoinQPNoScore, DocumentAnalysisRequestHandlerTest, TestQuerySenderNoQuery, PrimUtilsTest, TestPostingsSolrHighlighter, RecoveryAfterSoftCommitTest, TestTolerantUpdateProcessorRandomCloud, TestSchemaResource, RecoveryZkTest, TermsComponentTest, TestDownShardTolerantSearch, SharedFSAutoReplicaFailoverTest, DistanceUnitsTest, DistributedExpandComponentTest, TestLRUCache, SegmentsInfoRequestHandlerTest, IndexBasedSpellCheckerTest, TestStressLiveNodes, TestFieldCacheSanityChecker, TestConfigOverlay, TestCodecSupport, CollectionsAPIAsyncDistributedZkTest, TestSortByMinMaxFunction, TestUniqueKeyFieldResource, TestPhraseSuggestions, BasicDistributedZkTest, QueryEqualityTest, TestRecoveryHdfs, BlockJoinFacetDistribTest, ExplicitHLLTest, DistributedFacetPivotLongTailTest, SpatialHeatmapFacetsTest, TestDynamicFieldResource, TestCSVLoader, PeerSyncTest, SimpleCollectionCreateDeleteTest, ClusterStateTest, DocumentBuilderTest, BasicDistributedZk2Test, OverseerTest, LeaderElectionIntegrationTest, FullSolrCloudDistribCmdsTest, TestReplicationHandler, TestDistributedSearch, AutoCommitTest, TestHashPartitioner, DistributedSpellCheckComponentTest, TermVectorComponentDistributedTest, TestStressReorder, TestStressVersions, HardAutoCommitTest, TestRangeQuery, SimpleFacetsTest, SolrCoreTest, SolrCmdDistributorTest, QueryElevationComponentTest, ConvertedLegacyTest, TestSort, TestFunctionQuery, BasicFunctionalityTest, TestLazyCores, TestBadConfig, SoftAutoCommitTest, DistributedQueryElevationComponentTest, CurrencyFieldXmlFileTest, SimplePostToolTest, AnalysisAfterCoreReloadTest, TestExtendedDismaxParser, SpellCheckCollatorTest, SuggesterFSTTest, CoreAdminHandlerTest, TestFoldingMultitermQuery, SuggesterTest, TestTrie, WordBreakSolrSpellCheckerTest, SchemaVersionSpecificBehaviorTest, TestWordDelimiterFilterFactory, StatelessScriptUpdateProcessorFactoryTest, SolrInfoMBeanTest, TestSurroundQueryParser, TestQueryUtils, StandardRequestHandlerTest, TestQueryTypes, TestOmitPositions, XmlUpdateRequestHandlerTest, RequestHandlersTest, TermVectorComponentTest, RequiredFieldsTest, TestJmxIntegration, TestCollationField, TestCSVResponseWriter, UniqFieldsUpdateProcessorFactoryTest, JsonLoaderTest, TestPHPSerializedResponseWriter, CSVRequestHandlerTest, TestBinaryResponseWriter, TestQuerySenderListener, CopyFieldTest, TestMergePolicyConfig, SampleTest, TestDocSet, NumericFieldsTest, TestElisionMultitermQuery, ExternalFileFieldSortTest, NotRequiredUniqueKeyTest, TestCharFilters, TestSweetSpotSimilarityFactory, TestLMJelinekMercerSimilarityFactory, OpenExchangeRatesOrgProviderTest, URLClassifyProcessorTest, TestFastLRUCache, ChaosMonkeyNothingIsSafeTest, CollectionsAPISolrJTest, CustomCollectionTest, DistribDocExpirationUpdateProcessorTest, HttpPartitionTest, OutOfBoxZkACLAndCredentialsProvidersTest, OverseerCollectionConfigSetProcessorTest, OverseerTaskQueueTest, ReplicationFactorTest, RestartWhileUpdatingTest, SaslZkACLProviderTest, SolrXmlInZkTest, TestCloudBackupRestore, TestCloudDeleteByQuery, TestConfigSetsAPI, TestCryptoKeys, TestLeaderInitiatedRecoveryThread, TestSSLRandomization, TestShortCircuitedRequests, TriLevelCompositeIdRoutingTest, HdfsRecoverLeaseTest, DirectoryFactoryTest, ExitableDirectoryReaderTest, TestConfigSetProperties, TestConfigSets, TestDynamicLoading]
   [junit4] Completed [504/614 (2!)] on J0 in 55.13s, 1 test, 1 failure <<< FAILURES!

[...truncated 338 lines...]
BUILD FAILED
/export/home/jenkins/workspace/Lucene-Solr-master-Solaris/build.xml:740: The following error occurred while executing this line:
/export/home/jenkins/workspace/Lucene-Solr-master-Solaris/build.xml:684: The following error occurred while executing this line:
/export/home/jenkins/workspace/Lucene-Solr-master-Solaris/build.xml:59: The following error occurred while executing this line:
/export/home/jenkins/workspace/Lucene-Solr-master-Solaris/solr/build.xml:233: The following error occurred while executing this line:
/export/home/jenkins/workspace/Lucene-Solr-master-Solaris/solr/common-build.xml:530: The following error occurred while executing this line:
/export/home/jenkins/workspace/Lucene-Solr-master-Solaris/lucene/common-build.xml:1427: The following error occurred while executing this line:
/export/home/jenkins/workspace/Lucene-Solr-master-Solaris/lucene/common-build.xml:984: There were test failures: 614 suites (10 ignored), 2584 tests, 2 failures, 88 ignored (73 assumptions) [seed: EAA29D29CB38C1CE]

Total time: 73 minutes 33 seconds
Build step 'Invoke Ant' marked build as failure
Archiving artifacts
[WARNINGS] Skipping publisher since build result is FAILURE
Recording test results
Email was triggered for: Failure - Any
Sending email for trigger: Failure - Any



Mime
View raw message