lucene-dev mailing list archives

Site index · List index
Message view « Date » · « Thread »
Top « Date » · « Thread »
From Policeman Jenkins Server <jenk...@thetaphi.de>
Subject [JENKINS] Lucene-Solr-master-Linux (64bit/jdk1.8.0_92) - Build # 16945 - Failure!
Date Wed, 08 Jun 2016 09:30:16 GMT
Build: http://jenkins.thetaphi.de/job/Lucene-Solr-master-Linux/16945/
Java: 64bit/jdk1.8.0_92 -XX:-UseCompressedOops -XX:+UseSerialGC

1 tests failed.
FAILED:  org.apache.solr.handler.TestReqParamsAPI.test

Error Message:
Could not get expected value  'CY val' for path 'params/c' full output: {   "responseHeader":{     "status":0,     "QTime":0},   "params":{     "a":"A val",     "b":"B val",     "wt":"json",     "useParams":""},   "context":{     "webapp":"",     "path":"/dump1",     "httpMethod":"GET"}},  from server:  https://127.0.0.1:39883/collection1

Stack Trace:
java.lang.AssertionError: Could not get expected value  'CY val' for path 'params/c' full output: {
  "responseHeader":{
    "status":0,
    "QTime":0},
  "params":{
    "a":"A val",
    "b":"B val",
    "wt":"json",
    "useParams":""},
  "context":{
    "webapp":"",
    "path":"/dump1",
    "httpMethod":"GET"}},  from server:  https://127.0.0.1:39883/collection1
	at __randomizedtesting.SeedInfo.seed([C804E71256A6F2C1:4050D8C8F85A9F39]:0)
	at org.junit.Assert.fail(Assert.java:93)
	at org.junit.Assert.assertTrue(Assert.java:43)
	at org.apache.solr.core.TestSolrConfigHandler.testForResponseElement(TestSolrConfigHandler.java:457)
	at org.apache.solr.handler.TestReqParamsAPI.testReqParams(TestReqParamsAPI.java:172)
	at org.apache.solr.handler.TestReqParamsAPI.test(TestReqParamsAPI.java:62)
	at sun.reflect.NativeMethodAccessorImpl.invoke0(Native Method)
	at sun.reflect.NativeMethodAccessorImpl.invoke(NativeMethodAccessorImpl.java:62)
	at sun.reflect.DelegatingMethodAccessorImpl.invoke(DelegatingMethodAccessorImpl.java:43)
	at java.lang.reflect.Method.invoke(Method.java:498)
	at com.carrotsearch.randomizedtesting.RandomizedRunner.invoke(RandomizedRunner.java:1764)
	at com.carrotsearch.randomizedtesting.RandomizedRunner$8.evaluate(RandomizedRunner.java:871)
	at com.carrotsearch.randomizedtesting.RandomizedRunner$9.evaluate(RandomizedRunner.java:907)
	at com.carrotsearch.randomizedtesting.RandomizedRunner$10.evaluate(RandomizedRunner.java:921)
	at org.apache.solr.BaseDistributedSearchTestCase$ShardsRepeatRule$ShardsFixedStatement.callStatement(BaseDistributedSearchTestCase.java:985)
	at org.apache.solr.BaseDistributedSearchTestCase$ShardsRepeatRule$ShardsStatement.evaluate(BaseDistributedSearchTestCase.java:960)
	at com.carrotsearch.randomizedtesting.rules.SystemPropertiesRestoreRule$1.evaluate(SystemPropertiesRestoreRule.java:57)
	at org.apache.lucene.util.TestRuleSetupTeardownChained$1.evaluate(TestRuleSetupTeardownChained.java:49)
	at org.apache.lucene.util.AbstractBeforeAfterRule$1.evaluate(AbstractBeforeAfterRule.java:45)
	at org.apache.lucene.util.TestRuleThreadAndTestName$1.evaluate(TestRuleThreadAndTestName.java:48)
	at org.apache.lucene.util.TestRuleIgnoreAfterMaxFailures$1.evaluate(TestRuleIgnoreAfterMaxFailures.java:64)
	at org.apache.lucene.util.TestRuleMarkFailure$1.evaluate(TestRuleMarkFailure.java:47)
	at com.carrotsearch.randomizedtesting.rules.StatementAdapter.evaluate(StatementAdapter.java:36)
	at com.carrotsearch.randomizedtesting.ThreadLeakControl$StatementRunner.run(ThreadLeakControl.java:367)
	at com.carrotsearch.randomizedtesting.ThreadLeakControl.forkTimeoutingTask(ThreadLeakControl.java:809)
	at com.carrotsearch.randomizedtesting.ThreadLeakControl$3.evaluate(ThreadLeakControl.java:460)
	at com.carrotsearch.randomizedtesting.RandomizedRunner.runSingleTest(RandomizedRunner.java:880)
	at com.carrotsearch.randomizedtesting.RandomizedRunner$5.evaluate(RandomizedRunner.java:781)
	at com.carrotsearch.randomizedtesting.RandomizedRunner$6.evaluate(RandomizedRunner.java:816)
	at com.carrotsearch.randomizedtesting.RandomizedRunner$7.evaluate(RandomizedRunner.java:827)
	at com.carrotsearch.randomizedtesting.rules.StatementAdapter.evaluate(StatementAdapter.java:36)
	at com.carrotsearch.randomizedtesting.rules.SystemPropertiesRestoreRule$1.evaluate(SystemPropertiesRestoreRule.java:57)
	at org.apache.lucene.util.AbstractBeforeAfterRule$1.evaluate(AbstractBeforeAfterRule.java:45)
	at com.carrotsearch.randomizedtesting.rules.StatementAdapter.evaluate(StatementAdapter.java:36)
	at org.apache.lucene.util.TestRuleStoreClassName$1.evaluate(TestRuleStoreClassName.java:41)
	at com.carrotsearch.randomizedtesting.rules.NoShadowingOrOverridesOnMethodsRule$1.evaluate(NoShadowingOrOverridesOnMethodsRule.java:40)
	at com.carrotsearch.randomizedtesting.rules.NoShadowingOrOverridesOnMethodsRule$1.evaluate(NoShadowingOrOverridesOnMethodsRule.java:40)
	at com.carrotsearch.randomizedtesting.rules.StatementAdapter.evaluate(StatementAdapter.java:36)
	at com.carrotsearch.randomizedtesting.rules.StatementAdapter.evaluate(StatementAdapter.java:36)
	at com.carrotsearch.randomizedtesting.rules.StatementAdapter.evaluate(StatementAdapter.java:36)
	at org.apache.lucene.util.TestRuleAssertionsRequired$1.evaluate(TestRuleAssertionsRequired.java:53)
	at org.apache.lucene.util.TestRuleMarkFailure$1.evaluate(TestRuleMarkFailure.java:47)
	at org.apache.lucene.util.TestRuleIgnoreAfterMaxFailures$1.evaluate(TestRuleIgnoreAfterMaxFailures.java:64)
	at org.apache.lucene.util.TestRuleIgnoreTestSuites$1.evaluate(TestRuleIgnoreTestSuites.java:54)
	at com.carrotsearch.randomizedtesting.rules.StatementAdapter.evaluate(StatementAdapter.java:36)
	at com.carrotsearch.randomizedtesting.ThreadLeakControl$StatementRunner.run(ThreadLeakControl.java:367)
	at java.lang.Thread.run(Thread.java:745)




Build Log:
[...truncated 10687 lines...]
   [junit4] Suite: org.apache.solr.handler.TestReqParamsAPI
   [junit4]   2> Creating dataDir: /home/jenkins/workspace/Lucene-Solr-master-Linux/solr/build/solr-core/test/J1/temp/solr.handler.TestReqParamsAPI_C804E71256A6F2C1-001/init-core-data-001
   [junit4]   2> 326012 INFO  (SUITE-TestReqParamsAPI-seed#[C804E71256A6F2C1]-worker) [    ] o.a.s.SolrTestCaseJ4 Randomized ssl (true) and clientAuth (false) via: @org.apache.solr.util.RandomizeSSL(reason=, ssl=NaN, value=NaN, clientAuth=NaN)
   [junit4]   2> 326012 INFO  (SUITE-TestReqParamsAPI-seed#[C804E71256A6F2C1]-worker) [    ] o.a.s.BaseDistributedSearchTestCase Setting hostContext system property: /
   [junit4]   2> 326014 INFO  (TEST-TestReqParamsAPI.test-seed#[C804E71256A6F2C1]) [    ] o.a.s.c.ZkTestServer STARTING ZK TEST SERVER
   [junit4]   2> 326015 INFO  (Thread-511) [    ] o.a.s.c.ZkTestServer client port:0.0.0.0/0.0.0.0:0
   [junit4]   2> 326015 INFO  (Thread-511) [    ] o.a.s.c.ZkTestServer Starting server
   [junit4]   2> 326115 INFO  (TEST-TestReqParamsAPI.test-seed#[C804E71256A6F2C1]) [    ] o.a.s.c.ZkTestServer start zk server on port:34602
   [junit4]   2> 326115 INFO  (TEST-TestReqParamsAPI.test-seed#[C804E71256A6F2C1]) [    ] o.a.s.c.c.SolrZkClient Using default ZkCredentialsProvider
   [junit4]   2> 326115 INFO  (TEST-TestReqParamsAPI.test-seed#[C804E71256A6F2C1]) [    ] o.a.s.c.c.ConnectionManager Waiting for client to connect to ZooKeeper
   [junit4]   2> 326120 INFO  (zkCallback-225-thread-1) [    ] o.a.s.c.c.ConnectionManager Watcher org.apache.solr.common.cloud.ConnectionManager@37d47ac3 name:ZooKeeperConnection Watcher:127.0.0.1:34602 got event WatchedEvent state:SyncConnected type:None path:null path:null type:None
   [junit4]   2> 326120 INFO  (TEST-TestReqParamsAPI.test-seed#[C804E71256A6F2C1]) [    ] o.a.s.c.c.ConnectionManager Client is connected to ZooKeeper
   [junit4]   2> 326121 INFO  (TEST-TestReqParamsAPI.test-seed#[C804E71256A6F2C1]) [    ] o.a.s.c.c.SolrZkClient Using default ZkACLProvider
   [junit4]   2> 326121 INFO  (TEST-TestReqParamsAPI.test-seed#[C804E71256A6F2C1]) [    ] o.a.s.c.c.SolrZkClient makePath: /solr
   [junit4]   2> 326123 INFO  (TEST-TestReqParamsAPI.test-seed#[C804E71256A6F2C1]) [    ] o.a.s.c.c.SolrZkClient Using default ZkCredentialsProvider
   [junit4]   2> 326124 INFO  (TEST-TestReqParamsAPI.test-seed#[C804E71256A6F2C1]) [    ] o.a.s.c.c.ConnectionManager Waiting for client to connect to ZooKeeper
   [junit4]   2> 326126 INFO  (zkCallback-226-thread-1) [    ] o.a.s.c.c.ConnectionManager Watcher org.apache.solr.common.cloud.ConnectionManager@58b25e62 name:ZooKeeperConnection Watcher:127.0.0.1:34602/solr got event WatchedEvent state:SyncConnected type:None path:null path:null type:None
   [junit4]   2> 326126 INFO  (TEST-TestReqParamsAPI.test-seed#[C804E71256A6F2C1]) [    ] o.a.s.c.c.ConnectionManager Client is connected to ZooKeeper
   [junit4]   2> 326127 INFO  (TEST-TestReqParamsAPI.test-seed#[C804E71256A6F2C1]) [    ] o.a.s.c.c.SolrZkClient Using default ZkACLProvider
   [junit4]   2> 326127 INFO  (TEST-TestReqParamsAPI.test-seed#[C804E71256A6F2C1]) [    ] o.a.s.c.c.SolrZkClient makePath: /collections/collection1
   [junit4]   2> 326129 INFO  (TEST-TestReqParamsAPI.test-seed#[C804E71256A6F2C1]) [    ] o.a.s.c.c.SolrZkClient makePath: /collections/collection1/shards
   [junit4]   2> 326129 INFO  (TEST-TestReqParamsAPI.test-seed#[C804E71256A6F2C1]) [    ] o.a.s.c.c.SolrZkClient makePath: /collections/control_collection
   [junit4]   2> 326130 INFO  (TEST-TestReqParamsAPI.test-seed#[C804E71256A6F2C1]) [    ] o.a.s.c.c.SolrZkClient makePath: /collections/control_collection/shards
   [junit4]   2> 326130 INFO  (TEST-TestReqParamsAPI.test-seed#[C804E71256A6F2C1]) [    ] o.a.s.c.AbstractZkTestCase put /home/jenkins/workspace/Lucene-Solr-master-Linux/solr/core/src/test-files/solr/collection1/conf/solrconfig-tlog.xml to /configs/conf1/solrconfig.xml
   [junit4]   2> 326131 INFO  (TEST-TestReqParamsAPI.test-seed#[C804E71256A6F2C1]) [    ] o.a.s.c.c.SolrZkClient makePath: /configs/conf1/solrconfig.xml
   [junit4]   2> 326132 INFO  (TEST-TestReqParamsAPI.test-seed#[C804E71256A6F2C1]) [    ] o.a.s.c.AbstractZkTestCase put /home/jenkins/workspace/Lucene-Solr-master-Linux/solr/core/src/test-files/solr/collection1/conf/schema.xml to /configs/conf1/schema.xml
   [junit4]   2> 326132 INFO  (TEST-TestReqParamsAPI.test-seed#[C804E71256A6F2C1]) [    ] o.a.s.c.c.SolrZkClient makePath: /configs/conf1/schema.xml
   [junit4]   2> 326134 INFO  (TEST-TestReqParamsAPI.test-seed#[C804E71256A6F2C1]) [    ] o.a.s.c.AbstractZkTestCase put /home/jenkins/workspace/Lucene-Solr-master-Linux/solr/core/src/test-files/solr/collection1/conf/solrconfig.snippet.randomindexconfig.xml to /configs/conf1/solrconfig.snippet.randomindexconfig.xml
   [junit4]   2> 326134 INFO  (TEST-TestReqParamsAPI.test-seed#[C804E71256A6F2C1]) [    ] o.a.s.c.c.SolrZkClient makePath: /configs/conf1/solrconfig.snippet.randomindexconfig.xml
   [junit4]   2> 326144 INFO  (TEST-TestReqParamsAPI.test-seed#[C804E71256A6F2C1]) [    ] o.a.s.c.AbstractZkTestCase put /home/jenkins/workspace/Lucene-Solr-master-Linux/solr/core/src/test-files/solr/collection1/conf/stopwords.txt to /configs/conf1/stopwords.txt
   [junit4]   2> 326144 INFO  (TEST-TestReqParamsAPI.test-seed#[C804E71256A6F2C1]) [    ] o.a.s.c.c.SolrZkClient makePath: /configs/conf1/stopwords.txt
   [junit4]   2> 326145 INFO  (TEST-TestReqParamsAPI.test-seed#[C804E71256A6F2C1]) [    ] o.a.s.c.AbstractZkTestCase put /home/jenkins/workspace/Lucene-Solr-master-Linux/solr/core/src/test-files/solr/collection1/conf/protwords.txt to /configs/conf1/protwords.txt
   [junit4]   2> 326145 INFO  (TEST-TestReqParamsAPI.test-seed#[C804E71256A6F2C1]) [    ] o.a.s.c.c.SolrZkClient makePath: /configs/conf1/protwords.txt
   [junit4]   2> 326146 INFO  (TEST-TestReqParamsAPI.test-seed#[C804E71256A6F2C1]) [    ] o.a.s.c.AbstractZkTestCase put /home/jenkins/workspace/Lucene-Solr-master-Linux/solr/core/src/test-files/solr/collection1/conf/currency.xml to /configs/conf1/currency.xml
   [junit4]   2> 326146 INFO  (TEST-TestReqParamsAPI.test-seed#[C804E71256A6F2C1]) [    ] o.a.s.c.c.SolrZkClient makePath: /configs/conf1/currency.xml
   [junit4]   2> 326147 INFO  (TEST-TestReqParamsAPI.test-seed#[C804E71256A6F2C1]) [    ] o.a.s.c.AbstractZkTestCase put /home/jenkins/workspace/Lucene-Solr-master-Linux/solr/core/src/test-files/solr/collection1/conf/enumsConfig.xml to /configs/conf1/enumsConfig.xml
   [junit4]   2> 326147 INFO  (TEST-TestReqParamsAPI.test-seed#[C804E71256A6F2C1]) [    ] o.a.s.c.c.SolrZkClient makePath: /configs/conf1/enumsConfig.xml
   [junit4]   2> 326147 INFO  (TEST-TestReqParamsAPI.test-seed#[C804E71256A6F2C1]) [    ] o.a.s.c.AbstractZkTestCase put /home/jenkins/workspace/Lucene-Solr-master-Linux/solr/core/src/test-files/solr/collection1/conf/open-exchange-rates.json to /configs/conf1/open-exchange-rates.json
   [junit4]   2> 326148 INFO  (TEST-TestReqParamsAPI.test-seed#[C804E71256A6F2C1]) [    ] o.a.s.c.c.SolrZkClient makePath: /configs/conf1/open-exchange-rates.json
   [junit4]   2> 326148 INFO  (TEST-TestReqParamsAPI.test-seed#[C804E71256A6F2C1]) [    ] o.a.s.c.AbstractZkTestCase put /home/jenkins/workspace/Lucene-Solr-master-Linux/solr/core/src/test-files/solr/collection1/conf/mapping-ISOLatin1Accent.txt to /configs/conf1/mapping-ISOLatin1Accent.txt
   [junit4]   2> 326148 INFO  (TEST-TestReqParamsAPI.test-seed#[C804E71256A6F2C1]) [    ] o.a.s.c.c.SolrZkClient makePath: /configs/conf1/mapping-ISOLatin1Accent.txt
   [junit4]   2> 326149 INFO  (TEST-TestReqParamsAPI.test-seed#[C804E71256A6F2C1]) [    ] o.a.s.c.AbstractZkTestCase put /home/jenkins/workspace/Lucene-Solr-master-Linux/solr/core/src/test-files/solr/collection1/conf/old_synonyms.txt to /configs/conf1/old_synonyms.txt
   [junit4]   2> 326149 INFO  (TEST-TestReqParamsAPI.test-seed#[C804E71256A6F2C1]) [    ] o.a.s.c.c.SolrZkClient makePath: /configs/conf1/old_synonyms.txt
   [junit4]   2> 326150 INFO  (TEST-TestReqParamsAPI.test-seed#[C804E71256A6F2C1]) [    ] o.a.s.c.AbstractZkTestCase put /home/jenkins/workspace/Lucene-Solr-master-Linux/solr/core/src/test-files/solr/collection1/conf/synonyms.txt to /configs/conf1/synonyms.txt
   [junit4]   2> 326150 INFO  (TEST-TestReqParamsAPI.test-seed#[C804E71256A6F2C1]) [    ] o.a.s.c.c.SolrZkClient makePath: /configs/conf1/synonyms.txt
   [junit4]   2> 326152 INFO  (TEST-TestReqParamsAPI.test-seed#[C804E71256A6F2C1]) [    ] o.a.s.c.c.SolrZkClient Using default ZkCredentialsProvider
   [junit4]   2> 326153 INFO  (TEST-TestReqParamsAPI.test-seed#[C804E71256A6F2C1]) [    ] o.a.s.c.c.ConnectionManager Waiting for client to connect to ZooKeeper
   [junit4]   2> 326153 INFO  (zkCallback-228-thread-1) [    ] o.a.s.c.c.ConnectionManager Watcher org.apache.solr.common.cloud.ConnectionManager@1b31df64 name:ZooKeeperConnection Watcher:127.0.0.1:34602/solr got event WatchedEvent state:SyncConnected type:None path:null path:null type:None
   [junit4]   2> 326153 INFO  (TEST-TestReqParamsAPI.test-seed#[C804E71256A6F2C1]) [    ] o.a.s.c.c.ConnectionManager Client is connected to ZooKeeper
   [junit4]   2> 326154 INFO  (TEST-TestReqParamsAPI.test-seed#[C804E71256A6F2C1]) [    ] o.a.s.c.c.SolrZkClient Using default ZkACLProvider
   [junit4]   2> 326225 INFO  (TEST-TestReqParamsAPI.test-seed#[C804E71256A6F2C1]) [    ] o.a.s.SolrTestCaseJ4 Writing core.properties file to /home/jenkins/workspace/Lucene-Solr-master-Linux/solr/build/solr-core/test/J1/temp/solr.handler.TestReqParamsAPI_C804E71256A6F2C1-001/control-001/cores/collection1
   [junit4]   2> 326252 INFO  (TEST-TestReqParamsAPI.test-seed#[C804E71256A6F2C1]) [    ] o.e.j.s.Server jetty-9.3.8.v20160314
   [junit4]   2> 326253 INFO  (TEST-TestReqParamsAPI.test-seed#[C804E71256A6F2C1]) [    ] o.e.j.s.h.ContextHandler Started o.e.j.s.ServletContextHandler@7ccf9910{/,null,AVAILABLE}
   [junit4]   2> 326255 INFO  (TEST-TestReqParamsAPI.test-seed#[C804E71256A6F2C1]) [    ] o.e.j.s.ServerConnector Started ServerConnector@ebc2c50{SSL,[ssl, http/1.1]}{127.0.0.1:41538}
   [junit4]   2> 326255 INFO  (TEST-TestReqParamsAPI.test-seed#[C804E71256A6F2C1]) [    ] o.e.j.s.Server Started @328212ms
   [junit4]   2> 326255 INFO  (TEST-TestReqParamsAPI.test-seed#[C804E71256A6F2C1]) [    ] o.a.s.c.s.e.JettySolrRunner Jetty properties: {solr.data.dir=/home/jenkins/workspace/Lucene-Solr-master-Linux/solr/build/solr-core/test/J1/temp/solr.handler.TestReqParamsAPI_C804E71256A6F2C1-001/tempDir-001/control/data, hostContext=/, hostPort=41538, coreRootDirectory=/home/jenkins/workspace/Lucene-Solr-master-Linux/solr/build/solr-core/test/J1/temp/solr.handler.TestReqParamsAPI_C804E71256A6F2C1-001/control-001/cores}
   [junit4]   2> 326255 INFO  (TEST-TestReqParamsAPI.test-seed#[C804E71256A6F2C1]) [    ] o.a.s.s.SolrDispatchFilter SolrDispatchFilter.init(): sun.misc.Launcher$AppClassLoader@73d16e93
   [junit4]   2> 326255 INFO  (TEST-TestReqParamsAPI.test-seed#[C804E71256A6F2C1]) [    ] o.a.s.c.SolrResourceLoader new SolrResourceLoader for directory: '/home/jenkins/workspace/Lucene-Solr-master-Linux/solr/build/solr-core/test/J1/temp/solr.handler.TestReqParamsAPI_C804E71256A6F2C1-001/control-001'
   [junit4]   2> 326255 INFO  (TEST-TestReqParamsAPI.test-seed#[C804E71256A6F2C1]) [    ] o.a.s.c.SolrResourceLoader JNDI not configured for solr (NoInitialContextEx)
   [junit4]   2> 326256 INFO  (TEST-TestReqParamsAPI.test-seed#[C804E71256A6F2C1]) [    ] o.a.s.c.SolrResourceLoader solr home defaulted to 'solr/' (could not find system property or JNDI)
   [junit4]   2> 326256 INFO  (TEST-TestReqParamsAPI.test-seed#[C804E71256A6F2C1]) [    ] o.a.s.c.c.SolrZkClient Using default ZkCredentialsProvider
   [junit4]   2> 326256 INFO  (TEST-TestReqParamsAPI.test-seed#[C804E71256A6F2C1]) [    ] o.a.s.c.c.ConnectionManager Waiting for client to connect to ZooKeeper
   [junit4]   2> 326257 INFO  (zkCallback-229-thread-1) [    ] o.a.s.c.c.ConnectionManager Watcher org.apache.solr.common.cloud.ConnectionManager@723ac9b3 name:ZooKeeperConnection Watcher:127.0.0.1:34602/solr got event WatchedEvent state:SyncConnected type:None path:null path:null type:None
   [junit4]   2> 326257 INFO  (TEST-TestReqParamsAPI.test-seed#[C804E71256A6F2C1]) [    ] o.a.s.c.c.ConnectionManager Client is connected to ZooKeeper
   [junit4]   2> 326257 INFO  (TEST-TestReqParamsAPI.test-seed#[C804E71256A6F2C1]) [    ] o.a.s.c.c.SolrZkClient Using default ZkACLProvider
   [junit4]   2> 326258 INFO  (TEST-TestReqParamsAPI.test-seed#[C804E71256A6F2C1]) [    ] o.a.s.s.SolrDispatchFilter Loading solr.xml from SolrHome (not found in ZooKeeper)
   [junit4]   2> 326258 INFO  (TEST-TestReqParamsAPI.test-seed#[C804E71256A6F2C1]) [    ] o.a.s.c.SolrXmlConfig Loading container configuration from /home/jenkins/workspace/Lucene-Solr-master-Linux/solr/build/solr-core/test/J1/temp/solr.handler.TestReqParamsAPI_C804E71256A6F2C1-001/control-001/solr.xml
   [junit4]   2> 326263 INFO  (TEST-TestReqParamsAPI.test-seed#[C804E71256A6F2C1]) [    ] o.a.s.c.CorePropertiesLocator Config-defined core root directory: /home/jenkins/workspace/Lucene-Solr-master-Linux/solr/build/solr-core/test/J1/temp/solr.handler.TestReqParamsAPI_C804E71256A6F2C1-001/control-001/cores
   [junit4]   2> 326263 INFO  (TEST-TestReqParamsAPI.test-seed#[C804E71256A6F2C1]) [    ] o.a.s.c.CoreContainer New CoreContainer 110250797
   [junit4]   2> 326263 INFO  (TEST-TestReqParamsAPI.test-seed#[C804E71256A6F2C1]) [    ] o.a.s.c.CoreContainer Loading cores into CoreContainer [instanceDir=/home/jenkins/workspace/Lucene-Solr-master-Linux/solr/build/solr-core/test/J1/temp/solr.handler.TestReqParamsAPI_C804E71256A6F2C1-001/control-001]
   [junit4]   2> 326263 WARN  (TEST-TestReqParamsAPI.test-seed#[C804E71256A6F2C1]) [    ] o.a.s.c.CoreContainer Couldn't add files from /home/jenkins/workspace/Lucene-Solr-master-Linux/solr/build/solr-core/test/J1/temp/solr.handler.TestReqParamsAPI_C804E71256A6F2C1-001/control-001/lib to classpath: /home/jenkins/workspace/Lucene-Solr-master-Linux/solr/build/solr-core/test/J1/temp/solr.handler.TestReqParamsAPI_C804E71256A6F2C1-001/control-001/lib
   [junit4]   2> 326263 INFO  (TEST-TestReqParamsAPI.test-seed#[C804E71256A6F2C1]) [    ] o.a.s.h.c.HttpShardHandlerFactory created with socketTimeout : 90000,urlScheme : ,connTimeout : 15000,maxConnectionsPerHost : 20,maxConnections : 10000,corePoolSize : 0,maximumPoolSize : 2147483647,maxThreadIdleTime : 5,sizeOfQueue : -1,fairnessPolicy : false,
   [junit4]   2> 326264 INFO  (TEST-TestReqParamsAPI.test-seed#[C804E71256A6F2C1]) [    ] o.a.s.u.UpdateShardHandler Creating UpdateShardHandler HTTP client with params: 
   [junit4]   2> 326265 INFO  (TEST-TestReqParamsAPI.test-seed#[C804E71256A6F2C1]) [    ] o.a.s.l.LogWatcher SLF4J impl is org.slf4j.impl.Log4jLoggerFactory
   [junit4]   2> 326265 INFO  (TEST-TestReqParamsAPI.test-seed#[C804E71256A6F2C1]) [    ] o.a.s.l.LogWatcher Registering Log Listener [Log4j (org.slf4j.impl.Log4jLoggerFactory)]
   [junit4]   2> 326265 INFO  (TEST-TestReqParamsAPI.test-seed#[C804E71256A6F2C1]) [    ] o.a.s.c.ZkContainer Zookeeper client=127.0.0.1:34602/solr
   [junit4]   2> 326265 INFO  (TEST-TestReqParamsAPI.test-seed#[C804E71256A6F2C1]) [    ] o.a.s.c.ZkController zkHost includes chroot
   [junit4]   2> 326265 INFO  (TEST-TestReqParamsAPI.test-seed#[C804E71256A6F2C1]) [    ] o.a.s.c.c.SolrZkClient Using default ZkCredentialsProvider
   [junit4]   2> 326266 INFO  (TEST-TestReqParamsAPI.test-seed#[C804E71256A6F2C1]) [    ] o.a.s.c.c.ConnectionManager Waiting for client to connect to ZooKeeper
   [junit4]   2> 326266 INFO  (zkCallback-232-thread-1) [    ] o.a.s.c.c.ConnectionManager Watcher org.apache.solr.common.cloud.ConnectionManager@105f6232 name:ZooKeeperConnection Watcher:127.0.0.1:34602 got event WatchedEvent state:SyncConnected type:None path:null path:null type:None
   [junit4]   2> 326267 INFO  (TEST-TestReqParamsAPI.test-seed#[C804E71256A6F2C1]) [    ] o.a.s.c.c.ConnectionManager Client is connected to ZooKeeper
   [junit4]   2> 326267 INFO  (TEST-TestReqParamsAPI.test-seed#[C804E71256A6F2C1]) [    ] o.a.s.c.c.SolrZkClient Using default ZkACLProvider
   [junit4]   2> 326269 INFO  (TEST-TestReqParamsAPI.test-seed#[C804E71256A6F2C1]) [n:127.0.0.1:41538_    ] o.a.s.c.ZkController Added new OnReconnect listener org.apache.solr.cloud.ZkController$$Lambda$37/167678938@4de0166a
   [junit4]   2> 326270 INFO  (TEST-TestReqParamsAPI.test-seed#[C804E71256A6F2C1]) [n:127.0.0.1:41538_    ] o.a.s.c.c.ConnectionManager Waiting for client to connect to ZooKeeper
   [junit4]   2> 326271 INFO  (zkCallback-233-thread-1-processing-n:127.0.0.1:41538_) [n:127.0.0.1:41538_    ] o.a.s.c.c.ConnectionManager Watcher org.apache.solr.common.cloud.ConnectionManager@2c852fdf name:ZooKeeperConnection Watcher:127.0.0.1:34602/solr got event WatchedEvent state:SyncConnected type:None path:null path:null type:None
   [junit4]   2> 326272 INFO  (TEST-TestReqParamsAPI.test-seed#[C804E71256A6F2C1]) [n:127.0.0.1:41538_    ] o.a.s.c.c.ConnectionManager Client is connected to ZooKeeper
   [junit4]   2> 326272 INFO  (TEST-TestReqParamsAPI.test-seed#[C804E71256A6F2C1]) [n:127.0.0.1:41538_    ] o.a.s.c.c.SolrZkClient makePath: /overseer/queue
   [junit4]   2> 326273 INFO  (TEST-TestReqParamsAPI.test-seed#[C804E71256A6F2C1]) [n:127.0.0.1:41538_    ] o.a.s.c.c.SolrZkClient makePath: /overseer/collection-queue-work
   [junit4]   2> 326275 INFO  (TEST-TestReqParamsAPI.test-seed#[C804E71256A6F2C1]) [n:127.0.0.1:41538_    ] o.a.s.c.c.SolrZkClient makePath: /overseer/collection-map-running
   [junit4]   2> 326275 INFO  (TEST-TestReqParamsAPI.test-seed#[C804E71256A6F2C1]) [n:127.0.0.1:41538_    ] o.a.s.c.c.SolrZkClient makePath: /overseer/collection-map-completed
   [junit4]   2> 326276 INFO  (TEST-TestReqParamsAPI.test-seed#[C804E71256A6F2C1]) [n:127.0.0.1:41538_    ] o.a.s.c.c.SolrZkClient makePath: /overseer/collection-map-failure
   [junit4]   2> 326276 INFO  (TEST-TestReqParamsAPI.test-seed#[C804E71256A6F2C1]) [n:127.0.0.1:41538_    ] o.a.s.c.c.SolrZkClient makePath: /live_nodes
   [junit4]   2> 326277 INFO  (TEST-TestReqParamsAPI.test-seed#[C804E71256A6F2C1]) [n:127.0.0.1:41538_    ] o.a.s.c.c.SolrZkClient makePath: /aliases.json
   [junit4]   2> 326277 INFO  (TEST-TestReqParamsAPI.test-seed#[C804E71256A6F2C1]) [n:127.0.0.1:41538_    ] o.a.s.c.c.SolrZkClient makePath: /clusterstate.json
   [junit4]   2> 326278 INFO  (TEST-TestReqParamsAPI.test-seed#[C804E71256A6F2C1]) [n:127.0.0.1:41538_    ] o.a.s.c.c.SolrZkClient makePath: /security.json
   [junit4]   2> 326278 INFO  (TEST-TestReqParamsAPI.test-seed#[C804E71256A6F2C1]) [n:127.0.0.1:41538_    ] o.a.s.c.c.ZkStateReader Updating cluster state from ZooKeeper... 
   [junit4]   2> 326278 INFO  (TEST-TestReqParamsAPI.test-seed#[C804E71256A6F2C1]) [n:127.0.0.1:41538_    ] o.a.s.c.c.ZkStateReader Loaded cluster properties: {urlScheme=https}
   [junit4]   2> 326278 INFO  (TEST-TestReqParamsAPI.test-seed#[C804E71256A6F2C1]) [n:127.0.0.1:41538_    ] o.a.s.c.c.ZkStateReader Updated live nodes from ZooKeeper... (0) -> (0)
   [junit4]   2> 326279 INFO  (TEST-TestReqParamsAPI.test-seed#[C804E71256A6F2C1]) [n:127.0.0.1:41538_    ] o.a.s.c.c.SolrZkClient makePath: /overseer_elect
   [junit4]   2> 326280 INFO  (TEST-TestReqParamsAPI.test-seed#[C804E71256A6F2C1]) [n:127.0.0.1:41538_    ] o.a.s.c.c.SolrZkClient makePath: /overseer_elect/election
   [junit4]   2> 326280 INFO  (TEST-TestReqParamsAPI.test-seed#[C804E71256A6F2C1]) [n:127.0.0.1:41538_    ] o.a.s.c.Overseer Overseer (id=null) closing
   [junit4]   2> 326280 INFO  (TEST-TestReqParamsAPI.test-seed#[C804E71256A6F2C1]) [n:127.0.0.1:41538_    ] o.a.s.c.LeaderElector Joined leadership election with path: /overseer_elect/election/96034917591351301-127.0.0.1:41538_-n_0000000000
   [junit4]   2> 326280 INFO  (TEST-TestReqParamsAPI.test-seed#[C804E71256A6F2C1]) [n:127.0.0.1:41538_    ] o.a.s.c.OverseerElectionContext I am going to be the leader 127.0.0.1:41538_
   [junit4]   2> 326280 INFO  (TEST-TestReqParamsAPI.test-seed#[C804E71256A6F2C1]) [n:127.0.0.1:41538_    ] o.a.s.c.c.SolrZkClient makePath: /overseer_elect/leader
   [junit4]   2> 326281 INFO  (TEST-TestReqParamsAPI.test-seed#[C804E71256A6F2C1]) [n:127.0.0.1:41538_    ] o.a.s.c.Overseer Overseer (id=96034917591351301-127.0.0.1:41538_-n_0000000000) starting
   [junit4]   2> 326282 INFO  (TEST-TestReqParamsAPI.test-seed#[C804E71256A6F2C1]) [n:127.0.0.1:41538_    ] o.a.s.c.c.SolrZkClient makePath: /overseer/queue-work
   [junit4]   2> 326285 INFO  (TEST-TestReqParamsAPI.test-seed#[C804E71256A6F2C1]) [n:127.0.0.1:41538_    ] o.a.s.c.OverseerAutoReplicaFailoverThread Starting OverseerAutoReplicaFailoverThread autoReplicaFailoverWorkLoopDelay=10000 autoReplicaFailoverWaitAfterExpiration=30000 autoReplicaFailoverBadNodeExpiration=60000
   [junit4]   2> 326286 INFO  (OverseerCollectionConfigSetProcessor-96034917591351301-127.0.0.1:41538_-n_0000000000) [n:127.0.0.1:41538_    ] o.a.s.c.OverseerTaskProcessor Process current queue of overseer operations
   [junit4]   2> 326286 INFO  (TEST-TestReqParamsAPI.test-seed#[C804E71256A6F2C1]) [n:127.0.0.1:41538_    ] o.a.s.c.ZkController Register node as live in ZooKeeper:/live_nodes/127.0.0.1:41538_
   [junit4]   2> 326286 INFO  (OverseerStateUpdate-96034917591351301-127.0.0.1:41538_-n_0000000000) [n:127.0.0.1:41538_    ] o.a.s.c.Overseer Starting to work on the main queue
   [junit4]   2> 326286 INFO  (TEST-TestReqParamsAPI.test-seed#[C804E71256A6F2C1]) [n:127.0.0.1:41538_    ] o.a.s.c.c.SolrZkClient makePath: /live_nodes/127.0.0.1:41538_
   [junit4]   2> 326287 INFO  (OverseerStateUpdate-96034917591351301-127.0.0.1:41538_-n_0000000000) [n:127.0.0.1:41538_    ] o.a.s.c.c.ZkStateReader Updated live nodes from ZooKeeper... (0) -> (0)
   [junit4]   2> 326287 INFO  (zkCallback-233-thread-1-processing-n:127.0.0.1:41538_) [n:127.0.0.1:41538_    ] o.a.s.c.c.ZkStateReader A live node change: [WatchedEvent state:SyncConnected type:NodeChildrenChanged path:/live_nodes], has occurred - updating... (live nodes size: [0])
   [junit4]   2> 326287 INFO  (zkCallback-233-thread-1-processing-n:127.0.0.1:41538_) [n:127.0.0.1:41538_    ] o.a.s.c.c.ZkStateReader Updated live nodes from ZooKeeper... (0) -> (1)
   [junit4]   2> 326297 INFO  (TEST-TestReqParamsAPI.test-seed#[C804E71256A6F2C1]) [n:127.0.0.1:41538_    ] o.a.s.c.CoreContainer Security conf doesn't exist. Skipping setup for authorization module.
   [junit4]   2> 326297 INFO  (TEST-TestReqParamsAPI.test-seed#[C804E71256A6F2C1]) [n:127.0.0.1:41538_    ] o.a.s.c.CoreContainer No authentication plugin used.
   [junit4]   2> 326297 INFO  (TEST-TestReqParamsAPI.test-seed#[C804E71256A6F2C1]) [n:127.0.0.1:41538_    ] o.a.s.c.CorePropertiesLocator Looking for core definitions underneath /home/jenkins/workspace/Lucene-Solr-master-Linux/solr/build/solr-core/test/J1/temp/solr.handler.TestReqParamsAPI_C804E71256A6F2C1-001/control-001/cores
   [junit4]   2> 326298 INFO  (TEST-TestReqParamsAPI.test-seed#[C804E71256A6F2C1]) [n:127.0.0.1:41538_    ] o.a.s.c.CoreDescriptor Created CoreDescriptor: {name=collection1, config=solrconfig.xml, transient=false, schema=schema.xml, loadOnStartup=true, configSetProperties=configsetprops.json, collection=control_collection, coreNodeName=, dataDir=data/, shard=}
   [junit4]   2> 326298 INFO  (TEST-TestReqParamsAPI.test-seed#[C804E71256A6F2C1]) [n:127.0.0.1:41538_    ] o.a.s.c.CorePropertiesLocator Found core collection1 in /home/jenkins/workspace/Lucene-Solr-master-Linux/solr/build/solr-core/test/J1/temp/solr.handler.TestReqParamsAPI_C804E71256A6F2C1-001/control-001/cores/collection1
   [junit4]   2> 326298 INFO  (TEST-TestReqParamsAPI.test-seed#[C804E71256A6F2C1]) [n:127.0.0.1:41538_    ] o.a.s.c.CorePropertiesLocator Found 1 core definitions
   [junit4]   2> 326299 INFO  (TEST-TestReqParamsAPI.test-seed#[C804E71256A6F2C1]) [n:127.0.0.1:41538_    ] o.a.s.s.SolrDispatchFilter user.dir=/home/jenkins/workspace/Lucene-Solr-master-Linux/solr/build/solr-core/test/J1
   [junit4]   2> 326299 INFO  (TEST-TestReqParamsAPI.test-seed#[C804E71256A6F2C1]) [n:127.0.0.1:41538_    ] o.a.s.s.SolrDispatchFilter SolrDispatchFilter.init() done
   [junit4]   2> 326299 INFO  (coreLoadExecutor-540-thread-1-processing-n:127.0.0.1:41538_) [n:127.0.0.1:41538_ c:control_collection   x:collection1] o.a.s.c.ZkController publishing state=down
   [junit4]   2> 326299 INFO  (coreLoadExecutor-540-thread-1-processing-n:127.0.0.1:41538_) [n:127.0.0.1:41538_ c:control_collection   x:collection1] o.a.s.c.ZkController numShards not found on descriptor - reading it from system property
   [junit4]   2> 326300 INFO  (coreLoadExecutor-540-thread-1-processing-n:127.0.0.1:41538_) [n:127.0.0.1:41538_ c:control_collection   x:collection1] o.a.s.c.ZkController Collection control_collection not visible yet, but flagging it so a watch is registered when it becomes visible
   [junit4]   2> 326300 INFO  (OverseerStateUpdate-96034917591351301-127.0.0.1:41538_-n_0000000000) [n:127.0.0.1:41538_    ] o.a.s.c.Overseer processMessage: queueSize: 1, message = {
   [junit4]   2>   "core":"collection1",
   [junit4]   2>   "roles":null,
   [junit4]   2>   "base_url":"https://127.0.0.1:41538",
   [junit4]   2>   "node_name":"127.0.0.1:41538_",
   [junit4]   2>   "numShards":"1",
   [junit4]   2>   "state":"down",
   [junit4]   2>   "shard":null,
   [junit4]   2>   "collection":"control_collection",
   [junit4]   2>   "operation":"state"} current state version: 0
   [junit4]   2> 326300 INFO  (OverseerStateUpdate-96034917591351301-127.0.0.1:41538_-n_0000000000) [n:127.0.0.1:41538_    ] o.a.s.c.o.ReplicaMutator Update state numShards=1 message={
   [junit4]   2>   "core":"collection1",
   [junit4]   2>   "roles":null,
   [junit4]   2>   "base_url":"https://127.0.0.1:41538",
   [junit4]   2>   "node_name":"127.0.0.1:41538_",
   [junit4]   2>   "numShards":"1",
   [junit4]   2>   "state":"down",
   [junit4]   2>   "shard":null,
   [junit4]   2>   "collection":"control_collection",
   [junit4]   2>   "operation":"state"}
   [junit4]   2> 326300 INFO  (coreLoadExecutor-540-thread-1-processing-n:127.0.0.1:41538_) [n:127.0.0.1:41538_ c:control_collection   x:collection1] o.a.s.c.c.ZkStateReader Deleting data for [control_collection]
   [junit4]   2> 326301 INFO  (OverseerStateUpdate-96034917591351301-127.0.0.1:41538_-n_0000000000) [n:127.0.0.1:41538_    ] o.a.s.c.o.ClusterStateMutator building a new cName: control_collection
   [junit4]   2> 326301 INFO  (OverseerStateUpdate-96034917591351301-127.0.0.1:41538_-n_0000000000) [n:127.0.0.1:41538_    ] o.a.s.c.o.ReplicaMutator Assigning new node to shard shard=shard1
   [junit4]   2> 326301 INFO  (coreLoadExecutor-540-thread-1-processing-n:127.0.0.1:41538_) [n:127.0.0.1:41538_ c:control_collection   x:collection1] o.a.s.c.ZkController look for our core node name
   [junit4]   2> 326302 INFO  (zkCallback-233-thread-2-processing-n:127.0.0.1:41538_) [n:127.0.0.1:41538_    ] o.a.s.c.c.ZkStateReader A cluster state change: [WatchedEvent state:SyncConnected type:NodeDataChanged path:/clusterstate.json], has occurred - updating... (live nodes size: [1])
   [junit4]   2> 327301 INFO  (coreLoadExecutor-540-thread-1-processing-n:127.0.0.1:41538_) [n:127.0.0.1:41538_ c:control_collection   x:collection1] o.a.s.c.ZkController waiting to find shard id in clusterstate for collection1
   [junit4]   2> 327301 INFO  (coreLoadExecutor-540-thread-1-processing-n:127.0.0.1:41538_) [n:127.0.0.1:41538_ c:control_collection   x:collection1] o.a.s.c.ZkController Check for collection zkNode:control_collection
   [junit4]   2> 327302 INFO  (coreLoadExecutor-540-thread-1-processing-n:127.0.0.1:41538_) [n:127.0.0.1:41538_ c:control_collection   x:collection1] o.a.s.c.ZkController Collection zkNode exists
   [junit4]   2> 327302 INFO  (coreLoadExecutor-540-thread-1-processing-n:127.0.0.1:41538_) [n:127.0.0.1:41538_ c:control_collection   x:collection1] o.a.s.c.c.ZkStateReader Load collection config from: [/collections/control_collection]
   [junit4]   2> 327302 INFO  (coreLoadExecutor-540-thread-1-processing-n:127.0.0.1:41538_) [n:127.0.0.1:41538_ c:control_collection   x:collection1] o.a.s.c.c.ZkStateReader path=[/collections/control_collection] [configName]=[conf1] specified config exists in ZooKeeper
   [junit4]   2> 327302 INFO  (coreLoadExecutor-540-thread-1-processing-n:127.0.0.1:41538_) [n:127.0.0.1:41538_ c:control_collection   x:collection1] o.a.s.c.SolrResourceLoader new SolrResourceLoader for directory: '/home/jenkins/workspace/Lucene-Solr-master-Linux/solr/build/solr-core/test/J1/temp/solr.handler.TestReqParamsAPI_C804E71256A6F2C1-001/control-001/cores/collection1'
   [junit4]   2> 327303 INFO  (coreLoadExecutor-540-thread-1-processing-n:127.0.0.1:41538_) [n:127.0.0.1:41538_ c:control_collection   x:collection1] o.a.s.c.SolrResourceLoader JNDI not configured for solr (NoInitialContextEx)
   [junit4]   2> 327303 INFO  (coreLoadExecutor-540-thread-1-processing-n:127.0.0.1:41538_) [n:127.0.0.1:41538_ c:control_collection   x:collection1] o.a.s.c.SolrResourceLoader solr home defaulted to 'solr/' (could not find system property or JNDI)
   [junit4]   2> 327304 INFO  (coreLoadExecutor-540-thread-1-processing-n:127.0.0.1:41538_) [n:127.0.0.1:41538_ c:control_collection   x:collection1] o.a.s.c.Config loaded config solrconfig.xml with version 0 
   [junit4]   2> 327308 INFO  (coreLoadExecutor-540-thread-1-processing-n:127.0.0.1:41538_) [n:127.0.0.1:41538_ c:control_collection   x:collection1] o.a.s.c.SolrConfig current version of requestparams : -1
   [junit4]   2> 327311 INFO  (coreLoadExecutor-540-thread-1-processing-n:127.0.0.1:41538_) [n:127.0.0.1:41538_ c:control_collection   x:collection1] o.a.s.c.SolrConfig Using Lucene MatchVersion: 7.0.0
   [junit4]   2> 327337 INFO  (coreLoadExecutor-540-thread-1-processing-n:127.0.0.1:41538_) [n:127.0.0.1:41538_ c:control_collection   x:collection1] o.a.s.c.SolrConfig Loaded SolrConfig: solrconfig.xml
   [junit4]   2> 327341 INFO  (coreLoadExecutor-540-thread-1-processing-n:127.0.0.1:41538_) [n:127.0.0.1:41538_ c:control_collection   x:collection1] o.a.s.s.IndexSchema [collection1] Schema name=test
   [junit4]   2> 327428 INFO  (coreLoadExecutor-540-thread-1-processing-n:127.0.0.1:41538_) [n:127.0.0.1:41538_ c:control_collection   x:collection1] o.a.s.s.OpenExchangeRatesOrgProvider Initialized with rates=open-exchange-rates.json, refreshInterval=1440.
   [junit4]   2> 327435 INFO  (coreLoadExecutor-540-thread-1-processing-n:127.0.0.1:41538_) [n:127.0.0.1:41538_ c:control_collection   x:collection1] o.a.s.s.IndexSchema default search field in schema is text
   [junit4]   2> 327436 INFO  (coreLoadExecutor-540-thread-1-processing-n:127.0.0.1:41538_) [n:127.0.0.1:41538_ c:control_collection   x:collection1] o.a.s.s.IndexSchema unique key field: id
   [junit4]   2> 327442 INFO  (coreLoadExecutor-540-thread-1-processing-n:127.0.0.1:41538_) [n:127.0.0.1:41538_ c:control_collection   x:collection1] o.a.s.s.FileExchangeRateProvider Reloading exchange rates from file currency.xml
   [junit4]   2> 327443 INFO  (coreLoadExecutor-540-thread-1-processing-n:127.0.0.1:41538_) [n:127.0.0.1:41538_ c:control_collection   x:collection1] o.a.s.s.FileExchangeRateProvider Reloading exchange rates from file currency.xml
   [junit4]   2> 327444 INFO  (coreLoadExecutor-540-thread-1-processing-n:127.0.0.1:41538_) [n:127.0.0.1:41538_ c:control_collection   x:collection1] o.a.s.s.OpenExchangeRatesOrgProvider Reloading exchange rates from open-exchange-rates.json
   [junit4]   2> 327445 INFO  (coreLoadExecutor-540-thread-1-processing-n:127.0.0.1:41538_) [n:127.0.0.1:41538_ c:control_collection   x:collection1] o.a.s.s.OpenExchangeRatesOrgProvider Reloading exchange rates from open-exchange-rates.json
   [junit4]   2> 327445 INFO  (coreLoadExecutor-540-thread-1-processing-n:127.0.0.1:41538_) [n:127.0.0.1:41538_ c:control_collection   x:collection1] o.a.s.c.ConfigSetProperties Did not find ConfigSet properties, assuming default properties: Can't find resource 'configsetprops.json' in classpath or '/configs/conf1', cwd=/home/jenkins/workspace/Lucene-Solr-master-Linux/solr/build/solr-core/test/J1
   [junit4]   2> 327445 INFO  (coreLoadExecutor-540-thread-1-processing-n:127.0.0.1:41538_) [n:127.0.0.1:41538_ c:control_collection   x:collection1] o.a.s.c.CoreContainer Creating SolrCore 'collection1' using configuration from collection control_collection
   [junit4]   2> 327446 INFO  (coreLoadExecutor-540-thread-1-processing-n:127.0.0.1:41538_) [n:127.0.0.1:41538_ c:control_collection s:shard1 r:core_node1 x:collection1] o.a.s.c.SolrCore org.apache.solr.core.MockDirectoryFactory
   [junit4]   2> 327446 INFO  (coreLoadExecutor-540-thread-1-processing-n:127.0.0.1:41538_) [n:127.0.0.1:41538_ c:control_collection s:shard1 r:core_node1 x:collection1] o.a.s.c.SolrCore [[collection1] ] Opening new SolrCore at [/home/jenkins/workspace/Lucene-Solr-master-Linux/solr/build/solr-core/test/J1/temp/solr.handler.TestReqParamsAPI_C804E71256A6F2C1-001/control-001/cores/collection1], dataDir=[/home/jenkins/workspace/Lucene-Solr-master-Linux/solr/build/solr-core/test/J1/temp/solr.handler.TestReqParamsAPI_C804E71256A6F2C1-001/control-001/cores/collection1/data/]
   [junit4]   2> 327446 INFO  (coreLoadExecutor-540-thread-1-processing-n:127.0.0.1:41538_) [n:127.0.0.1:41538_ c:control_collection s:shard1 r:core_node1 x:collection1] o.a.s.c.JmxMonitoredMap JMX monitoring is enabled. Adding Solr mbeans to JMX Server: com.sun.jmx.mbeanserver.JmxMBeanServer@c127788
   [junit4]   2> 327448 INFO  (coreLoadExecutor-540-thread-1-processing-n:127.0.0.1:41538_) [n:127.0.0.1:41538_ c:control_collection s:shard1 r:core_node1 x:collection1] o.a.s.c.CachingDirectoryFactory return new directory for /home/jenkins/workspace/Lucene-Solr-master-Linux/solr/build/solr-core/test/J1/temp/solr.handler.TestReqParamsAPI_C804E71256A6F2C1-001/control-001/cores/collection1/data
   [junit4]   2> 327448 INFO  (coreLoadExecutor-540-thread-1-processing-n:127.0.0.1:41538_) [n:127.0.0.1:41538_ c:control_collection s:shard1 r:core_node1 x:collection1] o.a.s.c.SolrCore New index directory detected: old=null new=/home/jenkins/workspace/Lucene-Solr-master-Linux/solr/build/solr-core/test/J1/temp/solr.handler.TestReqParamsAPI_C804E71256A6F2C1-001/control-001/cores/collection1/data/index/
   [junit4]   2> 327448 WARN  (coreLoadExecutor-540-thread-1-processing-n:127.0.0.1:41538_) [n:127.0.0.1:41538_ c:control_collection s:shard1 r:core_node1 x:collection1] o.a.s.c.SolrCore [collection1] Solr index directory '/home/jenkins/workspace/Lucene-Solr-master-Linux/solr/build/solr-core/test/J1/temp/solr.handler.TestReqParamsAPI_C804E71256A6F2C1-001/control-001/cores/collection1/data/index' doesn't exist. Creating new index...
   [junit4]   2> 327449 INFO  (coreLoadExecutor-540-thread-1-processing-n:127.0.0.1:41538_) [n:127.0.0.1:41538_ c:control_collection s:shard1 r:core_node1 x:collection1] o.a.s.c.CachingDirectoryFactory return new directory for /home/jenkins/workspace/Lucene-Solr-master-Linux/solr/build/solr-core/test/J1/temp/solr.handler.TestReqParamsAPI_C804E71256A6F2C1-001/control-001/cores/collection1/data/index
   [junit4]   2> 327449 INFO  (coreLoadExecutor-540-thread-1-processing-n:127.0.0.1:41538_) [n:127.0.0.1:41538_ c:control_collection s:shard1 r:core_node1 x:collection1] o.a.s.u.RandomMergePolicy RandomMergePolicy wrapping class org.apache.lucene.index.LogDocMergePolicy: [LogDocMergePolicy: minMergeSize=1000, mergeFactor=12, maxMergeSize=9223372036854775807, maxMergeSizeForForcedMerge=9223372036854775807, calibrateSizeByDeletes=true, maxMergeDocs=2147483647, maxCFSSegmentSizeMB=8.796093022207999E12, noCFSRatio=0.39274733136127826]
   [junit4]   2> 327449 INFO  (coreLoadExecutor-540-thread-1-processing-n:127.0.0.1:41538_) [n:127.0.0.1:41538_ c:control_collection s:shard1 r:core_node1 x:collection1] o.a.s.c.SolrDeletionPolicy SolrDeletionPolicy.onCommit: commits: num=1
   [junit4]   2> 	commit{dir=MockDirectoryWrapper(RAMDirectory@5b0bea76 lockFactory=org.apache.lucene.store.SingleInstanceLockFactory@7ec7eafa),segFN=segments_1,generation=1}
   [junit4]   2> 327449 INFO  (coreLoadExecutor-540-thread-1-processing-n:127.0.0.1:41538_) [n:127.0.0.1:41538_ c:control_collection s:shard1 r:core_node1 x:collection1] o.a.s.c.SolrDeletionPolicy newest commit generation = 1
   [junit4]   2> 327449 INFO  (OldIndexDirectoryCleanupThreadForCore-collection1) [n:127.0.0.1:41538_ c:control_collection s:shard1 r:core_node1 x:collection1] o.a.s.c.SolrCore Looking for old index directories to cleanup for core collection1 in /home/jenkins/workspace/Lucene-Solr-master-Linux/solr/build/solr-core/test/J1/temp/solr.handler.TestReqParamsAPI_C804E71256A6F2C1-001/control-001/cores/collection1/data/
   [junit4]   2> 327449 WARN  (OldIndexDirectoryCleanupThreadForCore-collection1) [n:127.0.0.1:41538_ c:control_collection s:shard1 r:core_node1 x:collection1] o.a.s.c.DirectoryFactory /home/jenkins/workspace/Lucene-Solr-master-Linux/solr/build/solr-core/test/J1/temp/solr.handler.TestReqParamsAPI_C804E71256A6F2C1-001/control-001/cores/collection1/data/ does not point to a valid data directory; skipping clean-up of old index directories.
   [junit4]   2> 327451 INFO  (coreLoadExecutor-540-thread-1-processing-n:127.0.0.1:41538_) [n:127.0.0.1:41538_ c:control_collection s:shard1 r:core_node1 x:collection1] o.a.s.u.p.UpdateRequestProcessorChain creating updateRequestProcessorChain "nodistrib"
   [junit4]   2> 327452 INFO  (coreLoadExecutor-540-thread-1-processing-n:127.0.0.1:41538_) [n:127.0.0.1:41538_ c:control_collection s:shard1 r:core_node1 x:collection1] o.a.s.u.p.UpdateRequestProcessorChain creating updateRequestProcessorChain "dedupe"
   [junit4]   2> 327452 INFO  (coreLoadExecutor-540-thread-1-processing-n:127.0.0.1:41538_) [n:127.0.0.1:41538_ c:control_collection s:shard1 r:core_node1 x:collection1] o.a.s.u.p.UpdateRequestProcessorChain inserting DistributedUpdateProcessorFactory into updateRequestProcessorChain "dedupe"
   [junit4]   2> 327452 INFO  (coreLoadExecutor-540-thread-1-processing-n:127.0.0.1:41538_) [n:127.0.0.1:41538_ c:control_collection s:shard1 r:core_node1 x:collection1] o.a.s.u.p.UpdateRequestProcessorChain creating updateRequestProcessorChain "stored_sig"
   [junit4]   2> 327452 INFO  (coreLoadExecutor-540-thread-1-processing-n:127.0.0.1:41538_) [n:127.0.0.1:41538_ c:control_collection s:shard1 r:core_node1 x:collection1] o.a.s.u.p.UpdateRequestProcessorChain inserting DistributedUpdateProcessorFactory into updateRequestProcessorChain "stored_sig"
   [junit4]   2> 327452 INFO  (coreLoadExecutor-540-thread-1-processing-n:127.0.0.1:41538_) [n:127.0.0.1:41538_ c:control_collection s:shard1 r:core_node1 x:collection1] o.a.s.u.p.UpdateRequestProcessorChain creating updateRequestProcessorChain "distrib-dup-test-chain-explicit"
   [junit4]   2> 327452 INFO  (coreLoadExecutor-540-thread-1-processing-n:127.0.0.1:41538_) [n:127.0.0.1:41538_ c:control_collection s:shard1 r:core_node1 x:collection1] o.a.s.u.p.UpdateRequestProcessorChain creating updateRequestProcessorChain "distrib-dup-test-chain-implicit"
   [junit4]   2> 327452 INFO  (coreLoadExecutor-540-thread-1-processing-n:127.0.0.1:41538_) [n:127.0.0.1:41538_ c:control_collection s:shard1 r:core_node1 x:collection1] o.a.s.u.p.UpdateRequestProcessorChain inserting DistributedUpdateProcessorFactory into updateRequestProcessorChain "distrib-dup-test-chain-implicit"
   [junit4]   2> 327452 INFO  (coreLoadExecutor-540-thread-1-processing-n:127.0.0.1:41538_) [n:127.0.0.1:41538_ c:control_collection s:shard1 r:core_node1 x:collection1] o.a.s.c.SolrCore no updateRequestProcessorChain defined as default, creating implicit default
   [junit4]   2> 327452 WARN  (coreLoadExecutor-540-thread-1-processing-n:127.0.0.1:41538_) [n:127.0.0.1:41538_ c:control_collection s:shard1 r:core_node1 x:collection1] o.a.s.c.RequestHandlers INVALID paramSet a in requestHandler {type = requestHandler,name = /dump,class = DumpRequestHandler,args = {defaults={a=A,b=B}}}
   [junit4]   2> 327453 INFO  (coreLoadExecutor-540-thread-1-processing-n:127.0.0.1:41538_) [n:127.0.0.1:41538_ c:control_collection s:shard1 r:core_node1 x:collection1] o.a.s.h.l.XMLLoader xsltCacheLifetimeSeconds=60
   [junit4]   2> 327454 INFO  (coreLoadExecutor-540-thread-1-processing-n:127.0.0.1:41538_) [n:127.0.0.1:41538_ c:control_collection s:shard1 r:core_node1 x:collection1] o.a.s.h.l.XMLLoader xsltCacheLifetimeSeconds=60
   [junit4]   2> 327455 INFO  (coreLoadExecutor-540-thread-1-processing-n:127.0.0.1:41538_) [n:127.0.0.1:41538_ c:control_collection s:shard1 r:core_node1 x:collection1] o.a.s.h.l.XMLLoader xsltCacheLifetimeSeconds=60
   [junit4]   2> 327455 INFO  (coreLoadExecutor-540-thread-1-processing-n:127.0.0.1:41538_) [n:127.0.0.1:41538_ c:control_collection s:shard1 r:core_node1 x:collection1] o.a.s.h.l.XMLLoader xsltCacheLifetimeSeconds=60
   [junit4]   2> 327457 INFO  (coreLoadExecutor-540-thread-1-processing-n:127.0.0.1:41538_) [n:127.0.0.1:41538_ c:control_collection s:shard1 r:core_node1 x:collection1] o.a.s.c.RequestHandlers Registered paths: /admin/mbeans,standard,/update/json/docs,/admin/luke,/export,/get,/admin/properties,/update/json,/admin/threads,/dump,/update/csv,/sql,/graph,/admin/segments,/admin/system,/replication,/config,/stream,/schema,/admin/plugins,/admin/logging,/admin/ping,/update,/admin/file
   [junit4]   2> 327457 INFO  (coreLoadExecutor-540-thread-1-processing-n:127.0.0.1:41538_) [n:127.0.0.1:41538_ c:control_collection s:shard1 r:core_node1 x:collection1] o.a.s.c.SolrCore Using default statsCache cache: org.apache.solr.search.stats.LocalStatsCache
   [junit4]   2> 327457 INFO  (coreLoadExecutor-540-thread-1-processing-n:127.0.0.1:41538_) [n:127.0.0.1:41538_ c:control_collection s:shard1 r:core_node1 x:collection1] o.a.s.u.UpdateHandler Using UpdateLog implementation: org.apache.solr.update.UpdateLog
   [junit4]   2> 327458 INFO  (coreLoadExecutor-540-thread-1-processing-n:127.0.0.1:41538_) [n:127.0.0.1:41538_ c:control_collection s:shard1 r:core_node1 x:collection1] o.a.s.u.UpdateLog Initializing UpdateLog: dataDir= defaultSyncLevel=FLUSH numRecordsToKeep=100 maxNumLogsToKeep=10 numVersionBuckets=65536
   [junit4]   2> 327458 INFO  (coreLoadExecutor-540-thread-1-processing-n:127.0.0.1:41538_) [n:127.0.0.1:41538_ c:control_collection s:shard1 r:core_node1 x:collection1] o.a.s.u.CommitTracker Hard AutoCommit: disabled
   [junit4]   2> 327458 INFO  (coreLoadExecutor-540-thread-1-processing-n:127.0.0.1:41538_) [n:127.0.0.1:41538_ c:control_collection s:shard1 r:core_node1 x:collection1] o.a.s.u.CommitTracker Soft AutoCommit: disabled
   [junit4]   2> 327459 INFO  (coreLoadExecutor-540-thread-1-processing-n:127.0.0.1:41538_) [n:127.0.0.1:41538_ c:control_collection s:shard1 r:core_node1 x:collection1] o.a.s.u.RandomMergePolicy RandomMergePolicy wrapping class org.apache.lucene.index.AlcoholicMergePolicy: [AlcoholicMergePolicy: minMergeSize=0, mergeFactor=10, maxMergeSize=600846440, maxMergeSizeForForcedMerge=9223372036854775807, calibrateSizeByDeletes=true, maxMergeDocs=2147483647, maxCFSSegmentSizeMB=8.796093022207999E12, noCFSRatio=0.1]
   [junit4]   2> 327459 INFO  (coreLoadExecutor-540-thread-1-processing-n:127.0.0.1:41538_) [n:127.0.0.1:41538_ c:control_collection s:shard1 r:core_node1 x:collection1] o.a.s.c.SolrDeletionPolicy SolrDeletionPolicy.onInit: commits: num=1
   [junit4]   2> 	commit{dir=MockDirectoryWrapper(RAMDirectory@5b0bea76 lockFactory=org.apache.lucene.store.SingleInstanceLockFactory@7ec7eafa),segFN=segments_1,generation=1}
   [junit4]   2> 327459 INFO  (coreLoadExecutor-540-thread-1-processing-n:127.0.0.1:41538_) [n:127.0.0.1:41538_ c:control_collection s:shard1 r:core_node1 x:collection1] o.a.s.c.SolrDeletionPolicy newest commit generation = 1
   [junit4]   2> 327459 INFO  (coreLoadExecutor-540-thread-1-processing-n:127.0.0.1:41538_) [n:127.0.0.1:41538_ c:control_collection s:shard1 r:core_node1 x:collection1] o.a.s.s.SolrIndexSearcher Opening [Searcher@5491fcf0[collection1] main]
   [junit4]   2> 327459 INFO  (coreLoadExecutor-540-thread-1-processing-n:127.0.0.1:41538_) [n:127.0.0.1:41538_ c:control_collection s:shard1 r:core_node1 x:collection1] o.a.s.c.c.ZkStateReader Load collection config from: [/collections/control_collection]
   [junit4]   2> 327460 INFO  (coreLoadExecutor-540-thread-1-processing-n:127.0.0.1:41538_) [n:127.0.0.1:41538_ c:control_collection s:shard1 r:core_node1 x:collection1] o.a.s.c.c.ZkStateReader path=[/collections/control_collection] [configName]=[conf1] specified config exists in ZooKeeper
   [junit4]   2> 327460 INFO  (coreLoadExecutor-540-thread-1-processing-n:127.0.0.1:41538_) [n:127.0.0.1:41538_ c:control_collection s:shard1 r:core_node1 x:collection1] o.a.s.r.ManagedResourceStorage Setting up ZooKeeper-based storage for the RestManager with znodeBase: /configs/conf1
   [junit4]   2> 327460 INFO  (coreLoadExecutor-540-thread-1-processing-n:127.0.0.1:41538_) [n:127.0.0.1:41538_ c:control_collection s:shard1 r:core_node1 x:collection1] o.a.s.r.ManagedResourceStorage Configured ZooKeeperStorageIO with znodeBase: /configs/conf1
   [junit4]   2> 327460 INFO  (coreLoadExecutor-540-thread-1-processing-n:127.0.0.1:41538_) [n:127.0.0.1:41538_ c:control_collection s:shard1 r:core_node1 x:collection1] o.a.s.r.RestManager Initializing RestManager with initArgs: {}
   [junit4]   2> 327460 INFO  (coreLoadExecutor-540-thread-1-processing-n:127.0.0.1:41538_) [n:127.0.0.1:41538_ c:control_collection s:shard1 r:core_node1 x:collection1] o.a.s.r.ManagedResourceStorage Reading _rest_managed.json using ZooKeeperStorageIO:path=/configs/conf1
   [junit4]   2> 327460 INFO  (coreLoadExecutor-540-thread-1-processing-n:127.0.0.1:41538_) [n:127.0.0.1:41538_ c:control_collection s:shard1 r:core_node1 x:collection1] o.a.s.r.ManagedResourceStorage No data found for znode /configs/conf1/_rest_managed.json
   [junit4]   2> 327460 INFO  (coreLoadExecutor-540-thread-1-processing-n:127.0.0.1:41538_) [n:127.0.0.1:41538_ c:control_collection s:shard1 r:core_node1 x:collection1] o.a.s.r.ManagedResourceStorage Loaded null at path _rest_managed.json using ZooKeeperStorageIO:path=/configs/conf1
   [junit4]   2> 327460 INFO  (coreLoadExecutor-540-thread-1-processing-n:127.0.0.1:41538_) [n:127.0.0.1:41538_ c:control_collection s:shard1 r:core_node1 x:collection1] o.a.s.r.RestManager Initializing 0 registered ManagedResources
   [junit4]   2> 327460 INFO  (coreLoadExecutor-540-thread-1-processing-n:127.0.0.1:41538_) [n:127.0.0.1:41538_ c:control_collection s:shard1 r:core_node1 x:collection1] o.a.s.h.ReplicationHandler Commits will be reserved for  10000
   [junit4]   2> 327461 INFO  (searcherExecutor-541-thread-1-processing-n:127.0.0.1:41538_ x:collection1 s:shard1 c:control_collection r:core_node1) [n:127.0.0.1:41538_ c:control_collection s:shard1 r:core_node1 x:collection1] o.a.s.c.SolrCore [collection1] Registered new searcher Searcher@5491fcf0[collection1] main{ExitableDirectoryReader(UninvertingDirectoryReader())}
   [junit4]   2> 327461 INFO  (coreLoadExecutor-540-thread-1-processing-n:127.0.0.1:41538_) [n:127.0.0.1:41538_ c:control_collection s:shard1 r:core_node1 x:collection1] o.a.s.u.UpdateLog Looking up max value of version field to seed version buckets
   [junit4]   2> 327461 INFO  (coreLoadExecutor-540-thread-1-processing-n:127.0.0.1:41538_) [n:127.0.0.1:41538_ c:control_collection s:shard1 r:core_node1 x:collection1] o.a.s.u.VersionInfo Refreshing highest value of _version_ for 65536 version buckets from index
   [junit4]   2> 327461 INFO  (coreLoadExecutor-540-thread-1-processing-n:127.0.0.1:41538_) [n:127.0.0.1:41538_ c:control_collection s:shard1 r:core_node1 x:collection1] o.a.s.u.VersionInfo No terms found for _version_, cannot seed version bucket highest value from index
   [junit4]   2> 327461 INFO  (coreLoadExecutor-540-thread-1-processing-n:127.0.0.1:41538_) [n:127.0.0.1:41538_ c:control_collection s:shard1 r:core_node1 x:collection1] o.a.s.u.UpdateLog Could not find max version in index or recent updates, using new clock 1536558682976813056
   [junit4]   2> 327464 INFO  (coreLoadExecutor-540-thread-1-processing-n:127.0.0.1:41538_) [n:127.0.0.1:41538_ c:control_collection s:shard1 r:core_node1 x:collection1] o.a.s.u.UpdateLog Took 2.0ms to seed version buckets with highest version 1536558682976813056
   [junit4]   2> 327464 INFO  (coreLoadExecutor-540-thread-1-processing-n:127.0.0.1:41538_) [n:127.0.0.1:41538_ c:control_collection s:shard1 r:core_node1 x:collection1] o.a.s.c.ZkController watch zkdir /configs/conf1
   [junit4]   2> 327464 INFO  (coreLoadExecutor-540-thread-1-processing-n:127.0.0.1:41538_) [n:127.0.0.1:41538_ c:control_collection s:shard1 r:core_node1 x:collection1] o.a.s.c.CoreContainer registering core: collection1
   [junit4]   2> 327465 INFO  (coreZkRegister-534-thread-1-processing-n:127.0.0.1:41538_ x:collection1 s:shard1 c:control_collection r:core_node1) [n:127.0.0.1:41538_ c:control_collection s:shard1 r:core_node1 x:collection1] o.a.s.c.ZkController Register replica - core:collection1 address:https://127.0.0.1:41538 collection:control_collection shard:shard1
   [junit4]   2> 327465 INFO  (coreZkRegister-534-thread-1-processing-n:127.0.0.1:41538_ x:collection1 s:shard1 c:control_collection r:core_node1) [n:127.0.0.1:41538_ c:control_collection s:shard1 r:core_node1 x:collection1] o.a.s.c.c.SolrZkClient makePath: /collections/control_collection/leader_elect/shard1/election
   [junit4]   2> 327466 INFO  (coreZkRegister-534-thread-1-processing-n:127.0.0.1:41538_ x:collection1 s:shard1 c:control_collection r:core_node1) [n:127.0.0.1:41538_ c:control_collection s:shard1 r:core_node1 x:collection1] o.a.s.c.LeaderElector Joined leadership election with path: /collections/control_collection/leader_elect/shard1/election/96034917591351301-core_node1-n_0000000000
   [junit4]   2> 327466 INFO  (coreZkRegister-534-thread-1-processing-n:127.0.0.1:41538_ x:collection1 s:shard1 c:control_collection r:core_node1) [n:127.0.0.1:41538_ c:control_collection s:shard1 r:core_node1 x:collection1] o.a.s.c.ShardLeaderElectionContext Running the leader process for shard=shard1 and weAreReplacement=false and leaderVoteWait=10000
   [junit4]   2> 327467 INFO  (coreZkRegister-534-thread-1-processing-n:127.0.0.1:41538_ x:collection1 s:shard1 c:control_collection r:core_node1) [n:127.0.0.1:41538_ c:control_collection s:shard1 r:core_node1 x:collection1] o.a.s.c.ShardLeaderElectionContext Enough replicas found to continue.
   [junit4]   2> 327467 INFO  (coreZkRegister-534-thread-1-processing-n:127.0.0.1:41538_ x:collection1 s:shard1 c:control_collection r:core_node1) [n:127.0.0.1:41538_ c:control_collection s:shard1 r:core_node1 x:collection1] o.a.s.c.ShardLeaderElectionContext I may be the new leader - try and sync
   [junit4]   2> 327467 INFO  (coreZkRegister-534-thread-1-processing-n:127.0.0.1:41538_ x:collection1 s:shard1 c:control_collection r:core_node1) [n:127.0.0.1:41538_ c:control_collection s:shard1 r:core_node1 x:collection1] o.a.s.c.SyncStrategy Sync replicas to https://127.0.0.1:41538/collection1/
   [junit4]   2> 327467 INFO  (coreZkRegister-534-thread-1-processing-n:127.0.0.1:41538_ x:collection1 s:shard1 c:control_collection r:core_node1) [n:127.0.0.1:41538_ c:control_collection s:shard1 r:core_node1 x:collection1] o.a.s.c.SyncStrategy Sync Success - now sync replicas to me
   [junit4]   2> 327467 INFO  (OverseerStateUpdate-96034917591351301-127.0.0.1:41538_-n_0000000000) [n:127.0.0.1:41538_    ] o.a.s.c.Overseer processMessage: queueSize: 1, message = {
   [junit4]   2>   "operation":"leader",
   [junit4]   2>   "shard":"shard1",
   [junit4]   2>   "collection":"control_collection"} current state version: 1
   [junit4]   2> 327467 INFO  (coreZkRegister-534-thread-1-processing-n:127.0.0.1:41538_ x:collection1 s:shard1 c:control_collection r:core_node1) [n:127.0.0.1:41538_ c:control_collection s:shard1 r:core_node1 x:collection1] o.a.s.c.SyncStrategy https://127.0.0.1:41538/collection1/ has no replicas
   [junit4]   2> 327468 INFO  (coreZkRegister-534-thread-1-processing-n:127.0.0.1:41538_ x:collection1 s:shard1 c:control_collection r:core_node1) [n:127.0.0.1:41538_ c:control_collection s:shard1 r:core_node1 x:collection1] o.a.s.c.c.SolrZkClient makePath: /collections/control_collection/leaders/shard1
   [junit4]   2> 327468 INFO  (coreZkRegister-534-thread-1-processing-n:127.0.0.1:41538_ x:collection1 s:shard1 c:control_collection r:core_node1) [n:127.0.0.1:41538_ c:control_collection s:shard1 r:core_node1 x:collection1] o.a.s.c.ShardLeaderElectionContextBase Creating leader registration node /collections/control_collection/leaders/shard1/leader after winning as /collections/control_collection/leader_elect/shard1/election/96034917591351301-core_node1-n_0000000000
   [junit4]   2> 327469 INFO  (coreZkRegister-534-thread-1-processing-n:127.0.0.1:41538_ x:collection1 s:shard1 c:control_collection r:core_node1) [n:127.0.0.1:41538_ c:control_collection s:shard1 r:core_node1 x:collection1] o.a.s.c.ShardLeaderElectionContext I am the new leader: https://127.0.0.1:41538/collection1/ shard1
   [junit4]   2> 327469 INFO  (OverseerStateUpdate-96034917591351301-127.0.0.1:41538_-n_0000000000) [n:127.0.0.1:41538_    ] o.a.s.c.Overseer processMessage: queueSize: 1, message = {
   [junit4]   2>   "operation":"leader",
   [junit4]   2>   "shard":"shard1",
   [junit4]   2>   "collection":"control_collection",
   [junit4]   2>   "base_url":"https://127.0.0.1:41538",
   [junit4]   2>   "core":"collection1",
   [junit4]   2>   "state":"active"} current state version: 1
   [junit4]   2> 327570 INFO  (zkCallback-233-thread-1-processing-n:127.0.0.1:41538_) [n:127.0.0.1:41538_    ] o.a.s.c.c.ZkStateReader A cluster state change: [WatchedEvent state:SyncConnected type:NodeDataChanged path:/clusterstate.json], has occurred - updating... (live nodes size: [1])
   [junit4]   2> 327619 INFO  (coreZkRegister-534-thread-1-processing-n:127.0.0.1:41538_ x:collection1 s:shard1 c:control_collection r:core_node1) [n:127.0.0.1:41538_ c:control_collection s:shard1 r:core_node1 x:collection1] o.a.s.c.ZkController We are https://127.0.0.1:41538/collection1/ and leader is https://127.0.0.1:41538/collection1/
   [junit4]   2> 327620 INFO  (coreZkRegister-534-thread-1-processing-n:127.0.0.1:41538_ x:collection1 s:shard1 c:control_collection r:core_node1) [n:127.0.0.1:41538_ c:control_collection s:shard1 r:core_node1 x:collection1] o.a.s.c.ZkController No LogReplay needed for core=collection1 baseURL=https://127.0.0.1:41538
   [junit4]   2> 327620 INFO  (coreZkRegister-534-thread-1-processing-n:127.0.0.1:41538_ x:collection1 s:shard1 c:control_collection r:core_node1) [n:127.0.0.1:41538_ c:control_collection s:shard1 r:core_node1 x:collection1] o.a.s.c.ZkController I am the leader, no recovery necessary
   [junit4]   2> 327620 INFO  (coreZkRegister-534-thread-1-processing-n:127.0.0.1:41538_ x:collection1 s:shard1 c:control_collection r:core_node1) [n:127.0.0.1:41538_ c:control_collection s:shard1 r:core_node1 x:collection1] o.a.s.c.ZkController publishing state=active
   [junit4]   2> 327620 INFO  (coreZkRegister-534-thread-1-processing-n:127.0.0.1:41538_ x:collection1 s:shard1 c:control_collection r:core_node1) [n:127.0.0.1:41538_ c:control_collection s:shard1 r:core_node1 x:collection1] o.a.s.c.ZkController numShards not found on descriptor - reading it from system property
   [junit4]   2> 327622 INFO  (OverseerStateUpdate-96034917591351301-127.0.0.1:41538_-n_0000000000) [n:127.0.0.1:41538_    ] o.a.s.c.Overseer processMessage: queueSize: 1, message = {
   [junit4]   2>   "core":"collection1",
   [junit4]   2>   "core_node_name":"core_node1",
   [junit4]   2>   "roles":null,
   [junit4]   2>   "base_url":"https://127.0.0.1:41538",
   [junit4]   2>   "node_name":"127.0.0.1:41538_",
   [junit4]   2>   "numShards":"1",
   [junit4]   2>   "state":"active",
   [junit4]   2>   "shard":"shard1",
   [junit4]   2>   "collection":"control_collection",
   [junit4]   2>   "operation":"state"} current state version: 2
   [junit4]   2> 327622 INFO  (OverseerStateUpdate-96034917591351301-127.0.0.1:41538_-n_0000000000) [n:127.0.0.1:41538_    ] o.a.s.c.o.ReplicaMutator Update state numShards=1 message={
   [junit4]   2>   "core":"collection1",
   [junit4]   2>   "core_node_name":"core_node1",
   [junit4]   2>   "roles":null,
   [junit4]   2>   "base_url":"https://127.0.0.1:41538",
   [junit4]   2>   "node_name":"127.0.0.1:41538_",
   [junit4]   2>   "numShards":"1",
   [junit4]   2>   "state":"active",
   [junit4]   2>   "shard":"shard1",
   [junit4]   2>   "collection":"control_collection",
   [junit4]   2>   "operation":"state"}
   [junit4]   2> 327723 INFO  (zkCallback-233-thread-1-processing-n:127.0.0.1:41538_) [n:127.0.0.1:41538_    ] o.a.s.c.c.ZkStateReader A cluster state change: [WatchedEvent state:SyncConnected type:NodeDataChanged path:/clusterstate.json], has occurred - updating... (live nodes size: [1])
   [junit4]   2> 327801 INFO  (TEST-TestReqParamsAPI.test-seed#[C804E71256A6F2C1]) [    ] o.a.s.c.c.SolrZkClient Using default ZkCredentialsProvider
   [junit4]   2> 327801 INFO  (TEST-TestReqParamsAPI.test-seed#[C804E71256A6F2C1]) [    ] o.a.s.c.c.ConnectionManager Waiting for client to connect to ZooKeeper
   [junit4]   2> 327803 INFO  (zkCallback-237-thread-1) [    ] o.a.s.c.c.ConnectionManager Watcher org.apache.solr.common.cloud.ConnectionManager@46e19e48 name:ZooKeeperConnection Watcher:127.0.0.1:34602/solr got event WatchedEvent state:SyncConnected type:None path:null path:null type:None
   [junit4]   2> 327803 INFO  (TEST-TestReqParamsAPI.test-seed#[C804E71256A6F2C1]) [    ] o.a.s.c.c.ConnectionManager Client is connected to ZooKeeper
   [junit4]   2> 327803 INFO  (TEST-TestReqParamsAPI.test-seed#[C804E71256A6F2C1]) [    ] o.a.s.c.c.SolrZkClient Using default ZkACLProvider
   [junit4]   2> 327803 INFO  (TEST-TestReqParamsAPI.test-seed#[C804E71256A6F2C1]) [    ] o.a.s.c.c.ZkStateReader Updating cluster state from ZooKeeper... 
   [junit4]   2> 327803 INFO  (TEST-TestReqParamsAPI.test-seed#[C804E71256A6F2C1]) [    ] o.a.s.c.c.ZkStateReader Loaded cluster properties: {urlScheme=https}
   [junit4]   2> 327803 INFO  (TEST-TestReqParamsAPI.test-seed#[C804E71256A6F2C1]) [    ] o.a.s.c.c.ZkStateReader Updated live nodes from ZooKeeper... (0) -> (1)
   [junit4]   2> 327804 INFO  (TEST-TestReqParamsAPI.test-seed#[C804E71256A6F2C1]) [    ] o.a.s.c.ChaosMonkey monkey: init - expire sessions:false cause connection loss:false
   [junit4]   2> 327804 INFO  (TEST-TestReqParamsAPI.test-seed#[C804E71256A6F2C1]) [    ] o.a.s.c.AbstractFullDistribZkTestBase Creating collection1 with stateFormat=2
   [junit4]   2> 327804 INFO  (TEST-TestReqParamsAPI.test-seed#[C804E71256A6F2C1]) [    ] o.a.s.c.c.SolrZkClient Using default ZkCredentialsProvider
   [junit4]   2> 327805 INFO  (TEST-TestReqParamsAPI.test-seed#[C804E71256A6F2C1]) [    ] o.a.s.c.c.ConnectionManager Waiting for client to connect to ZooKeeper
   [junit4]   2> 327805 INFO  (zkCallback-238-thread-1) [    ] o.a.s.c.c.ConnectionManager Watcher org.apache.solr.common.cloud.ConnectionManager@2fbf06f6 name:ZooKeeperConnection Watcher:127.0.0.1:34602/solr got event WatchedEvent state:SyncConnected type:None path:null path:null type:None
   [junit4]   2> 327805 INFO  (TEST-TestReqParamsAPI.test-seed#[C804E71256A6F2C1]) [    ] o.a.s.c.c.ConnectionManager Client is connected to ZooKeeper
   [junit4]   2> 327805 INFO  (TEST-TestReqParamsAPI.test-seed#[C804E71256A6F2C1]) [    ] o.a.s.c.c.SolrZkClient Using default ZkACLProvider
   [junit4]   2> 327807 INFO  (OverseerStateUpdate-96034917591351301-127.0.0.1:41538_-n_0000000000) [n:127.0.0.1:41538_    ] o.a.s.c.Overseer processMessage: queueSize: 1, message = {
   [junit4]   2>   "operation":"create",
   [junit4]   2>   "name":"collection1",
   [junit4]   2>   "numShards":"2",
   [junit4]   2>   "stateFormat":"2"} current state version: 3
   [junit4]   2> 327807 INFO  (OverseerStateUpdate-96034917591351301-127.0.0.1:41538_-n_0000000000) [n:127.0.0.1:41538_    ] o.a.s.c.o.ClusterStateMutator building a new cName: collection1
   [junit4]   2> 327865 INFO  (TEST-TestReqParamsAPI.test-seed#[C804E71256A6F2C1]) [    ] o.a.s.SolrTestCaseJ4 Writing core.properties file to /home/jenkins/workspace/Lucene-Solr-master-Linux/solr/build/solr-core/test/J1/temp/solr.handler.TestReqParamsAPI_C804E71256A6F2C1-001/shard-1-001/cores/collection1
   [junit4]   2> 327865 INFO  (TEST-TestReqParamsAPI.test-seed#[C804E71256A6F2C1]) [    ] o.a.s.c.AbstractFullDistribZkTestBase create jetty 1 in directory /home/jenkins/workspace/Lucene-Solr-master-Linux/solr/build/solr-core/test/J1/temp/solr.handler.TestReqParamsAPI_C804E71256A6F2C1-001/shard-1-001
   [junit4]   2> 327869 INFO  (TEST-TestReqParamsAPI.test-seed#[C804E71256A6F2C1]) [    ] o.e.j.s.Server jetty-9.3.8.v20160314
   [junit4]   2> 327870 INFO  (TEST-TestReqParamsAPI.test-seed#[C804E71256A6F2C1]) [    ] o.e.j.s.h.ContextHandler Started o.e.j.s.ServletContextHandler@1f60adcc{/,null,AVAILABLE}
   [junit4]   2> 327872 INFO  (TEST-TestReqParamsAPI.test-seed#[C804E71256A6F2C1]) [    ] o.e.j.s.ServerConnector Started ServerConnector@3469655b{SSL,[ssl, http/1.1]}{127.0.0.1:44089}
   [junit4]   2> 327872 INFO  (TEST-TestReqParamsAPI.test-seed#[C804E71256A6F2C1]) [    ] o.e.j.s.Server Started @329829ms
   [junit4]   2> 327872 INFO  (TEST-TestReqParamsAPI.test-seed#[C804E71256A6F2C1]) [    ] o.a.s.c.s.e.JettySolrRunner Jetty properties: {solr.data.dir=/home/jenkins/workspace/Lucene-Solr-master-Linux/solr/build/solr-core/test/J1/temp/solr.handler.TestReqParamsAPI_C804E71256A6F2C1-001/tempDir-001/jetty1, solrconfig=solrconfig.xml, hostContext=/, hostPort=44089, coreRootDirectory=/home/jenkins/workspace/Lucene-Solr-master-Linux/solr/build/solr-core/test/J1/../../../../../../../../../home/jenkins/workspace/Lucene-Solr-master-Linux/solr/build/solr-core/test/J1/temp/solr.handler.TestReqParamsAPI_C804E71256A6F2C1-001/shard-1-001/cores}
   [junit4]   2> 327873 INFO  (TEST-TestReqParamsAPI.test-seed#[C804E71256A6F2C1]) [    ] o.a.s.s.SolrDispatchFilter SolrDispatchFilter.init(): sun.misc.Launcher$AppClassLoader@73d16e93
   [junit4]   2> 327873 INFO  (TEST-TestReqParamsAPI.test-seed#[C804E71256A6F2C1]) [    ] o.a.s.c.SolrResourceLoader new SolrResourceLoader for directory: '/home/jenkins/workspace/Lucene-Solr-master-Linux/solr/build/solr-core/test/J1/temp/solr.handler.TestReqParamsAPI_C804E71256A6F2C1-001/shard-1-001'
   [junit4]   2> 327873 INFO  (TEST-TestReqParamsAPI.test-seed#[C804E71256A6F2C1]) [    ] o.a.s.c.SolrResourceLoader JNDI not configured for solr (NoInitialContextEx)
   [junit4]   2> 327873 INFO  (TEST-TestReqParamsAPI.test-seed#[C804E71256A6F2C1]) [    ] o.a.s.c.SolrResourceLoader solr home defaulted to 'solr/' (could not find system property or JNDI)
   [junit4]   2> 327873 INFO  (TEST-TestReqParamsAPI.test-seed#[C804E71256A6F2C1]) [    ] o.a.s.c.c.SolrZkClient Using default ZkCredentialsProvider
   [junit4]   2> 327874 INFO  (TEST-TestReqParamsAPI.test-seed#[C804E71256A6F2C1]) [    ] o.a.s.c.c.ConnectionManager Waiting for client to connect to ZooKeeper
   [junit4]   2> 327875 INFO  (zkCallback-239-thread-1) [    ] o.a.s.c.c.ConnectionManager Watcher org.apache.solr.common.cloud.ConnectionManager@1fef24dc name:ZooKeeperConnection Watcher:127.0.0.1:34602/solr got event WatchedEvent state:SyncConnected type:None path:null path:null type:None
   [junit4]   2> 327875 INFO  (TEST-TestReqParamsAPI.test-seed#[C804E71256A6F2C1]) [    ] o.a.s.c.c.ConnectionManager Client is connected to ZooKeeper
   [junit4]   2> 327875 INFO  (TEST-TestReqParamsAPI.test-seed#[C804E71256A6F2C1]) [    ] o.a.s.c.c.SolrZkClient Using default ZkACLProvider
   [junit4]   2> 327875 INFO  (TEST-TestReqParamsAPI.test-seed#[C804E71256A6F2C1]) [    ] o.a.s.s.SolrDispatchFilter Loading solr.xml from SolrHome (not found in ZooKeeper)
   [junit4]   2> 327875 INFO  (TEST-TestReqParamsAPI.test-seed#[C804E71256A6F2C1]) [    ] o.a.s.c.SolrXmlConfig Loading container configuration from /home/jenkins/workspace/Lucene-Solr-master-Linux/solr/build/solr-core/test/J1/temp/solr.handler.TestReqParamsAPI_C804E71256A6F2C1-001/shard-1-001/solr.xml
   [junit4]   2> 327881 INFO  (TEST-TestReqParamsAPI.test-seed#[C804E71256A6F2C1]) [    ] o.a.s.c.CorePropertiesLocator Config-defined core root directory: /home/jenkins/workspace/Lucene-Solr-master-Linux/solr/build/solr-core/test/J1/../../../../../../../../../home/jenkins/workspace/Lucene-Solr-master-Linux/solr/build/solr-core/test/J1/temp/solr.handler.TestReqParamsAPI_C804E71256A6F2C1-001/shard-1-001/cores
   [junit4]   2> 327881 INFO  (TEST-TestReqParamsAPI.test-seed#[C804E71256A6F2C1]) [    ] o.a.s.c.CoreContainer New CoreContainer 1124838267
   [junit4]   2> 327881 INFO  (TEST-TestReqParamsAPI.test-seed#[C804E71256A6F2C1]) [    ] o.a.s.c.CoreContainer Loading cores into CoreContainer [instanceDir=/home/jenkins/workspace/Lucene-Solr-master-Linux/solr/build/solr-core/test/J1/temp/solr.handler.TestReqParamsAPI_C804E71256A6F2C1-001/shard-1-001]
   [junit4]   2> 327881 WARN  (TEST-TestReqParamsAPI.test-seed#[C804E71256A6F2C1]) [    ] o.a.s.c.CoreContainer Couldn't add files from /home/jenkins/workspace/Lucene-Solr-master-Linux/solr/build/solr-core/test/J1/temp/solr.handler.TestReqParamsAPI_C804E71256A6F2C1-001/shard-1-001/lib to classpath: /home/jenkins/workspace/Lucene-Solr-master-Linux/solr/build/solr-core/test/J1/temp/solr.handler.TestReqParamsAPI_C804E71256A6F2C1-001/shard-1-001/lib
   [junit4]   2> 327882 INFO  (TEST-TestReqParamsAPI.test-seed#[C804E71256A6F2C1]) [    ] o.a.s.h.c.HttpShardHandlerFactory created with socketTimeout : 90000,urlScheme : ,connTimeout : 15000,maxConnectionsPerHost : 20,maxConnections : 10000,corePoolSize : 0,maximumPoolSize : 2147483647,maxThreadIdleTime : 5,sizeOfQueue : -1,fairnessPolicy : false,
   [junit4]   2> 327883 INFO  (TEST-TestReqParamsAPI.test-seed#[C804E71256A6F2C1]) [    ] o.a.s.u.UpdateShardHandler Creating UpdateShardHandler HTTP client with params: 
   [junit4]   2> 327883 INFO  (TEST-TestReqParamsAPI.test-seed#[C804E71256A6F2C1]) [    ] o.a.s.l.LogWatcher SLF4J impl is org.slf4j.impl.Log4jLoggerFactory
   [junit4]   2> 327883 INFO  (TEST-TestReqParamsAPI.test-seed#[C804E71256A6F2C1]) [    ] o.a.s.l.LogWatcher Registering Log Listener [Log4j (org.slf4j.impl.Log4jLoggerFactory)]
   [junit4]   2> 327883 INFO  (TEST-TestReqParamsAPI.test-seed#[C804E71256A6F2C1]) [    ] o.a.s.c.ZkContainer Zookeeper client=127.0.0.1:34602/solr
   [junit4]   2> 327883 INFO  (TEST-TestReqParamsAPI.test-seed#[C804E71256A6F2C1]) [    ] o.a.s.c.ZkController zkHost includes chroot
   [junit4]   2> 327883 INFO  (TEST-TestReqParamsAPI.test-seed#[C804E71256A6F2C1]) [    ] o.a.s.c.c.SolrZkClient Using default ZkCredentialsProvider
   [junit4]   2> 327884 INFO  (TEST-TestReqParamsAPI.test-seed#[C804E71256A6F2C1]) [    ] o.a.s.c.c.ConnectionManager Waiting for client to connect to ZooKeeper
   [junit4]   2> 327885 INFO  (zkCallback-242-thread-1) [    ] o.a.s.c.c.ConnectionManager Watcher org.apache.solr.common.cloud.ConnectionManager@c9aa145 name:ZooKeeperConnection Watcher:127.0.0.1:34602 got event WatchedEvent state:SyncConnected type:None path:null path:null type:None
   [junit4]   2> 327885 INFO  (TEST-TestReqParamsAPI.test-seed#[C804E71256A6F2C1]) [    ] o.a.s.c.c.ConnectionManager Client is connected to ZooKeeper
   [junit4]   2> 327885 INFO  (TEST-TestReqParamsAPI.test-seed#[C804E71256A6F2C1]) [    ] o.a.s.c.c.SolrZkClient Using default ZkACLProvider
   [junit4]   2> 327886 INFO  (TEST-TestReqParamsAPI.test-seed#[C804E71256A6F2C1]) [n:127.0.0.1:44089_    ] o.a.s.c.ZkController Added new OnReconnect listener org.apache.solr.cloud.ZkController$$Lambda$37/167678938@50b96a64
   [junit4]   2> 327887 INFO  (TEST-TestReqParamsAPI.test-seed#[C804E71256A6F2C1]) [n:127.0.0.1:44089_    ] o.a.s.c.c.ConnectionManager Waiting for client to connect to ZooKeeper
   [junit4]   2> 327888 INFO  (zkCallback-243-thread-1-processing-n:127.0.0.1:44089_) [n:127.0.0.1:44089_    ] o.a.s.c.c.ConnectionManager Watcher org.apache.solr.common.cloud.ConnectionManager@35d3ab80 name:ZooKeeperConnection Watcher:127.0.0.1:34602/solr got event WatchedEvent state:SyncConnected type:None path:null path:null type:None
   [junit4]   2> 327888 INFO  (TEST-TestReqParamsAPI.test-seed#[C804E71256A6F2C1]) [n:127.0.0.1:44089_    ] o.a.s.c.c.ConnectionManager Client is connected to ZooKeeper
   [junit4]   2> 327899 INFO  (TEST-TestReqParamsAPI.test-seed#[C804E71256A6F2C1]) [n:127.0.0.1:44089_    ] o.a.s.c.c.ZkStateReader Updating cluster state from ZooKeeper... 
   [junit4]   2> 327899 INFO  (TEST-TestReqParamsAPI.test-seed#[C804E71256A6F2C1]) [n:127.0.0.1:44089_    ] o.a.s.c.c.ZkStateReader Loaded cluster properties: {urlScheme=https}
   [junit4]   2> 327899 INFO  (TEST-TestReqParamsAPI.test-seed#[C804E71256A6F2C1]) [n:127.0.0.1:44089_    ] o.a.s.c.c.ZkStateReader Updated live nodes from ZooKeeper... (0) -> (1)
   [junit4]   2> 327901 INFO  (TEST-TestReqParamsAPI.test-seed#[C804E71256A6F2C1]) [n:127.0.0.1:44089_    ] o.a.s.c.Overseer Overseer (id=null) closing
   [junit4]   2> 327901 INFO  (TEST-TestReqParamsAPI.test-seed#[C804E71256A6F2C1]) [n:127.0.0.1:44089_    ] o.a.s.c.LeaderElector Joined leadership election with path: /overseer_elect/election/96034917591351306-127.0.0.1:44089_-n_0000000001
   [junit4]   2> 327901 INFO  (TEST-TestReqParamsAPI.test-seed#[C804E71256A6F2C1]) [n:127.0.0.1:44089_    ] o.a.s.c.LeaderElector Watching path /overseer_elect/election/96034917591351301-127.0.0.1:41538_-n_0000000000 to know if I could be the leader
   [junit4]   2> 327901 INFO  (TEST-TestReqParamsAPI.test-seed#[C804E71256A6F2C1]) [n:127.0.0.1:44089_    ] o.a.s.c.ZkController Publish node=127.0.0.1:44089_ as DOWN
   [junit4]   2> 327904 INFO  (OverseerStateUpdate-96034917591351301-127.0.0.1:41538_-n_0000000000) [n:127.0.0.1:41538_    ] o.a.s.c.Overseer processMessage: queueSize: 1, message = {
   [junit4]   2>   "operation":"downnode",
   [junit4]   2>   "node_name":"127.0.0.1:44089_"} current state version: 3
   [junit4]   2> 327904 INFO  (OverseerStateUpdate-96034917591351301-127.0.0.1:41538_-n_0000000000) [n:127.0.0.1:41538_    ] o.a.s.c.o.NodeMutator DownNode state invoked for node: 127.0.0.1:44089_
   [junit4]   2> 327904 INFO  (OverseerStateUpdate-96034917591351301-127.0.0.1:41538_-n_0000000000) [n:127.0.0.1:41538_    ] o.a.s.c.o.ZkStateWriter going to create_collection /collections/collection1/state.json
   [junit4]   2> 327905 INFO  (zkCallback-233-thread-1-processing-n:127.0.0.1:41538_) [n:127.0.0.1:41538_    ] o.a.s.c.c.ZkStateReader A cluster state change: [WatchedEvent state:SyncConnected type:NodeDataChanged path:/clusterstate.json], has occurred - updating... (live nodes size: [1])
   [junit4]   2> 327906 INFO  (zkCallback-237-thread-1) [    ] o.a.s.c.c.ZkStateReader A cluster state change: [WatchedEvent state:SyncConnected type:NodeDataChanged path:/clusterstate.json], has occurred - updating... (live nodes size: [1])
   [junit4]   2> 327906 INFO  (zkCallback-243-thread-1-processing-n:127.0.0.1:44089_) [n:127.0.0.1:44089_    ] o.a.s.c.c.ZkStateReader A cluster state change: [WatchedEvent state:SyncConnected type:NodeDataChanged path:/clusterstate.json], has occurred - updating... (live nodes size: [1])
   [junit4]   2> 328008 INFO  (OverseerStateUpdate-96034917591351301-127.0.0.1:41538_-n_0000000000) [n:127.0.0.1:41538_    ] o.a.s.c.o.ZkStateWriter going to update_collection /collections/collection1/state.json version: 2147483647
   [junit4]   2> 328008 WARN  (OverseerStateUpdate-96034917591351301-127.0.0.1:41538_-n_0000000000) [n:127.0.0.1:41538_    ] o.a.s.c.Overseer Bad version writing to ZK using compare-and-set, will force refresh cluster state
   [junit4]   2> org.apache.zookeeper.KeeperException$BadVersionException: KeeperErrorCode = BadVersion for /collections/collection1/state.json
   [junit4]   2> 	at org.apache.zookeeper.KeeperException.create(KeeperException.java:115)
   [junit4]   2> 	at org.apache.zookeeper.KeeperException.create(KeeperException.java:51)
   [junit4]   2> 	at org.apache.zookeeper.ZooKeeper.setData(ZooKeeper.java:1270)
   [junit4]   2> 	at org.apache.solr.common.cloud.SolrZkClient$8.execute(SolrZkClient.java:365)
   [junit4]   2> 	at org.apache.solr.common.cloud.SolrZkClient$8.execute(SolrZkClient.java:362)
   [junit4]   2> 	at org.apache.solr.common.cloud.ZkCmdExecutor.retryOperation(ZkCmdExecutor.java:60)
   [junit4]   2> 	at org.apache.solr.common.cloud.SolrZkClient.setData(SolrZkClient.java:362)
   [junit4]   2> 	at org.apache.solr.cloud.overseer.ZkStateWriter.writePendingUpdates(ZkStateWriter.java:232)
   [junit4]   2> 	at org.apache.solr.cloud.Overseer$ClusterStateUpdater.run(Overseer.java:240)
   [junit4]   2> 	at java.lang.Thread.run(Thread.java:745)
   [junit4]   2> 328009 INFO  (OverseerStateUpdate-96034917591351301-127.0.0.1:41538_-n_0000000000) [n:127.0.0.1:41538_    ] o.a.s.c.c.ZkStateReader Updated live nodes from ZooKeeper... (1) -> (1)
   [junit4]   2> 328010 INFO  (OverseerStateUpdate-96034917591351301-127.0.0.1:41538_-n_0000000000) [n:127.0.0.1:41538_    ] o.a.s.c.Overseer processMessage: workQueueSize: 1, message = {
   [junit4]   2>   "operation":"downnode",
   [junit4]   2>   "node_name":"127.0.0.1:44089_"}
   [junit4]   2> 328010 INFO  (OverseerStateUpdate-96034917591351301-127.0.0.1:41538_-n_0000000000) [n:127.0.0.1:41538_    ] o.a.s.c.o.NodeMutator DownNode state invoked for node: 127.0.0.1:44089_
   [junit4]   2> 328011 INFO  (zkCallback-237-thread-1) [    ] o.a.s.c.c.ZkStateReader A cluster state change: [WatchedEvent state:SyncConnected type:NodeDataChanged path:/clusterstate.json], has occurred - updating... (live nodes size: [1])
   [junit4]   2> 328011 INFO  (zkCallback-243-thread-1-processing-n:127.0.0.1:44089_) [n:127.0.0.1:44089_    ] o.a.s.c.c.ZkStateReader A cluster state change: [WatchedEvent state:SyncConnected type:NodeDataChanged path:/clusterstate.json], has occurred - updating... (live nodes size: [1])
   [junit4]   2> 328011 INFO  (zkCallback-233-thread-1-processing-n:127.0.0.1:41538_) [n:127.0.0.1:41538_    ] o.a.s.c.c.ZkStateReader A cluster state change: [WatchedEvent state:SyncConnected type:NodeDataChanged path:/clusterstate.json], has occurred - updating... (live nodes size: [1])
   [junit4]   2> 328012 INFO  (OverseerStateUpdate-96034917591351301-127.0.0.1:41538_-n_0000000000) [n:127.0.0.1:41538_    ] o.a.s.c.o.ZkStateWriter going to update_collection /collections/collection1/state.json version: 0
   [junit4]   2> 328903 INFO  (TEST-TestReqParamsAPI.test-seed#[C804E71256A6F2C1]) [n:127.0.0.1:44089_    ] o.a.s.c.ZkController Register node as live in ZooKeeper:/live_nodes/127.0.0.1:44089_
   [junit4]   2> 328904 INFO  (TEST-TestReqParamsAPI.test-seed#[C804E71256A6F2C1]) [n:127.0.0.1:44089_    ] o.a.s.c.c.SolrZkClient makePath: /live_nodes/127.0.0.1:44089_
   [junit4]   2> 328905 INFO  (zkCallback-237-thread-1) [    ] o.a.s.c.c.ZkStateReader A live node change: [WatchedEvent state:SyncConnected type:NodeChildrenChanged path:/live_nodes], has occurred - updating... (live nodes size: [1])
   [junit4]   2> 328905 INFO  (zkCallback-233-thread-1-processing-n:127.0.0.1:41538_) [n:127.0.0.1:41538_    ] o.a.s.c.c.ZkStateReader A live node change: [WatchedEvent state:SyncConnected type:NodeChildrenChanged path:/live_nodes], has occurred - updating... (live nodes size: [1])
   [junit4]   2> 328905 INFO  (zkCallback-243-thread-1-processing-n:127.0.0.1:44089_) [n:127.0.0.1:44089_    ] o.a.s.c.c.ZkStateReader A live node change: [WatchedEvent state:SyncConnected type:NodeChildrenChanged path:/live_nodes], has occurred - updating... (live nodes size: [1])
   [junit4]   2> 328905 INFO  (zkCallback-237-thread-1) [    ] o.a.s.c.c.ZkStateReader Updated live nodes from ZooKeeper... (1) -> (2)
   [junit4]   2> 328905 INFO  (zkCallback-243-thread-1-processing-n:127.0.0.1:44089_) [n:127.0.0.1:44089_    ] o.a.s.c.c.ZkStateReader Updated live nodes from ZooKeeper... (1) -> (2)
   [junit4]   2> 328905 INFO  (zkCallback-233-thread-1-processing-n:127.0.0.1:41538_) [n:127.0.0.1:41538_    ] o.a.s.c.c.ZkStateReader Updated live nodes from ZooKeeper... (1) -> (2)
   [junit4]   2> 328919 INFO  (TEST-TestReqParamsAPI.test-seed#[C804E71256A6F2C1]) [n:127.0.0.1:44089_    ] o.a.s.c.CoreContainer Security conf doesn't exist. Skipping setup for authorization module.
   [junit4]   2> 328919 INFO  (TEST-TestReqParamsAPI.test-seed#[C804E71256A6F2C1]) [n:127.0.0.1:44089_    ] o.a.s.c.CoreContainer No authentication plugin used.
   [junit4]   2> 328920 INFO  (TEST-TestReqParamsAPI.test-seed#[C804E71256A6F2C1]) [n:127.0.0.1:44089_    ] o.a.s.c.CorePropertiesLocator Looking for core definitions underneath /home/jenkins/workspace/Lucene-Solr-master-Linux/solr/build/solr-core/test/J1/../../../../../../../../../home/jenkins/workspace/Lucene-Solr-master-Linux/solr/build/solr-core/test/J1/temp/solr.handler.TestReqParamsAPI_C804E71256A6F2C1-001/shard-1-001/cores
   [junit4]   2> 328921 INFO  (TEST-TestReqParamsAPI.test-seed#[C804E71256A6F2C1]) [n:127.0.0.1:44089_    ] o.a.s.c.CoreDescriptor Created CoreDescriptor: {name=collection1, config=solrconfig.xml, transient=false, schema=schema.xml, loadOnStartup=true, configSetProperties=configsetprops.json, collection=collection1, coreNodeName=, dataDir=data/, shard=}
   [junit4]   2> 328921 INFO  (TEST-TestReqParamsAPI.test-seed#[C804E71256A6F2C1]) [n:127.0.0.1:44089_    ] o.a.s.c.CorePropertiesLocator Found core collection1 in /home/jenkins/workspace/Lucene-Solr-master-Linux/solr/build/solr-core/test/J1/../../../../../../../../../home/jenkins/workspace/Lucene-Solr-master-Linux/solr/build/solr-core/test/J1/temp/solr.handler.TestReqParamsAPI_C804E71256A6F2C1-001/shard-1-001/cores/collection1
   [junit4]   2> 328921 INFO  (TEST-TestReqParamsAPI.test-seed#[C804E71256A6F2C1]) [n:127.0.0.1:44089_    ] o.a.s.c.CorePropertiesLocator Found 1 core definitions
   [junit4]   2> 328925 INFO  (coreLoadExecutor-551-thread-1-processing-n:127.0.0.1:44089_) [n:127.0.0.1:44089_ c:collection1   x:collection1] o.a.s.c.ZkController publishing state=down
   [junit4]   2> 328925 INFO  (TEST-TestReqParamsAPI.test-seed#[C804E71256A6F2C1]) [n:127.0.0.1:44089_    ] o.a.s.s.SolrDispatchFilter user.dir=/home/jenkins/workspace/Lucene-Solr-master-Linux/solr/build/solr-core/test/J1
   [junit4]   2> 328925 INFO  (TEST-TestReqParamsAPI.test-seed#[C804E71256A6F2C1]) [n:127.0.0.1:44089_    ] o.a.s.s.SolrDispatchFilter SolrDispatchFilter.init() done
   [junit4]   2> 328925 INFO  (coreLoadExecutor-551-thread-1-processing-n:127.0.0.1:44089_) [n:127.0.0.1:44089_ c:collection1   x:collection1] o.a.s.c.ZkController numShards not found on descriptor - reading it from system property
   [junit4]   2> 328925 INFO  (coreLoadExecutor-551-thread-1-processing-n:127.0.0.1:44089_) [n:127.0.0.1:44089_ c:collection1   x:collection1] o.a.s.c.ZkController Registering watch for collection collection1
   [junit4]   2> 328925 INFO  (coreLoadExecutor-551-thread-1-processing-n:127.0.0.1:44089_) [n:127.0.0.1:44089_ c:collection1   x:collection1] o.a.s.c.c.ZkStateReader Add data for [collection1] ver [1]
   [junit4]   2> 328926 INFO  (OverseerStateUpdate-96034917591351301-127.0.0.1:41538_-n_0000000000) [n:127.0.0.1:41538_    ] o.a.s.c.Overseer processMessage: queueSize: 1, message = {
   [junit4]   2>   "core":"collection1",
   [junit4]   2>   "roles":null,
   [junit4]   2>   "base_url":"https://127.0.0.1:44089",
   [junit4]   2>   "node_name":"127.0.0.1:44089_",
   [junit4]   2>   "numShards":"2",
   [junit4]   2>   "state":"down",
   [junit4]   2>   "shard":null,
   [junit4]   2>   "collection":"collection1",
   [junit4]   2>   "operation":"state"} current state version: 5
   [junit4]   2> 328926 INFO  (OverseerStateUpdate-96034917591351301-127.0.0.1:41538_-n_0000000000) [n:127.0.0.1:41538_    ] o.a.s.c.o.ReplicaMutator Update state numShards=2 message={
   [junit4]   2>   "core":"collection1",
   [junit4]   2>   "roles":null,
   [junit4]   2>   "base_url":"https://127.0.0.1:44089",
   [junit4]   2>   "node_name":"127.0.0.1:44089_",
   [junit4]   2>   "numShards":"2",
   [junit4]   2>   "state":"down",
   [junit4]   2>   "shard":null,
   [junit4]   2>   "collection":"collection1",
   [junit4]   2>   "operation":"state"}
   [junit4]   2> 328926 INFO  (coreLoadExecutor-551-thread-1-processing-n:127.0.0.1:44089_) [n:127.0.0.1:44089_ c:collection1   x:collection1] o.a.s.c.ZkController look for our core node name
   [junit4]   2> 328926 INFO  (OverseerStateUpdate-96034917591351301-127.0.0.1:41538_-n_0000000000) [n:127.0.0.1:41538_    ] o.a.s.c.o.ReplicaMutator Collection already exists with numShards=2
   [junit4]   2> 328926 INFO  (OverseerStateUpdate-96034917591351301-127.0.0.1:41538_-n_0000000000) [n:127.0.0.1:41538_    ] o.a.s.c.o.ReplicaMutator Assigning new node to shard shard=shard2
   [junit4]   2> 329032 INFO  (OverseerStateUpdate-96034917591351301-127.0.0.1:41538_-n_0000000000) [n:127.0.0.1:41538_    ] o.a.s.c.o.ZkStateWriter going to update_collection /collections/collection1/state.json version: 1
   [junit4]   2> 329032 INFO  (zkCallback-243-thread-1-processing-n:127.0.0.1:44089_) [n:127.0.0.1:44089_    ] o.a.s.c.c.ZkStateReader A cluster state change: [WatchedEvent state:SyncConnected type:NodeDataChanged path:/collections/collection1/state.json] for collection [collection1] has occurred - updating... (live nodes size: [2])
   [junit4]   2> 329033 INFO  (zkCallback-243-thread-1-processing-n:127.0.0.1:44089_) [n:127.0.0.1:44089_    ] o.a.s.c.c.ZkStateReader Updating data for [collection1] from [1] to [2]
   [junit4]   2> 329926 INFO  (coreLoadExecutor-551-thread-1-processing-n:127.0.0.1:44089_) [n:127.0.0.1:44089_ c:collection1   x:collection1] o.a.s.c.ZkController waiting to find shard id in clusterstate for collection1
   [junit4]   2> 329926 INFO  (coreLoadExecutor-551-thread-1-processing-n:127.0.0.1:44089_) [n:127.0.0.1:44089_ c:collection1   x:collection1] o.a.s.c.ZkController Check for collection zkNode:collection1
   [junit4]   2> 329926 INFO  (coreLoadExecutor-551-thread-1-processing-n:127.0.0.1:44089_) [n:127.0.0.1:44089_ c:collection1   x:collection1] o.a.s.c.ZkController Collection zkNode exists
   [junit4]   2> 329926 INFO  (coreLoadExecutor-551-thread-1-processing-n:127.0.0.1:44089_) [n:127.0.0.1:44089_ c:collection1   x:collection1] o.a.s.c.c.ZkStateReader Load collection config from: [/collections/collection1]
   [junit4]   2> 329927 INFO  (coreLoadExecutor-551-thread-1-processing-n:127.0.0.1:44089_) [n:127.0.0.1:44089_ c:collection1   x:collection1] o.a.s.c.c.ZkStateReader path=[/collections/collection1] [configName]=[conf1] specified config exists in ZooKeeper
   [junit4]   2> 329927 INFO  (coreLoadExecutor-551-thread-1-processing-n:127.0.0.1:44089_) [n:127.0.0.1:44089_ c:collection1   x:collection1] o.a.s.c.SolrResourceLoader new SolrResourceLoader for directory: '/home/jenkins/workspace/Lucene-Solr-master-Linux/solr/build/solr-core/test/J1/temp/solr.handler.TestReqParamsAPI_C804E71256A6F2C1-001/shard-1-001/cores/collection1'
   [junit4]   2> 329927 INFO  (coreLoadExecutor-551-thread-1-processing-n:127.0.0.1:44089_) [n:127.0.0.1:44089_ c:collection1   x:collection1] o.a.s.c.SolrResourceLoader JNDI not configured for solr (NoInitialContextEx)
   [junit4]   2> 329927 INFO  (coreLoadExecutor-551-thread-1-processing-n:127.0.0.1:44089_) [n:127.0.0.1:44089_ c:collection1   x:collection1] o.a.s.c.SolrResourceLoader solr home defaulted to 'solr/' (could not find system property or JNDI)
   [junit4]   2> 329928 INFO  (coreLoadExecutor-551-thread-1-processing-n:127.0.0.1:44089_) [n:127.0.0.1:44089_ c:collection1   x:collection1] o.a.s.c.Config loaded config solrconfig.xml with version 0 
   [junit4]   2> 329933 INFO  (coreLoadExecutor-551-thread-1-processing-n:127.0.0.1:44089_) [n:127.0.0.1:44089_ c:collection1   x:collection1] o.a.s.c.SolrConfig current version of requestparams : -1
   [junit4]   2> 329959 INFO  (coreLoadExecutor-551-thread-1-processing-n:127.0.0.1:44089_) [n:127.0.0.1:44089_ c:collection1   x:collection1] o.a.s.c.SolrConfig Using Lucene MatchVersion: 7.0.0
   [junit4]   2> 329966 INFO  (coreLoadExecutor-551-thread-1-processing-n:127.0.0.1:44089_) [n:127.0.0.1:44089_ c:collection1   x:collection1] o.a.s.c.SolrConfig Loaded SolrConfig: solrconfig.xml
   [junit4]   2> 329972 INFO  (coreLoadExecutor-551-thread-1-processing-n:127.0.0.1:44089_) [n:127.0.0.1:44089_ c:collection1 

[...truncated too long message...]

iter with IndexWriterCloser
   [junit4]   2> 351016 INFO  (recoveryExecutor-260-thread-1-processing-n:127.0.0.1:46597_ x:collection1 s:shard1 c:collection1 r:core_node4) [n:127.0.0.1:46597_ c:collection1 s:shard1 r:core_node4 x:collection1] o.a.s.c.SolrCore [collection1] Closing main searcher on request.
   [junit4]   2> 351016 INFO  (recoveryExecutor-260-thread-1-processing-n:127.0.0.1:46597_ x:collection1 s:shard1 c:collection1 r:core_node4) [n:127.0.0.1:46597_ c:collection1 s:shard1 r:core_node4 x:collection1] o.a.s.c.CachingDirectoryFactory Closing MockDirectoryFactory - 2 directories currently being tracked
   [junit4]   2> 351016 INFO  (recoveryExecutor-260-thread-1-processing-n:127.0.0.1:46597_ x:collection1 s:shard1 c:collection1 r:core_node4) [n:127.0.0.1:46597_ c:collection1 s:shard1 r:core_node4 x:collection1] o.a.s.c.CachingDirectoryFactory looking to close /home/jenkins/workspace/Lucene-Solr-master-Linux/solr/build/solr-core/test/J1/temp/solr.handler.TestReqParamsAPI_C804E71256A6F2C1-001/shard-4-001/cores/collection1/data/index [CachedDir<<refCount=0;path=/home/jenkins/workspace/Lucene-Solr-master-Linux/solr/build/solr-core/test/J1/temp/solr.handler.TestReqParamsAPI_C804E71256A6F2C1-001/shard-4-001/cores/collection1/data/index;done=false>>]
   [junit4]   2> 351016 INFO  (recoveryExecutor-260-thread-1-processing-n:127.0.0.1:46597_ x:collection1 s:shard1 c:collection1 r:core_node4) [n:127.0.0.1:46597_ c:collection1 s:shard1 r:core_node4 x:collection1] o.a.s.c.CachingDirectoryFactory Closing directory, CoreContainer#isShutdown=true
   [junit4]   2> 351016 INFO  (recoveryExecutor-260-thread-1-processing-n:127.0.0.1:46597_ x:collection1 s:shard1 c:collection1 r:core_node4) [n:127.0.0.1:46597_ c:collection1 s:shard1 r:core_node4 x:collection1] o.a.s.c.CachingDirectoryFactory Closing directory: /home/jenkins/workspace/Lucene-Solr-master-Linux/solr/build/solr-core/test/J1/temp/solr.handler.TestReqParamsAPI_C804E71256A6F2C1-001/shard-4-001/cores/collection1/data/index
   [junit4]   2> 351016 INFO  (recoveryExecutor-260-thread-1-processing-n:127.0.0.1:46597_ x:collection1 s:shard1 c:collection1 r:core_node4) [n:127.0.0.1:46597_ c:collection1 s:shard1 r:core_node4 x:collection1] o.a.s.c.CachingDirectoryFactory looking to close /home/jenkins/workspace/Lucene-Solr-master-Linux/solr/build/solr-core/test/J1/temp/solr.handler.TestReqParamsAPI_C804E71256A6F2C1-001/shard-4-001/cores/collection1/data [CachedDir<<refCount=0;path=/home/jenkins/workspace/Lucene-Solr-master-Linux/solr/build/solr-core/test/J1/temp/solr.handler.TestReqParamsAPI_C804E71256A6F2C1-001/shard-4-001/cores/collection1/data;done=false>>]
   [junit4]   2> 351016 INFO  (recoveryExecutor-260-thread-1-processing-n:127.0.0.1:46597_ x:collection1 s:shard1 c:collection1 r:core_node4) [n:127.0.0.1:46597_ c:collection1 s:shard1 r:core_node4 x:collection1] o.a.s.c.CachingDirectoryFactory Closing directory, CoreContainer#isShutdown=true
   [junit4]   2> 351016 INFO  (recoveryExecutor-260-thread-1-processing-n:127.0.0.1:46597_ x:collection1 s:shard1 c:collection1 r:core_node4) [n:127.0.0.1:46597_ c:collection1 s:shard1 r:core_node4 x:collection1] o.a.s.c.CachingDirectoryFactory Closing directory: /home/jenkins/workspace/Lucene-Solr-master-Linux/solr/build/solr-core/test/J1/temp/solr.handler.TestReqParamsAPI_C804E71256A6F2C1-001/shard-4-001/cores/collection1/data
   [junit4]   2> 351016 INFO  (TEST-TestReqParamsAPI.test-seed#[C804E71256A6F2C1]) [    ] o.a.s.c.Overseer Overseer (id=96034917591351315-127.0.0.1:46597_-n_0000000004) closing
   [junit4]   2> 351017 INFO  (OverseerStateUpdate-96034917591351315-127.0.0.1:46597_-n_0000000004) [n:127.0.0.1:46597_    ] o.a.s.c.Overseer Overseer Loop exiting : 127.0.0.1:46597_
   [junit4]   2> 351018 INFO  (zkCallback-262-thread-2-processing-n:127.0.0.1:46597_) [n:127.0.0.1:46597_    ] o.a.s.c.c.ZkStateReader A live node change: [WatchedEvent state:SyncConnected type:NodeChildrenChanged path:/live_nodes], has occurred - updating... (live nodes size: [1])
   [junit4]   2> 351018 WARN  (zkCallback-262-thread-2-processing-n:127.0.0.1:46597_) [n:127.0.0.1:46597_    ] o.a.s.c.c.ZkStateReader ZooKeeper watch triggered, but Solr cannot talk to ZK: [KeeperErrorCode = Session expired for /live_nodes]
   [junit4]   2> 351019 INFO  (TEST-TestReqParamsAPI.test-seed#[C804E71256A6F2C1]) [    ] o.e.j.s.ServerConnector Stopped ServerConnector@23d2b927{SSL,[ssl, http/1.1]}{127.0.0.1:0}
   [junit4]   2> 351019 INFO  (TEST-TestReqParamsAPI.test-seed#[C804E71256A6F2C1]) [    ] o.e.j.s.h.ContextHandler Stopped o.e.j.s.ServletContextHandler@403a9e6a{/,null,UNAVAILABLE}
   [junit4]   2> 351020 INFO  (TEST-TestReqParamsAPI.test-seed#[C804E71256A6F2C1]) [    ] o.a.s.c.ZkTestServer connecting to 127.0.0.1:34602 34602
   [junit4]   2> 351149 INFO  (Thread-511) [    ] o.a.s.c.ZkTestServer connecting to 127.0.0.1:34602 34602
   [junit4]   2> 351151 WARN  (Thread-511) [    ] o.a.s.c.ZkTestServer Watch limit violations: 
   [junit4]   2> Maximum concurrent create/delete watches above limit:
   [junit4]   2> 
   [junit4]   2> 	25	/solr/configs/conf1
   [junit4]   2> 	6	/solr/aliases.json
   [junit4]   2> 	5	/solr/security.json
   [junit4]   2> 
   [junit4]   2> Maximum concurrent data watches above limit:
   [junit4]   2> 
   [junit4]   2> 	6	/solr/clusterstate.json
   [junit4]   2> 	6	/solr/clusterprops.json
   [junit4]   2> 	4	/solr/collections/collection1/state.json
   [junit4]   2> 
   [junit4]   2> Maximum concurrent children watches above limit:
   [junit4]   2> 
   [junit4]   2> 	6	/solr/live_nodes
   [junit4]   2> 	6	/solr/collections
   [junit4]   2> 	3	/solr/overseer/collection-queue-work
   [junit4]   2> 	2	/solr/overseer/queue
   [junit4]   2> 
   [junit4]   2> NOTE: reproduce with: ant test  -Dtestcase=TestReqParamsAPI -Dtests.method=test -Dtests.seed=C804E71256A6F2C1 -Dtests.multiplier=3 -Dtests.slow=true -Dtests.locale=fr-LU -Dtests.timezone=ECT -Dtests.asserts=true -Dtests.file.encoding=ISO-8859-1
   [junit4] FAILURE 25.1s J1 | TestReqParamsAPI.test <<<
   [junit4]    > Throwable #1: java.lang.AssertionError: Could not get expected value  'CY val' for path 'params/c' full output: {
   [junit4]    >   "responseHeader":{
   [junit4]    >     "status":0,
   [junit4]    >     "QTime":0},
   [junit4]    >   "params":{
   [junit4]    >     "a":"A val",
   [junit4]    >     "b":"B val",
   [junit4]    >     "wt":"json",
   [junit4]    >     "useParams":""},
   [junit4]    >   "context":{
   [junit4]    >     "webapp":"",
   [junit4]    >     "path":"/dump1",
   [junit4]    >     "httpMethod":"GET"}},  from server:  https://127.0.0.1:39883/collection1
   [junit4]    > 	at __randomizedtesting.SeedInfo.seed([C804E71256A6F2C1:4050D8C8F85A9F39]:0)
   [junit4]    > 	at org.apache.solr.core.TestSolrConfigHandler.testForResponseElement(TestSolrConfigHandler.java:457)
   [junit4]    > 	at org.apache.solr.handler.TestReqParamsAPI.testReqParams(TestReqParamsAPI.java:172)
   [junit4]    > 	at org.apache.solr.handler.TestReqParamsAPI.test(TestReqParamsAPI.java:62)
   [junit4]    > 	at org.apache.solr.BaseDistributedSearchTestCase$ShardsRepeatRule$ShardsFixedStatement.callStatement(BaseDistributedSearchTestCase.java:985)
   [junit4]    > 	at org.apache.solr.BaseDistributedSearchTestCase$ShardsRepeatRule$ShardsStatement.evaluate(BaseDistributedSearchTestCase.java:960)
   [junit4]    > 	at java.lang.Thread.run(Thread.java:745)
   [junit4]   2> 351153 INFO  (SUITE-TestReqParamsAPI-seed#[C804E71256A6F2C1]-worker) [    ] o.a.s.SolrTestCaseJ4 ###deleteCore
   [junit4]   2> NOTE: leaving temporary files on disk at: /home/jenkins/workspace/Lucene-Solr-master-Linux/solr/build/solr-core/test/J1/temp/solr.handler.TestReqParamsAPI_C804E71256A6F2C1-001
   [junit4]   2> Jun 08, 2016 9:02:55 AM com.carrotsearch.randomizedtesting.ThreadLeakControl checkThreadLeaks
   [junit4]   2> WARNING: Will linger awaiting termination of 1 leaked thread(s).
   [junit4]   2> NOTE: test params are: codec=CheapBastard, sim=ClassicSimilarity, locale=fr-LU, timezone=ECT
   [junit4]   2> NOTE: Linux 4.4.0-21-generic amd64/Oracle Corporation 1.8.0_92 (64-bit)/cpus=12,threads=1,free=146212968,total=518979584
   [junit4]   2> NOTE: All tests run in this JVM: [HdfsWriteToMultipleCollectionsTest, WordBreakSolrSpellCheckerTest, TestSolrDynamicMBean, TestOnReconnectListenerSupport, TestDownShardTolerantSearch, DirectSolrSpellCheckerTest, DistributedQueueTest, SolrInfoMBeanTest, ChaosMonkeySafeLeaderTest, TestSchemaResource, HttpPartitionTest, SolrCmdDistributorTest, SpellCheckComponentTest, DocValuesTest, ShardRoutingCustomTest, ClusterStateUpdateTest, TestReqParamsAPI]
   [junit4] Completed [60/612 (1!)] on J1 in 25.93s, 1 test, 1 failure <<< FAILURES!

[...truncated 1790 lines...]
BUILD FAILED
/home/jenkins/workspace/Lucene-Solr-master-Linux/build.xml:740: The following error occurred while executing this line:
/home/jenkins/workspace/Lucene-Solr-master-Linux/build.xml:684: The following error occurred while executing this line:
/home/jenkins/workspace/Lucene-Solr-master-Linux/build.xml:59: The following error occurred while executing this line:
/home/jenkins/workspace/Lucene-Solr-master-Linux/solr/build.xml:233: The following error occurred while executing this line:
/home/jenkins/workspace/Lucene-Solr-master-Linux/solr/common-build.xml:531: The following error occurred while executing this line:
/home/jenkins/workspace/Lucene-Solr-master-Linux/lucene/common-build.xml:1427: The following error occurred while executing this line:
/home/jenkins/workspace/Lucene-Solr-master-Linux/lucene/common-build.xml:984: There were test failures: 612 suites (10 ignored), 2560 tests, 1 failure, 116 ignored (72 assumptions) [seed: C804E71256A6F2C1]

Total time: 59 minutes 11 seconds
Build step 'Invoke Ant' marked build as failure
Archiving artifacts
[WARNINGS] Skipping publisher since build result is FAILURE
Recording test results
Email was triggered for: Failure - Any
Sending email for trigger: Failure - Any



Mime
View raw message