lucene-dev mailing list archives

Site index · List index
Message view « Date » · « Thread »
Top « Date » · « Thread »
From Policeman Jenkins Server <jenk...@thetaphi.de>
Subject [JENKINS] Lucene-Solr-master-Windows (64bit/jdk1.8.0_92) - Build # 5883 - Failure!
Date Wed, 01 Jun 2016 08:01:31 GMT
Build: http://jenkins.thetaphi.de/job/Lucene-Solr-master-Windows/5883/
Java: 64bit/jdk1.8.0_92 -XX:+UseCompressedOops -XX:+UseSerialGC

1 tests failed.
FAILED:  junit.framework.TestSuite.org.apache.solr.handler.TestSolrConfigHandlerCloud

Error Message:
2 threads leaked from SUITE scope at org.apache.solr.handler.TestSolrConfigHandlerCloud:     1) Thread[id=23253, name=Thread-7139, state=TIMED_WAITING, group=TGRP-TestSolrConfigHandlerCloud]         at java.lang.Thread.sleep(Native Method)         at org.apache.solr.cloud.ZkSolrResourceLoader.openResource(ZkSolrResourceLoader.java:101)         at org.apache.solr.core.SolrResourceLoader.openSchema(SolrResourceLoader.java:333)         at org.apache.solr.schema.IndexSchemaFactory.create(IndexSchemaFactory.java:48)         at org.apache.solr.schema.IndexSchemaFactory.buildIndexSchema(IndexSchemaFactory.java:75)         at org.apache.solr.core.ConfigSetService.createIndexSchema(ConfigSetService.java:108)         at org.apache.solr.core.ConfigSetService.getConfig(ConfigSetService.java:79)         at org.apache.solr.core.CoreContainer.reload(CoreContainer.java:936)         at org.apache.solr.core.SolrCore.lambda$getConfListener$6(SolrCore.java:2510)         at org.apache.solr.core.SolrCore$$Lambda$55/305378721.run(Unknown Source)         at org.apache.solr.cloud.ZkController$4.run(ZkController.java:2408)    2) Thread[id=22388, name=Thread-7006, state=TIMED_WAITING, group=TGRP-TestSolrConfigHandlerCloud]         at java.lang.Thread.sleep(Native Method)         at org.apache.solr.cloud.ZkSolrResourceLoader.openResource(ZkSolrResourceLoader.java:101)         at org.apache.solr.core.SolrResourceLoader.openSchema(SolrResourceLoader.java:333)         at org.apache.solr.schema.IndexSchemaFactory.create(IndexSchemaFactory.java:48)         at org.apache.solr.schema.IndexSchemaFactory.buildIndexSchema(IndexSchemaFactory.java:75)         at org.apache.solr.core.ConfigSetService.createIndexSchema(ConfigSetService.java:108)         at org.apache.solr.core.ConfigSetService.getConfig(ConfigSetService.java:79)         at org.apache.solr.core.CoreContainer.reload(CoreContainer.java:936)         at org.apache.solr.core.SolrCore.lambda$getConfListener$6(SolrCore.java:2510)         at org.apache.solr.core.SolrCore$$Lambda$55/305378721.run(Unknown Source)         at org.apache.solr.cloud.ZkController$4.run(ZkController.java:2408)

Stack Trace:
com.carrotsearch.randomizedtesting.ThreadLeakError: 2 threads leaked from SUITE scope at org.apache.solr.handler.TestSolrConfigHandlerCloud: 
   1) Thread[id=23253, name=Thread-7139, state=TIMED_WAITING, group=TGRP-TestSolrConfigHandlerCloud]
        at java.lang.Thread.sleep(Native Method)
        at org.apache.solr.cloud.ZkSolrResourceLoader.openResource(ZkSolrResourceLoader.java:101)
        at org.apache.solr.core.SolrResourceLoader.openSchema(SolrResourceLoader.java:333)
        at org.apache.solr.schema.IndexSchemaFactory.create(IndexSchemaFactory.java:48)
        at org.apache.solr.schema.IndexSchemaFactory.buildIndexSchema(IndexSchemaFactory.java:75)
        at org.apache.solr.core.ConfigSetService.createIndexSchema(ConfigSetService.java:108)
        at org.apache.solr.core.ConfigSetService.getConfig(ConfigSetService.java:79)
        at org.apache.solr.core.CoreContainer.reload(CoreContainer.java:936)
        at org.apache.solr.core.SolrCore.lambda$getConfListener$6(SolrCore.java:2510)
        at org.apache.solr.core.SolrCore$$Lambda$55/305378721.run(Unknown Source)
        at org.apache.solr.cloud.ZkController$4.run(ZkController.java:2408)
   2) Thread[id=22388, name=Thread-7006, state=TIMED_WAITING, group=TGRP-TestSolrConfigHandlerCloud]
        at java.lang.Thread.sleep(Native Method)
        at org.apache.solr.cloud.ZkSolrResourceLoader.openResource(ZkSolrResourceLoader.java:101)
        at org.apache.solr.core.SolrResourceLoader.openSchema(SolrResourceLoader.java:333)
        at org.apache.solr.schema.IndexSchemaFactory.create(IndexSchemaFactory.java:48)
        at org.apache.solr.schema.IndexSchemaFactory.buildIndexSchema(IndexSchemaFactory.java:75)
        at org.apache.solr.core.ConfigSetService.createIndexSchema(ConfigSetService.java:108)
        at org.apache.solr.core.ConfigSetService.getConfig(ConfigSetService.java:79)
        at org.apache.solr.core.CoreContainer.reload(CoreContainer.java:936)
        at org.apache.solr.core.SolrCore.lambda$getConfListener$6(SolrCore.java:2510)
        at org.apache.solr.core.SolrCore$$Lambda$55/305378721.run(Unknown Source)
        at org.apache.solr.cloud.ZkController$4.run(ZkController.java:2408)
	at __randomizedtesting.SeedInfo.seed([A906F2217AA6E7B1]:0)




Build Log:
[...truncated 12189 lines...]
   [junit4] Suite: org.apache.solr.handler.TestSolrConfigHandlerCloud
   [junit4]   2> Creating dataDir: C:\Users\jenkins\workspace\Lucene-Solr-master-Windows\solr\build\solr-core\test\J0\temp\solr.handler.TestSolrConfigHandlerCloud_A906F2217AA6E7B1-001\init-core-data-001
   [junit4]   2> 2743743 INFO  (SUITE-TestSolrConfigHandlerCloud-seed#[A906F2217AA6E7B1]-worker) [    ] o.a.s.SolrTestCaseJ4 Randomized ssl (false) and clientAuth (false)
   [junit4]   2> 2743749 INFO  (SUITE-TestSolrConfigHandlerCloud-seed#[A906F2217AA6E7B1]-worker) [    ] o.a.s.BaseDistributedSearchTestCase Setting hostContext system property: /
   [junit4]   2> 2743753 INFO  (TEST-TestSolrConfigHandlerCloud.test-seed#[A906F2217AA6E7B1]) [    ] o.a.s.c.ZkTestServer STARTING ZK TEST SERVER
   [junit4]   2> 2743753 INFO  (Thread-6848) [    ] o.a.s.c.ZkTestServer client port:0.0.0.0/0.0.0.0:0
   [junit4]   2> 2743754 INFO  (Thread-6848) [    ] o.a.s.c.ZkTestServer Starting server
   [junit4]   2> 2743855 INFO  (TEST-TestSolrConfigHandlerCloud.test-seed#[A906F2217AA6E7B1]) [    ] o.a.s.c.ZkTestServer start zk server on port:59169
   [junit4]   2> 2743855 INFO  (TEST-TestSolrConfigHandlerCloud.test-seed#[A906F2217AA6E7B1]) [    ] o.a.s.c.c.SolrZkClient Using default ZkCredentialsProvider
   [junit4]   2> 2743856 INFO  (TEST-TestSolrConfigHandlerCloud.test-seed#[A906F2217AA6E7B1]) [    ] o.a.s.c.c.ConnectionManager Waiting for client to connect to ZooKeeper
   [junit4]   2> 2743861 INFO  (zkCallback-3581-thread-1) [    ] o.a.s.c.c.ConnectionManager Watcher org.apache.solr.common.cloud.ConnectionManager@e43e9a7 name:ZooKeeperConnection Watcher:127.0.0.1:59169 got event WatchedEvent state:SyncConnected type:None path:null path:null type:None
   [junit4]   2> 2743862 INFO  (TEST-TestSolrConfigHandlerCloud.test-seed#[A906F2217AA6E7B1]) [    ] o.a.s.c.c.ConnectionManager Client is connected to ZooKeeper
   [junit4]   2> 2743862 INFO  (TEST-TestSolrConfigHandlerCloud.test-seed#[A906F2217AA6E7B1]) [    ] o.a.s.c.c.SolrZkClient Using default ZkACLProvider
   [junit4]   2> 2743862 INFO  (TEST-TestSolrConfigHandlerCloud.test-seed#[A906F2217AA6E7B1]) [    ] o.a.s.c.c.SolrZkClient makePath: /solr
   [junit4]   2> 2743865 INFO  (TEST-TestSolrConfigHandlerCloud.test-seed#[A906F2217AA6E7B1]) [    ] o.a.s.c.c.SolrZkClient Using default ZkCredentialsProvider
   [junit4]   2> 2743866 INFO  (TEST-TestSolrConfigHandlerCloud.test-seed#[A906F2217AA6E7B1]) [    ] o.a.s.c.c.ConnectionManager Waiting for client to connect to ZooKeeper
   [junit4]   2> 2743868 INFO  (zkCallback-3582-thread-1) [    ] o.a.s.c.c.ConnectionManager Watcher org.apache.solr.common.cloud.ConnectionManager@55f7c652 name:ZooKeeperConnection Watcher:127.0.0.1:59169/solr got event WatchedEvent state:SyncConnected type:None path:null path:null type:None
   [junit4]   2> 2743868 INFO  (TEST-TestSolrConfigHandlerCloud.test-seed#[A906F2217AA6E7B1]) [    ] o.a.s.c.c.ConnectionManager Client is connected to ZooKeeper
   [junit4]   2> 2743868 INFO  (TEST-TestSolrConfigHandlerCloud.test-seed#[A906F2217AA6E7B1]) [    ] o.a.s.c.c.SolrZkClient Using default ZkACLProvider
   [junit4]   2> 2743868 INFO  (TEST-TestSolrConfigHandlerCloud.test-seed#[A906F2217AA6E7B1]) [    ] o.a.s.c.c.SolrZkClient makePath: /collections/collection1
   [junit4]   2> 2743871 INFO  (TEST-TestSolrConfigHandlerCloud.test-seed#[A906F2217AA6E7B1]) [    ] o.a.s.c.c.SolrZkClient makePath: /collections/collection1/shards
   [junit4]   2> 2743874 INFO  (TEST-TestSolrConfigHandlerCloud.test-seed#[A906F2217AA6E7B1]) [    ] o.a.s.c.c.SolrZkClient makePath: /collections/control_collection
   [junit4]   2> 2743876 INFO  (TEST-TestSolrConfigHandlerCloud.test-seed#[A906F2217AA6E7B1]) [    ] o.a.s.c.c.SolrZkClient makePath: /collections/control_collection/shards
   [junit4]   2> 2743879 INFO  (TEST-TestSolrConfigHandlerCloud.test-seed#[A906F2217AA6E7B1]) [    ] o.a.s.c.AbstractZkTestCase put C:\Users\jenkins\workspace\Lucene-Solr-master-Windows\solr\core\src\test-files\solr\collection1\conf\solrconfig-tlog.xml to /configs/conf1/solrconfig.xml
   [junit4]   2> 2743880 INFO  (TEST-TestSolrConfigHandlerCloud.test-seed#[A906F2217AA6E7B1]) [    ] o.a.s.c.c.SolrZkClient makePath: /configs/conf1/solrconfig.xml
   [junit4]   2> 2743887 INFO  (TEST-TestSolrConfigHandlerCloud.test-seed#[A906F2217AA6E7B1]) [    ] o.a.s.c.AbstractZkTestCase put C:\Users\jenkins\workspace\Lucene-Solr-master-Windows\solr\core\src\test-files\solr\collection1\conf\schema.xml to /configs/conf1/schema.xml
   [junit4]   2> 2743889 INFO  (TEST-TestSolrConfigHandlerCloud.test-seed#[A906F2217AA6E7B1]) [    ] o.a.s.c.c.SolrZkClient makePath: /configs/conf1/schema.xml
   [junit4]   2> 2743892 INFO  (TEST-TestSolrConfigHandlerCloud.test-seed#[A906F2217AA6E7B1]) [    ] o.a.s.c.AbstractZkTestCase put C:\Users\jenkins\workspace\Lucene-Solr-master-Windows\solr\core\src\test-files\solr\collection1\conf\solrconfig.snippet.randomindexconfig.xml to /configs/conf1/solrconfig.snippet.randomindexconfig.xml
   [junit4]   2> 2743892 INFO  (TEST-TestSolrConfigHandlerCloud.test-seed#[A906F2217AA6E7B1]) [    ] o.a.s.c.c.SolrZkClient makePath: /configs/conf1/solrconfig.snippet.randomindexconfig.xml
   [junit4]   2> 2743896 INFO  (TEST-TestSolrConfigHandlerCloud.test-seed#[A906F2217AA6E7B1]) [    ] o.a.s.c.AbstractZkTestCase put C:\Users\jenkins\workspace\Lucene-Solr-master-Windows\solr\core\src\test-files\solr\collection1\conf\stopwords.txt to /configs/conf1/stopwords.txt
   [junit4]   2> 2743899 INFO  (TEST-TestSolrConfigHandlerCloud.test-seed#[A906F2217AA6E7B1]) [    ] o.a.s.c.c.SolrZkClient makePath: /configs/conf1/stopwords.txt
   [junit4]   2> 2743901 INFO  (TEST-TestSolrConfigHandlerCloud.test-seed#[A906F2217AA6E7B1]) [    ] o.a.s.c.AbstractZkTestCase put C:\Users\jenkins\workspace\Lucene-Solr-master-Windows\solr\core\src\test-files\solr\collection1\conf\protwords.txt to /configs/conf1/protwords.txt
   [junit4]   2> 2743901 INFO  (TEST-TestSolrConfigHandlerCloud.test-seed#[A906F2217AA6E7B1]) [    ] o.a.s.c.c.SolrZkClient makePath: /configs/conf1/protwords.txt
   [junit4]   2> 2743904 INFO  (TEST-TestSolrConfigHandlerCloud.test-seed#[A906F2217AA6E7B1]) [    ] o.a.s.c.AbstractZkTestCase put C:\Users\jenkins\workspace\Lucene-Solr-master-Windows\solr\core\src\test-files\solr\collection1\conf\currency.xml to /configs/conf1/currency.xml
   [junit4]   2> 2743904 INFO  (TEST-TestSolrConfigHandlerCloud.test-seed#[A906F2217AA6E7B1]) [    ] o.a.s.c.c.SolrZkClient makePath: /configs/conf1/currency.xml
   [junit4]   2> 2743907 INFO  (TEST-TestSolrConfigHandlerCloud.test-seed#[A906F2217AA6E7B1]) [    ] o.a.s.c.AbstractZkTestCase put C:\Users\jenkins\workspace\Lucene-Solr-master-Windows\solr\core\src\test-files\solr\collection1\conf\enumsConfig.xml to /configs/conf1/enumsConfig.xml
   [junit4]   2> 2743908 INFO  (TEST-TestSolrConfigHandlerCloud.test-seed#[A906F2217AA6E7B1]) [    ] o.a.s.c.c.SolrZkClient makePath: /configs/conf1/enumsConfig.xml
   [junit4]   2> 2743911 INFO  (TEST-TestSolrConfigHandlerCloud.test-seed#[A906F2217AA6E7B1]) [    ] o.a.s.c.AbstractZkTestCase put C:\Users\jenkins\workspace\Lucene-Solr-master-Windows\solr\core\src\test-files\solr\collection1\conf\open-exchange-rates.json to /configs/conf1/open-exchange-rates.json
   [junit4]   2> 2743911 INFO  (TEST-TestSolrConfigHandlerCloud.test-seed#[A906F2217AA6E7B1]) [    ] o.a.s.c.c.SolrZkClient makePath: /configs/conf1/open-exchange-rates.json
   [junit4]   2> 2743914 INFO  (TEST-TestSolrConfigHandlerCloud.test-seed#[A906F2217AA6E7B1]) [    ] o.a.s.c.AbstractZkTestCase put C:\Users\jenkins\workspace\Lucene-Solr-master-Windows\solr\core\src\test-files\solr\collection1\conf\mapping-ISOLatin1Accent.txt to /configs/conf1/mapping-ISOLatin1Accent.txt
   [junit4]   2> 2743914 INFO  (TEST-TestSolrConfigHandlerCloud.test-seed#[A906F2217AA6E7B1]) [    ] o.a.s.c.c.SolrZkClient makePath: /configs/conf1/mapping-ISOLatin1Accent.txt
   [junit4]   2> 2743917 INFO  (TEST-TestSolrConfigHandlerCloud.test-seed#[A906F2217AA6E7B1]) [    ] o.a.s.c.AbstractZkTestCase put C:\Users\jenkins\workspace\Lucene-Solr-master-Windows\solr\core\src\test-files\solr\collection1\conf\old_synonyms.txt to /configs/conf1/old_synonyms.txt
   [junit4]   2> 2743917 INFO  (TEST-TestSolrConfigHandlerCloud.test-seed#[A906F2217AA6E7B1]) [    ] o.a.s.c.c.SolrZkClient makePath: /configs/conf1/old_synonyms.txt
   [junit4]   2> 2743920 INFO  (TEST-TestSolrConfigHandlerCloud.test-seed#[A906F2217AA6E7B1]) [    ] o.a.s.c.AbstractZkTestCase put C:\Users\jenkins\workspace\Lucene-Solr-master-Windows\solr\core\src\test-files\solr\collection1\conf\synonyms.txt to /configs/conf1/synonyms.txt
   [junit4]   2> 2743920 INFO  (TEST-TestSolrConfigHandlerCloud.test-seed#[A906F2217AA6E7B1]) [    ] o.a.s.c.c.SolrZkClient makePath: /configs/conf1/synonyms.txt
   [junit4]   2> 2743923 WARN  (NIOServerCxn.Factory:0.0.0.0/0.0.0.0:0) [    ] o.a.z.s.NIOServerCnxn caught end of stream exception
   [junit4]   2> EndOfStreamException: Unable to read additional data from client sessionid 0x1550aefc49a0001, likely client has closed socket
   [junit4]   2> 	at org.apache.zookeeper.server.NIOServerCnxn.doIO(NIOServerCnxn.java:228)
   [junit4]   2> 	at org.apache.zookeeper.server.NIOServerCnxnFactory.run(NIOServerCnxnFactory.java:208)
   [junit4]   2> 	at java.lang.Thread.run(Thread.java:745)
   [junit4]   2> 2744608 INFO  (TEST-TestSolrConfigHandlerCloud.test-seed#[A906F2217AA6E7B1]) [    ] o.a.s.SolrTestCaseJ4 Writing core.properties file to C:\Users\jenkins\workspace\Lucene-Solr-master-Windows\solr\build\solr-core\test\J0\temp\solr.handler.TestSolrConfigHandlerCloud_A906F2217AA6E7B1-001\control-001\cores\collection1
   [junit4]   2> 2744612 INFO  (TEST-TestSolrConfigHandlerCloud.test-seed#[A906F2217AA6E7B1]) [    ] o.e.j.s.Server jetty-9.3.8.v20160314
   [junit4]   2> 2744612 INFO  (TEST-TestSolrConfigHandlerCloud.test-seed#[A906F2217AA6E7B1]) [    ] o.e.j.s.h.ContextHandler Started o.e.j.s.ServletContextHandler@5dc2de5c{/,null,AVAILABLE}
   [junit4]   2> 2744613 INFO  (TEST-TestSolrConfigHandlerCloud.test-seed#[A906F2217AA6E7B1]) [    ] o.e.j.s.ServerConnector Started ServerConnector@3cbf0a41{HTTP/1.1,[http/1.1]}{127.0.0.1:59179}
   [junit4]   2> 2744613 INFO  (TEST-TestSolrConfigHandlerCloud.test-seed#[A906F2217AA6E7B1]) [    ] o.e.j.s.Server Started @2748961ms
   [junit4]   2> 2744613 INFO  (TEST-TestSolrConfigHandlerCloud.test-seed#[A906F2217AA6E7B1]) [    ] o.a.s.c.s.e.JettySolrRunner Jetty properties: {solr.data.dir=C:\Users\jenkins\workspace\Lucene-Solr-master-Windows\solr\build\solr-core\test\J0\temp\solr.handler.TestSolrConfigHandlerCloud_A906F2217AA6E7B1-001\tempDir-001/control/data, hostContext=/, hostPort=59179, coreRootDirectory=C:\Users\jenkins\workspace\Lucene-Solr-master-Windows\solr\build\solr-core\test\J0\temp\solr.handler.TestSolrConfigHandlerCloud_A906F2217AA6E7B1-001\control-001\cores}
   [junit4]   2> 2744614 INFO  (TEST-TestSolrConfigHandlerCloud.test-seed#[A906F2217AA6E7B1]) [    ] o.a.s.s.SolrDispatchFilter SolrDispatchFilter.init(): sun.misc.Launcher$AppClassLoader@73d16e93
   [junit4]   2> 2744614 INFO  (TEST-TestSolrConfigHandlerCloud.test-seed#[A906F2217AA6E7B1]) [    ] o.a.s.c.SolrResourceLoader new SolrResourceLoader for directory: 'C:\Users\jenkins\workspace\Lucene-Solr-master-Windows\solr\build\solr-core\test\J0\temp\solr.handler.TestSolrConfigHandlerCloud_A906F2217AA6E7B1-001\control-001'
   [junit4]   2> 2744614 INFO  (TEST-TestSolrConfigHandlerCloud.test-seed#[A906F2217AA6E7B1]) [    ] o.a.s.c.SolrResourceLoader JNDI not configured for solr (NoInitialContextEx)
   [junit4]   2> 2744615 INFO  (TEST-TestSolrConfigHandlerCloud.test-seed#[A906F2217AA6E7B1]) [    ] o.a.s.c.SolrResourceLoader solr home defaulted to 'solr/' (could not find system property or JNDI)
   [junit4]   2> 2744615 INFO  (TEST-TestSolrConfigHandlerCloud.test-seed#[A906F2217AA6E7B1]) [    ] o.a.s.c.c.SolrZkClient Using default ZkCredentialsProvider
   [junit4]   2> 2744616 INFO  (TEST-TestSolrConfigHandlerCloud.test-seed#[A906F2217AA6E7B1]) [    ] o.a.s.c.c.ConnectionManager Waiting for client to connect to ZooKeeper
   [junit4]   2> 2744618 INFO  (zkCallback-3583-thread-1) [    ] o.a.s.c.c.ConnectionManager Watcher org.apache.solr.common.cloud.ConnectionManager@515ded7b name:ZooKeeperConnection Watcher:127.0.0.1:59169/solr got event WatchedEvent state:SyncConnected type:None path:null path:null type:None
   [junit4]   2> 2744618 INFO  (TEST-TestSolrConfigHandlerCloud.test-seed#[A906F2217AA6E7B1]) [    ] o.a.s.c.c.ConnectionManager Client is connected to ZooKeeper
   [junit4]   2> 2744618 INFO  (TEST-TestSolrConfigHandlerCloud.test-seed#[A906F2217AA6E7B1]) [    ] o.a.s.c.c.SolrZkClient Using default ZkACLProvider
   [junit4]   2> 2744619 INFO  (TEST-TestSolrConfigHandlerCloud.test-seed#[A906F2217AA6E7B1]) [    ] o.a.s.s.SolrDispatchFilter Loading solr.xml from SolrHome (not found in ZooKeeper)
   [junit4]   2> 2744619 INFO  (TEST-TestSolrConfigHandlerCloud.test-seed#[A906F2217AA6E7B1]) [    ] o.a.s.c.SolrXmlConfig Loading container configuration from C:\Users\jenkins\workspace\Lucene-Solr-master-Windows\solr\build\solr-core\test\J0\temp\solr.handler.TestSolrConfigHandlerCloud_A906F2217AA6E7B1-001\control-001\solr.xml
   [junit4]   2> 2744632 INFO  (TEST-TestSolrConfigHandlerCloud.test-seed#[A906F2217AA6E7B1]) [    ] o.a.s.c.CorePropertiesLocator Config-defined core root directory: C:\Users\jenkins\workspace\Lucene-Solr-master-Windows\solr\build\solr-core\test\J0\temp\solr.handler.TestSolrConfigHandlerCloud_A906F2217AA6E7B1-001\control-001\cores
   [junit4]   2> 2744632 INFO  (TEST-TestSolrConfigHandlerCloud.test-seed#[A906F2217AA6E7B1]) [    ] o.a.s.c.CoreContainer New CoreContainer 1470101604
   [junit4]   2> 2744632 INFO  (TEST-TestSolrConfigHandlerCloud.test-seed#[A906F2217AA6E7B1]) [    ] o.a.s.c.CoreContainer Loading cores into CoreContainer [instanceDir=C:\Users\jenkins\workspace\Lucene-Solr-master-Windows\solr\build\solr-core\test\J0\temp\solr.handler.TestSolrConfigHandlerCloud_A906F2217AA6E7B1-001\control-001]
   [junit4]   2> 2744632 WARN  (TEST-TestSolrConfigHandlerCloud.test-seed#[A906F2217AA6E7B1]) [    ] o.a.s.c.CoreContainer Couldn't add files from C:\Users\jenkins\workspace\Lucene-Solr-master-Windows\solr\build\solr-core\test\J0\temp\solr.handler.TestSolrConfigHandlerCloud_A906F2217AA6E7B1-001\control-001\lib to classpath: C:\Users\jenkins\workspace\Lucene-Solr-master-Windows\solr\build\solr-core\test\J0\temp\solr.handler.TestSolrConfigHandlerCloud_A906F2217AA6E7B1-001\control-001\lib
   [junit4]   2> 2744633 INFO  (TEST-TestSolrConfigHandlerCloud.test-seed#[A906F2217AA6E7B1]) [    ] o.a.s.h.c.HttpShardHandlerFactory created with socketTimeout : 90000,urlScheme : ,connTimeout : 15000,maxConnectionsPerHost : 20,maxConnections : 10000,corePoolSize : 0,maximumPoolSize : 2147483647,maxThreadIdleTime : 5,sizeOfQueue : -1,fairnessPolicy : false,
   [junit4]   2> 2744637 INFO  (TEST-TestSolrConfigHandlerCloud.test-seed#[A906F2217AA6E7B1]) [    ] o.a.s.u.UpdateShardHandler Creating UpdateShardHandler HTTP client with params: 
   [junit4]   2> 2744639 INFO  (TEST-TestSolrConfigHandlerCloud.test-seed#[A906F2217AA6E7B1]) [    ] o.a.s.l.LogWatcher SLF4J impl is org.slf4j.impl.Log4jLoggerFactory
   [junit4]   2> 2744639 INFO  (TEST-TestSolrConfigHandlerCloud.test-seed#[A906F2217AA6E7B1]) [    ] o.a.s.l.LogWatcher Registering Log Listener [Log4j (org.slf4j.impl.Log4jLoggerFactory)]
   [junit4]   2> 2744639 INFO  (TEST-TestSolrConfigHandlerCloud.test-seed#[A906F2217AA6E7B1]) [    ] o.a.s.c.ZkContainer Zookeeper client=127.0.0.1:59169/solr
   [junit4]   2> 2744639 INFO  (TEST-TestSolrConfigHandlerCloud.test-seed#[A906F2217AA6E7B1]) [    ] o.a.s.c.ZkController zkHost includes chroot
   [junit4]   2> 2744639 INFO  (TEST-TestSolrConfigHandlerCloud.test-seed#[A906F2217AA6E7B1]) [    ] o.a.s.c.c.SolrZkClient Using default ZkCredentialsProvider
   [junit4]   2> 2744640 INFO  (TEST-TestSolrConfigHandlerCloud.test-seed#[A906F2217AA6E7B1]) [    ] o.a.s.c.c.ConnectionManager Waiting for client to connect to ZooKeeper
   [junit4]   2> 2744641 INFO  (zkCallback-3586-thread-1) [    ] o.a.s.c.c.ConnectionManager Watcher org.apache.solr.common.cloud.ConnectionManager@3b1b25ff name:ZooKeeperConnection Watcher:127.0.0.1:59169 got event WatchedEvent state:SyncConnected type:None path:null path:null type:None
   [junit4]   2> 2744642 INFO  (TEST-TestSolrConfigHandlerCloud.test-seed#[A906F2217AA6E7B1]) [    ] o.a.s.c.c.ConnectionManager Client is connected to ZooKeeper
   [junit4]   2> 2744642 INFO  (TEST-TestSolrConfigHandlerCloud.test-seed#[A906F2217AA6E7B1]) [    ] o.a.s.c.c.SolrZkClient Using default ZkACLProvider
   [junit4]   2> 2744643 WARN  (NIOServerCxn.Factory:0.0.0.0/0.0.0.0:0) [    ] o.a.z.s.NIOServerCnxn caught end of stream exception
   [junit4]   2> EndOfStreamException: Unable to read additional data from client sessionid 0x1550aefc49a0003, likely client has closed socket
   [junit4]   2> 	at org.apache.zookeeper.server.NIOServerCnxn.doIO(NIOServerCnxn.java:228)
   [junit4]   2> 	at org.apache.zookeeper.server.NIOServerCnxnFactory.run(NIOServerCnxnFactory.java:208)
   [junit4]   2> 	at java.lang.Thread.run(Thread.java:745)
   [junit4]   2> 2744643 INFO  (TEST-TestSolrConfigHandlerCloud.test-seed#[A906F2217AA6E7B1]) [n:127.0.0.1:59179_    ] o.a.s.c.ZkController Added new OnReconnect listener org.apache.solr.cloud.ZkController$$Lambda$45/349613047@4678308
   [junit4]   2> 2744646 INFO  (TEST-TestSolrConfigHandlerCloud.test-seed#[A906F2217AA6E7B1]) [n:127.0.0.1:59179_    ] o.a.s.c.c.ConnectionManager Waiting for client to connect to ZooKeeper
   [junit4]   2> 2744648 INFO  (zkCallback-3587-thread-1-processing-n:127.0.0.1:59179_) [n:127.0.0.1:59179_    ] o.a.s.c.c.ConnectionManager Watcher org.apache.solr.common.cloud.ConnectionManager@6cd2ca41 name:ZooKeeperConnection Watcher:127.0.0.1:59169/solr got event WatchedEvent state:SyncConnected type:None path:null path:null type:None
   [junit4]   2> 2744648 INFO  (TEST-TestSolrConfigHandlerCloud.test-seed#[A906F2217AA6E7B1]) [n:127.0.0.1:59179_    ] o.a.s.c.c.ConnectionManager Client is connected to ZooKeeper
   [junit4]   2> 2744649 INFO  (TEST-TestSolrConfigHandlerCloud.test-seed#[A906F2217AA6E7B1]) [n:127.0.0.1:59179_    ] o.a.s.c.c.SolrZkClient makePath: /overseer/queue
   [junit4]   2> 2744652 INFO  (TEST-TestSolrConfigHandlerCloud.test-seed#[A906F2217AA6E7B1]) [n:127.0.0.1:59179_    ] o.a.s.c.c.SolrZkClient makePath: /overseer/collection-queue-work
   [junit4]   2> 2744656 INFO  (TEST-TestSolrConfigHandlerCloud.test-seed#[A906F2217AA6E7B1]) [n:127.0.0.1:59179_    ] o.a.s.c.c.SolrZkClient makePath: /overseer/collection-map-running
   [junit4]   2> 2744659 INFO  (TEST-TestSolrConfigHandlerCloud.test-seed#[A906F2217AA6E7B1]) [n:127.0.0.1:59179_    ] o.a.s.c.c.SolrZkClient makePath: /overseer/collection-map-completed
   [junit4]   2> 2744662 INFO  (TEST-TestSolrConfigHandlerCloud.test-seed#[A906F2217AA6E7B1]) [n:127.0.0.1:59179_    ] o.a.s.c.c.SolrZkClient makePath: /overseer/collection-map-failure
   [junit4]   2> 2744663 INFO  (TEST-TestSolrConfigHandlerCloud.test-seed#[A906F2217AA6E7B1]) [n:127.0.0.1:59179_    ] o.a.s.c.c.SolrZkClient makePath: /live_nodes
   [junit4]   2> 2744665 INFO  (TEST-TestSolrConfigHandlerCloud.test-seed#[A906F2217AA6E7B1]) [n:127.0.0.1:59179_    ] o.a.s.c.c.SolrZkClient makePath: /aliases.json
   [junit4]   2> 2744667 INFO  (TEST-TestSolrConfigHandlerCloud.test-seed#[A906F2217AA6E7B1]) [n:127.0.0.1:59179_    ] o.a.s.c.c.SolrZkClient makePath: /clusterstate.json
   [junit4]   2> 2744668 INFO  (TEST-TestSolrConfigHandlerCloud.test-seed#[A906F2217AA6E7B1]) [n:127.0.0.1:59179_    ] o.a.s.c.c.SolrZkClient makePath: /security.json
   [junit4]   2> 2744670 INFO  (TEST-TestSolrConfigHandlerCloud.test-seed#[A906F2217AA6E7B1]) [n:127.0.0.1:59179_    ] o.a.s.c.c.ZkStateReader Updating cluster state from ZooKeeper... 
   [junit4]   2> 2744670 INFO  (TEST-TestSolrConfigHandlerCloud.test-seed#[A906F2217AA6E7B1]) [n:127.0.0.1:59179_    ] o.a.s.c.c.ZkStateReader Loaded empty cluster properties
   [junit4]   2> 2744671 INFO  (TEST-TestSolrConfigHandlerCloud.test-seed#[A906F2217AA6E7B1]) [n:127.0.0.1:59179_    ] o.a.s.c.c.ZkStateReader Updated live nodes from ZooKeeper... (0) -> (0)
   [junit4]   2> 2744675 INFO  (TEST-TestSolrConfigHandlerCloud.test-seed#[A906F2217AA6E7B1]) [n:127.0.0.1:59179_    ] o.a.s.c.c.SolrZkClient makePath: /overseer_elect
   [junit4]   2> 2744679 INFO  (TEST-TestSolrConfigHandlerCloud.test-seed#[A906F2217AA6E7B1]) [n:127.0.0.1:59179_    ] o.a.s.c.c.SolrZkClient makePath: /overseer_elect/election
   [junit4]   2> 2744680 INFO  (TEST-TestSolrConfigHandlerCloud.test-seed#[A906F2217AA6E7B1]) [n:127.0.0.1:59179_    ] o.a.s.c.Overseer Overseer (id=null) closing
   [junit4]   2> 2744681 INFO  (TEST-TestSolrConfigHandlerCloud.test-seed#[A906F2217AA6E7B1]) [n:127.0.0.1:59179_    ] o.a.s.c.LeaderElector Joined leadership election with path: /overseer_elect/election/95994991970222084-127.0.0.1:59179_-n_0000000000
   [junit4]   2> 2744682 INFO  (TEST-TestSolrConfigHandlerCloud.test-seed#[A906F2217AA6E7B1]) [n:127.0.0.1:59179_    ] o.a.s.c.OverseerElectionContext I am going to be the leader 127.0.0.1:59179_
   [junit4]   2> 2744682 INFO  (TEST-TestSolrConfigHandlerCloud.test-seed#[A906F2217AA6E7B1]) [n:127.0.0.1:59179_    ] o.a.s.c.c.SolrZkClient makePath: /overseer_elect/leader
   [junit4]   2> 2744684 INFO  (TEST-TestSolrConfigHandlerCloud.test-seed#[A906F2217AA6E7B1]) [n:127.0.0.1:59179_    ] o.a.s.c.Overseer Overseer (id=95994991970222084-127.0.0.1:59179_-n_0000000000) starting
   [junit4]   2> 2744687 INFO  (TEST-TestSolrConfigHandlerCloud.test-seed#[A906F2217AA6E7B1]) [n:127.0.0.1:59179_    ] o.a.s.c.c.SolrZkClient makePath: /overseer/queue-work
   [junit4]   2> 2744693 INFO  (TEST-TestSolrConfigHandlerCloud.test-seed#[A906F2217AA6E7B1]) [n:127.0.0.1:59179_    ] o.a.s.c.OverseerAutoReplicaFailoverThread Starting OverseerAutoReplicaFailoverThread autoReplicaFailoverWorkLoopDelay=10000 autoReplicaFailoverWaitAfterExpiration=30000 autoReplicaFailoverBadNodeExpiration=60000
   [junit4]   2> 2744694 INFO  (TEST-TestSolrConfigHandlerCloud.test-seed#[A906F2217AA6E7B1]) [n:127.0.0.1:59179_    ] o.a.s.c.ZkController Register node as live in ZooKeeper:/live_nodes/127.0.0.1:59179_
   [junit4]   2> 2744694 INFO  (OverseerCollectionConfigSetProcessor-95994991970222084-127.0.0.1:59179_-n_0000000000) [n:127.0.0.1:59179_    ] o.a.s.c.OverseerTaskProcessor Process current queue of overseer operations
   [junit4]   2> 2744694 INFO  (OverseerStateUpdate-95994991970222084-127.0.0.1:59179_-n_0000000000) [n:127.0.0.1:59179_    ] o.a.s.c.Overseer Starting to work on the main queue
   [junit4]   2> 2744694 INFO  (TEST-TestSolrConfigHandlerCloud.test-seed#[A906F2217AA6E7B1]) [n:127.0.0.1:59179_    ] o.a.s.c.c.SolrZkClient makePath: /live_nodes/127.0.0.1:59179_
   [junit4]   2> 2744696 INFO  (zkCallback-3587-thread-1-processing-n:127.0.0.1:59179_) [n:127.0.0.1:59179_    ] o.a.s.c.c.ZkStateReader A live node change: [WatchedEvent state:SyncConnected type:NodeChildrenChanged path:/live_nodes], has occurred - updating... (live nodes size: [0])
   [junit4]   2> 2744697 INFO  (OverseerStateUpdate-95994991970222084-127.0.0.1:59179_-n_0000000000) [n:127.0.0.1:59179_    ] o.a.s.c.c.ZkStateReader Updated live nodes from ZooKeeper... (0) -> (1)
   [junit4]   2> 2744698 INFO  (zkCallback-3587-thread-1-processing-n:127.0.0.1:59179_) [n:127.0.0.1:59179_    ] o.a.s.c.c.ZkStateReader Updated live nodes from ZooKeeper... (1) -> (1)
   [junit4]   2> 2744706 INFO  (TEST-TestSolrConfigHandlerCloud.test-seed#[A906F2217AA6E7B1]) [n:127.0.0.1:59179_    ] o.a.s.c.CoreContainer Security conf doesn't exist. Skipping setup for authorization module.
   [junit4]   2> 2744706 INFO  (TEST-TestSolrConfigHandlerCloud.test-seed#[A906F2217AA6E7B1]) [n:127.0.0.1:59179_    ] o.a.s.c.CoreContainer No authentication plugin used.
   [junit4]   2> 2744708 INFO  (TEST-TestSolrConfigHandlerCloud.test-seed#[A906F2217AA6E7B1]) [n:127.0.0.1:59179_    ] o.a.s.c.CorePropertiesLocator Looking for core definitions underneath C:\Users\jenkins\workspace\Lucene-Solr-master-Windows\solr\build\solr-core\test\J0\temp\solr.handler.TestSolrConfigHandlerCloud_A906F2217AA6E7B1-001\control-001\cores
   [junit4]   2> 2744709 INFO  (TEST-TestSolrConfigHandlerCloud.test-seed#[A906F2217AA6E7B1]) [n:127.0.0.1:59179_    ] o.a.s.c.CoreDescriptor Created CoreDescriptor: {name=collection1, config=solrconfig.xml, transient=false, schema=schema.xml, loadOnStartup=true, configSetProperties=configsetprops.json, collection=control_collection, coreNodeName=, dataDir=data\, shard=}
   [junit4]   2> 2744710 INFO  (TEST-TestSolrConfigHandlerCloud.test-seed#[A906F2217AA6E7B1]) [n:127.0.0.1:59179_    ] o.a.s.c.CorePropertiesLocator Found core collection1 in C:\Users\jenkins\workspace\Lucene-Solr-master-Windows\solr\build\solr-core\test\J0\temp\solr.handler.TestSolrConfigHandlerCloud_A906F2217AA6E7B1-001\control-001\cores\collection1
   [junit4]   2> 2744710 INFO  (TEST-TestSolrConfigHandlerCloud.test-seed#[A906F2217AA6E7B1]) [n:127.0.0.1:59179_    ] o.a.s.c.CorePropertiesLocator Found 1 core definitions
   [junit4]   2> 2744711 INFO  (TEST-TestSolrConfigHandlerCloud.test-seed#[A906F2217AA6E7B1]) [n:127.0.0.1:59179_    ] o.a.s.s.SolrDispatchFilter user.dir=C:\Users\jenkins\workspace\Lucene-Solr-master-Windows\solr\build\solr-core\test\J0
   [junit4]   2> 2744711 INFO  (TEST-TestSolrConfigHandlerCloud.test-seed#[A906F2217AA6E7B1]) [n:127.0.0.1:59179_    ] o.a.s.s.SolrDispatchFilter SolrDispatchFilter.init() done
   [junit4]   2> 2744711 INFO  (coreLoadExecutor-9849-thread-1-processing-n:127.0.0.1:59179_) [n:127.0.0.1:59179_ c:control_collection   x:collection1] o.a.s.c.ZkController publishing state=down
   [junit4]   2> 2744711 INFO  (coreLoadExecutor-9849-thread-1-processing-n:127.0.0.1:59179_) [n:127.0.0.1:59179_ c:control_collection   x:collection1] o.a.s.c.ZkController numShards not found on descriptor - reading it from system property
   [junit4]   2> 2744713 INFO  (coreLoadExecutor-9849-thread-1-processing-n:127.0.0.1:59179_) [n:127.0.0.1:59179_ c:control_collection   x:collection1] o.a.s.c.ZkController Collection control_collection not visible yet, but flagging it so a watch is registered when it becomes visible
   [junit4]   2> 2744714 INFO  (OverseerStateUpdate-95994991970222084-127.0.0.1:59179_-n_0000000000) [n:127.0.0.1:59179_    ] o.a.s.c.Overseer processMessage: queueSize: 1, message = {
   [junit4]   2>   "core":"collection1",
   [junit4]   2>   "roles":null,
   [junit4]   2>   "base_url":"http://127.0.0.1:59179",
   [junit4]   2>   "node_name":"127.0.0.1:59179_",
   [junit4]   2>   "numShards":"1",
   [junit4]   2>   "state":"down",
   [junit4]   2>   "shard":null,
   [junit4]   2>   "collection":"control_collection",
   [junit4]   2>   "operation":"state"} current state version: 0
   [junit4]   2> 2744714 INFO  (OverseerStateUpdate-95994991970222084-127.0.0.1:59179_-n_0000000000) [n:127.0.0.1:59179_    ] o.a.s.c.o.ReplicaMutator Update state numShards=1 message={
   [junit4]   2>   "core":"collection1",
   [junit4]   2>   "roles":null,
   [junit4]   2>   "base_url":"http://127.0.0.1:59179",
   [junit4]   2>   "node_name":"127.0.0.1:59179_",
   [junit4]   2>   "numShards":"1",
   [junit4]   2>   "state":"down",
   [junit4]   2>   "shard":null,
   [junit4]   2>   "collection":"control_collection",
   [junit4]   2>   "operation":"state"}
   [junit4]   2> 2744714 INFO  (coreLoadExecutor-9849-thread-1-processing-n:127.0.0.1:59179_) [n:127.0.0.1:59179_ c:control_collection   x:collection1] o.a.s.c.c.ZkStateReader Deleting data for [control_collection]
   [junit4]   2> 2744714 INFO  (OverseerStateUpdate-95994991970222084-127.0.0.1:59179_-n_0000000000) [n:127.0.0.1:59179_    ] o.a.s.c.o.ClusterStateMutator building a new cName: control_collection
   [junit4]   2> 2744715 INFO  (coreLoadExecutor-9849-thread-1-processing-n:127.0.0.1:59179_) [n:127.0.0.1:59179_ c:control_collection   x:collection1] o.a.s.c.ZkController look for our core node name
   [junit4]   2> 2744715 INFO  (OverseerStateUpdate-95994991970222084-127.0.0.1:59179_-n_0000000000) [n:127.0.0.1:59179_    ] o.a.s.c.o.ReplicaMutator Assigning new node to shard shard=shard1
   [junit4]   2> 2744718 INFO  (zkCallback-3587-thread-1-processing-n:127.0.0.1:59179_) [n:127.0.0.1:59179_    ] o.a.s.c.c.ZkStateReader A cluster state change: [WatchedEvent state:SyncConnected type:NodeDataChanged path:/clusterstate.json], has occurred - updating... (live nodes size: [1])
   [junit4]   2> 2745716 INFO  (coreLoadExecutor-9849-thread-1-processing-n:127.0.0.1:59179_) [n:127.0.0.1:59179_ c:control_collection   x:collection1] o.a.s.c.ZkController waiting to find shard id in clusterstate for collection1
   [junit4]   2> 2745716 INFO  (coreLoadExecutor-9849-thread-1-processing-n:127.0.0.1:59179_) [n:127.0.0.1:59179_ c:control_collection   x:collection1] o.a.s.c.ZkController Check for collection zkNode:control_collection
   [junit4]   2> 2745716 INFO  (coreLoadExecutor-9849-thread-1-processing-n:127.0.0.1:59179_) [n:127.0.0.1:59179_ c:control_collection   x:collection1] o.a.s.c.ZkController Collection zkNode exists
   [junit4]   2> 2745716 INFO  (coreLoadExecutor-9849-thread-1-processing-n:127.0.0.1:59179_) [n:127.0.0.1:59179_ c:control_collection   x:collection1] o.a.s.c.c.ZkStateReader Load collection config from: [/collections/control_collection]
   [junit4]   2> 2745717 INFO  (coreLoadExecutor-9849-thread-1-processing-n:127.0.0.1:59179_) [n:127.0.0.1:59179_ c:control_collection   x:collection1] o.a.s.c.c.ZkStateReader path=[/collections/control_collection] [configName]=[conf1] specified config exists in ZooKeeper
   [junit4]   2> 2745717 INFO  (coreLoadExecutor-9849-thread-1-processing-n:127.0.0.1:59179_) [n:127.0.0.1:59179_ c:control_collection   x:collection1] o.a.s.c.SolrResourceLoader new SolrResourceLoader for directory: 'C:\Users\jenkins\workspace\Lucene-Solr-master-Windows\solr\build\solr-core\test\J0\temp\solr.handler.TestSolrConfigHandlerCloud_A906F2217AA6E7B1-001\control-001\cores\collection1'
   [junit4]   2> 2745717 INFO  (coreLoadExecutor-9849-thread-1-processing-n:127.0.0.1:59179_) [n:127.0.0.1:59179_ c:control_collection   x:collection1] o.a.s.c.SolrResourceLoader JNDI not configured for solr (NoInitialContextEx)
   [junit4]   2> 2745717 INFO  (coreLoadExecutor-9849-thread-1-processing-n:127.0.0.1:59179_) [n:127.0.0.1:59179_ c:control_collection   x:collection1] o.a.s.c.SolrResourceLoader solr home defaulted to 'solr/' (could not find system property or JNDI)
   [junit4]   2> 2745721 INFO  (coreLoadExecutor-9849-thread-1-processing-n:127.0.0.1:59179_) [n:127.0.0.1:59179_ c:control_collection   x:collection1] o.a.s.c.Config loaded config solrconfig.xml with version 0 
   [junit4]   2> 2745732 INFO  (coreLoadExecutor-9849-thread-1-processing-n:127.0.0.1:59179_) [n:127.0.0.1:59179_ c:control_collection   x:collection1] o.a.s.c.SolrConfig current version of requestparams : -1
   [junit4]   2> 2745734 WARN  (coreLoadExecutor-9849-thread-1-processing-n:127.0.0.1:59179_) [n:127.0.0.1:59179_ c:control_collection   x:collection1] o.a.s.c.Config Beginning with Solr 5.5, <mergePolicy> is deprecated, use <mergePolicyFactory> instead.
   [junit4]   2> 2745735 INFO  (coreLoadExecutor-9849-thread-1-processing-n:127.0.0.1:59179_) [n:127.0.0.1:59179_ c:control_collection   x:collection1] o.a.s.c.SolrConfig Using Lucene MatchVersion: 7.0.0
   [junit4]   2> 2745742 INFO  (coreLoadExecutor-9849-thread-1-processing-n:127.0.0.1:59179_) [n:127.0.0.1:59179_ c:control_collection   x:collection1] o.a.s.c.SolrConfig Loaded SolrConfig: solrconfig.xml
   [junit4]   2> 2745784 INFO  (coreLoadExecutor-9849-thread-1-processing-n:127.0.0.1:59179_) [n:127.0.0.1:59179_ c:control_collection   x:collection1] o.a.s.s.IndexSchema [collection1] Schema name=test
   [junit4]   2> 2745872 INFO  (coreLoadExecutor-9849-thread-1-processing-n:127.0.0.1:59179_) [n:127.0.0.1:59179_ c:control_collection   x:collection1] o.a.s.s.OpenExchangeRatesOrgProvider Initialized with rates=open-exchange-rates.json, refreshInterval=1440.
   [junit4]   2> 2745880 INFO  (coreLoadExecutor-9849-thread-1-processing-n:127.0.0.1:59179_) [n:127.0.0.1:59179_ c:control_collection   x:collection1] o.a.s.s.IndexSchema default search field in schema is text
   [junit4]   2> 2745882 INFO  (coreLoadExecutor-9849-thread-1-processing-n:127.0.0.1:59179_) [n:127.0.0.1:59179_ c:control_collection   x:collection1] o.a.s.s.IndexSchema unique key field: id
   [junit4]   2> 2745892 INFO  (coreLoadExecutor-9849-thread-1-processing-n:127.0.0.1:59179_) [n:127.0.0.1:59179_ c:control_collection   x:collection1] o.a.s.s.FileExchangeRateProvider Reloading exchange rates from file currency.xml
   [junit4]   2> 2745895 INFO  (coreLoadExecutor-9849-thread-1-processing-n:127.0.0.1:59179_) [n:127.0.0.1:59179_ c:control_collection   x:collection1] o.a.s.s.FileExchangeRateProvider Reloading exchange rates from file currency.xml
   [junit4]   2> 2745898 INFO  (coreLoadExecutor-9849-thread-1-processing-n:127.0.0.1:59179_) [n:127.0.0.1:59179_ c:control_collection   x:collection1] o.a.s.s.OpenExchangeRatesOrgProvider Reloading exchange rates from open-exchange-rates.json
   [junit4]   2> 2745898 INFO  (coreLoadExecutor-9849-thread-1-processing-n:127.0.0.1:59179_) [n:127.0.0.1:59179_ c:control_collection   x:collection1] o.a.s.s.OpenExchangeRatesOrgProvider Reloading exchange rates from open-exchange-rates.json
   [junit4]   2> 2745904 INFO  (coreLoadExecutor-9849-thread-1-processing-n:127.0.0.1:59179_) [n:127.0.0.1:59179_ c:control_collection   x:collection1] o.a.s.c.ConfigSetProperties Did not find ConfigSet properties, assuming default properties: Can't find resource 'configsetprops.json' in classpath or '/configs/conf1', cwd=C:\Users\jenkins\workspace\Lucene-Solr-master-Windows\solr\build\solr-core\test\J0
   [junit4]   2> 2745904 INFO  (coreLoadExecutor-9849-thread-1-processing-n:127.0.0.1:59179_) [n:127.0.0.1:59179_ c:control_collection   x:collection1] o.a.s.c.CoreContainer Creating SolrCore 'collection1' using configuration from collection control_collection
   [junit4]   2> 2745904 INFO  (coreLoadExecutor-9849-thread-1-processing-n:127.0.0.1:59179_) [n:127.0.0.1:59179_ c:control_collection s:shard1 r:core_node1 x:collection1] o.a.s.c.SolrCore org.apache.solr.core.MockDirectoryFactory
   [junit4]   2> 2745904 INFO  (coreLoadExecutor-9849-thread-1-processing-n:127.0.0.1:59179_) [n:127.0.0.1:59179_ c:control_collection s:shard1 r:core_node1 x:collection1] o.a.s.c.SolrCore [[collection1] ] Opening new SolrCore at [C:\Users\jenkins\workspace\Lucene-Solr-master-Windows\solr\build\solr-core\test\J0\temp\solr.handler.TestSolrConfigHandlerCloud_A906F2217AA6E7B1-001\control-001\cores\collection1], dataDir=[C:\Users\jenkins\workspace\Lucene-Solr-master-Windows\solr\build\solr-core\test\J0\temp\solr.handler.TestSolrConfigHandlerCloud_A906F2217AA6E7B1-001\control-001\cores\collection1\data\]
   [junit4]   2> 2745904 INFO  (coreLoadExecutor-9849-thread-1-processing-n:127.0.0.1:59179_) [n:127.0.0.1:59179_ c:control_collection s:shard1 r:core_node1 x:collection1] o.a.s.c.JmxMonitoredMap JMX monitoring is enabled. Adding Solr mbeans to JMX Server: com.sun.jmx.mbeanserver.JmxMBeanServer@4d8a5f9
   [junit4]   2> 2745905 INFO  (coreLoadExecutor-9849-thread-1-processing-n:127.0.0.1:59179_) [n:127.0.0.1:59179_ c:control_collection s:shard1 r:core_node1 x:collection1] o.a.s.c.CachingDirectoryFactory return new directory for C:\Users\jenkins\workspace\Lucene-Solr-master-Windows\solr\build\solr-core\test\J0\temp\solr.handler.TestSolrConfigHandlerCloud_A906F2217AA6E7B1-001\control-001\cores\collection1\data\
   [junit4]   2> 2745905 INFO  (coreLoadExecutor-9849-thread-1-processing-n:127.0.0.1:59179_) [n:127.0.0.1:59179_ c:control_collection s:shard1 r:core_node1 x:collection1] o.a.s.c.SolrCore New index directory detected: old=null new=C:\Users\jenkins\workspace\Lucene-Solr-master-Windows\solr\build\solr-core\test\J0\temp\solr.handler.TestSolrConfigHandlerCloud_A906F2217AA6E7B1-001\control-001\cores\collection1\data\index/
   [junit4]   2> 2745905 WARN  (coreLoadExecutor-9849-thread-1-processing-n:127.0.0.1:59179_) [n:127.0.0.1:59179_ c:control_collection s:shard1 r:core_node1 x:collection1] o.a.s.c.SolrCore [collection1] Solr index directory 'C:\Users\jenkins\workspace\Lucene-Solr-master-Windows\solr\build\solr-core\test\J0\temp\solr.handler.TestSolrConfigHandlerCloud_A906F2217AA6E7B1-001\control-001\cores\collection1\data\index' doesn't exist. Creating new index...
   [junit4]   2> 2745906 INFO  (coreLoadExecutor-9849-thread-1-processing-n:127.0.0.1:59179_) [n:127.0.0.1:59179_ c:control_collection s:shard1 r:core_node1 x:collection1] o.a.s.c.CachingDirectoryFactory return new directory for C:\Users\jenkins\workspace\Lucene-Solr-master-Windows\solr\build\solr-core\test\J0\temp\solr.handler.TestSolrConfigHandlerCloud_A906F2217AA6E7B1-001\control-001\cores\collection1\data\index
   [junit4]   2> 2745906 INFO  (coreLoadExecutor-9849-thread-1-processing-n:127.0.0.1:59179_) [n:127.0.0.1:59179_ c:control_collection s:shard1 r:core_node1 x:collection1] o.a.s.u.RandomMergePolicy RandomMergePolicy wrapping class org.apache.lucene.index.TieredMergePolicy: [TieredMergePolicy: maxMergeAtOnce=20, maxMergeAtOnceExplicit=29, maxMergedSegmentMB=75.33984375, floorSegmentMB=2.1513671875, forceMergeDeletesPctAllowed=3.939136851071291, segmentsPerTier=28.0, maxCFSSegmentSizeMB=1.8017578125, noCFSRatio=0.0
   [junit4]   2> 2745906 INFO  (coreLoadExecutor-9849-thread-1-processing-n:127.0.0.1:59179_) [n:127.0.0.1:59179_ c:control_collection s:shard1 r:core_node1 x:collection1] o.a.s.c.SolrDeletionPolicy SolrDeletionPolicy.onCommit: commits: num=1
   [junit4]   2> 	commit{dir=MockDirectoryWrapper(RAMDirectory@58fe2fb0 lockFactory=org.apache.lucene.store.SingleInstanceLockFactory@7e4168e),segFN=segments_1,generation=1}
   [junit4]   2> 2745906 INFO  (coreLoadExecutor-9849-thread-1-processing-n:127.0.0.1:59179_) [n:127.0.0.1:59179_ c:control_collection s:shard1 r:core_node1 x:collection1] o.a.s.c.SolrDeletionPolicy newest commit generation = 1
   [junit4]   2> 2745907 INFO  (OldIndexDirectoryCleanupThreadForCore-collection1) [n:127.0.0.1:59179_ c:control_collection s:shard1 r:core_node1 x:collection1] o.a.s.c.SolrCore Looking for old index directories to cleanup for core collection1 in C:\Users\jenkins\workspace\Lucene-Solr-master-Windows\solr\build\solr-core\test\J0\temp\solr.handler.TestSolrConfigHandlerCloud_A906F2217AA6E7B1-001\control-001\cores\collection1\data\
   [junit4]   2> 2745907 WARN  (OldIndexDirectoryCleanupThreadForCore-collection1) [n:127.0.0.1:59179_ c:control_collection s:shard1 r:core_node1 x:collection1] o.a.s.c.DirectoryFactory C:\Users\jenkins\workspace\Lucene-Solr-master-Windows\solr\build\solr-core\test\J0\temp\solr.handler.TestSolrConfigHandlerCloud_A906F2217AA6E7B1-001\control-001\cores\collection1\data\ does not point to a valid data directory; skipping clean-up of old index directories.
   [junit4]   2> 2745908 INFO  (coreLoadExecutor-9849-thread-1-processing-n:127.0.0.1:59179_) [n:127.0.0.1:59179_ c:control_collection s:shard1 r:core_node1 x:collection1] o.a.s.u.p.UpdateRequestProcessorChain creating updateRequestProcessorChain "nodistrib"
   [junit4]   2> 2745910 INFO  (coreLoadExecutor-9849-thread-1-processing-n:127.0.0.1:59179_) [n:127.0.0.1:59179_ c:control_collection s:shard1 r:core_node1 x:collection1] o.a.s.u.p.UpdateRequestProcessorChain creating updateRequestProcessorChain "dedupe"
   [junit4]   2> 2745910 INFO  (coreLoadExecutor-9849-thread-1-processing-n:127.0.0.1:59179_) [n:127.0.0.1:59179_ c:control_collection s:shard1 r:core_node1 x:collection1] o.a.s.u.p.UpdateRequestProcessorChain inserting DistributedUpdateProcessorFactory into updateRequestProcessorChain "dedupe"
   [junit4]   2> 2745910 INFO  (coreLoadExecutor-9849-thread-1-processing-n:127.0.0.1:59179_) [n:127.0.0.1:59179_ c:control_collection s:shard1 r:core_node1 x:collection1] o.a.s.u.p.UpdateRequestProcessorChain creating updateRequestProcessorChain "stored_sig"
   [junit4]   2> 2745910 INFO  (coreLoadExecutor-9849-thread-1-processing-n:127.0.0.1:59179_) [n:127.0.0.1:59179_ c:control_collection s:shard1 r:core_node1 x:collection1] o.a.s.u.p.UpdateRequestProcessorChain inserting DistributedUpdateProcessorFactory into updateRequestProcessorChain "stored_sig"
   [junit4]   2> 2745910 INFO  (coreLoadExecutor-9849-thread-1-processing-n:127.0.0.1:59179_) [n:127.0.0.1:59179_ c:control_collection s:shard1 r:core_node1 x:collection1] o.a.s.u.p.UpdateRequestProcessorChain creating updateRequestProcessorChain "distrib-dup-test-chain-explicit"
   [junit4]   2> 2745910 INFO  (coreLoadExecutor-9849-thread-1-processing-n:127.0.0.1:59179_) [n:127.0.0.1:59179_ c:control_collection s:shard1 r:core_node1 x:collection1] o.a.s.u.p.UpdateRequestProcessorChain creating updateRequestProcessorChain "distrib-dup-test-chain-implicit"
   [junit4]   2> 2745910 INFO  (coreLoadExecutor-9849-thread-1-processing-n:127.0.0.1:59179_) [n:127.0.0.1:59179_ c:control_collection s:shard1 r:core_node1 x:collection1] o.a.s.u.p.UpdateRequestProcessorChain inserting DistributedUpdateProcessorFactory into updateRequestProcessorChain "distrib-dup-test-chain-implicit"
   [junit4]   2> 2745910 INFO  (coreLoadExecutor-9849-thread-1-processing-n:127.0.0.1:59179_) [n:127.0.0.1:59179_ c:control_collection s:shard1 r:core_node1 x:collection1] o.a.s.c.SolrCore no updateRequestProcessorChain defined as default, creating implicit default
   [junit4]   2> 2745910 WARN  (coreLoadExecutor-9849-thread-1-processing-n:127.0.0.1:59179_) [n:127.0.0.1:59179_ c:control_collection s:shard1 r:core_node1 x:collection1] o.a.s.c.RequestHandlers INVALID paramSet a in requestHandler {type = requestHandler,name = /dump,class = DumpRequestHandler,args = {defaults={a=A,b=B}}}
   [junit4]   2> 2745918 INFO  (coreLoadExecutor-9849-thread-1-processing-n:127.0.0.1:59179_) [n:127.0.0.1:59179_ c:control_collection s:shard1 r:core_node1 x:collection1] o.a.s.h.l.XMLLoader xsltCacheLifetimeSeconds=60
   [junit4]   2> 2745920 INFO  (coreLoadExecutor-9849-thread-1-processing-n:127.0.0.1:59179_) [n:127.0.0.1:59179_ c:control_collection s:shard1 r:core_node1 x:collection1] o.a.s.h.l.XMLLoader xsltCacheLifetimeSeconds=60
   [junit4]   2> 2745920 INFO  (coreLoadExecutor-9849-thread-1-processing-n:127.0.0.1:59179_) [n:127.0.0.1:59179_ c:control_collection s:shard1 r:core_node1 x:collection1] o.a.s.h.l.XMLLoader xsltCacheLifetimeSeconds=60
   [junit4]   2> 2745921 INFO  (coreLoadExecutor-9849-thread-1-processing-n:127.0.0.1:59179_) [n:127.0.0.1:59179_ c:control_collection s:shard1 r:core_node1 x:collection1] o.a.s.h.l.XMLLoader xsltCacheLifetimeSeconds=60
   [junit4]   2> 2745948 INFO  (coreLoadExecutor-9849-thread-1-processing-n:127.0.0.1:59179_) [n:127.0.0.1:59179_ c:control_collection s:shard1 r:core_node1 x:collection1] o.a.s.c.RequestHandlers Registered paths: /admin/mbeans,standard,/update/json/docs,/admin/luke,/export,/get,/admin/properties,/update/json,/admin/threads,/dump,/update/csv,/sql,/graph,/admin/segments,/admin/system,/replication,/config,/stream,/schema,/admin/plugins,/admin/logging,/admin/ping,/update,/admin/file
   [junit4]   2> 2745951 INFO  (coreLoadExecutor-9849-thread-1-processing-n:127.0.0.1:59179_) [n:127.0.0.1:59179_ c:control_collection s:shard1 r:core_node1 x:collection1] o.a.s.c.SolrCore Using default statsCache cache: org.apache.solr.search.stats.LocalStatsCache
   [junit4]   2> 2745952 INFO  (coreLoadExecutor-9849-thread-1-processing-n:127.0.0.1:59179_) [n:127.0.0.1:59179_ c:control_collection s:shard1 r:core_node1 x:collection1] o.a.s.u.UpdateHandler Using UpdateLog implementation: org.apache.solr.update.UpdateLog
   [junit4]   2> 2745952 INFO  (coreLoadExecutor-9849-thread-1-processing-n:127.0.0.1:59179_) [n:127.0.0.1:59179_ c:control_collection s:shard1 r:core_node1 x:collection1] o.a.s.u.UpdateLog Initializing UpdateLog: dataDir= defaultSyncLevel=FLUSH numRecordsToKeep=100 maxNumLogsToKeep=10 numVersionBuckets=65536
   [junit4]   2> 2745954 INFO  (coreLoadExecutor-9849-thread-1-processing-n:127.0.0.1:59179_) [n:127.0.0.1:59179_ c:control_collection s:shard1 r:core_node1 x:collection1] o.a.s.u.CommitTracker Hard AutoCommit: disabled
   [junit4]   2> 2745954 INFO  (coreLoadExecutor-9849-thread-1-processing-n:127.0.0.1:59179_) [n:127.0.0.1:59179_ c:control_collection s:shard1 r:core_node1 x:collection1] o.a.s.u.CommitTracker Soft AutoCommit: disabled
   [junit4]   2> 2745955 INFO  (coreLoadExecutor-9849-thread-1-processing-n:127.0.0.1:59179_) [n:127.0.0.1:59179_ c:control_collection s:shard1 r:core_node1 x:collection1] o.a.s.u.RandomMergePolicy RandomMergePolicy wrapping class org.apache.lucene.index.AlcoholicMergePolicy: [AlcoholicMergePolicy: minMergeSize=0, mergeFactor=10, maxMergeSize=2029748862, maxMergeSizeForForcedMerge=9223372036854775807, calibrateSizeByDeletes=true, maxMergeDocs=2147483647, maxCFSSegmentSizeMB=8.796093022207999E12, noCFSRatio=0.1]
   [junit4]   2> 2745955 INFO  (coreLoadExecutor-9849-thread-1-processing-n:127.0.0.1:59179_) [n:127.0.0.1:59179_ c:control_collection s:shard1 r:core_node1 x:collection1] o.a.s.c.SolrDeletionPolicy SolrDeletionPolicy.onInit: commits: num=1
   [junit4]   2> 	commit{dir=MockDirectoryWrapper(RAMDirectory@58fe2fb0 lockFactory=org.apache.lucene.store.SingleInstanceLockFactory@7e4168e),segFN=segments_1,generation=1}
   [junit4]   2> 2745955 INFO  (coreLoadExecutor-9849-thread-1-processing-n:127.0.0.1:59179_) [n:127.0.0.1:59179_ c:control_collection s:shard1 r:core_node1 x:collection1] o.a.s.c.SolrDeletionPolicy newest commit generation = 1
   [junit4]   2> 2745955 INFO  (coreLoadExecutor-9849-thread-1-processing-n:127.0.0.1:59179_) [n:127.0.0.1:59179_ c:control_collection s:shard1 r:core_node1 x:collection1] o.a.s.s.SolrIndexSearcher Opening [Searcher@3ffb7815[collection1] main]
   [junit4]   2> 2745955 INFO  (coreLoadExecutor-9849-thread-1-processing-n:127.0.0.1:59179_) [n:127.0.0.1:59179_ c:control_collection s:shard1 r:core_node1 x:collection1] o.a.s.c.c.ZkStateReader Load collection config from: [/collections/control_collection]
   [junit4]   2> 2745957 INFO  (coreLoadExecutor-9849-thread-1-processing-n:127.0.0.1:59179_) [n:127.0.0.1:59179_ c:control_collection s:shard1 r:core_node1 x:collection1] o.a.s.c.c.ZkStateReader path=[/collections/control_collection] [configName]=[conf1] specified config exists in ZooKeeper
   [junit4]   2> 2745957 INFO  (coreLoadExecutor-9849-thread-1-processing-n:127.0.0.1:59179_) [n:127.0.0.1:59179_ c:control_collection s:shard1 r:core_node1 x:collection1] o.a.s.r.ManagedResourceStorage Setting up ZooKeeper-based storage for the RestManager with znodeBase: /configs/conf1
   [junit4]   2> 2745957 INFO  (coreLoadExecutor-9849-thread-1-processing-n:127.0.0.1:59179_) [n:127.0.0.1:59179_ c:control_collection s:shard1 r:core_node1 x:collection1] o.a.s.r.ManagedResourceStorage Configured ZooKeeperStorageIO with znodeBase: /configs/conf1
   [junit4]   2> 2745957 INFO  (coreLoadExecutor-9849-thread-1-processing-n:127.0.0.1:59179_) [n:127.0.0.1:59179_ c:control_collection s:shard1 r:core_node1 x:collection1] o.a.s.r.RestManager Initializing RestManager with initArgs: {}
   [junit4]   2> 2745957 INFO  (coreLoadExecutor-9849-thread-1-processing-n:127.0.0.1:59179_) [n:127.0.0.1:59179_ c:control_collection s:shard1 r:core_node1 x:collection1] o.a.s.r.ManagedResourceStorage Reading _rest_managed.json using ZooKeeperStorageIO:path=/configs/conf1
   [junit4]   2> 2745958 INFO  (coreLoadExecutor-9849-thread-1-processing-n:127.0.0.1:59179_) [n:127.0.0.1:59179_ c:control_collection s:shard1 r:core_node1 x:collection1] o.a.s.r.ManagedResourceStorage No data found for znode /configs/conf1/_rest_managed.json
   [junit4]   2> 2745958 INFO  (coreLoadExecutor-9849-thread-1-processing-n:127.0.0.1:59179_) [n:127.0.0.1:59179_ c:control_collection s:shard1 r:core_node1 x:collection1] o.a.s.r.ManagedResourceStorage Loaded null at path _rest_managed.json using ZooKeeperStorageIO:path=/configs/conf1
   [junit4]   2> 2745958 INFO  (coreLoadExecutor-9849-thread-1-processing-n:127.0.0.1:59179_) [n:127.0.0.1:59179_ c:control_collection s:shard1 r:core_node1 x:collection1] o.a.s.r.RestManager Initializing 0 registered ManagedResources
   [junit4]   2> 2745958 INFO  (coreLoadExecutor-9849-thread-1-processing-n:127.0.0.1:59179_) [n:127.0.0.1:59179_ c:control_collection s:shard1 r:core_node1 x:collection1] o.a.s.h.ReplicationHandler Commits will be reserved for  10000
   [junit4]   2> 2745959 INFO  (searcherExecutor-9850-thread-1-processing-n:127.0.0.1:59179_ x:collection1 s:shard1 c:control_collection r:core_node1) [n:127.0.0.1:59179_ c:control_collection s:shard1 r:core_node1 x:collection1] o.a.s.c.SolrCore [collection1] Registered new searcher Searcher@3ffb7815[collection1] main{ExitableDirectoryReader(UninvertingDirectoryReader())}
   [junit4]   2> 2745959 INFO  (coreLoadExecutor-9849-thread-1-processing-n:127.0.0.1:59179_) [n:127.0.0.1:59179_ c:control_collection s:shard1 r:core_node1 x:collection1] o.a.s.u.UpdateLog Looking up max value of version field to seed version buckets
   [junit4]   2> 2745959 INFO  (coreLoadExecutor-9849-thread-1-processing-n:127.0.0.1:59179_) [n:127.0.0.1:59179_ c:control_collection s:shard1 r:core_node1 x:collection1] o.a.s.u.VersionInfo Refreshing highest value of _version_ for 65536 version buckets from index
   [junit4]   2> 2745959 INFO  (coreLoadExecutor-9849-thread-1-processing-n:127.0.0.1:59179_) [n:127.0.0.1:59179_ c:control_collection s:shard1 r:core_node1 x:collection1] o.a.s.u.VersionInfo No terms found for _version_, cannot seed version bucket highest value from index
   [junit4]   2> 2745959 INFO  (coreLoadExecutor-9849-thread-1-processing-n:127.0.0.1:59179_) [n:127.0.0.1:59179_ c:control_collection s:shard1 r:core_node1 x:collection1] o.a.s.u.UpdateLog Could not find max version in index or recent updates, using new clock 1535919873828323328
   [junit4]   2> 2745960 INFO  (coreLoadExecutor-9849-thread-1-processing-n:127.0.0.1:59179_) [n:127.0.0.1:59179_ c:control_collection s:shard1 r:core_node1 x:collection1] o.a.s.u.UpdateLog Took 1.0ms to seed version buckets with highest version 1535919873828323328
   [junit4]   2> 2745960 INFO  (coreLoadExecutor-9849-thread-1-processing-n:127.0.0.1:59179_) [n:127.0.0.1:59179_ c:control_collection s:shard1 r:core_node1 x:collection1] o.a.s.c.ZkController watch zkdir /configs/conf1
   [junit4]   2> 2745960 INFO  (coreLoadExecutor-9849-thread-1-processing-n:127.0.0.1:59179_) [n:127.0.0.1:59179_ c:control_collection s:shard1 r:core_node1 x:collection1] o.a.s.c.CoreContainer registering core: collection1
   [junit4]   2> 2745963 INFO  (coreZkRegister-9843-thread-1-processing-n:127.0.0.1:59179_ x:collection1 s:shard1 c:control_collection r:core_node1) [n:127.0.0.1:59179_ c:control_collection s:shard1 r:core_node1 x:collection1] o.a.s.c.ZkController Register replica - core:collection1 address:http://127.0.0.1:59179 collection:control_collection shard:shard1
   [junit4]   2> 2745964 INFO  (coreZkRegister-9843-thread-1-processing-n:127.0.0.1:59179_ x:collection1 s:shard1 c:control_collection r:core_node1) [n:127.0.0.1:59179_ c:control_collection s:shard1 r:core_node1 x:collection1] o.a.s.c.c.SolrZkClient makePath: /collections/control_collection/leader_elect/shard1/election
   [junit4]   2> 2745969 INFO  (coreZkRegister-9843-thread-1-processing-n:127.0.0.1:59179_ x:collection1 s:shard1 c:control_collection r:core_node1) [n:127.0.0.1:59179_ c:control_collection s:shard1 r:core_node1 x:collection1] o.a.s.c.LeaderElector Joined leadership election with path: /collections/control_collection/leader_elect/shard1/election/95994991970222084-core_node1-n_0000000000
   [junit4]   2> 2745970 INFO  (coreZkRegister-9843-thread-1-processing-n:127.0.0.1:59179_ x:collection1 s:shard1 c:control_collection r:core_node1) [n:127.0.0.1:59179_ c:control_collection s:shard1 r:core_node1 x:collection1] o.a.s.c.ShardLeaderElectionContext Running the leader process for shard=shard1 and weAreReplacement=false and leaderVoteWait=10000
   [junit4]   2> 2745972 INFO  (coreZkRegister-9843-thread-1-processing-n:127.0.0.1:59179_ x:collection1 s:shard1 c:control_collection r:core_node1) [n:127.0.0.1:59179_ c:control_collection s:shard1 r:core_node1 x:collection1] o.a.s.c.ShardLeaderElectionContext Enough replicas found to continue.
   [junit4]   2> 2745972 INFO  (coreZkRegister-9843-thread-1-processing-n:127.0.0.1:59179_ x:collection1 s:shard1 c:control_collection r:core_node1) [n:127.0.0.1:59179_ c:control_collection s:shard1 r:core_node1 x:collection1] o.a.s.c.ShardLeaderElectionContext I may be the new leader - try and sync
   [junit4]   2> 2745972 INFO  (coreZkRegister-9843-thread-1-processing-n:127.0.0.1:59179_ x:collection1 s:shard1 c:control_collection r:core_node1) [n:127.0.0.1:59179_ c:control_collection s:shard1 r:core_node1 x:collection1] o.a.s.c.SyncStrategy Sync replicas to http://127.0.0.1:59179/collection1/
   [junit4]   2> 2745972 INFO  (coreZkRegister-9843-thread-1-processing-n:127.0.0.1:59179_ x:collection1 s:shard1 c:control_collection r:core_node1) [n:127.0.0.1:59179_ c:control_collection s:shard1 r:core_node1 x:collection1] o.a.s.c.SyncStrategy Sync Success - now sync replicas to me
   [junit4]   2> 2745972 INFO  (coreZkRegister-9843-thread-1-processing-n:127.0.0.1:59179_ x:collection1 s:shard1 c:control_collection r:core_node1) [n:127.0.0.1:59179_ c:control_collection s:shard1 r:core_node1 x:collection1] o.a.s.c.SyncStrategy http://127.0.0.1:59179/collection1/ has no replicas
   [junit4]   2> 2745973 INFO  (OverseerStateUpdate-95994991970222084-127.0.0.1:59179_-n_0000000000) [n:127.0.0.1:59179_    ] o.a.s.c.Overseer processMessage: queueSize: 1, message = {
   [junit4]   2>   "operation":"leader",
   [junit4]   2>   "shard":"shard1",
   [junit4]   2>   "collection":"control_collection"} current state version: 1
   [junit4]   2> 2745973 INFO  (coreZkRegister-9843-thread-1-processing-n:127.0.0.1:59179_ x:collection1 s:shard1 c:control_collection r:core_node1) [n:127.0.0.1:59179_ c:control_collection s:shard1 r:core_node1 x:collection1] o.a.s.c.c.SolrZkClient makePath: /collections/control_collection/leaders/shard1
   [junit4]   2> 2745977 INFO  (coreZkRegister-9843-thread-1-processing-n:127.0.0.1:59179_ x:collection1 s:shard1 c:control_collection r:core_node1) [n:127.0.0.1:59179_ c:control_collection s:shard1 r:core_node1 x:collection1] o.a.s.c.ShardLeaderElectionContextBase Creating leader registration node /collections/control_collection/leaders/shard1/leader after winning as /collections/control_collection/leader_elect/shard1/election/95994991970222084-core_node1-n_0000000000
   [junit4]   2> 2745980 INFO  (coreZkRegister-9843-thread-1-processing-n:127.0.0.1:59179_ x:collection1 s:shard1 c:control_collection r:core_node1) [n:127.0.0.1:59179_ c:control_collection s:shard1 r:core_node1 x:collection1] o.a.s.c.ShardLeaderElectionContext I am the new leader: http://127.0.0.1:59179/collection1/ shard1
   [junit4]   2> 2745981 INFO  (OverseerStateUpdate-95994991970222084-127.0.0.1:59179_-n_0000000000) [n:127.0.0.1:59179_    ] o.a.s.c.Overseer processMessage: queueSize: 1, message = {
   [junit4]   2>   "operation":"leader",
   [junit4]   2>   "shard":"shard1",
   [junit4]   2>   "collection":"control_collection",
   [junit4]   2>   "base_url":"http://127.0.0.1:59179",
   [junit4]   2>   "core":"collection1",
   [junit4]   2>   "state":"active"} current state version: 1
   [junit4]   2> 2746085 INFO  (zkCallback-3587-thread-1-processing-n:127.0.0.1:59179_) [n:127.0.0.1:59179_    ] o.a.s.c.c.ZkStateReader A cluster state change: [WatchedEvent state:SyncConnected type:NodeDataChanged path:/clusterstate.json], has occurred - updating... (live nodes size: [1])
   [junit4]   2> 2746133 INFO  (coreZkRegister-9843-thread-1-processing-n:127.0.0.1:59179_ x:collection1 s:shard1 c:control_collection r:core_node1) [n:127.0.0.1:59179_ c:control_collection s:shard1 r:core_node1 x:collection1] o.a.s.c.ZkController We are http://127.0.0.1:59179/collection1/ and leader is http://127.0.0.1:59179/collection1/
   [junit4]   2> 2746133 INFO  (coreZkRegister-9843-thread-1-processing-n:127.0.0.1:59179_ x:collection1 s:shard1 c:control_collection r:core_node1) [n:127.0.0.1:59179_ c:control_collection s:shard1 r:core_node1 x:collection1] o.a.s.c.ZkController No LogReplay needed for core=collection1 baseURL=http://127.0.0.1:59179
   [junit4]   2> 2746133 INFO  (coreZkRegister-9843-thread-1-processing-n:127.0.0.1:59179_ x:collection1 s:shard1 c:control_collection r:core_node1) [n:127.0.0.1:59179_ c:control_collection s:shard1 r:core_node1 x:collection1] o.a.s.c.ZkController I am the leader, no recovery necessary
   [junit4]   2> 2746133 INFO  (coreZkRegister-9843-thread-1-processing-n:127.0.0.1:59179_ x:collection1 s:shard1 c:control_collection r:core_node1) [n:127.0.0.1:59179_ c:control_collection s:shard1 r:core_node1 x:collection1] o.a.s.c.ZkController publishing state=active
   [junit4]   2> 2746133 INFO  (coreZkRegister-9843-thread-1-processing-n:127.0.0.1:59179_ x:collection1 s:shard1 c:control_collection r:core_node1) [n:127.0.0.1:59179_ c:control_collection s:shard1 r:core_node1 x:collection1] o.a.s.c.ZkController numShards not found on descriptor - reading it from system property
   [junit4]   2> 2746137 INFO  (OverseerStateUpdate-95994991970222084-127.0.0.1:59179_-n_0000000000) [n:127.0.0.1:59179_    ] o.a.s.c.Overseer processMessage: queueSize: 1, message = {
   [junit4]   2>   "core":"collection1",
   [junit4]   2>   "core_node_name":"core_node1",
   [junit4]   2>   "roles":null,
   [junit4]   2>   "base_url":"http://127.0.0.1:59179",
   [junit4]   2>   "node_name":"127.0.0.1:59179_",
   [junit4]   2>   "numShards":"1",
   [junit4]   2>   "state":"active",
   [junit4]   2>   "shard":"shard1",
   [junit4]   2>   "collection":"control_collection",
   [junit4]   2>   "operation":"state"} current state version: 2
   [junit4]   2> 2746137 INFO  (OverseerStateUpdate-95994991970222084-127.0.0.1:59179_-n_0000000000) [n:127.0.0.1:59179_    ] o.a.s.c.o.ReplicaMutator Update state numShards=1 message={
   [junit4]   2>   "core":"collection1",
   [junit4]   2>   "core_node_name":"core_node1",
   [junit4]   2>   "roles":null,
   [junit4]   2>   "base_url":"http://127.0.0.1:59179",
   [junit4]   2>   "node_name":"127.0.0.1:59179_",
   [junit4]   2>   "numShards":"1",
   [junit4]   2>   "state":"active",
   [junit4]   2>   "shard":"shard1",
   [junit4]   2>   "collection":"control_collection",
   [junit4]   2>   "operation":"state"}
   [junit4]   2> 2746217 INFO  (TEST-TestSolrConfigHandlerCloud.test-seed#[A906F2217AA6E7B1]) [    ] o.a.s.c.c.SolrZkClient Using default ZkCredentialsProvider
   [junit4]   2> 2746219 INFO  (TEST-TestSolrConfigHandlerCloud.test-seed#[A906F2217AA6E7B1]) [    ] o.a.s.c.c.ConnectionManager Waiting for client to connect to ZooKeeper
   [junit4]   2> 2746221 INFO  (zkCallback-3591-thread-1) [    ] o.a.s.c.c.ConnectionManager Watcher org.apache.solr.common.cloud.ConnectionManager@140c0db name:ZooKeeperConnection Watcher:127.0.0.1:59169/solr got event WatchedEvent state:SyncConnected type:None path:null path:null type:None
   [junit4]   2> 2746221 INFO  (TEST-TestSolrConfigHandlerCloud.test-seed#[A906F2217AA6E7B1]) [    ] o.a.s.c.c.ConnectionManager Client is connected to ZooKeeper
   [junit4]   2> 2746221 INFO  (TEST-TestSolrConfigHandlerCloud.test-seed#[A906F2217AA6E7B1]) [    ] o.a.s.c.c.SolrZkClient Using default ZkACLProvider
   [junit4]   2> 2746221 INFO  (TEST-TestSolrConfigHandlerCloud.test-seed#[A906F2217AA6E7B1]) [    ] o.a.s.c.c.ZkStateReader Updating cluster state from ZooKeeper... 
   [junit4]   2> 2746222 INFO  (TEST-TestSolrConfigHandlerCloud.test-seed#[A906F2217AA6E7B1]) [    ] o.a.s.c.c.ZkStateReader Loaded empty cluster properties
   [junit4]   2> 2746223 INFO  (TEST-TestSolrConfigHandlerCloud.test-seed#[A906F2217AA6E7B1]) [    ] o.a.s.c.c.ZkStateReader Updated live nodes from ZooKeeper... (0) -> (1)
   [junit4]   2> 2746224 INFO  (TEST-TestSolrConfigHandlerCloud.test-seed#[A906F2217AA6E7B1]) [    ] o.a.s.c.ChaosMonkey monkey: init - expire sessions:false cause connection loss:false
   [junit4]   2> 2746242 INFO  (zkCallback-3591-thread-1) [    ] o.a.s.c.c.ZkStateReader A cluster state change: [WatchedEvent state:SyncConnected type:NodeDataChanged path:/clusterstate.json], has occurred - updating... (live nodes size: [1])
   [junit4]   2> 2746242 INFO  (zkCallback-3587-thread-1-processing-n:127.0.0.1:59179_) [n:127.0.0.1:59179_    ] o.a.s.c.c.ZkStateReader A cluster state change: [WatchedEvent state:SyncConnected type:NodeDataChanged path:/clusterstate.json], has occurred - updating... (live nodes size: [1])
   [junit4]   2> 2746810 INFO  (TEST-TestSolrConfigHandlerCloud.test-seed#[A906F2217AA6E7B1]) [    ] o.a.s.SolrTestCaseJ4 Writing core.properties file to C:\Users\jenkins\workspace\Lucene-Solr-master-Windows\solr\build\solr-core\test\J0\temp\solr.handler.TestSolrConfigHandlerCloud_A906F2217AA6E7B1-001\shard-1-001\cores\collection1
   [junit4]   2> 2746812 INFO  (TEST-TestSolrConfigHandlerCloud.test-seed#[A906F2217AA6E7B1]) [    ] o.a.s.c.AbstractFullDistribZkTestBase create jetty 1 in directory C:\Users\jenkins\workspace\Lucene-Solr-master-Windows\solr\build\solr-core\test\J0\temp\solr.handler.TestSolrConfigHandlerCloud_A906F2217AA6E7B1-001\shard-1-001
   [junit4]   2> 2746813 INFO  (TEST-TestSolrConfigHandlerCloud.test-seed#[A906F2217AA6E7B1]) [    ] o.e.j.s.Server jetty-9.3.8.v20160314
   [junit4]   2> 2746814 INFO  (TEST-TestSolrConfigHandlerCloud.test-seed#[A906F2217AA6E7B1]) [    ] o.e.j.s.h.ContextHandler Started o.e.j.s.ServletContextHandler@36ddc27{/,null,AVAILABLE}
   [junit4]   2> 2746815 INFO  (TEST-TestSolrConfigHandlerCloud.test-seed#[A906F2217AA6E7B1]) [    ] o.e.j.s.ServerConnector Started ServerConnector@3dd691e5{HTTP/1.1,[http/1.1]}{127.0.0.1:59197}
   [junit4]   2> 2746816 INFO  (TEST-TestSolrConfigHandlerCloud.test-seed#[A906F2217AA6E7B1]) [    ] o.e.j.s.Server Started @2751164ms
   [junit4]   2> 2746817 INFO  (TEST-TestSolrConfigHandlerCloud.test-seed#[A906F2217AA6E7B1]) [    ] o.a.s.c.s.e.JettySolrRunner Jetty properties: {solr.data.dir=C:\Users\jenkins\workspace\Lucene-Solr-master-Windows\solr\build\solr-core\test\J0\temp\solr.handler.TestSolrConfigHandlerCloud_A906F2217AA6E7B1-001\tempDir-001/jetty1, solrconfig=solrconfig.xml, hostContext=/, hostPort=59197, coreRootDirectory=C:\Users\jenkins\workspace\Lucene-Solr-master-Windows\solr\build\solr-core\test\J0\..\..\..\..\..\..\..\..\..\Users\jenkins\workspace\Lucene-Solr-master-Windows\solr\build\solr-core\test\J0\temp\solr.handler.TestSolrConfigHandlerCloud_A906F2217AA6E7B1-001\shard-1-001\cores}
   [junit4]   2> 2746817 INFO  (TEST-TestSolrConfigHandlerCloud.test-seed#[A906F2217AA6E7B1]) [    ] o.a.s.s.SolrDispatchFilter SolrDispatchFilter.init(): sun.misc.Launcher$AppClassLoader@73d16e93
   [junit4]   2> 2746817 INFO  (TEST-TestSolrConfigHandlerCloud.test-seed#[A906F2217AA6E7B1]) [    ] o.a.s.c.SolrResourceLoader new SolrResourceLoader for directory: 'C:\Users\jenkins\workspace\Lucene-Solr-master-Windows\solr\build\solr-core\test\J0\temp\solr.handler.TestSolrConfigHandlerCloud_A906F2217AA6E7B1-001\shard-1-001'
   [junit4]   2> 2746817 INFO  (TEST-TestSolrConfigHandlerCloud.test-seed#[A906F2217AA6E7B1]) [    ] o.a.s.c.SolrResourceLoader JNDI not configured for solr (NoInitialContextEx)
   [junit4]   2> 2746817 INFO  (TEST-TestSolrConfigHandlerCloud.test-seed#[A906F2217AA6E7B1]) [    ] o.a.s.c.SolrResourceLoader solr home defaulted to 'solr/' (could not find system property or JNDI)
   [junit4]   2> 2746818 INFO  (TEST-TestSolrConfigHandlerCloud.test-seed#[A906F2217AA6E7B1]) [    ] o.a.s.c.c.SolrZkClient Using default ZkCredentialsProvider
   [junit4]   2> 2746818 INFO  (TEST-TestSolrConfigHandlerCloud.test-seed#[A906F2217AA6E7B1]) [    ] o.a.s.c.c.ConnectionManager Waiting for client to connect to ZooKeeper
   [junit4]   2> 2746821 INFO  (zkCallback-3592-thread-1) [    ] o.a.s.c.c.ConnectionManager Watcher org.apache.solr.common.cloud.ConnectionManager@73f6d10b name:ZooKeeperConnection Watcher:127.0.0.1:59169/solr got event WatchedEvent state:SyncConnected type:None path:null path:null type:None
   [junit4]   2> 2746821 INFO  (TEST-TestSolrConfigHandlerCloud.test-seed#[A906F2217AA6E7B1]) [    ] o.a.s.c.c.ConnectionManager Client is connected to ZooKeeper
   [junit4]   2> 2746821 INFO  (TEST-TestSolrConfigHandlerCloud.test-seed#[A906F2217AA6E7B1]) [    ] o.a.s.c.c.SolrZkClient Using default ZkACLProvider
   [junit4]   2> 2746823 INFO  (TEST-TestSolrConfigHandlerCloud.test-seed#[A906F2217AA6E7B1]) [    ] o.a.s.s.SolrDispatchFilter Loading solr.xml from SolrHome (not found in ZooKeeper)
   [junit4]   2> 2746823 INFO  (TEST-TestSolrConfigHandlerCloud.test-seed#[A906F2217AA6E7B1]) [    ] o.a.s.c.SolrXmlConfig Loading container configuration from C:\Users\jenkins\workspace\Lucene-Solr-master-Windows\solr\build\solr-core\test\J0\temp\solr.handler.TestSolrConfigHandlerCloud_A906F2217AA6E7B1-001\shard-1-001\solr.xml
   [junit4]   2> 2746834 INFO  (TEST-TestSolrConfigHandlerCloud.test-seed#[A906F2217AA6E7B1]) [    ] o.a.s.c.CorePropertiesLocator Config-defined core root directory: C:\Users\jenkins\workspace\Lucene-Solr-master-Windows\solr\build\solr-core\test\J0\..\..\..\..\..\..\..\..\..\Users\jenkins\workspace\Lucene-Solr-master-Windows\solr\build\solr-core\test\J0\temp\solr.handler.TestSolrConfigHandlerCloud_A906F2217AA6E7B1-001\shard-1-001\cores
   [junit4]   2> 2746834 INFO  (TEST-TestSolrConfigHandlerCloud.test-seed#[A906F2217AA6E7B1]) [    ] o.a.s.c.CoreContainer New CoreContainer 828361805
   [junit4]   2> 2746834 INFO  (TEST-TestSolrConfigHandlerCloud.test-seed#[A906F2217AA6E7B1]) [    ] o.a.s.c.CoreContainer Loading cores into CoreContainer [instanceDir=C:\Users\jenkins\workspace\Lucene-Solr-master-Windows\solr\build\solr-core\test\J0\temp\solr.handler.TestSolrConfigHandlerCloud_A906F2217AA6E7B1-001\shard-1-001]
   [junit4]   2> 2746834 WARN  (TEST-TestSolrConfigHandlerCloud.test-seed#[A906F2217AA6E7B1]) [    ] o.a.s.c.CoreContainer Couldn't add files from C:\Users\jenkins\workspace\Lucene-Solr-master-Windows\solr\build\solr-core\test\J0\temp\solr.handler.TestSolrConfigHandlerCloud_A906F2217AA6E7B1-001\shard-1-001\lib to classpath: C:\Users\jenkins\workspace\Lucene-Solr-master-Windows\solr\build\solr-core\test\J0\temp\solr.handler.TestSolrConfigHandlerCloud_A906F2217AA6E7B1-001\shard-1-001\lib
   [junit4]   2> 2746834 INFO  (TEST-TestSolrConfigHandlerCloud.test-seed#[A906F2217AA6E7B1]) [    ] o.a.s.h.c.HttpShardHandlerFactory created with socketTimeout : 90000,urlScheme : ,connTimeout : 15000,maxConnectionsPerHost : 20,maxConnections : 10000,corePoolSize : 0,maximumPoolSize : 2147483647,maxThreadIdleTime : 5,sizeOfQueue : -1,fairnessPolicy : false,
   [junit4]   2> 2746838 INFO  (TEST-TestSolrConfigHandlerCloud.test-seed#[A906F2217AA6E7B1]) [    ] o.a.s.u.UpdateShardHandler Creating UpdateShardHandler HTTP client with params: 
   [junit4]   2> 2746839 INFO  (TEST-TestSolrConfigHandlerCloud.test-seed#[A906F2217AA6E7B1]) [    ] o.a.s.l.LogWatcher SLF4J impl is org.slf4j.impl.Log4jLoggerFactory
   [junit4]   2> 2746839 INFO  (TEST-TestSolrConfigHandlerCloud.test-seed#[A906F2217AA6E7B1]) [    ] o.a.s.l.LogWatcher Registering Log Listener [Log4j (org.slf4j.impl.Log4jLoggerFactory)]
   [junit4]   2> 2746839 INFO  (TEST-TestSolrConfigHandlerCloud.test-seed#[A906F2217AA6E7B1]) [    ] o.a.s.c.ZkContainer Zookeeper client=127.0.0.1:59169/solr
   [junit4]   2> 2746840 INFO  (TEST-TestSolrConfigHandlerCloud.test-seed#[A906F2217AA6E7B1]) [    ] o.a.s.c.ZkController zkHost includes chroot
   [junit4]   2> 2746840 INFO  (TEST-TestSolrConfigHandlerCloud.test-seed#[A906F2217AA6E7B1]) [    ] o.a.s.c.c.SolrZkClient Using default ZkCredentialsProvider
   [junit4]   2> 2746840 INFO  (TEST-TestSolrConfigHandlerCloud.test-seed#[A906F2217AA6E7B1]) [    ] o.a.s.c.c.ConnectionManager Waiting for client to connect to ZooKeeper
   [junit4]   2> 2746843 INFO  (zkCallback-3595-thread-1) [    ] o.a.s.c.c.ConnectionManager Watcher org.apache.solr.common.cloud.ConnectionManager@1fa27720 name:ZooKeeperConnection Watcher:127.0.0.1:59169 got event WatchedEvent state:SyncConnected type:None path:null path:null type:None
   [junit4]   2> 2746843 INFO  (TEST-TestSolrConfigHandlerCloud.test-seed#[A906F2217AA6E7B1]) [    ] o.a.s.c.c.ConnectionManager Client is connected to ZooKeeper
   [junit4]   2> 2746843 INFO  (TEST-TestSolrConfigHandlerCloud.test-seed#[A906F2217AA6E7B1]) [    ] o.a.s.c.c.SolrZkClient Using default ZkACLProvider
   [junit4]   2> 2746844 WARN  (NIOServerCxn.Factory:0.0.0.0/0.0.0.0:0) [    ] o.a.z.s.NIOServerCnxn caught end of stream exception
   [junit4]   2> EndOfStreamException: Unable to read additional data from client sessionid 0x1550aefc49a0007, likely client has closed socket
   [junit4]   2> 	at org.apache.zookeeper.server.NIOServerCnxn.doIO(NIOServerCnxn.java:228)
   [junit4]   2> 	at org.apache.zookeeper.server.NIOServerCnxnFactory.run(NIOServerCnxnFactory.java:208)
   [junit4]   2> 	at java.lang.Thread.run(Thread.java:745)
   [junit4]   2> 2746844 INFO  (TEST-TestSolrConfigHandlerCloud.test-seed#[A906F2217AA6E7B1]) [n:127.0.0.1:59197_    ] o.a.s.c.ZkController Added new OnReconnect listener org.apache.solr.cloud.ZkController$$Lambda$45/349613047@52f12a1
   [junit4]   2> 2746845 INFO  (TEST-TestSolrConfigHandlerCloud.test-seed#[A906F2217AA6E7B1]) [n:127.0.0.1:59197_    ] o.a.s.c.c.ConnectionManager Waiting for client to connect to ZooKeeper
   [junit4]   2> 2746847 INFO  (zkCallback-3596-thread-1-processing-n:127.0.0.1:59197_) [n:127.0.0.1:59197_    ] o.a.s.c.c.ConnectionManager Watcher org.apache.solr.common.cloud.ConnectionManager@2bc38520 name:ZooKeeperConnection Watcher:127.0.0.1:59169/solr got event WatchedEvent state:SyncConnected type:None path:null path:null type:None
   [junit4]   2> 2746847 INFO  (TEST-TestSolrConfigHandlerCloud.test-seed#[A906F2217AA6E7B1]) [n:127.0.0.1:59197_    ] o.a.s.c.c.ConnectionManager Client is connected to ZooKeeper
   [junit4]   2> 2746857 INFO  (TEST-TestSolrConfigHandlerCloud.test-seed#[A906F2217AA6E7B1]) [n:127.0.0.1:59197_    ] o.a.s.c.c.ZkStateReader Updating cluster state from ZooKeeper... 
   [junit4]   2> 2746858 INFO  (TEST-TestSolrConfigHandlerCloud.test-seed#[A906F2217AA6E7B1]) [n:127.0.0.1:59197_    ] o.a.s.c.c.ZkStateReader Loaded empty cluster properties
   [junit4]   2> 2746858 INFO  (TEST-TestSolrConfigHandlerCloud.test-seed#[A906F2217AA6E7B1]) [n:127.0.0.1:59197_    ] o.a.s.c.c.ZkStateReader Updated live nodes from ZooKeeper... (0) -> (1)
   [junit4]   2> 2746865 INFO  (TEST-TestSolrConfigHandlerCloud.test-seed#[A906F2217AA6E7B1]) [n:127.0.0.1:59197_    ] o.a.s.c.Overseer Overseer (id=null) closing
   [junit4]   2> 2746866 INFO  (TEST-TestSolrConfigHandlerCloud.test-seed#[A906F2217AA6E7B1]) [n:127.0.0.1:59197_    ] o.a.s.c.LeaderElector Joined leadership election with path: /overseer_elect/election/95994991970222088-127.0.0.1:59197_-n_0000000001
   [junit4]   2> 2746867 INFO  (TEST-TestSolrConfigHandlerCloud.test-seed#[A906F2217AA6E7B1]) [n:127.0.0.1:59197_    ] o.a.s.c.LeaderElector Watching path /overseer_elect/election/95994991970222084-127.0.0.1:59179_-n_0000000000 to know if I could be the leader
   [junit4]   2> 2746868 INFO  (TEST-TestSolrConfigHandlerCloud.test-seed#[A906F2217AA6E7B1]) [n:127.0.0.1:59197_    ] o.a.s.c.ZkController Publish node=127.0.0.1:59197_ as DOWN
   [junit4]   2> 2746870 INFO  (OverseerStateUpdate-95994991970222084-127.0.0.1:59179_-n_0000000000) [n:127.0.0.1:59179_    ] o.a.s.c.Overseer processMessage: queueSize: 1, message = {
   [junit4]   2>   "operation":"downnode",
   [junit4]   2>   "node_name":"127.0.0.1:59197_"} current state version: 3
   [junit4]   2> 2746870 INFO  (OverseerStateUpdate-95994991970222084-127.0.0.1:59179_-n_0000000000) [n:127.0.0.1:59179_    ] o.a.s.c.o.NodeMutator DownNode state invoked for node: 127.0.0.1:59197_
   [junit4]   2> 2746974 INFO  (zkCallback-3591-thread-1) [    ] o.a.s.c.c.ZkStateReader A cluster state change: [WatchedEvent state:SyncConnected type:NodeDataChanged path:/clusterstate.json], has occurred - updating... (live nodes size: [1])
   [junit4]   2> 2746974 INFO  (zkCallback-3596-thread-1-processing-n:127.0.0.1:59197_) [n:127.0.0.1:59197_    ] o.a.s.c.c.ZkStateReader A cluster state change: [WatchedEvent state:SyncConnected type:NodeDataChanged path:/clusterstate.json], has occurred - updating... (live nodes size: [1])
   [junit4]   2> 2746975 INFO  (zkCallback-3587-thread-1-processing-n:127.0.0.1:59179_) [n:127.0.0.1:59179_    ] o.a.s.c.c.ZkStateReader A cluster state change: [WatchedEvent state:SyncConnected type:NodeDataChanged path:/clusterstate.json], has occurred - updating... (live nodes size: [1])
   [junit4]   2> 2747870 INFO  (TEST-TestSolrConfigHandlerCloud.test-seed#[A906F2217AA6E7B1]) [n:127.0.0.1:59197_    ] o.a.s.c.ZkController Register node as live in ZooKeeper:/live_nodes/127.0.0.1:59197_
   [junit4]   2> 2747872 INFO  (TEST-TestSolrConfigHandlerCloud.test-seed#[A906F2217AA6E7B1]) [n:127.0.0.1:59197_    ] o.a.s.c.c.SolrZkClient makePath: /live_nodes/127.0.0.1:59197_
   [junit4]   2> 2747877 INFO  (zkCallback-3591-thread-1) [    ] o.a.s.c.c.ZkStateReader A live node change: [WatchedEvent state:SyncConnected type:NodeChildrenChanged path:/live_nodes], has occurred - updating... (live nodes size: [1])
   [junit4]   2> 2747877 INFO  (zkCallback-3596-thread-1-processing-n:127.0.0.1:59197_) [n:127.0.0.1:59197_    ] o.a.s.c.c.ZkStateReader A live node change: [WatchedEvent state:SyncConnected type:NodeChildrenChanged path:/live_nodes], has occurred - updating... (live nodes size: [1])
   [junit4]   2> 2747877 INFO  (zkCallback-3587-thread-1-processing-n:127.0.0.1:59179_) [n:127.0.0.1:59179_    ] o.a.s.c.c.ZkStateReader A live node change: [WatchedEvent state:SyncConnected type:NodeChildrenChanged path:/live_nodes], has occurred - updating... (live nodes size: [1])
   [junit4]   2> 2747886 INFO  (TEST-TestSolrConfigHandlerCloud.test-seed#[A906F2217AA6E7B1]) [n:127.0.0.1:59197_    ] o.a.s.c.CoreContainer Security conf doesn't exist. Skipping setup for authorization module.
   [junit4]   2> 2747886 INFO  (TEST-TestSolrConfigHandlerCloud.test-seed#[A906F2217AA6E7B1]) [n:127.0.0.1:59197_    ] o.a.s.c.CoreContainer No authentication plugin used.
   [junit4]   2> 2747887 INFO  (TEST-TestSolrConfigHandlerCloud.test-seed#[A906F2217AA6E7B1]) [n:127.0.0.1:59197_    ] o.a.s.c.CorePropertiesLocator Looking for core definitions underneath C:\Users\jenkins\workspace\Lucene-Solr-master-Windows\solr\build\solr-core\test\J0\..\..\..\..\..\..\..\..\..\Users\jenkins\workspace\Lucene-Solr-master-Windows\solr\build\solr-core\test\J0\temp\solr.handler.TestSolrConfigHandlerCloud_A906F2217AA6E7B1-001\shard-1-001\cores
   [junit4]   2> 2747890 INFO  (TEST-TestSolrConfigHandlerCloud.test-seed#[A906F2217AA6E7B1]) [n:127.0.0.1:59197_    ] o.a.s.c.CoreDescriptor Created CoreDescriptor: {name=collection1, config=solrconfig.xml, transient=false, schema=schema.xml, loadOnStartup=true, configSetProperties=configsetprops.json, collection=collection1, coreNodeName=, dataDir=data\, shard=}
   [junit4]   2> 2747890 INFO  (TEST-TestSolrConfigHandlerCloud.test-seed#[A906F2217AA6E7B1]) [n:127.0.0.1:59197_    ] o.a.s.c.CorePropertiesLocator Found core collection1 in C:\Users\jenkins\workspace\Lucene-Solr-master-Windows\solr\build\solr-core\test\J0\..\..\..\..\..\..\..\..\..\Users\jenkins\workspace\Lucene-Solr-master-Windows\solr\build\solr-core\test\J0\temp\solr.handler.TestSolrConfigHandlerCloud_A906F2217AA6E7B1-001\shard-1-001\cores\collection1
   [junit4]   2> 2747890 INFO  (TEST-TestSolrConfigHandlerCloud.test-seed#[A906F2217AA6E7B1]) [n:127.0.0.1:59197_    ] o.a.s.c.CorePropertiesLocator Found 1 core definitions
   [junit4]   2> 2747892 INFO  (zkCallback-3596-thread-1-processing-n:127.0.0.1:59197_) [n:127.0.0.1:59197_    ] o.a.s.c.c.ZkStateReader Updated live nodes from ZooKeeper... (1) -> (2)
   [junit4]   2> 2747892 INFO  (zkCallback-3591-thread-1) [    ] o.a.s.c.c.ZkStateReader Updated live nodes from ZooKeeper... (1) -> (2)
   [junit4]   2> 2747893 INFO  (zkCallback-3587-thread-1-processing-n:127.0.0.1:59179_) [n:127.0.0.1:59179_    ] o.a.s.c.c.ZkStateReader Updated live nodes from ZooKeeper... (1) -> (2)
   [junit4]   2> 2747893 INFO  (TEST-TestSolrConfigHandlerCloud.test-seed#[A906F2217AA6E7B1]) [n:127.0.0.1:59197_    ] o.a.s.s.SolrDispatchFilter user.dir=C:\Users\jenkins\workspace\Lucene-Solr-master-Windows\solr\build\solr-core\test\J0
   [junit4]   2> 2747893 INFO  (TEST-TestSolrConfigHandlerCloud.test-seed#[A906F2217AA6E7B1]) [n:127.0.0.1:59197_    ] o.a.s.s.SolrDispatchFilter SolrDispatchFilter.init() done
   [junit4]   2> 2747895 INFO  (coreLoadExecutor-9860-thread-1-processing-n:127.0.0.1:59197_) [n:127.0.0.1:59197_ c:collection1   x:collection1] o.a.s.c.ZkController publishing state=down
   [junit4]   2> 2747895 INFO  (coreLoadExecutor-9860-thread-1-processing-n:127.0.0.1:59197_) [n:127.0.0.1:59197_ c:collection1   x:collection1] o.a.s.c.ZkController numShards not found on descriptor - reading it from system property
   [junit4]   2> 2747896 INFO  (OverseerStateUpdate-95994991970222084-127.0.0.1:59179_-n_0000000000) [n:127.0.0.1:59179_    ] o.a.s.c.Overseer processMessage: queueSize: 1, message = {
   [junit4]   2>   "core":"collection1",
   [junit4]   2>   "roles":null,
   [junit4]   2>   "base_url":"http://127.0.0.1:59197",
   [junit4]   2>   "node_name":"127.0.0.1:59197_",
   [junit4]   2>   "numShards":"2",
   [junit4]   2>   "state":"down",
   [junit4]   2>   "shard":null,
   [junit4]   2>   "collection":"collection1",
   [junit4]   2>   "operation":"state"} current state version: 4
   [junit4]   2> 2747896 INFO  (OverseerStateUpdate-95994991970222084-127.0.0.1:59179_-n_0000000000) [n:127.0.0.1:59179_    ] o.a.s.c.o.ReplicaMutator Update state numShards=2 message={
   [junit4]   2>   "core":"collection1",
   [junit4]   2>   "roles":null,
   [junit4]   2>   "base_url":"http://127.0.0.1:59197",
   [junit4]   2>   "node_name":"127.0.0.1:59197_",
   [junit4]   2>   "numShards":"2",
   [junit4]   2>   "state":"down",
   [junit4]   2>   "shard":null,
   [junit4]   2>   "collection":"collection1",
   [junit4]   2>   "operation":"state"}
   [junit4]   2> 2747896 INFO  (OverseerStateUpdate-95994991970222084-127.0.0.1:59179_-n_0000000000) [n:127.0.0.1:59179_    ] o.a.s.c.o.ClusterStateMutator building a new cName: collection1
   [junit4]   2> 2747898 INFO  (OverseerStateUpdate-95994991970222084-127.0.0.1:59179_-n_0000000000) [n:127.0.0.1:59179_    ] o.a.s.c.o.ReplicaMutator Assigning new node to shard shard=shard2
   [junit4]   2> 2747899 INFO  (coreLoadExecutor-9860-thread-1-processing-n:127.0.0.1:59197_) [n:127.0.0.1:59197_ c:collection1   x:collection1] o.a.s.c.ZkController Collection collection1 not visible yet, but flagging it so a watch is registered when it becomes visible
   [junit4]   2> 2747901 INFO  (coreLoadExecutor-9860-thread-1-processing-n:127.0.0.1:59197_) [n:127.0.0.1:59197_ c:collection1   x:collection1] o.a.s.c.c.ZkStateReader Deleting data for [collection1]
   [junit4]   2> 2747904 INFO  (coreLoadExecutor-9860-thread-1-processing-n:127.0.0.1:59197_) [n:127.0.0.1:59197_ c:collection1   x:collection1] o.a.s.c.ZkController look for our core node name
   [junit4]   2> 2748007 INFO  (zkCallback-3591-thread-1) [    ] o.a.s.c.c.ZkStateReader A cluster state change: [WatchedEvent state:SyncConnected type:NodeDataChanged path:/clusterstate.json], has occurred - updating... (live nodes size: [2])
   [junit4]   2> 2748007 INFO  (zkCallback-3587-thread-1-processing-n:127.0.0.1:59179_) [n:127.0.0.1:59179_    ] o.a.s.c.c.ZkStateReader A cluster state change: [WatchedEvent state:SyncConnected type:NodeDataChanged path:/clusterstate.json], has occurred - updating... (live nodes size: [2])
   [junit4]   2> 2748008 INFO  (zkCallback-3596-thread-1-processing-n:127.0.0.1:59197_) [n:127.0.0.1:59197_    ] o.a.s.c.c.ZkStateReader A cluster state change: [WatchedEvent state:SyncConnected type:NodeDataChanged path:/clusterstate.json], has occurred - updating... (live nodes size: [2])
   [junit4]   2> 2748905 INFO  (coreLoadExecutor-9860-thread-1-processing-n:127.0.0.1:59197_) [n:127.0.0.1:59197_ c:collection1   x:collection1] o.a.s.c.ZkController waiting to find shard id in clusterstate for collection1
   [junit4]   2> 2748905 INFO  (coreLoadExecutor-9860-thread-1-processing-n:127.0.0.1:59197_) [n:127.0.0.1:59197_ c:collection1   x:collection1] o.a.s.c.ZkController Check for collection zkNode:collection1
   [junit4]   2> 2748906 INFO  (coreLoadExecutor-9860-thread-1-processing-n:127.0.0.1:59197_) [n:127.0.0.1:59197_ c:collection1   x:collection1] o.a.s.c.ZkController Collection zkNode exists
   [junit4]   2> 2748906 INFO  (coreLoadExecutor-9860-thread-1-processing-n:127.0.0.1:59197_) [n:127.0.0.1:59197_ c:collection1   x:collection1] o.a.s.c.c.ZkStateReader Load collection config from: [/collections/collection1]
   [junit4]   2> 2748907 INFO  (coreLoadExecutor-9860-thread-1-processing-n:127.0.0.1:59197_) [n:127.0.0.1:59197_ c:collection1   x:collection1] o.a.s.c.c.ZkStateReader path=[/collections/collection1] [configName]=[conf1] specified config exists in ZooKeeper
   [junit4]   2> 2748907 INFO  (coreLoadExecutor-9860-thread-1-processing-n:127.0.0.1:59197_) [n:127.0.0.1:59197_ c:collection1   x:collection1] o.a.s.c.SolrResourceLoader new SolrResourceLoader for directory: 'C:\Users\jenkins\workspace\Lucene-Solr-master-Windows\solr\build\solr-core\test\J0\temp\solr.handler.TestSolrConfigHandlerCloud_A906F2217AA6E7B1-001\shard-1-001\cores\collection1'
   [junit4]   2> 2748907 INFO  (coreLoadExecutor-9860-thread-1-processing-n:127.0.0.1:59197_) [n:127.0.0.1:59197_ c:collection1   x:collection1] o.a.s.c.SolrResourceLoader JNDI not configured for solr (NoInitialContextEx)
   [junit4]   2> 2748907 INFO  (coreLoadExecutor-9860-thread-1-processing-n:127.0.0.1:59197_) [n:127.0.0.1:59197_ c:collection1   x:collection1] o.a.s.c.SolrResourceLoader solr home defaulted to 'solr/' (could not find system property or JNDI)
   [junit4]   2> 2748910 INFO  (coreLoadExecutor-9860-thread-1-processing-n:127.0.0.1:59197_) [n:127.0.0.1:59197_ c:collection1   x:collection1] o.a.s.c.Config loaded config solrconfig.xml with version 0 
   [junit4]   2> 2748920 INFO  (coreLoadExecutor-9860-thread-1-processing-n:127.0.0.1:59197_) [n:127.0.0.1:59197_ c:collection1   x:collection1] o.a.s.c.SolrConfig current version of requestparams : -1
   [junit4]   2> 2748923 WARN  (coreLoadExecutor-9860-thread-1-processing-n:127.0.0.1:59197_) [n:127.0.0.1:59197_ c:collection1   x:collection1] o.a.s.c.Config Beginning with Solr 5.5, <mergePolicy> is deprecated, use <mergePolicyFactory> instead.
   [junit4]   2> 2748924 INFO  (coreLoadExecutor-9860-thread-1-processing-n:127.0.0.1:59197_) [n:127.0.0.1:59197_ c:collection1   x:collection1] o.a.s.c.SolrConfig Using Lucene MatchVersion: 7.0.0
   [junit4]   2> 2748933 INFO  (coreLoadExecutor-9860-thread-1-processing-n:127.0.0.1:59197_) [n:127.0.0.1:59197_ c:collection1   x:collection1] o.a.s.c.SolrConfig Loaded SolrConfig: solrconfig.xml
   [junit4]   2> 2748941 INFO  (coreLoadExecutor-9860-thread-1-processing-n:127.0.0.1:59197_) [n:127.0.0.1:59197_ c:collection1   x:collection1] o.a.s.s.IndexSchema [collection1] Schema name=test
   [junit4]   2> 2749048 INFO  (coreLoadExecutor-9860-thread-1-processing-n:127.0.0.1:59197_) [n:127.0.0.1:59197_ c:collection1   x:collection1] o.a.s.s.OpenExchangeRatesOrgProvider Initialized with rates=open-exchange-rates.json, refreshInterval=1440.
   [junit4]   2> 2749062 INFO  (coreLoadExecutor-9860-thread-1-processing-n:127.0.0.1:59197_) [n:127.0.0.1:59197_ c:collection1   x:collection1] o.a.s.s.IndexSchema default search field in schema is text
   [junit4]   2> 2749063 INFO  (coreLoadExecutor-9860-thread-1-processing-n:127.0.0.1:59197_) [n:127.0.0.1:59197_ c:collection1   x:collection1] o.a.s.s.IndexSchema unique key field: id
   [junit4]   2> 2749075 INFO  (coreLoadExecutor-9860-thread-1-processing-n:127.0.0.1:59197_) [n:127.0.0.1:59197_ c:collection1   x:collection1] o.a.s.s.FileExchangeRateProvider Reloading exchange rates from file currency.xml
   [junit4]   2> 2749078 INFO  (coreLoadExecutor-9860-thread-1-processing-n:127.0.0.1:59197_) [n:127.0.0.1:59197_ c:collection1   x:collection1] o.a.s.s.FileExchangeRateProvider Reloading exchange rates from file currency.xml
   [junit4]   2> 2749081 INFO  (coreLoadExecutor-9860-thread-1-processing-n:127.0.0.1:59197_) [n:127.0.0.1:59197_ c:collection1  

[...truncated too long message...]

dInspectUtil, TestJmxIntegration, CircularListTest, TestUniqueKeyFieldResource, HdfsDirectoryTest, BadComponentTest, SchemaVersionSpecificBehaviorTest, SampleTest, BitVectorTest, SuggestComponentContextFilterQueryTest, TestIBSimilarityFactory, CursorPagingTest, JavabinLoaderTest, QueryEqualityTest, TestDefaultSearchFieldResource, ConnectionManagerTest, TestArbitraryIndexDir, OverseerTest, ZkCLITest, SliceStateTest, JSONWriterTest, TestDocSet, SuggesterFSTTest, QueryResultKeyTest, AssignTest, TestManagedSchema, TestSolr4Spatial2, UUIDFieldTest, TestElisionMultitermQuery, HdfsSyncSliceTest, TestChildDocTransformer, TestJmxMonitoredMap, BigEndianAscendingWordDeserializerTest, TestSolrConfigHandler, JsonLoaderTest, SpatialFilterTest, TestFieldResource, TestDistribIDF, SOLR749Test, TestSearchPerf, SimpleFacetsTest, TestRequestForwarding, TestUpdate, CheckHdfsIndexTest, TestConfigSets, TestSolrXml, TestReloadDeadlock, TestFaceting, CdcrRequestHandlerTest, TermsComponentTest, CloudExitableDirectoryReaderTest, PathHierarchyTokenizerFactoryTest, HttpPartitionTest, DirectUpdateHandlerTest, TestPseudoReturnFields, OverseerStatusTest, SoftAutoCommitTest, RequiredFieldsTest, OverseerCollectionConfigSetProcessorTest, TestHashPartitioner, TestReplicationHandler, AddSchemaFieldsUpdateProcessorFactoryTest, TestDistributedSearch, TestReplicationHandlerBackup, FacetPivotSmallTest, TestDynamicFieldResource, TestObjectReleaseTracker, TestComponentsName, HdfsWriteToMultipleCollectionsTest, TestStressVersions, TestHighlightDedupGrouping, IndexBasedSpellCheckerTest, HdfsBasicDistributedZkTest, RecoveryZkTest, PreAnalyzedFieldTest, BasicDistributedZkTest, ChaosMonkeySafeLeaderTest, BasicDistributedZk2Test, BasicZkTest, FullSolrCloudDistribCmdsTest, ClusterStateUpdateTest, TestRandomFaceting, LeaderElectionTest, ShardRoutingCustomTest, TestRecovery, DistributedSpellCheckComponentTest, ZkControllerTest, TestRealTimeGet, TestReload, SolrCoreTest, StatsComponentTest, SpellCheckComponentTest, TestGroupingSearch, PeerSyncTest, BadIndexSchemaTest, ConvertedLegacyTest, TestSort, TestFunctionQuery, TestLazyCores, HighlighterTest, ShowFileRequestHandlerTest, CurrencyFieldOpenExchangeTest, DistributedQueryElevationComponentTest, CurrencyFieldXmlFileTest, SolrIndexSplitterTest, SimplePostToolTest, TestCoreDiscovery, SolrRequestParserTest, TestFoldingMultitermQuery, DocValuesTest, SuggesterTSTTest, TestStressLucene, SuggesterWFSTTest, TestCSVLoader, PolyFieldTest, WordBreakSolrSpellCheckerTest, DirectUpdateHandlerOptimizeTest, StatelessScriptUpdateProcessorFactoryTest, TestRemoteStreaming, DocValuesMultiTest, DistanceFunctionTest, TestSolrDeletionPolicy1, XsltUpdateRequestHandlerTest, TestSurroundQueryParser, TestQueryUtils, TestWriterPerf, DirectSolrSpellCheckerTest, TestReversedWildcardFilterFactory, DocumentAnalysisRequestHandlerTest, TestOmitPositions, FileBasedSpellCheckerTest, XmlUpdateRequestHandlerTest, DocumentBuilderTest, TestValueSourceCache, TermVectorComponentTest, TestIndexingPerformance, FieldAnalysisRequestHandlerTest, TestSolrQueryParser, FastVectorHighlighterTest, IndexSchemaRuntimeFieldTest, LoggingHandlerTest, UpdateRequestProcessorFactoryTest, TestCSVResponseWriter, MBeansHandlerTest, TestAnalyzedSuggestions, UniqFieldsUpdateProcessorFactoryTest, BinaryUpdateRequestHandlerTest, TestPartialUpdateDeduplication, TestPHPSerializedResponseWriter, TestLFUCache, UpdateParamsTest, AlternateDirectoryTest, TestQuerySenderNoQuery, TestMergePolicyConfig, MultiTermTest, TestBinaryField, MinimalSchemaTest, TestConfig, OutputWriterTest, ExternalFileFieldSortTest, DirectSolrConnectionTest, NotRequiredUniqueKeyTest, TestPhraseSuggestions, SpellPossibilityIteratorTest, TestCharFilters, TestXIncludeConfig, TestDFRSimilarityFactory, TestPerFieldSimilarity, TestLMDirichletSimilarityFactory, ResourceLoaderTest, TestFastOutputStream, ScriptEngineTest, URLClassifyProcessorTest, PluginInfoTest, ChaosMonkeyNothingIsSafeTest, TestSystemIdResolver, DateFieldTest, DOMUtilTest, RAMDirectoryFactoryTest, ClusterStateTest, TestUtils, ZkNodePropsTest, FileUtilsTest, SolrTestCaseJ4Test, TestDistributedMissingSort, TestSimpleTrackingShardHandler, TestTolerantSearch, TestJettySolrRunner, AliasIntegrationTest, AsyncCallRequestStatusResponseTest, CollectionTooManyReplicasTest, DeleteInactiveReplicaTest, DeleteReplicaTest, DeleteStatusTest, DistribCursorPagingTest, DistributedVersionInfoTest, LeaderInitiatedRecoveryOnCommitTest, MigrateRouteKeyTest, OutOfBoxZkACLAndCredentialsProvidersTest, OverseerTaskQueueTest, RecoveryAfterSoftCommitTest, SaslZkACLProviderTest, SharedFSAutoReplicaFailoverUtilsTest, SimpleCollectionCreateDeleteTest, TestCollectionAPI, TestConfigSetsAPIZkFailure, TestCryptoKeys, TestDownShardTolerantSearch, TestExclusionRuleCollectionAccess, TestLeaderElectionZkExpiry, TestMiniSolrCloudCluster, TestRandomRequestDistribution, TestSSLRandomization, TestSizeLimitedDistributedMap, TriLevelCompositeIdRoutingTest, VMParamsZkACLAndCredentialsProvidersTest, HdfsChaosMonkeyNothingIsSafeTest, HdfsChaosMonkeySafeLeaderTest, HdfsRecoveryZkTest, HdfsRestartWhileUpdatingTest, HdfsThreadLeakTest, HdfsTlogReplayBufferedWhileIndexingTest, StressHdfsTest, ZkStateReaderTest, ZkStateWriterTest, RuleEngineTest, BlobRepositoryCloudTest, DirectoryFactoryTest, ExitableDirectoryReaderTest, HdfsDirectoryFactoryTest, TestConfigOverlay, TestConfigSetImmutable, TestImplicitCoreProperties, TestInitParams, TestNRTOpen, TestReloadAndDeleteDocs, TestShardHandlerFactory, TestBlobHandler, TestSolrConfigHandlerCloud]
   [junit4]   2> NOTE: reproduce with: ant test  -Dtestcase=TestSolrConfigHandlerCloud -Dtests.seed=A906F2217AA6E7B1 -Dtests.slow=true -Dtests.locale=und -Dtests.timezone=America/St_Lucia -Dtests.asserts=true -Dtests.file.encoding=US-ASCII
   [junit4] ERROR   0.00s J0 | TestSolrConfigHandlerCloud (suite) <<<
   [junit4]    > Throwable #1: com.carrotsearch.randomizedtesting.ThreadLeakError: 2 threads leaked from SUITE scope at org.apache.solr.handler.TestSolrConfigHandlerCloud: 
   [junit4]    >    1) Thread[id=23253, name=Thread-7139, state=TIMED_WAITING, group=TGRP-TestSolrConfigHandlerCloud]
   [junit4]    >         at java.lang.Thread.sleep(Native Method)
   [junit4]    >         at org.apache.solr.cloud.ZkSolrResourceLoader.openResource(ZkSolrResourceLoader.java:101)
   [junit4]    >         at org.apache.solr.core.SolrResourceLoader.openSchema(SolrResourceLoader.java:333)
   [junit4]    >         at org.apache.solr.schema.IndexSchemaFactory.create(IndexSchemaFactory.java:48)
   [junit4]    >         at org.apache.solr.schema.IndexSchemaFactory.buildIndexSchema(IndexSchemaFactory.java:75)
   [junit4]    >         at org.apache.solr.core.ConfigSetService.createIndexSchema(ConfigSetService.java:108)
   [junit4]    >         at org.apache.solr.core.ConfigSetService.getConfig(ConfigSetService.java:79)
   [junit4]    >         at org.apache.solr.core.CoreContainer.reload(CoreContainer.java:936)
   [junit4]    >         at org.apache.solr.core.SolrCore.lambda$getConfListener$6(SolrCore.java:2510)
   [junit4]    >         at org.apache.solr.core.SolrCore$$Lambda$55/305378721.run(Unknown Source)
   [junit4]    >         at org.apache.solr.cloud.ZkController$4.run(ZkController.java:2408)
   [junit4]    >    2) Thread[id=22388, name=Thread-7006, state=TIMED_WAITING, group=TGRP-TestSolrConfigHandlerCloud]
   [junit4]    >         at java.lang.Thread.sleep(Native Method)
   [junit4]    >         at org.apache.solr.cloud.ZkSolrResourceLoader.openResource(ZkSolrResourceLoader.java:101)
   [junit4]    >         at org.apache.solr.core.SolrResourceLoader.openSchema(SolrResourceLoader.java:333)
   [junit4]    >         at org.apache.solr.schema.IndexSchemaFactory.create(IndexSchemaFactory.java:48)
   [junit4]    >         at org.apache.solr.schema.IndexSchemaFactory.buildIndexSchema(IndexSchemaFactory.java:75)
   [junit4]    >         at org.apache.solr.core.ConfigSetService.createIndexSchema(ConfigSetService.java:108)
   [junit4]    >         at org.apache.solr.core.ConfigSetService.getConfig(ConfigSetService.java:79)
   [junit4]    >         at org.apache.solr.core.CoreContainer.reload(CoreContainer.java:936)
   [junit4]    >         at org.apache.solr.core.SolrCore.lambda$getConfListener$6(SolrCore.java:2510)
   [junit4]    >         at org.apache.solr.core.SolrCore$$Lambda$55/305378721.run(Unknown Source)
   [junit4]    >         at org.apache.solr.cloud.ZkController$4.run(ZkController.java:2408)
   [junit4]    > 	at __randomizedtesting.SeedInfo.seed([A906F2217AA6E7B1]:0)
   [junit4] Completed [524/611 (1!)] on J0 in 73.28s, 1 test, 1 error <<< FAILURES!

[...truncated 304 lines...]
BUILD FAILED
C:\Users\jenkins\workspace\Lucene-Solr-master-Windows\build.xml:740: The following error occurred while executing this line:
C:\Users\jenkins\workspace\Lucene-Solr-master-Windows\build.xml:684: The following error occurred while executing this line:
C:\Users\jenkins\workspace\Lucene-Solr-master-Windows\build.xml:59: The following error occurred while executing this line:
C:\Users\jenkins\workspace\Lucene-Solr-master-Windows\solr\build.xml:233: The following error occurred while executing this line:
C:\Users\jenkins\workspace\Lucene-Solr-master-Windows\solr\common-build.xml:531: The following error occurred while executing this line:
C:\Users\jenkins\workspace\Lucene-Solr-master-Windows\lucene\common-build.xml:1427: The following error occurred while executing this line:
C:\Users\jenkins\workspace\Lucene-Solr-master-Windows\lucene\common-build.xml:984: There were test failures: 611 suites (10 ignored), 2558 tests, 1 suite-level error, 125 ignored (81 assumptions) [seed: A906F2217AA6E7B1]

Total time: 81 minutes 2 seconds
Build step 'Invoke Ant' marked build as failure
Archiving artifacts
[WARNINGS] Skipping publisher since build result is FAILURE
Recording test results
Email was triggered for: Failure - Any
Sending email for trigger: Failure - Any



Mime
View raw message