lucene-dev mailing list archives

Site index · List index
Message view « Date » · « Thread »
Top « Date » · « Thread »
From Apache Jenkins Server <jenk...@builds.apache.org>
Subject [JENKINS] Lucene-Solr-Tests-master - Build # 1230 - Failure
Date Mon, 27 Jun 2016 03:17:15 GMT
Build: https://builds.apache.org/job/Lucene-Solr-Tests-master/1230/

1 tests failed.
FAILED:  junit.framework.TestSuite.org.apache.solr.handler.TestSolrConfigHandlerCloud

Error Message:
1 thread leaked from SUITE scope at org.apache.solr.handler.TestSolrConfigHandlerCloud:     1) Thread[id=75230, name=Thread-8065, state=TIMED_WAITING, group=TGRP-TestSolrConfigHandlerCloud]         at java.lang.Thread.sleep(Native Method)         at org.apache.solr.cloud.ZkSolrResourceLoader.openResource(ZkSolrResourceLoader.java:101)         at org.apache.solr.core.SolrResourceLoader.openSchema(SolrResourceLoader.java:333)         at org.apache.solr.schema.IndexSchemaFactory.create(IndexSchemaFactory.java:48)         at org.apache.solr.schema.IndexSchemaFactory.buildIndexSchema(IndexSchemaFactory.java:75)         at org.apache.solr.core.ConfigSetService.createIndexSchema(ConfigSetService.java:107)         at org.apache.solr.core.ConfigSetService.getConfig(ConfigSetService.java:78)         at org.apache.solr.core.CoreContainer.reload(CoreContainer.java:944)         at org.apache.solr.core.SolrCore.lambda$getConfListener$6(SolrCore.java:2509)         at org.apache.solr.core.SolrCore$$Lambda$67/1651346545.run(Unknown Source)         at org.apache.solr.cloud.ZkController$4.run(ZkController.java:2405)

Stack Trace:
com.carrotsearch.randomizedtesting.ThreadLeakError: 1 thread leaked from SUITE scope at org.apache.solr.handler.TestSolrConfigHandlerCloud: 
   1) Thread[id=75230, name=Thread-8065, state=TIMED_WAITING, group=TGRP-TestSolrConfigHandlerCloud]
        at java.lang.Thread.sleep(Native Method)
        at org.apache.solr.cloud.ZkSolrResourceLoader.openResource(ZkSolrResourceLoader.java:101)
        at org.apache.solr.core.SolrResourceLoader.openSchema(SolrResourceLoader.java:333)
        at org.apache.solr.schema.IndexSchemaFactory.create(IndexSchemaFactory.java:48)
        at org.apache.solr.schema.IndexSchemaFactory.buildIndexSchema(IndexSchemaFactory.java:75)
        at org.apache.solr.core.ConfigSetService.createIndexSchema(ConfigSetService.java:107)
        at org.apache.solr.core.ConfigSetService.getConfig(ConfigSetService.java:78)
        at org.apache.solr.core.CoreContainer.reload(CoreContainer.java:944)
        at org.apache.solr.core.SolrCore.lambda$getConfListener$6(SolrCore.java:2509)
        at org.apache.solr.core.SolrCore$$Lambda$67/1651346545.run(Unknown Source)
        at org.apache.solr.cloud.ZkController$4.run(ZkController.java:2405)
	at __randomizedtesting.SeedInfo.seed([BCFC47F4AA4F3878]:0)




Build Log:
[...truncated 12248 lines...]
   [junit4] Suite: org.apache.solr.handler.TestSolrConfigHandlerCloud
   [junit4]   2> Creating dataDir: /x1/jenkins/jenkins-slave/workspace/Lucene-Solr-Tests-master/solr/build/solr-core/test/J0/temp/solr.handler.TestSolrConfigHandlerCloud_BCFC47F4AA4F3878-001/init-core-data-001
   [junit4]   2> 1915408 INFO  (SUITE-TestSolrConfigHandlerCloud-seed#[BCFC47F4AA4F3878]-worker) [    ] o.a.s.SolrTestCaseJ4 Randomized ssl (false) and clientAuth (false) via: @org.apache.solr.util.RandomizeSSL(reason=, ssl=NaN, value=NaN, clientAuth=NaN)
   [junit4]   2> 1915408 INFO  (SUITE-TestSolrConfigHandlerCloud-seed#[BCFC47F4AA4F3878]-worker) [    ] o.a.s.BaseDistributedSearchTestCase Setting hostContext system property: /
   [junit4]   2> 1915410 INFO  (TEST-TestSolrConfigHandlerCloud.test-seed#[BCFC47F4AA4F3878]) [    ] o.a.s.c.ZkTestServer STARTING ZK TEST SERVER
   [junit4]   2> 1915410 INFO  (Thread-7996) [    ] o.a.s.c.ZkTestServer client port:0.0.0.0/0.0.0.0:0
   [junit4]   2> 1915410 INFO  (Thread-7996) [    ] o.a.s.c.ZkTestServer Starting server
   [junit4]   2> 1915510 INFO  (TEST-TestSolrConfigHandlerCloud.test-seed#[BCFC47F4AA4F3878]) [    ] o.a.s.c.ZkTestServer start zk server on port:38658
   [junit4]   2> 1915511 INFO  (TEST-TestSolrConfigHandlerCloud.test-seed#[BCFC47F4AA4F3878]) [    ] o.a.s.c.c.SolrZkClient Using default ZkCredentialsProvider
   [junit4]   2> 1915511 INFO  (TEST-TestSolrConfigHandlerCloud.test-seed#[BCFC47F4AA4F3878]) [    ] o.a.s.c.c.ConnectionManager Waiting for client to connect to ZooKeeper
   [junit4]   2> 1915514 INFO  (zkCallback-17881-thread-1) [    ] o.a.s.c.c.ConnectionManager Watcher org.apache.solr.common.cloud.ConnectionManager@7c0f7879 name:ZooKeeperConnection Watcher:127.0.0.1:38658 got event WatchedEvent state:SyncConnected type:None path:null path:null type:None
   [junit4]   2> 1915514 INFO  (TEST-TestSolrConfigHandlerCloud.test-seed#[BCFC47F4AA4F3878]) [    ] o.a.s.c.c.ConnectionManager Client is connected to ZooKeeper
   [junit4]   2> 1915514 INFO  (TEST-TestSolrConfigHandlerCloud.test-seed#[BCFC47F4AA4F3878]) [    ] o.a.s.c.c.SolrZkClient Using default ZkACLProvider
   [junit4]   2> 1915515 INFO  (TEST-TestSolrConfigHandlerCloud.test-seed#[BCFC47F4AA4F3878]) [    ] o.a.s.c.c.SolrZkClient makePath: /solr
   [junit4]   2> 1915517 INFO  (TEST-TestSolrConfigHandlerCloud.test-seed#[BCFC47F4AA4F3878]) [    ] o.a.s.c.c.SolrZkClient Using default ZkCredentialsProvider
   [junit4]   2> 1915518 INFO  (TEST-TestSolrConfigHandlerCloud.test-seed#[BCFC47F4AA4F3878]) [    ] o.a.s.c.c.ConnectionManager Waiting for client to connect to ZooKeeper
   [junit4]   2> 1915518 INFO  (zkCallback-17882-thread-1) [    ] o.a.s.c.c.ConnectionManager Watcher org.apache.solr.common.cloud.ConnectionManager@699d0b5c name:ZooKeeperConnection Watcher:127.0.0.1:38658/solr got event WatchedEvent state:SyncConnected type:None path:null path:null type:None
   [junit4]   2> 1915519 INFO  (TEST-TestSolrConfigHandlerCloud.test-seed#[BCFC47F4AA4F3878]) [    ] o.a.s.c.c.ConnectionManager Client is connected to ZooKeeper
   [junit4]   2> 1915519 INFO  (TEST-TestSolrConfigHandlerCloud.test-seed#[BCFC47F4AA4F3878]) [    ] o.a.s.c.c.SolrZkClient Using default ZkACLProvider
   [junit4]   2> 1915519 INFO  (TEST-TestSolrConfigHandlerCloud.test-seed#[BCFC47F4AA4F3878]) [    ] o.a.s.c.c.SolrZkClient makePath: /collections/collection1
   [junit4]   2> 1915520 INFO  (TEST-TestSolrConfigHandlerCloud.test-seed#[BCFC47F4AA4F3878]) [    ] o.a.s.c.c.SolrZkClient makePath: /collections/collection1/shards
   [junit4]   2> 1915521 INFO  (TEST-TestSolrConfigHandlerCloud.test-seed#[BCFC47F4AA4F3878]) [    ] o.a.s.c.c.SolrZkClient makePath: /collections/control_collection
   [junit4]   2> 1915522 INFO  (TEST-TestSolrConfigHandlerCloud.test-seed#[BCFC47F4AA4F3878]) [    ] o.a.s.c.c.SolrZkClient makePath: /collections/control_collection/shards
   [junit4]   2> 1915523 INFO  (TEST-TestSolrConfigHandlerCloud.test-seed#[BCFC47F4AA4F3878]) [    ] o.a.s.c.AbstractZkTestCase put /x1/jenkins/jenkins-slave/workspace/Lucene-Solr-Tests-master/solr/core/src/test-files/solr/collection1/conf/solrconfig-tlog.xml to /configs/conf1/solrconfig.xml
   [junit4]   2> 1915524 INFO  (TEST-TestSolrConfigHandlerCloud.test-seed#[BCFC47F4AA4F3878]) [    ] o.a.s.c.c.SolrZkClient makePath: /configs/conf1/solrconfig.xml
   [junit4]   2> 1915525 INFO  (TEST-TestSolrConfigHandlerCloud.test-seed#[BCFC47F4AA4F3878]) [    ] o.a.s.c.AbstractZkTestCase put /x1/jenkins/jenkins-slave/workspace/Lucene-Solr-Tests-master/solr/core/src/test-files/solr/collection1/conf/schema.xml to /configs/conf1/schema.xml
   [junit4]   2> 1915525 INFO  (TEST-TestSolrConfigHandlerCloud.test-seed#[BCFC47F4AA4F3878]) [    ] o.a.s.c.c.SolrZkClient makePath: /configs/conf1/schema.xml
   [junit4]   2> 1915526 INFO  (TEST-TestSolrConfigHandlerCloud.test-seed#[BCFC47F4AA4F3878]) [    ] o.a.s.c.AbstractZkTestCase put /x1/jenkins/jenkins-slave/workspace/Lucene-Solr-Tests-master/solr/core/src/test-files/solr/collection1/conf/solrconfig.snippet.randomindexconfig.xml to /configs/conf1/solrconfig.snippet.randomindexconfig.xml
   [junit4]   2> 1915526 INFO  (TEST-TestSolrConfigHandlerCloud.test-seed#[BCFC47F4AA4F3878]) [    ] o.a.s.c.c.SolrZkClient makePath: /configs/conf1/solrconfig.snippet.randomindexconfig.xml
   [junit4]   2> 1915527 INFO  (TEST-TestSolrConfigHandlerCloud.test-seed#[BCFC47F4AA4F3878]) [    ] o.a.s.c.AbstractZkTestCase put /x1/jenkins/jenkins-slave/workspace/Lucene-Solr-Tests-master/solr/core/src/test-files/solr/collection1/conf/stopwords.txt to /configs/conf1/stopwords.txt
   [junit4]   2> 1915527 INFO  (TEST-TestSolrConfigHandlerCloud.test-seed#[BCFC47F4AA4F3878]) [    ] o.a.s.c.c.SolrZkClient makePath: /configs/conf1/stopwords.txt
   [junit4]   2> 1915528 INFO  (TEST-TestSolrConfigHandlerCloud.test-seed#[BCFC47F4AA4F3878]) [    ] o.a.s.c.AbstractZkTestCase put /x1/jenkins/jenkins-slave/workspace/Lucene-Solr-Tests-master/solr/core/src/test-files/solr/collection1/conf/protwords.txt to /configs/conf1/protwords.txt
   [junit4]   2> 1915528 INFO  (TEST-TestSolrConfigHandlerCloud.test-seed#[BCFC47F4AA4F3878]) [    ] o.a.s.c.c.SolrZkClient makePath: /configs/conf1/protwords.txt
   [junit4]   2> 1915529 INFO  (TEST-TestSolrConfigHandlerCloud.test-seed#[BCFC47F4AA4F3878]) [    ] o.a.s.c.AbstractZkTestCase put /x1/jenkins/jenkins-slave/workspace/Lucene-Solr-Tests-master/solr/core/src/test-files/solr/collection1/conf/currency.xml to /configs/conf1/currency.xml
   [junit4]   2> 1915529 INFO  (TEST-TestSolrConfigHandlerCloud.test-seed#[BCFC47F4AA4F3878]) [    ] o.a.s.c.c.SolrZkClient makePath: /configs/conf1/currency.xml
   [junit4]   2> 1915530 INFO  (TEST-TestSolrConfigHandlerCloud.test-seed#[BCFC47F4AA4F3878]) [    ] o.a.s.c.AbstractZkTestCase put /x1/jenkins/jenkins-slave/workspace/Lucene-Solr-Tests-master/solr/core/src/test-files/solr/collection1/conf/enumsConfig.xml to /configs/conf1/enumsConfig.xml
   [junit4]   2> 1915530 INFO  (TEST-TestSolrConfigHandlerCloud.test-seed#[BCFC47F4AA4F3878]) [    ] o.a.s.c.c.SolrZkClient makePath: /configs/conf1/enumsConfig.xml
   [junit4]   2> 1915531 INFO  (TEST-TestSolrConfigHandlerCloud.test-seed#[BCFC47F4AA4F3878]) [    ] o.a.s.c.AbstractZkTestCase put /x1/jenkins/jenkins-slave/workspace/Lucene-Solr-Tests-master/solr/core/src/test-files/solr/collection1/conf/open-exchange-rates.json to /configs/conf1/open-exchange-rates.json
   [junit4]   2> 1915531 INFO  (TEST-TestSolrConfigHandlerCloud.test-seed#[BCFC47F4AA4F3878]) [    ] o.a.s.c.c.SolrZkClient makePath: /configs/conf1/open-exchange-rates.json
   [junit4]   2> 1915532 INFO  (TEST-TestSolrConfigHandlerCloud.test-seed#[BCFC47F4AA4F3878]) [    ] o.a.s.c.AbstractZkTestCase put /x1/jenkins/jenkins-slave/workspace/Lucene-Solr-Tests-master/solr/core/src/test-files/solr/collection1/conf/mapping-ISOLatin1Accent.txt to /configs/conf1/mapping-ISOLatin1Accent.txt
   [junit4]   2> 1915532 INFO  (TEST-TestSolrConfigHandlerCloud.test-seed#[BCFC47F4AA4F3878]) [    ] o.a.s.c.c.SolrZkClient makePath: /configs/conf1/mapping-ISOLatin1Accent.txt
   [junit4]   2> 1915533 INFO  (TEST-TestSolrConfigHandlerCloud.test-seed#[BCFC47F4AA4F3878]) [    ] o.a.s.c.AbstractZkTestCase put /x1/jenkins/jenkins-slave/workspace/Lucene-Solr-Tests-master/solr/core/src/test-files/solr/collection1/conf/old_synonyms.txt to /configs/conf1/old_synonyms.txt
   [junit4]   2> 1915533 INFO  (TEST-TestSolrConfigHandlerCloud.test-seed#[BCFC47F4AA4F3878]) [    ] o.a.s.c.c.SolrZkClient makePath: /configs/conf1/old_synonyms.txt
   [junit4]   2> 1915534 INFO  (TEST-TestSolrConfigHandlerCloud.test-seed#[BCFC47F4AA4F3878]) [    ] o.a.s.c.AbstractZkTestCase put /x1/jenkins/jenkins-slave/workspace/Lucene-Solr-Tests-master/solr/core/src/test-files/solr/collection1/conf/synonyms.txt to /configs/conf1/synonyms.txt
   [junit4]   2> 1915534 INFO  (TEST-TestSolrConfigHandlerCloud.test-seed#[BCFC47F4AA4F3878]) [    ] o.a.s.c.c.SolrZkClient makePath: /configs/conf1/synonyms.txt
   [junit4]   2> 1915614 INFO  (TEST-TestSolrConfigHandlerCloud.test-seed#[BCFC47F4AA4F3878]) [    ] o.a.s.SolrTestCaseJ4 Writing core.properties file to /x1/jenkins/jenkins-slave/workspace/Lucene-Solr-Tests-master/solr/build/solr-core/test/J0/temp/solr.handler.TestSolrConfigHandlerCloud_BCFC47F4AA4F3878-001/control-001/cores/collection1
   [junit4]   2> 1915615 INFO  (TEST-TestSolrConfigHandlerCloud.test-seed#[BCFC47F4AA4F3878]) [    ] o.e.j.s.Server jetty-9.3.8.v20160314
   [junit4]   2> 1915616 INFO  (TEST-TestSolrConfigHandlerCloud.test-seed#[BCFC47F4AA4F3878]) [    ] o.e.j.s.h.ContextHandler Started o.e.j.s.ServletContextHandler@2d1bb050{/,null,AVAILABLE}
   [junit4]   2> 1915618 INFO  (TEST-TestSolrConfigHandlerCloud.test-seed#[BCFC47F4AA4F3878]) [    ] o.e.j.s.ServerConnector Started ServerConnector@153985e6{HTTP/1.1,[http/1.1]}{127.0.0.1:58203}
   [junit4]   2> 1915618 INFO  (TEST-TestSolrConfigHandlerCloud.test-seed#[BCFC47F4AA4F3878]) [    ] o.e.j.s.Server Started @1920424ms
   [junit4]   2> 1915618 INFO  (TEST-TestSolrConfigHandlerCloud.test-seed#[BCFC47F4AA4F3878]) [    ] o.a.s.c.s.e.JettySolrRunner Jetty properties: {solr.data.dir=/x1/jenkins/jenkins-slave/workspace/Lucene-Solr-Tests-master/solr/build/solr-core/test/J0/temp/solr.handler.TestSolrConfigHandlerCloud_BCFC47F4AA4F3878-001/tempDir-001/control/data, hostContext=/, hostPort=58203, coreRootDirectory=/x1/jenkins/jenkins-slave/workspace/Lucene-Solr-Tests-master/solr/build/solr-core/test/J0/../../../../../../../../../../x1/jenkins/jenkins-slave/workspace/Lucene-Solr-Tests-master/solr/build/solr-core/test/J0/temp/solr.handler.TestSolrConfigHandlerCloud_BCFC47F4AA4F3878-001/control-001/cores}
   [junit4]   2> 1915618 INFO  (TEST-TestSolrConfigHandlerCloud.test-seed#[BCFC47F4AA4F3878]) [    ] o.a.s.s.SolrDispatchFilter SolrDispatchFilter.init(): sun.misc.Launcher$AppClassLoader@73d16e93
   [junit4]   2> 1915619 INFO  (TEST-TestSolrConfigHandlerCloud.test-seed#[BCFC47F4AA4F3878]) [    ] o.a.s.c.SolrResourceLoader new SolrResourceLoader for directory: '/x1/jenkins/jenkins-slave/workspace/Lucene-Solr-Tests-master/solr/build/solr-core/test/J0/temp/solr.handler.TestSolrConfigHandlerCloud_BCFC47F4AA4F3878-001/control-001'
   [junit4]   2> 1915619 INFO  (TEST-TestSolrConfigHandlerCloud.test-seed#[BCFC47F4AA4F3878]) [    ] o.a.s.c.SolrResourceLoader JNDI not configured for solr (NoInitialContextEx)
   [junit4]   2> 1915619 INFO  (TEST-TestSolrConfigHandlerCloud.test-seed#[BCFC47F4AA4F3878]) [    ] o.a.s.c.SolrResourceLoader solr home defaulted to 'solr/' (could not find system property or JNDI)
   [junit4]   2> 1915619 INFO  (TEST-TestSolrConfigHandlerCloud.test-seed#[BCFC47F4AA4F3878]) [    ] o.a.s.c.c.SolrZkClient Using default ZkCredentialsProvider
   [junit4]   2> 1915620 INFO  (TEST-TestSolrConfigHandlerCloud.test-seed#[BCFC47F4AA4F3878]) [    ] o.a.s.c.c.ConnectionManager Waiting for client to connect to ZooKeeper
   [junit4]   2> 1915621 INFO  (zkCallback-17883-thread-1) [    ] o.a.s.c.c.ConnectionManager Watcher org.apache.solr.common.cloud.ConnectionManager@77446952 name:ZooKeeperConnection Watcher:127.0.0.1:38658/solr got event WatchedEvent state:SyncConnected type:None path:null path:null type:None
   [junit4]   2> 1915621 INFO  (TEST-TestSolrConfigHandlerCloud.test-seed#[BCFC47F4AA4F3878]) [    ] o.a.s.c.c.ConnectionManager Client is connected to ZooKeeper
   [junit4]   2> 1915622 INFO  (TEST-TestSolrConfigHandlerCloud.test-seed#[BCFC47F4AA4F3878]) [    ] o.a.s.c.c.SolrZkClient Using default ZkACLProvider
   [junit4]   2> 1915622 INFO  (TEST-TestSolrConfigHandlerCloud.test-seed#[BCFC47F4AA4F3878]) [    ] o.a.s.s.SolrDispatchFilter Loading solr.xml from SolrHome (not found in ZooKeeper)
   [junit4]   2> 1915622 INFO  (TEST-TestSolrConfigHandlerCloud.test-seed#[BCFC47F4AA4F3878]) [    ] o.a.s.c.SolrXmlConfig Loading container configuration from /x1/jenkins/jenkins-slave/workspace/Lucene-Solr-Tests-master/solr/build/solr-core/test/J0/temp/solr.handler.TestSolrConfigHandlerCloud_BCFC47F4AA4F3878-001/control-001/solr.xml
   [junit4]   2> 1915627 INFO  (TEST-TestSolrConfigHandlerCloud.test-seed#[BCFC47F4AA4F3878]) [    ] o.a.s.c.CorePropertiesLocator Config-defined core root directory: /x1/jenkins/jenkins-slave/workspace/Lucene-Solr-Tests-master/solr/build/solr-core/test/J0/../../../../../../../../../../x1/jenkins/jenkins-slave/workspace/Lucene-Solr-Tests-master/solr/build/solr-core/test/J0/temp/solr.handler.TestSolrConfigHandlerCloud_BCFC47F4AA4F3878-001/control-001/cores
   [junit4]   2> 1915627 INFO  (TEST-TestSolrConfigHandlerCloud.test-seed#[BCFC47F4AA4F3878]) [    ] o.a.s.c.CoreContainer New CoreContainer 685870925
   [junit4]   2> 1915627 INFO  (TEST-TestSolrConfigHandlerCloud.test-seed#[BCFC47F4AA4F3878]) [    ] o.a.s.c.CoreContainer Loading cores into CoreContainer [instanceDir=/x1/jenkins/jenkins-slave/workspace/Lucene-Solr-Tests-master/solr/build/solr-core/test/J0/temp/solr.handler.TestSolrConfigHandlerCloud_BCFC47F4AA4F3878-001/control-001]
   [junit4]   2> 1915627 WARN  (TEST-TestSolrConfigHandlerCloud.test-seed#[BCFC47F4AA4F3878]) [    ] o.a.s.c.CoreContainer Couldn't add files from /x1/jenkins/jenkins-slave/workspace/Lucene-Solr-Tests-master/solr/build/solr-core/test/J0/temp/solr.handler.TestSolrConfigHandlerCloud_BCFC47F4AA4F3878-001/control-001/lib to classpath: /x1/jenkins/jenkins-slave/workspace/Lucene-Solr-Tests-master/solr/build/solr-core/test/J0/temp/solr.handler.TestSolrConfigHandlerCloud_BCFC47F4AA4F3878-001/control-001/lib
   [junit4]   2> 1915628 INFO  (TEST-TestSolrConfigHandlerCloud.test-seed#[BCFC47F4AA4F3878]) [    ] o.a.s.h.c.HttpShardHandlerFactory created with socketTimeout : 90000,urlScheme : ,connTimeout : 15000,maxConnectionsPerHost : 20,maxConnections : 10000,corePoolSize : 0,maximumPoolSize : 2147483647,maxThreadIdleTime : 5,sizeOfQueue : -1,fairnessPolicy : false,
   [junit4]   2> 1915629 INFO  (TEST-TestSolrConfigHandlerCloud.test-seed#[BCFC47F4AA4F3878]) [    ] o.a.s.u.UpdateShardHandler Creating UpdateShardHandler HTTP client with params: 
   [junit4]   2> 1915629 INFO  (TEST-TestSolrConfigHandlerCloud.test-seed#[BCFC47F4AA4F3878]) [    ] o.a.s.l.LogWatcher SLF4J impl is org.slf4j.impl.Log4jLoggerFactory
   [junit4]   2> 1915629 INFO  (TEST-TestSolrConfigHandlerCloud.test-seed#[BCFC47F4AA4F3878]) [    ] o.a.s.l.LogWatcher Registering Log Listener [Log4j (org.slf4j.impl.Log4jLoggerFactory)]
   [junit4]   2> 1915630 INFO  (TEST-TestSolrConfigHandlerCloud.test-seed#[BCFC47F4AA4F3878]) [    ] o.a.s.c.ZkContainer Zookeeper client=127.0.0.1:38658/solr
   [junit4]   2> 1915630 INFO  (TEST-TestSolrConfigHandlerCloud.test-seed#[BCFC47F4AA4F3878]) [    ] o.a.s.c.ZkController zkHost includes chroot
   [junit4]   2> 1915630 INFO  (TEST-TestSolrConfigHandlerCloud.test-seed#[BCFC47F4AA4F3878]) [    ] o.a.s.c.c.SolrZkClient Using default ZkCredentialsProvider
   [junit4]   2> 1915630 INFO  (TEST-TestSolrConfigHandlerCloud.test-seed#[BCFC47F4AA4F3878]) [    ] o.a.s.c.c.ConnectionManager Waiting for client to connect to ZooKeeper
   [junit4]   2> 1915631 INFO  (zkCallback-17886-thread-1) [    ] o.a.s.c.c.ConnectionManager Watcher org.apache.solr.common.cloud.ConnectionManager@5605f2a1 name:ZooKeeperConnection Watcher:127.0.0.1:38658 got event WatchedEvent state:SyncConnected type:None path:null path:null type:None
   [junit4]   2> 1915631 INFO  (TEST-TestSolrConfigHandlerCloud.test-seed#[BCFC47F4AA4F3878]) [    ] o.a.s.c.c.ConnectionManager Client is connected to ZooKeeper
   [junit4]   2> 1915631 INFO  (TEST-TestSolrConfigHandlerCloud.test-seed#[BCFC47F4AA4F3878]) [    ] o.a.s.c.c.SolrZkClient Using default ZkACLProvider
   [junit4]   2> 1915631 INFO  (TEST-TestSolrConfigHandlerCloud.test-seed#[BCFC47F4AA4F3878]) [n:127.0.0.1:58203_    ] o.a.s.c.ZkController Added new OnReconnect listener org.apache.solr.cloud.ZkController$$Lambda$49/715190948@7b6e1b36
   [junit4]   2> 1915632 INFO  (TEST-TestSolrConfigHandlerCloud.test-seed#[BCFC47F4AA4F3878]) [n:127.0.0.1:58203_    ] o.a.s.c.c.ConnectionManager Waiting for client to connect to ZooKeeper
   [junit4]   2> 1915632 INFO  (zkCallback-17887-thread-1-processing-n:127.0.0.1:58203_) [n:127.0.0.1:58203_    ] o.a.s.c.c.ConnectionManager Watcher org.apache.solr.common.cloud.ConnectionManager@39e1fff9 name:ZooKeeperConnection Watcher:127.0.0.1:38658/solr got event WatchedEvent state:SyncConnected type:None path:null path:null type:None
   [junit4]   2> 1915632 INFO  (TEST-TestSolrConfigHandlerCloud.test-seed#[BCFC47F4AA4F3878]) [n:127.0.0.1:58203_    ] o.a.s.c.c.ConnectionManager Client is connected to ZooKeeper
   [junit4]   2> 1915633 INFO  (TEST-TestSolrConfigHandlerCloud.test-seed#[BCFC47F4AA4F3878]) [n:127.0.0.1:58203_    ] o.a.s.c.c.SolrZkClient makePath: /overseer/queue
   [junit4]   2> 1915634 INFO  (TEST-TestSolrConfigHandlerCloud.test-seed#[BCFC47F4AA4F3878]) [n:127.0.0.1:58203_    ] o.a.s.c.c.SolrZkClient makePath: /overseer/collection-queue-work
   [junit4]   2> 1915636 INFO  (TEST-TestSolrConfigHandlerCloud.test-seed#[BCFC47F4AA4F3878]) [n:127.0.0.1:58203_    ] o.a.s.c.c.SolrZkClient makePath: /overseer/collection-map-running
   [junit4]   2> 1915636 INFO  (TEST-TestSolrConfigHandlerCloud.test-seed#[BCFC47F4AA4F3878]) [n:127.0.0.1:58203_    ] o.a.s.c.c.SolrZkClient makePath: /overseer/collection-map-completed
   [junit4]   2> 1915637 INFO  (TEST-TestSolrConfigHandlerCloud.test-seed#[BCFC47F4AA4F3878]) [n:127.0.0.1:58203_    ] o.a.s.c.c.SolrZkClient makePath: /overseer/collection-map-failure
   [junit4]   2> 1915638 INFO  (TEST-TestSolrConfigHandlerCloud.test-seed#[BCFC47F4AA4F3878]) [n:127.0.0.1:58203_    ] o.a.s.c.c.SolrZkClient makePath: /live_nodes
   [junit4]   2> 1915640 INFO  (TEST-TestSolrConfigHandlerCloud.test-seed#[BCFC47F4AA4F3878]) [n:127.0.0.1:58203_    ] o.a.s.c.c.SolrZkClient makePath: /aliases.json
   [junit4]   2> 1915641 INFO  (TEST-TestSolrConfigHandlerCloud.test-seed#[BCFC47F4AA4F3878]) [n:127.0.0.1:58203_    ] o.a.s.c.c.SolrZkClient makePath: /clusterstate.json
   [junit4]   2> 1915642 INFO  (TEST-TestSolrConfigHandlerCloud.test-seed#[BCFC47F4AA4F3878]) [n:127.0.0.1:58203_    ] o.a.s.c.c.SolrZkClient makePath: /security.json
   [junit4]   2> 1915642 INFO  (TEST-TestSolrConfigHandlerCloud.test-seed#[BCFC47F4AA4F3878]) [n:127.0.0.1:58203_    ] o.a.s.c.c.ZkStateReader Updating cluster state from ZooKeeper... 
   [junit4]   2> 1915643 INFO  (TEST-TestSolrConfigHandlerCloud.test-seed#[BCFC47F4AA4F3878]) [n:127.0.0.1:58203_    ] o.a.s.c.c.ZkStateReader Loaded empty cluster properties
   [junit4]   2> 1915643 INFO  (TEST-TestSolrConfigHandlerCloud.test-seed#[BCFC47F4AA4F3878]) [n:127.0.0.1:58203_    ] o.a.s.c.c.ZkStateReader Updated live nodes from ZooKeeper... (0) -> (0)
   [junit4]   2> 1915645 INFO  (TEST-TestSolrConfigHandlerCloud.test-seed#[BCFC47F4AA4F3878]) [n:127.0.0.1:58203_    ] o.a.s.c.c.SolrZkClient makePath: /overseer_elect
   [junit4]   2> 1915645 INFO  (TEST-TestSolrConfigHandlerCloud.test-seed#[BCFC47F4AA4F3878]) [n:127.0.0.1:58203_    ] o.a.s.c.c.SolrZkClient makePath: /overseer_elect/election
   [junit4]   2> 1915646 INFO  (TEST-TestSolrConfigHandlerCloud.test-seed#[BCFC47F4AA4F3878]) [n:127.0.0.1:58203_    ] o.a.s.c.Overseer Overseer (id=null) closing
   [junit4]   2> 1915646 INFO  (TEST-TestSolrConfigHandlerCloud.test-seed#[BCFC47F4AA4F3878]) [n:127.0.0.1:58203_    ] o.a.s.c.LeaderElector Joined leadership election with path: /overseer_elect/election/96141085987766276-127.0.0.1:58203_-n_0000000000
   [junit4]   2> 1915647 INFO  (TEST-TestSolrConfigHandlerCloud.test-seed#[BCFC47F4AA4F3878]) [n:127.0.0.1:58203_    ] o.a.s.c.OverseerElectionContext I am going to be the leader 127.0.0.1:58203_
   [junit4]   2> 1915647 INFO  (TEST-TestSolrConfigHandlerCloud.test-seed#[BCFC47F4AA4F3878]) [n:127.0.0.1:58203_    ] o.a.s.c.c.SolrZkClient makePath: /overseer_elect/leader
   [junit4]   2> 1915647 INFO  (TEST-TestSolrConfigHandlerCloud.test-seed#[BCFC47F4AA4F3878]) [n:127.0.0.1:58203_    ] o.a.s.c.Overseer Overseer (id=96141085987766276-127.0.0.1:58203_-n_0000000000) starting
   [junit4]   2> 1915649 INFO  (TEST-TestSolrConfigHandlerCloud.test-seed#[BCFC47F4AA4F3878]) [n:127.0.0.1:58203_    ] o.a.s.c.c.SolrZkClient makePath: /overseer/queue-work
   [junit4]   2> 1915652 INFO  (TEST-TestSolrConfigHandlerCloud.test-seed#[BCFC47F4AA4F3878]) [n:127.0.0.1:58203_    ] o.a.s.c.OverseerAutoReplicaFailoverThread Starting OverseerAutoReplicaFailoverThread autoReplicaFailoverWorkLoopDelay=10000 autoReplicaFailoverWaitAfterExpiration=30000 autoReplicaFailoverBadNodeExpiration=60000
   [junit4]   2> 1915653 INFO  (OverseerCollectionConfigSetProcessor-96141085987766276-127.0.0.1:58203_-n_0000000000) [n:127.0.0.1:58203_    ] o.a.s.c.OverseerTaskProcessor Process current queue of overseer operations
   [junit4]   2> 1915653 INFO  (OverseerStateUpdate-96141085987766276-127.0.0.1:58203_-n_0000000000) [n:127.0.0.1:58203_    ] o.a.s.c.Overseer Starting to work on the main queue
   [junit4]   2> 1915653 INFO  (TEST-TestSolrConfigHandlerCloud.test-seed#[BCFC47F4AA4F3878]) [n:127.0.0.1:58203_    ] o.a.s.c.ZkController Register node as live in ZooKeeper:/live_nodes/127.0.0.1:58203_
   [junit4]   2> 1915655 INFO  (TEST-TestSolrConfigHandlerCloud.test-seed#[BCFC47F4AA4F3878]) [n:127.0.0.1:58203_    ] o.a.s.c.c.SolrZkClient makePath: /live_nodes/127.0.0.1:58203_
   [junit4]   2> 1915655 INFO  (OverseerStateUpdate-96141085987766276-127.0.0.1:58203_-n_0000000000) [n:127.0.0.1:58203_    ] o.a.s.c.c.ZkStateReader Updated live nodes from ZooKeeper... (0) -> (0)
   [junit4]   2> 1915656 INFO  (zkCallback-17887-thread-1-processing-n:127.0.0.1:58203_) [n:127.0.0.1:58203_    ] o.a.s.c.c.ZkStateReader A live node change: [WatchedEvent state:SyncConnected type:NodeChildrenChanged path:/live_nodes], has occurred - updating... (live nodes size: [0])
   [junit4]   2> 1915664 INFO  (zkCallback-17887-thread-1-processing-n:127.0.0.1:58203_) [n:127.0.0.1:58203_    ] o.a.s.c.c.ZkStateReader Updated live nodes from ZooKeeper... (0) -> (1)
   [junit4]   2> 1915664 INFO  (TEST-TestSolrConfigHandlerCloud.test-seed#[BCFC47F4AA4F3878]) [n:127.0.0.1:58203_    ] o.a.s.c.CoreContainer Security conf doesn't exist. Skipping setup for authorization module.
   [junit4]   2> 1915664 INFO  (TEST-TestSolrConfigHandlerCloud.test-seed#[BCFC47F4AA4F3878]) [n:127.0.0.1:58203_    ] o.a.s.c.CoreContainer No authentication plugin used.
   [junit4]   2> 1915665 INFO  (TEST-TestSolrConfigHandlerCloud.test-seed#[BCFC47F4AA4F3878]) [n:127.0.0.1:58203_    ] o.a.s.c.CorePropertiesLocator Looking for core definitions underneath /x1/jenkins/jenkins-slave/workspace/Lucene-Solr-Tests-master/solr/build/solr-core/test/J0/../../../../../../../../../../x1/jenkins/jenkins-slave/workspace/Lucene-Solr-Tests-master/solr/build/solr-core/test/J0/temp/solr.handler.TestSolrConfigHandlerCloud_BCFC47F4AA4F3878-001/control-001/cores
   [junit4]   2> 1915666 INFO  (TEST-TestSolrConfigHandlerCloud.test-seed#[BCFC47F4AA4F3878]) [n:127.0.0.1:58203_    ] o.a.s.c.CoreDescriptor Created CoreDescriptor: {name=collection1, config=solrconfig.xml, transient=false, schema=schema.xml, loadOnStartup=true, configSetProperties=configsetprops.json, collection=control_collection, coreNodeName=, dataDir=data/, shard=}
   [junit4]   2> 1915666 INFO  (TEST-TestSolrConfigHandlerCloud.test-seed#[BCFC47F4AA4F3878]) [n:127.0.0.1:58203_    ] o.a.s.c.CorePropertiesLocator Found core collection1 in /x1/jenkins/jenkins-slave/workspace/Lucene-Solr-Tests-master/solr/build/solr-core/test/J0/../../../../../../../../../../x1/jenkins/jenkins-slave/workspace/Lucene-Solr-Tests-master/solr/build/solr-core/test/J0/temp/solr.handler.TestSolrConfigHandlerCloud_BCFC47F4AA4F3878-001/control-001/cores/collection1
   [junit4]   2> 1915666 INFO  (TEST-TestSolrConfigHandlerCloud.test-seed#[BCFC47F4AA4F3878]) [n:127.0.0.1:58203_    ] o.a.s.c.CorePropertiesLocator Found 1 core definitions
   [junit4]   2> 1915667 INFO  (TEST-TestSolrConfigHandlerCloud.test-seed#[BCFC47F4AA4F3878]) [n:127.0.0.1:58203_    ] o.a.s.s.SolrDispatchFilter user.dir=/x1/jenkins/jenkins-slave/workspace/Lucene-Solr-Tests-master/solr/build/solr-core/test/J0
   [junit4]   2> 1915667 INFO  (TEST-TestSolrConfigHandlerCloud.test-seed#[BCFC47F4AA4F3878]) [n:127.0.0.1:58203_    ] o.a.s.s.SolrDispatchFilter SolrDispatchFilter.init() done
   [junit4]   2> 1915667 INFO  (coreLoadExecutor-8307-thread-1-processing-n:127.0.0.1:58203_) [n:127.0.0.1:58203_ c:control_collection   x:collection1] o.a.s.c.ZkController publishing state=down
   [junit4]   2> 1915667 INFO  (coreLoadExecutor-8307-thread-1-processing-n:127.0.0.1:58203_) [n:127.0.0.1:58203_ c:control_collection   x:collection1] o.a.s.c.ZkController numShards not found on descriptor - reading it from system property
   [junit4]   2> 1915667 INFO  (coreLoadExecutor-8307-thread-1-processing-n:127.0.0.1:58203_) [n:127.0.0.1:58203_ c:control_collection   x:collection1] o.a.s.c.ZkController Collection control_collection not visible yet, but flagging it so a watch is registered when it becomes visible
   [junit4]   2> 1915667 INFO  (OverseerStateUpdate-96141085987766276-127.0.0.1:58203_-n_0000000000) [n:127.0.0.1:58203_    ] o.a.s.c.Overseer processMessage: queueSize: 1, message = {
   [junit4]   2>   "core":"collection1",
   [junit4]   2>   "roles":null,
   [junit4]   2>   "base_url":"http://127.0.0.1:58203",
   [junit4]   2>   "node_name":"127.0.0.1:58203_",
   [junit4]   2>   "numShards":"1",
   [junit4]   2>   "state":"down",
   [junit4]   2>   "shard":null,
   [junit4]   2>   "collection":"control_collection",
   [junit4]   2>   "operation":"state"} current state version: 0
   [junit4]   2> 1915668 INFO  (OverseerStateUpdate-96141085987766276-127.0.0.1:58203_-n_0000000000) [n:127.0.0.1:58203_    ] o.a.s.c.o.ReplicaMutator Update state numShards=1 message={
   [junit4]   2>   "core":"collection1",
   [junit4]   2>   "roles":null,
   [junit4]   2>   "base_url":"http://127.0.0.1:58203",
   [junit4]   2>   "node_name":"127.0.0.1:58203_",
   [junit4]   2>   "numShards":"1",
   [junit4]   2>   "state":"down",
   [junit4]   2>   "shard":null,
   [junit4]   2>   "collection":"control_collection",
   [junit4]   2>   "operation":"state"}
   [junit4]   2> 1915668 INFO  (OverseerStateUpdate-96141085987766276-127.0.0.1:58203_-n_0000000000) [n:127.0.0.1:58203_    ] o.a.s.c.o.ClusterStateMutator building a new cName: control_collection
   [junit4]   2> 1915668 INFO  (coreLoadExecutor-8307-thread-1-processing-n:127.0.0.1:58203_) [n:127.0.0.1:58203_ c:control_collection   x:collection1] o.a.s.c.c.ZkStateReader Deleting data for [control_collection]
   [junit4]   2> 1915668 INFO  (OverseerStateUpdate-96141085987766276-127.0.0.1:58203_-n_0000000000) [n:127.0.0.1:58203_    ] o.a.s.c.o.ReplicaMutator Assigning new node to shard shard=shard1
   [junit4]   2> 1915669 INFO  (coreLoadExecutor-8307-thread-1-processing-n:127.0.0.1:58203_) [n:127.0.0.1:58203_ c:control_collection   x:collection1] o.a.s.c.ZkController look for our core node name
   [junit4]   2> 1915669 INFO  (zkCallback-17887-thread-1-processing-n:127.0.0.1:58203_) [n:127.0.0.1:58203_    ] o.a.s.c.c.ZkStateReader A cluster state change: [WatchedEvent state:SyncConnected type:NodeDataChanged path:/clusterstate.json], has occurred - updating... (live nodes size: [1])
   [junit4]   2> 1916669 INFO  (coreLoadExecutor-8307-thread-1-processing-n:127.0.0.1:58203_) [n:127.0.0.1:58203_ c:control_collection   x:collection1] o.a.s.c.ZkController waiting to find shard id in clusterstate for collection1
   [junit4]   2> 1916669 INFO  (coreLoadExecutor-8307-thread-1-processing-n:127.0.0.1:58203_) [n:127.0.0.1:58203_ c:control_collection   x:collection1] o.a.s.c.ZkController Check for collection zkNode:control_collection
   [junit4]   2> 1916670 INFO  (coreLoadExecutor-8307-thread-1-processing-n:127.0.0.1:58203_) [n:127.0.0.1:58203_ c:control_collection   x:collection1] o.a.s.c.ZkController Collection zkNode exists
   [junit4]   2> 1916670 INFO  (coreLoadExecutor-8307-thread-1-processing-n:127.0.0.1:58203_) [n:127.0.0.1:58203_ c:control_collection   x:collection1] o.a.s.c.c.ZkStateReader Load collection config from: [/collections/control_collection]
   [junit4]   2> 1916670 INFO  (coreLoadExecutor-8307-thread-1-processing-n:127.0.0.1:58203_) [n:127.0.0.1:58203_ c:control_collection   x:collection1] o.a.s.c.c.ZkStateReader path=[/collections/control_collection] [configName]=[conf1] specified config exists in ZooKeeper
   [junit4]   2> 1916670 INFO  (coreLoadExecutor-8307-thread-1-processing-n:127.0.0.1:58203_) [n:127.0.0.1:58203_ c:control_collection   x:collection1] o.a.s.c.SolrResourceLoader new SolrResourceLoader for directory: '/x1/jenkins/jenkins-slave/workspace/Lucene-Solr-Tests-master/solr/build/solr-core/test/J0/temp/solr.handler.TestSolrConfigHandlerCloud_BCFC47F4AA4F3878-001/control-001/cores/collection1'
   [junit4]   2> 1916670 INFO  (coreLoadExecutor-8307-thread-1-processing-n:127.0.0.1:58203_) [n:127.0.0.1:58203_ c:control_collection   x:collection1] o.a.s.c.SolrResourceLoader JNDI not configured for solr (NoInitialContextEx)
   [junit4]   2> 1916671 INFO  (coreLoadExecutor-8307-thread-1-processing-n:127.0.0.1:58203_) [n:127.0.0.1:58203_ c:control_collection   x:collection1] o.a.s.c.SolrResourceLoader solr home defaulted to 'solr/' (could not find system property or JNDI)
   [junit4]   2> 1916674 INFO  (coreLoadExecutor-8307-thread-1-processing-n:127.0.0.1:58203_) [n:127.0.0.1:58203_ c:control_collection   x:collection1] o.a.s.c.Config loaded config solrconfig.xml with version 0 
   [junit4]   2> 1916676 INFO  (coreLoadExecutor-8307-thread-1-processing-n:127.0.0.1:58203_) [n:127.0.0.1:58203_ c:control_collection   x:collection1] o.a.s.c.SolrConfig current version of requestparams : -1
   [junit4]   2> 1916680 INFO  (coreLoadExecutor-8307-thread-1-processing-n:127.0.0.1:58203_) [n:127.0.0.1:58203_ c:control_collection   x:collection1] o.a.s.c.SolrConfig Using Lucene MatchVersion: 7.0.0
   [junit4]   2> 1916686 INFO  (coreLoadExecutor-8307-thread-1-processing-n:127.0.0.1:58203_) [n:127.0.0.1:58203_ c:control_collection   x:collection1] o.a.s.c.SolrConfig Loaded SolrConfig: solrconfig.xml
   [junit4]   2> 1916690 INFO  (coreLoadExecutor-8307-thread-1-processing-n:127.0.0.1:58203_) [n:127.0.0.1:58203_ c:control_collection   x:collection1] o.a.s.s.IndexSchema [collection1] Schema name=test
   [junit4]   2> 1916758 INFO  (coreLoadExecutor-8307-thread-1-processing-n:127.0.0.1:58203_) [n:127.0.0.1:58203_ c:control_collection   x:collection1] o.a.s.s.OpenExchangeRatesOrgProvider Initialized with rates=open-exchange-rates.json, refreshInterval=1440.
   [junit4]   2> 1916762 INFO  (coreLoadExecutor-8307-thread-1-processing-n:127.0.0.1:58203_) [n:127.0.0.1:58203_ c:control_collection   x:collection1] o.a.s.s.IndexSchema default search field in schema is text
   [junit4]   2> 1916763 INFO  (coreLoadExecutor-8307-thread-1-processing-n:127.0.0.1:58203_) [n:127.0.0.1:58203_ c:control_collection   x:collection1] o.a.s.s.IndexSchema unique key field: id
   [junit4]   2> 1916767 INFO  (coreLoadExecutor-8307-thread-1-processing-n:127.0.0.1:58203_) [n:127.0.0.1:58203_ c:control_collection   x:collection1] o.a.s.s.FileExchangeRateProvider Reloading exchange rates from file currency.xml
   [junit4]   2> 1916769 INFO  (coreLoadExecutor-8307-thread-1-processing-n:127.0.0.1:58203_) [n:127.0.0.1:58203_ c:control_collection   x:collection1] o.a.s.s.FileExchangeRateProvider Reloading exchange rates from file currency.xml
   [junit4]   2> 1916770 INFO  (coreLoadExecutor-8307-thread-1-processing-n:127.0.0.1:58203_) [n:127.0.0.1:58203_ c:control_collection   x:collection1] o.a.s.s.OpenExchangeRatesOrgProvider Reloading exchange rates from open-exchange-rates.json
   [junit4]   2> 1916770 INFO  (coreLoadExecutor-8307-thread-1-processing-n:127.0.0.1:58203_) [n:127.0.0.1:58203_ c:control_collection   x:collection1] o.a.s.s.OpenExchangeRatesOrgProvider Reloading exchange rates from open-exchange-rates.json
   [junit4]   2> 1916771 INFO  (coreLoadExecutor-8307-thread-1-processing-n:127.0.0.1:58203_) [n:127.0.0.1:58203_ c:control_collection   x:collection1] o.a.s.c.ConfigSetProperties Did not find ConfigSet properties, assuming default properties: Can't find resource 'configsetprops.json' in classpath or '/configs/conf1', cwd=/x1/jenkins/jenkins-slave/workspace/Lucene-Solr-Tests-master/solr/build/solr-core/test/J0
   [junit4]   2> 1916771 INFO  (coreLoadExecutor-8307-thread-1-processing-n:127.0.0.1:58203_) [n:127.0.0.1:58203_ c:control_collection   x:collection1] o.a.s.c.CoreContainer Creating SolrCore 'collection1' using configuration from collection control_collection
   [junit4]   2> 1916771 INFO  (coreLoadExecutor-8307-thread-1-processing-n:127.0.0.1:58203_) [n:127.0.0.1:58203_ c:control_collection s:shard1 r:core_node1 x:collection1] o.a.s.c.SolrCore org.apache.solr.core.MockDirectoryFactory
   [junit4]   2> 1916771 INFO  (coreLoadExecutor-8307-thread-1-processing-n:127.0.0.1:58203_) [n:127.0.0.1:58203_ c:control_collection s:shard1 r:core_node1 x:collection1] o.a.s.c.SolrCore [[collection1] ] Opening new SolrCore at [/x1/jenkins/jenkins-slave/workspace/Lucene-Solr-Tests-master/solr/build/solr-core/test/J0/temp/solr.handler.TestSolrConfigHandlerCloud_BCFC47F4AA4F3878-001/control-001/cores/collection1], dataDir=[/x1/jenkins/jenkins-slave/workspace/Lucene-Solr-Tests-master/solr/build/solr-core/test/J0/../../../../../../../../../../x1/jenkins/jenkins-slave/workspace/Lucene-Solr-Tests-master/solr/build/solr-core/test/J0/temp/solr.handler.TestSolrConfigHandlerCloud_BCFC47F4AA4F3878-001/control-001/cores/collection1/data/]
   [junit4]   2> 1916772 INFO  (coreLoadExecutor-8307-thread-1-processing-n:127.0.0.1:58203_) [n:127.0.0.1:58203_ c:control_collection s:shard1 r:core_node1 x:collection1] o.a.s.c.JmxMonitoredMap JMX monitoring is enabled. Adding Solr mbeans to JMX Server: com.sun.jmx.mbeanserver.JmxMBeanServer@50f7b964
   [junit4]   2> 1916772 INFO  (coreLoadExecutor-8307-thread-1-processing-n:127.0.0.1:58203_) [n:127.0.0.1:58203_ c:control_collection s:shard1 r:core_node1 x:collection1] o.a.s.c.CachingDirectoryFactory return new directory for /x1/jenkins/jenkins-slave/workspace/Lucene-Solr-Tests-master/solr/build/solr-core/test/J0/../../../../../../../../../../x1/jenkins/jenkins-slave/workspace/Lucene-Solr-Tests-master/solr/build/solr-core/test/J0/temp/solr.handler.TestSolrConfigHandlerCloud_BCFC47F4AA4F3878-001/control-001/cores/collection1/data
   [junit4]   2> 1916772 INFO  (coreLoadExecutor-8307-thread-1-processing-n:127.0.0.1:58203_) [n:127.0.0.1:58203_ c:control_collection s:shard1 r:core_node1 x:collection1] o.a.s.c.SolrCore New index directory detected: old=null new=/x1/jenkins/jenkins-slave/workspace/Lucene-Solr-Tests-master/solr/build/solr-core/test/J0/../../../../../../../../../../x1/jenkins/jenkins-slave/workspace/Lucene-Solr-Tests-master/solr/build/solr-core/test/J0/temp/solr.handler.TestSolrConfigHandlerCloud_BCFC47F4AA4F3878-001/control-001/cores/collection1/data/index/
   [junit4]   2> 1916772 WARN  (coreLoadExecutor-8307-thread-1-processing-n:127.0.0.1:58203_) [n:127.0.0.1:58203_ c:control_collection s:shard1 r:core_node1 x:collection1] o.a.s.c.SolrCore [collection1] Solr index directory '/x1/jenkins/jenkins-slave/workspace/Lucene-Solr-Tests-master/solr/build/solr-core/test/J0/../../../../../../../../../../x1/jenkins/jenkins-slave/workspace/Lucene-Solr-Tests-master/solr/build/solr-core/test/J0/temp/solr.handler.TestSolrConfigHandlerCloud_BCFC47F4AA4F3878-001/control-001/cores/collection1/data/index' doesn't exist. Creating new index...
   [junit4]   2> 1916772 INFO  (coreLoadExecutor-8307-thread-1-processing-n:127.0.0.1:58203_) [n:127.0.0.1:58203_ c:control_collection s:shard1 r:core_node1 x:collection1] o.a.s.c.CachingDirectoryFactory return new directory for /x1/jenkins/jenkins-slave/workspace/Lucene-Solr-Tests-master/solr/build/solr-core/test/J0/../../../../../../../../../../x1/jenkins/jenkins-slave/workspace/Lucene-Solr-Tests-master/solr/build/solr-core/test/J0/temp/solr.handler.TestSolrConfigHandlerCloud_BCFC47F4AA4F3878-001/control-001/cores/collection1/data/index
   [junit4]   2> 1916772 INFO  (coreLoadExecutor-8307-thread-1-processing-n:127.0.0.1:58203_) [n:127.0.0.1:58203_ c:control_collection s:shard1 r:core_node1 x:collection1] o.a.s.u.RandomMergePolicy RandomMergePolicy wrapping class org.apache.lucene.index.LogDocMergePolicy: [LogDocMergePolicy: minMergeSize=1000, mergeFactor=38, maxMergeSize=9223372036854775807, maxMergeSizeForForcedMerge=9223372036854775807, calibrateSizeByDeletes=true, maxMergeDocs=2147483647, maxCFSSegmentSizeMB=8.796093022207999E12, noCFSRatio=0.6995368079730496]
   [junit4]   2> 1916773 INFO  (coreLoadExecutor-8307-thread-1-processing-n:127.0.0.1:58203_) [n:127.0.0.1:58203_ c:control_collection s:shard1 r:core_node1 x:collection1] o.a.s.c.SolrDeletionPolicy SolrDeletionPolicy.onCommit: commits: num=1
   [junit4]   2> 	commit{dir=MockDirectoryWrapper(RAMDirectory@427328dc lockFactory=org.apache.lucene.store.SingleInstanceLockFactory@40f883a3),segFN=segments_1,generation=1}
   [junit4]   2> 1916773 INFO  (coreLoadExecutor-8307-thread-1-processing-n:127.0.0.1:58203_) [n:127.0.0.1:58203_ c:control_collection s:shard1 r:core_node1 x:collection1] o.a.s.c.SolrDeletionPolicy newest commit generation = 1
   [junit4]   2> 1916773 INFO  (OldIndexDirectoryCleanupThreadForCore-collection1) [n:127.0.0.1:58203_ c:control_collection s:shard1 r:core_node1 x:collection1] o.a.s.c.SolrCore Looking for old index directories to cleanup for core collection1 in /x1/jenkins/jenkins-slave/workspace/Lucene-Solr-Tests-master/solr/build/solr-core/test/J0/../../../../../../../../../../x1/jenkins/jenkins-slave/workspace/Lucene-Solr-Tests-master/solr/build/solr-core/test/J0/temp/solr.handler.TestSolrConfigHandlerCloud_BCFC47F4AA4F3878-001/control-001/cores/collection1/data/
   [junit4]   2> 1916773 WARN  (OldIndexDirectoryCleanupThreadForCore-collection1) [n:127.0.0.1:58203_ c:control_collection s:shard1 r:core_node1 x:collection1] o.a.s.c.DirectoryFactory /x1/jenkins/jenkins-slave/workspace/Lucene-Solr-Tests-master/solr/build/solr-core/test/J0/../../../../../../../../../../x1/jenkins/jenkins-slave/workspace/Lucene-Solr-Tests-master/solr/build/solr-core/test/J0/temp/solr.handler.TestSolrConfigHandlerCloud_BCFC47F4AA4F3878-001/control-001/cores/collection1/data/ does not point to a valid data directory; skipping clean-up of old index directories.
   [junit4]   2> 1916775 INFO  (coreLoadExecutor-8307-thread-1-processing-n:127.0.0.1:58203_) [n:127.0.0.1:58203_ c:control_collection s:shard1 r:core_node1 x:collection1] o.a.s.u.p.UpdateRequestProcessorChain creating updateRequestProcessorChain "nodistrib"
   [junit4]   2> 1916775 INFO  (coreLoadExecutor-8307-thread-1-processing-n:127.0.0.1:58203_) [n:127.0.0.1:58203_ c:control_collection s:shard1 r:core_node1 x:collection1] o.a.s.u.p.UpdateRequestProcessorChain creating updateRequestProcessorChain "dedupe"
   [junit4]   2> 1916775 INFO  (coreLoadExecutor-8307-thread-1-processing-n:127.0.0.1:58203_) [n:127.0.0.1:58203_ c:control_collection s:shard1 r:core_node1 x:collection1] o.a.s.u.p.UpdateRequestProcessorChain inserting DistributedUpdateProcessorFactory into updateRequestProcessorChain "dedupe"
   [junit4]   2> 1916775 INFO  (coreLoadExecutor-8307-thread-1-processing-n:127.0.0.1:58203_) [n:127.0.0.1:58203_ c:control_collection s:shard1 r:core_node1 x:collection1] o.a.s.u.p.UpdateRequestProcessorChain creating updateRequestProcessorChain "stored_sig"
   [junit4]   2> 1916775 INFO  (coreLoadExecutor-8307-thread-1-processing-n:127.0.0.1:58203_) [n:127.0.0.1:58203_ c:control_collection s:shard1 r:core_node1 x:collection1] o.a.s.u.p.UpdateRequestProcessorChain inserting DistributedUpdateProcessorFactory into updateRequestProcessorChain "stored_sig"
   [junit4]   2> 1916775 INFO  (coreLoadExecutor-8307-thread-1-processing-n:127.0.0.1:58203_) [n:127.0.0.1:58203_ c:control_collection s:shard1 r:core_node1 x:collection1] o.a.s.u.p.UpdateRequestProcessorChain creating updateRequestProcessorChain "distrib-dup-test-chain-explicit"
   [junit4]   2> 1916775 INFO  (coreLoadExecutor-8307-thread-1-processing-n:127.0.0.1:58203_) [n:127.0.0.1:58203_ c:control_collection s:shard1 r:core_node1 x:collection1] o.a.s.u.p.UpdateRequestProcessorChain creating updateRequestProcessorChain "distrib-dup-test-chain-implicit"
   [junit4]   2> 1916775 INFO  (coreLoadExecutor-8307-thread-1-processing-n:127.0.0.1:58203_) [n:127.0.0.1:58203_ c:control_collection s:shard1 r:core_node1 x:collection1] o.a.s.u.p.UpdateRequestProcessorChain inserting DistributedUpdateProcessorFactory into updateRequestProcessorChain "distrib-dup-test-chain-implicit"
   [junit4]   2> 1916775 INFO  (coreLoadExecutor-8307-thread-1-processing-n:127.0.0.1:58203_) [n:127.0.0.1:58203_ c:control_collection s:shard1 r:core_node1 x:collection1] o.a.s.c.SolrCore no updateRequestProcessorChain defined as default, creating implicit default
   [junit4]   2> 1916776 WARN  (coreLoadExecutor-8307-thread-1-processing-n:127.0.0.1:58203_) [n:127.0.0.1:58203_ c:control_collection s:shard1 r:core_node1 x:collection1] o.a.s.c.RequestHandlers INVALID paramSet a in requestHandler {type = requestHandler,name = /dump,class = DumpRequestHandler,args = {defaults={a=A,b=B}}}
   [junit4]   2> 1916777 INFO  (coreLoadExecutor-8307-thread-1-processing-n:127.0.0.1:58203_) [n:127.0.0.1:58203_ c:control_collection s:shard1 r:core_node1 x:collection1] o.a.s.h.l.XMLLoader xsltCacheLifetimeSeconds=60
   [junit4]   2> 1916777 INFO  (coreLoadExecutor-8307-thread-1-processing-n:127.0.0.1:58203_) [n:127.0.0.1:58203_ c:control_collection s:shard1 r:core_node1 x:collection1] o.a.s.h.l.XMLLoader xsltCacheLifetimeSeconds=60
   [junit4]   2> 1916778 INFO  (coreLoadExecutor-8307-thread-1-processing-n:127.0.0.1:58203_) [n:127.0.0.1:58203_ c:control_collection s:shard1 r:core_node1 x:collection1] o.a.s.h.l.XMLLoader xsltCacheLifetimeSeconds=60
   [junit4]   2> 1916778 INFO  (coreLoadExecutor-8307-thread-1-processing-n:127.0.0.1:58203_) [n:127.0.0.1:58203_ c:control_collection s:shard1 r:core_node1 x:collection1] o.a.s.h.l.XMLLoader xsltCacheLifetimeSeconds=60
   [junit4]   2> 1916780 INFO  (coreLoadExecutor-8307-thread-1-processing-n:127.0.0.1:58203_) [n:127.0.0.1:58203_ c:control_collection s:shard1 r:core_node1 x:collection1] o.a.s.c.RequestHandlers Registered paths: /admin/mbeans,standard,/update/json/docs,/admin/luke,/export,/get,/admin/properties,/update/json,/admin/threads,/dump,/update/csv,/sql,/graph,/admin/segments,/admin/system,/replication,/config,/stream,/schema,/admin/plugins,/admin/logging,/admin/ping,/update,/admin/file
   [junit4]   2> 1916780 INFO  (coreLoadExecutor-8307-thread-1-processing-n:127.0.0.1:58203_) [n:127.0.0.1:58203_ c:control_collection s:shard1 r:core_node1 x:collection1] o.a.s.c.SolrCore Using default statsCache cache: org.apache.solr.search.stats.LocalStatsCache
   [junit4]   2> 1916780 INFO  (coreLoadExecutor-8307-thread-1-processing-n:127.0.0.1:58203_) [n:127.0.0.1:58203_ c:control_collection s:shard1 r:core_node1 x:collection1] o.a.s.u.UpdateHandler Using UpdateLog implementation: org.apache.solr.update.UpdateLog
   [junit4]   2> 1916781 INFO  (coreLoadExecutor-8307-thread-1-processing-n:127.0.0.1:58203_) [n:127.0.0.1:58203_ c:control_collection s:shard1 r:core_node1 x:collection1] o.a.s.u.UpdateLog Initializing UpdateLog: dataDir= defaultSyncLevel=FLUSH numRecordsToKeep=100 maxNumLogsToKeep=10 numVersionBuckets=65536
   [junit4]   2> 1916781 INFO  (coreLoadExecutor-8307-thread-1-processing-n:127.0.0.1:58203_) [n:127.0.0.1:58203_ c:control_collection s:shard1 r:core_node1 x:collection1] o.a.s.u.CommitTracker Hard AutoCommit: disabled
   [junit4]   2> 1916781 INFO  (coreLoadExecutor-8307-thread-1-processing-n:127.0.0.1:58203_) [n:127.0.0.1:58203_ c:control_collection s:shard1 r:core_node1 x:collection1] o.a.s.u.CommitTracker Soft AutoCommit: disabled
   [junit4]   2> 1916781 INFO  (coreLoadExecutor-8307-thread-1-processing-n:127.0.0.1:58203_) [n:127.0.0.1:58203_ c:control_collection s:shard1 r:core_node1 x:collection1] o.a.s.u.RandomMergePolicy RandomMergePolicy wrapping class org.apache.lucene.index.TieredMergePolicy: [TieredMergePolicy: maxMergeAtOnce=19, maxMergeAtOnceExplicit=11, maxMergedSegmentMB=99.7412109375, floorSegmentMB=1.671875, forceMergeDeletesPctAllowed=0.7654990999113787, segmentsPerTier=19.0, maxCFSSegmentSizeMB=8.796093022207999E12, noCFSRatio=0.1842608143518376
   [junit4]   2> 1916782 INFO  (coreLoadExecutor-8307-thread-1-processing-n:127.0.0.1:58203_) [n:127.0.0.1:58203_ c:control_collection s:shard1 r:core_node1 x:collection1] o.a.s.c.SolrDeletionPolicy SolrDeletionPolicy.onInit: commits: num=1
   [junit4]   2> 	commit{dir=MockDirectoryWrapper(RAMDirectory@427328dc lockFactory=org.apache.lucene.store.SingleInstanceLockFactory@40f883a3),segFN=segments_1,generation=1}
   [junit4]   2> 1916782 INFO  (coreLoadExecutor-8307-thread-1-processing-n:127.0.0.1:58203_) [n:127.0.0.1:58203_ c:control_collection s:shard1 r:core_node1 x:collection1] o.a.s.c.SolrDeletionPolicy newest commit generation = 1
   [junit4]   2> 1916782 INFO  (coreLoadExecutor-8307-thread-1-processing-n:127.0.0.1:58203_) [n:127.0.0.1:58203_ c:control_collection s:shard1 r:core_node1 x:collection1] o.a.s.s.SolrIndexSearcher Opening [Searcher@2dfbf2d1[collection1] main]
   [junit4]   2> 1916782 INFO  (coreLoadExecutor-8307-thread-1-processing-n:127.0.0.1:58203_) [n:127.0.0.1:58203_ c:control_collection s:shard1 r:core_node1 x:collection1] o.a.s.c.c.ZkStateReader Load collection config from: [/collections/control_collection]
   [junit4]   2> 1916782 INFO  (coreLoadExecutor-8307-thread-1-processing-n:127.0.0.1:58203_) [n:127.0.0.1:58203_ c:control_collection s:shard1 r:core_node1 x:collection1] o.a.s.c.c.ZkStateReader path=[/collections/control_collection] [configName]=[conf1] specified config exists in ZooKeeper
   [junit4]   2> 1916782 INFO  (coreLoadExecutor-8307-thread-1-processing-n:127.0.0.1:58203_) [n:127.0.0.1:58203_ c:control_collection s:shard1 r:core_node1 x:collection1] o.a.s.r.ManagedResourceStorage Setting up ZooKeeper-based storage for the RestManager with znodeBase: /configs/conf1
   [junit4]   2> 1916783 INFO  (coreLoadExecutor-8307-thread-1-processing-n:127.0.0.1:58203_) [n:127.0.0.1:58203_ c:control_collection s:shard1 r:core_node1 x:collection1] o.a.s.r.ManagedResourceStorage Configured ZooKeeperStorageIO with znodeBase: /configs/conf1
   [junit4]   2> 1916783 INFO  (coreLoadExecutor-8307-thread-1-processing-n:127.0.0.1:58203_) [n:127.0.0.1:58203_ c:control_collection s:shard1 r:core_node1 x:collection1] o.a.s.r.RestManager Initializing RestManager with initArgs: {}
   [junit4]   2> 1916783 INFO  (coreLoadExecutor-8307-thread-1-processing-n:127.0.0.1:58203_) [n:127.0.0.1:58203_ c:control_collection s:shard1 r:core_node1 x:collection1] o.a.s.r.ManagedResourceStorage Reading _rest_managed.json using ZooKeeperStorageIO:path=/configs/conf1
   [junit4]   2> 1916783 INFO  (coreLoadExecutor-8307-thread-1-processing-n:127.0.0.1:58203_) [n:127.0.0.1:58203_ c:control_collection s:shard1 r:core_node1 x:collection1] o.a.s.r.ManagedResourceStorage No data found for znode /configs/conf1/_rest_managed.json
   [junit4]   2> 1916783 INFO  (coreLoadExecutor-8307-thread-1-processing-n:127.0.0.1:58203_) [n:127.0.0.1:58203_ c:control_collection s:shard1 r:core_node1 x:collection1] o.a.s.r.ManagedResourceStorage Loaded null at path _rest_managed.json using ZooKeeperStorageIO:path=/configs/conf1
   [junit4]   2> 1916783 INFO  (coreLoadExecutor-8307-thread-1-processing-n:127.0.0.1:58203_) [n:127.0.0.1:58203_ c:control_collection s:shard1 r:core_node1 x:collection1] o.a.s.r.RestManager Initializing 0 registered ManagedResources
   [junit4]   2> 1916783 INFO  (coreLoadExecutor-8307-thread-1-processing-n:127.0.0.1:58203_) [n:127.0.0.1:58203_ c:control_collection s:shard1 r:core_node1 x:collection1] o.a.s.h.ReplicationHandler Commits will be reserved for  10000
   [junit4]   2> 1916784 INFO  (searcherExecutor-8308-thread-1-processing-n:127.0.0.1:58203_ x:collection1 s:shard1 c:control_collection r:core_node1) [n:127.0.0.1:58203_ c:control_collection s:shard1 r:core_node1 x:collection1] o.a.s.c.SolrCore [collection1] Registered new searcher Searcher@2dfbf2d1[collection1] main{ExitableDirectoryReader(UninvertingDirectoryReader())}
   [junit4]   2> 1916784 INFO  (coreLoadExecutor-8307-thread-1-processing-n:127.0.0.1:58203_) [n:127.0.0.1:58203_ c:control_collection s:shard1 r:core_node1 x:collection1] o.a.s.u.UpdateLog Looking up max value of version field to seed version buckets
   [junit4]   2> 1916784 INFO  (coreLoadExecutor-8307-thread-1-processing-n:127.0.0.1:58203_) [n:127.0.0.1:58203_ c:control_collection s:shard1 r:core_node1 x:collection1] o.a.s.u.VersionInfo Refreshing highest value of _version_ for 65536 version buckets from index
   [junit4]   2> 1916784 INFO  (coreLoadExecutor-8307-thread-1-processing-n:127.0.0.1:58203_) [n:127.0.0.1:58203_ c:control_collection s:shard1 r:core_node1 x:collection1] o.a.s.u.VersionInfo No terms found for _version_, cannot seed version bucket highest value from index
   [junit4]   2> 1916784 INFO  (coreLoadExecutor-8307-thread-1-processing-n:127.0.0.1:58203_) [n:127.0.0.1:58203_ c:control_collection s:shard1 r:core_node1 x:collection1] o.a.s.u.UpdateLog Could not find max version in index or recent updates, using new clock 1538257377243955200
   [junit4]   2> 1916785 INFO  (coreLoadExecutor-8307-thread-1-processing-n:127.0.0.1:58203_) [n:127.0.0.1:58203_ c:control_collection s:shard1 r:core_node1 x:collection1] o.a.s.u.UpdateLog Took 1.0ms to seed version buckets with highest version 1538257377243955200
   [junit4]   2> 1916785 INFO  (coreLoadExecutor-8307-thread-1-processing-n:127.0.0.1:58203_) [n:127.0.0.1:58203_ c:control_collection s:shard1 r:core_node1 x:collection1] o.a.s.c.ZkController watch zkdir /configs/conf1
   [junit4]   2> 1916786 INFO  (coreLoadExecutor-8307-thread-1-processing-n:127.0.0.1:58203_) [n:127.0.0.1:58203_ c:control_collection s:shard1 r:core_node1 x:collection1] o.a.s.c.CoreContainer registering core: collection1
   [junit4]   2> 1916786 INFO  (coreZkRegister-8301-thread-1-processing-n:127.0.0.1:58203_ x:collection1 s:shard1 c:control_collection r:core_node1) [n:127.0.0.1:58203_ c:control_collection s:shard1 r:core_node1 x:collection1] o.a.s.c.ZkController Register replica - core:collection1 address:http://127.0.0.1:58203 collection:control_collection shard:shard1
   [junit4]   2> 1916786 INFO  (coreZkRegister-8301-thread-1-processing-n:127.0.0.1:58203_ x:collection1 s:shard1 c:control_collection r:core_node1) [n:127.0.0.1:58203_ c:control_collection s:shard1 r:core_node1 x:collection1] o.a.s.c.c.SolrZkClient makePath: /collections/control_collection/leader_elect/shard1/election
   [junit4]   2> 1916788 INFO  (coreZkRegister-8301-thread-1-processing-n:127.0.0.1:58203_ x:collection1 s:shard1 c:control_collection r:core_node1) [n:127.0.0.1:58203_ c:control_collection s:shard1 r:core_node1 x:collection1] o.a.s.c.LeaderElector Joined leadership election with path: /collections/control_collection/leader_elect/shard1/election/96141085987766276-core_node1-n_0000000000
   [junit4]   2> 1916788 INFO  (coreZkRegister-8301-thread-1-processing-n:127.0.0.1:58203_ x:collection1 s:shard1 c:control_collection r:core_node1) [n:127.0.0.1:58203_ c:control_collection s:shard1 r:core_node1 x:collection1] o.a.s.c.ShardLeaderElectionContext Running the leader process for shard=shard1 and weAreReplacement=false and leaderVoteWait=10000
   [junit4]   2> 1916789 INFO  (coreZkRegister-8301-thread-1-processing-n:127.0.0.1:58203_ x:collection1 s:shard1 c:control_collection r:core_node1) [n:127.0.0.1:58203_ c:control_collection s:shard1 r:core_node1 x:collection1] o.a.s.c.ShardLeaderElectionContext Enough replicas found to continue.
   [junit4]   2> 1916789 INFO  (coreZkRegister-8301-thread-1-processing-n:127.0.0.1:58203_ x:collection1 s:shard1 c:control_collection r:core_node1) [n:127.0.0.1:58203_ c:control_collection s:shard1 r:core_node1 x:collection1] o.a.s.c.ShardLeaderElectionContext I may be the new leader - try and sync
   [junit4]   2> 1916789 INFO  (OverseerStateUpdate-96141085987766276-127.0.0.1:58203_-n_0000000000) [n:127.0.0.1:58203_    ] o.a.s.c.Overseer processMessage: queueSize: 1, message = {
   [junit4]   2>   "operation":"leader",
   [junit4]   2>   "shard":"shard1",
   [junit4]   2>   "collection":"control_collection"} current state version: 1
   [junit4]   2> 1916789 INFO  (coreZkRegister-8301-thread-1-processing-n:127.0.0.1:58203_ x:collection1 s:shard1 c:control_collection r:core_node1) [n:127.0.0.1:58203_ c:control_collection s:shard1 r:core_node1 x:collection1] o.a.s.c.SyncStrategy Sync replicas to http://127.0.0.1:58203/collection1/
   [junit4]   2> 1916790 INFO  (coreZkRegister-8301-thread-1-processing-n:127.0.0.1:58203_ x:collection1 s:shard1 c:control_collection r:core_node1) [n:127.0.0.1:58203_ c:control_collection s:shard1 r:core_node1 x:collection1] o.a.s.c.SyncStrategy Sync Success - now sync replicas to me
   [junit4]   2> 1916790 INFO  (coreZkRegister-8301-thread-1-processing-n:127.0.0.1:58203_ x:collection1 s:shard1 c:control_collection r:core_node1) [n:127.0.0.1:58203_ c:control_collection s:shard1 r:core_node1 x:collection1] o.a.s.c.SyncStrategy http://127.0.0.1:58203/collection1/ has no replicas
   [junit4]   2> 1916790 INFO  (coreZkRegister-8301-thread-1-processing-n:127.0.0.1:58203_ x:collection1 s:shard1 c:control_collection r:core_node1) [n:127.0.0.1:58203_ c:control_collection s:shard1 r:core_node1 x:collection1] o.a.s.c.c.SolrZkClient makePath: /collections/control_collection/leaders/shard1
   [junit4]   2> 1916792 INFO  (coreZkRegister-8301-thread-1-processing-n:127.0.0.1:58203_ x:collection1 s:shard1 c:control_collection r:core_node1) [n:127.0.0.1:58203_ c:control_collection s:shard1 r:core_node1 x:collection1] o.a.s.c.ShardLeaderElectionContextBase Creating leader registration node /collections/control_collection/leaders/shard1/leader after winning as /collections/control_collection/leader_elect/shard1/election/96141085987766276-core_node1-n_0000000000
   [junit4]   2> 1916795 INFO  (coreZkRegister-8301-thread-1-processing-n:127.0.0.1:58203_ x:collection1 s:shard1 c:control_collection r:core_node1) [n:127.0.0.1:58203_ c:control_collection s:shard1 r:core_node1 x:collection1] o.a.s.c.ShardLeaderElectionContext I am the new leader: http://127.0.0.1:58203/collection1/ shard1
   [junit4]   2> 1916796 INFO  (OverseerStateUpdate-96141085987766276-127.0.0.1:58203_-n_0000000000) [n:127.0.0.1:58203_    ] o.a.s.c.Overseer processMessage: queueSize: 1, message = {
   [junit4]   2>   "operation":"leader",
   [junit4]   2>   "shard":"shard1",
   [junit4]   2>   "collection":"control_collection",
   [junit4]   2>   "base_url":"http://127.0.0.1:58203",
   [junit4]   2>   "core":"collection1",
   [junit4]   2>   "state":"active"} current state version: 1
   [junit4]   2> 1916897 INFO  (zkCallback-17887-thread-1-processing-n:127.0.0.1:58203_) [n:127.0.0.1:58203_    ] o.a.s.c.c.ZkStateReader A cluster state change: [WatchedEvent state:SyncConnected type:NodeDataChanged path:/clusterstate.json], has occurred - updating... (live nodes size: [1])
   [junit4]   2> 1916946 INFO  (coreZkRegister-8301-thread-1-processing-n:127.0.0.1:58203_ x:collection1 s:shard1 c:control_collection r:core_node1) [n:127.0.0.1:58203_ c:control_collection s:shard1 r:core_node1 x:collection1] o.a.s.c.ZkController We are http://127.0.0.1:58203/collection1/ and leader is http://127.0.0.1:58203/collection1/
   [junit4]   2> 1916946 INFO  (coreZkRegister-8301-thread-1-processing-n:127.0.0.1:58203_ x:collection1 s:shard1 c:control_collection r:core_node1) [n:127.0.0.1:58203_ c:control_collection s:shard1 r:core_node1 x:collection1] o.a.s.c.ZkController No LogReplay needed for core=collection1 baseURL=http://127.0.0.1:58203
   [junit4]   2> 1916946 INFO  (coreZkRegister-8301-thread-1-processing-n:127.0.0.1:58203_ x:collection1 s:shard1 c:control_collection r:core_node1) [n:127.0.0.1:58203_ c:control_collection s:shard1 r:core_node1 x:collection1] o.a.s.c.ZkController I am the leader, no recovery necessary
   [junit4]   2> 1916946 INFO  (coreZkRegister-8301-thread-1-processing-n:127.0.0.1:58203_ x:collection1 s:shard1 c:control_collection r:core_node1) [n:127.0.0.1:58203_ c:control_collection s:shard1 r:core_node1 x:collection1] o.a.s.c.ZkController publishing state=active
   [junit4]   2> 1916946 INFO  (coreZkRegister-8301-thread-1-processing-n:127.0.0.1:58203_ x:collection1 s:shard1 c:control_collection r:core_node1) [n:127.0.0.1:58203_ c:control_collection s:shard1 r:core_node1 x:collection1] o.a.s.c.ZkController numShards not found on descriptor - reading it from system property
   [junit4]   2> 1916947 INFO  (OverseerStateUpdate-96141085987766276-127.0.0.1:58203_-n_0000000000) [n:127.0.0.1:58203_    ] o.a.s.c.Overseer processMessage: queueSize: 1, message = {
   [junit4]   2>   "core":"collection1",
   [junit4]   2>   "core_node_name":"core_node1",
   [junit4]   2>   "roles":null,
   [junit4]   2>   "base_url":"http://127.0.0.1:58203",
   [junit4]   2>   "node_name":"127.0.0.1:58203_",
   [junit4]   2>   "numShards":"1",
   [junit4]   2>   "state":"active",
   [junit4]   2>   "shard":"shard1",
   [junit4]   2>   "collection":"control_collection",
   [junit4]   2>   "operation":"state"} current state version: 2
   [junit4]   2> 1916948 INFO  (OverseerStateUpdate-96141085987766276-127.0.0.1:58203_-n_0000000000) [n:127.0.0.1:58203_    ] o.a.s.c.o.ReplicaMutator Update state numShards=1 message={
   [junit4]   2>   "core":"collection1",
   [junit4]   2>   "core_node_name":"core_node1",
   [junit4]   2>   "roles":null,
   [junit4]   2>   "base_url":"http://127.0.0.1:58203",
   [junit4]   2>   "node_name":"127.0.0.1:58203_",
   [junit4]   2>   "numShards":"1",
   [junit4]   2>   "state":"active",
   [junit4]   2>   "shard":"shard1",
   [junit4]   2>   "collection":"control_collection",
   [junit4]   2>   "operation":"state"}
   [junit4]   2> 1917050 INFO  (zkCallback-17887-thread-2-processing-n:127.0.0.1:58203_) [n:127.0.0.1:58203_    ] o.a.s.c.c.ZkStateReader A cluster state change: [WatchedEvent state:SyncConnected type:NodeDataChanged path:/clusterstate.json], has occurred - updating... (live nodes size: [1])
   [junit4]   2> 1917169 INFO  (TEST-TestSolrConfigHandlerCloud.test-seed#[BCFC47F4AA4F3878]) [    ] o.a.s.c.s.i.CloudSolrClient Final constructed zkHost string: 127.0.0.1:38658/solr
   [junit4]   2> 1917177 INFO  (TEST-TestSolrConfigHandlerCloud.test-seed#[BCFC47F4AA4F3878]) [    ] o.a.s.c.c.SolrZkClient Using default ZkCredentialsProvider
   [junit4]   2> 1917178 INFO  (TEST-TestSolrConfigHandlerCloud.test-seed#[BCFC47F4AA4F3878]) [    ] o.a.s.c.c.ConnectionManager Waiting for client to connect to ZooKeeper
   [junit4]   2> 1917191 INFO  (zkCallback-17891-thread-1) [    ] o.a.s.c.c.ConnectionManager Watcher org.apache.solr.common.cloud.ConnectionManager@3d7385d2 name:ZooKeeperConnection Watcher:127.0.0.1:38658/solr got event WatchedEvent state:SyncConnected type:None path:null path:null type:None
   [junit4]   2> 1917193 INFO  (TEST-TestSolrConfigHandlerCloud.test-seed#[BCFC47F4AA4F3878]) [    ] o.a.s.c.c.ConnectionManager Client is connected to ZooKeeper
   [junit4]   2> 1917193 INFO  (TEST-TestSolrConfigHandlerCloud.test-seed#[BCFC47F4AA4F3878]) [    ] o.a.s.c.c.SolrZkClient Using default ZkACLProvider
   [junit4]   2> 1917193 INFO  (TEST-TestSolrConfigHandlerCloud.test-seed#[BCFC47F4AA4F3878]) [    ] o.a.s.c.c.ZkStateReader Updating cluster state from ZooKeeper... 
   [junit4]   2> 1917201 INFO  (TEST-TestSolrConfigHandlerCloud.test-seed#[BCFC47F4AA4F3878]) [    ] o.a.s.c.c.ZkStateReader Loaded empty cluster properties
   [junit4]   2> 1917209 INFO  (TEST-TestSolrConfigHandlerCloud.test-seed#[BCFC47F4AA4F3878]) [    ] o.a.s.c.c.ZkStateReader Updated live nodes from ZooKeeper... (0) -> (1)
   [junit4]   2> 1917225 INFO  (TEST-TestSolrConfigHandlerCloud.test-seed#[BCFC47F4AA4F3878]) [    ] o.a.s.c.ChaosMonkey monkey: init - expire sessions:false cause connection loss:false
   [junit4]   2> 1917351 INFO  (TEST-TestSolrConfigHandlerCloud.test-seed#[BCFC47F4AA4F3878]) [    ] o.a.s.SolrTestCaseJ4 Writing core.properties file to /x1/jenkins/jenkins-slave/workspace/Lucene-Solr-Tests-master/solr/build/solr-core/test/J0/temp/solr.handler.TestSolrConfigHandlerCloud_BCFC47F4AA4F3878-001/shard-1-001/cores/collection1
   [junit4]   2> 1917351 INFO  (TEST-TestSolrConfigHandlerCloud.test-seed#[BCFC47F4AA4F3878]) [    ] o.a.s.c.AbstractFullDistribZkTestBase create jetty 1 in directory /x1/jenkins/jenkins-slave/workspace/Lucene-Solr-Tests-master/solr/build/solr-core/test/J0/temp/solr.handler.TestSolrConfigHandlerCloud_BCFC47F4AA4F3878-001/shard-1-001
   [junit4]   2> 1917352 INFO  (TEST-TestSolrConfigHandlerCloud.test-seed#[BCFC47F4AA4F3878]) [    ] o.e.j.s.Server jetty-9.3.8.v20160314
   [junit4]   2> 1917399 INFO  (TEST-TestSolrConfigHandlerCloud.test-seed#[BCFC47F4AA4F3878]) [    ] o.e.j.s.h.ContextHandler Started o.e.j.s.ServletContextHandler@61b0a04b{/,null,AVAILABLE}
   [junit4]   2> 1917400 INFO  (TEST-TestSolrConfigHandlerCloud.test-seed#[BCFC47F4AA4F3878]) [    ] o.e.j.s.ServerConnector Started ServerConnector@12d5ce6f{HTTP/1.1,[http/1.1]}{127.0.0.1:58990}
   [junit4]   2> 1917401 INFO  (TEST-TestSolrConfigHandlerCloud.test-seed#[BCFC47F4AA4F3878]) [    ] o.e.j.s.Server Started @1922206ms
   [junit4]   2> 1917401 INFO  (TEST-TestSolrConfigHandlerCloud.test-seed#[BCFC47F4AA4F3878]) [    ] o.a.s.c.s.e.JettySolrRunner Jetty properties: {solr.data.dir=/x1/jenkins/jenkins-slave/workspace/Lucene-Solr-Tests-master/solr/build/solr-core/test/J0/temp/solr.handler.TestSolrConfigHandlerCloud_BCFC47F4AA4F3878-001/tempDir-001/jetty1, solrconfig=solrconfig.xml, hostContext=/, hostPort=58990, coreRootDirectory=/x1/jenkins/jenkins-slave/workspace/Lucene-Solr-Tests-master/solr/build/solr-core/test/J0/temp/solr.handler.TestSolrConfigHandlerCloud_BCFC47F4AA4F3878-001/shard-1-001/cores}
   [junit4]   2> 1917401 INFO  (TEST-TestSolrConfigHandlerCloud.test-seed#[BCFC47F4AA4F3878]) [    ] o.a.s.s.SolrDispatchFilter SolrDispatchFilter.init(): sun.misc.Launcher$AppClassLoader@73d16e93
   [junit4]   2> 1917401 INFO  (TEST-TestSolrConfigHandlerCloud.test-seed#[BCFC47F4AA4F3878]) [    ] o.a.s.c.SolrResourceLoader new SolrResourceLoader for directory: '/x1/jenkins/jenkins-slave/workspace/Lucene-Solr-Tests-master/solr/build/solr-core/test/J0/temp/solr.handler.TestSolrConfigHandlerCloud_BCFC47F4AA4F3878-001/shard-1-001'
   [junit4]   2> 1917401 INFO  (TEST-TestSolrConfigHandlerCloud.test-seed#[BCFC47F4AA4F3878]) [    ] o.a.s.c.SolrResourceLoader JNDI not configured for solr (NoInitialContextEx)
   [junit4]   2> 1917401 INFO  (TEST-TestSolrConfigHandlerCloud.test-seed#[BCFC47F4AA4F3878]) [    ] o.a.s.c.SolrResourceLoader solr home defaulted to 'solr/' (could not find system property or JNDI)
   [junit4]   2> 1917405 INFO  (TEST-TestSolrConfigHandlerCloud.test-seed#[BCFC47F4AA4F3878]) [    ] o.a.s.c.c.SolrZkClient Using default ZkCredentialsProvider
   [junit4]   2> 1917409 INFO  (TEST-TestSolrConfigHandlerCloud.test-seed#[BCFC47F4AA4F3878]) [    ] o.a.s.c.c.ConnectionManager Waiting for client to connect to ZooKeeper
   [junit4]   2> 1917417 INFO  (zkCallback-17892-thread-1) [    ] o.a.s.c.c.ConnectionManager Watcher org.apache.solr.common.cloud.ConnectionManager@5f7210e0 name:ZooKeeperConnection Watcher:127.0.0.1:38658/solr got event WatchedEvent state:SyncConnected type:None path:null path:null type:None
   [junit4]   2> 1917417 INFO  (TEST-TestSolrConfigHandlerCloud.test-seed#[BCFC47F4AA4F3878]) [    ] o.a.s.c.c.ConnectionManager Client is connected to ZooKeeper
   [junit4]   2> 1917417 INFO  (TEST-TestSolrConfigHandlerCloud.test-seed#[BCFC47F4AA4F3878]) [    ] o.a.s.c.c.SolrZkClient Using default ZkACLProvider
   [junit4]   2> 1917418 INFO  (TEST-TestSolrConfigHandlerCloud.test-seed#[BCFC47F4AA4F3878]) [    ] o.a.s.s.SolrDispatchFilter Loading solr.xml from SolrHome (not found in ZooKeeper)
   [junit4]   2> 1917418 INFO  (TEST-TestSolrConfigHandlerCloud.test-seed#[BCFC47F4AA4F3878]) [    ] o.a.s.c.SolrXmlConfig Loading container configuration from /x1/jenkins/jenkins-slave/workspace/Lucene-Solr-Tests-master/solr/build/solr-core/test/J0/temp/solr.handler.TestSolrConfigHandlerCloud_BCFC47F4AA4F3878-001/shard-1-001/solr.xml
   [junit4]   2> 1917422 INFO  (TEST-TestSolrConfigHandlerCloud.test-seed#[BCFC47F4AA4F3878]) [    ] o.a.s.c.CorePropertiesLocator Config-defined core root directory: /x1/jenkins/jenkins-slave/workspace/Lucene-Solr-Tests-master/solr/build/solr-core/test/J0/temp/solr.handler.TestSolrConfigHandlerCloud_BCFC47F4AA4F3878-001/shard-1-001/cores
   [junit4]   2> 1917422 INFO  (TEST-TestSolrConfigHandlerCloud.test-seed#[BCFC47F4AA4F3878]) [    ] o.a.s.c.CoreContainer New CoreContainer 695120882
   [junit4]   2> 1917422 INFO  (TEST-TestSolrConfigHandlerCloud.test-seed#[BCFC47F4AA4F3878]) [    ] o.a.s.c.CoreContainer Loading cores into CoreContainer [instanceDir=/x1/jenkins/jenkins-slave/workspace/Lucene-Solr-Tests-master/solr/build/solr-core/test/J0/temp/solr.handler.TestSolrConfigHandlerCloud_BCFC47F4AA4F3878-001/shard-1-001]
   [junit4]   2> 1917422 WARN  (TEST-TestSolrConfigHandlerCloud.test-seed#[BCFC47F4AA4F3878]) [    ] o.a.s.c.CoreContainer Couldn't add files from /x1/jenkins/jenkins-slave/workspace/Lucene-Solr-Tests-master/solr/build/solr-core/test/J0/temp/solr.handler.TestSolrConfigHandlerCloud_BCFC47F4AA4F3878-001/shard-1-001/lib to classpath: /x1/jenkins/jenkins-slave/workspace/Lucene-Solr-Tests-master/solr/build/solr-core/test/J0/temp/solr.handler.TestSolrConfigHandlerCloud_BCFC47F4AA4F3878-001/shard-1-001/lib
   [junit4]   2> 1917422 INFO  (TEST-TestSolrConfigHandlerCloud.test-seed#[BCFC47F4AA4F3878]) [    ] o.a.s.h.c.HttpShardHandlerFactory created with socketTimeout : 90000,urlScheme : ,connTimeout : 15000,maxConnectionsPerHost : 20,maxConnections : 10000,corePoolSize : 0,maximumPoolSize : 2147483647,maxThreadIdleTime : 5,sizeOfQueue : -1,fairnessPolicy : false,
   [junit4]   2> 1917423 INFO  (TEST-TestSolrConfigHandlerCloud.test-seed#[BCFC47F4AA4F3878]) [    ] o.a.s.u.UpdateShardHandler Creating UpdateShardHandler HTTP client with params: 
   [junit4]   2> 1917424 INFO  (TEST-TestSolrConfigHandlerCloud.test-seed#[BCFC47F4AA4F3878]) [    ] o.a.s.l.LogWatcher SLF4J impl is org.slf4j.impl.Log4jLoggerFactory
   [junit4]   2> 1917424 INFO  (TEST-TestSolrConfigHandlerCloud.test-seed#[BCFC47F4AA4F3878]) [    ] o.a.s.l.LogWatcher Registering Log Listener [Log4j (org.slf4j.impl.Log4jLoggerFactory)]
   [junit4]   2> 1917424 INFO  (TEST-TestSolrConfigHandlerCloud.test-seed#[BCFC47F4AA4F3878]) [    ] o.a.s.c.ZkContainer Zookeeper client=127.0.0.1:38658/solr
   [junit4]   2> 1917424 INFO  (TEST-TestSolrConfigHandlerCloud.test-seed#[BCFC47F4AA4F3878]) [    ] o.a.s.c.ZkController zkHost includes chroot
   [junit4]   2> 1917424 INFO  (TEST-TestSolrConfigHandlerCloud.test-seed#[BCFC47F4AA4F3878]) [    ] o.a.s.c.c.SolrZkClient Using default ZkCredentialsProvider
   [junit4]   2> 1917424 INFO  (TEST-TestSolrConfigHandlerCloud.test-seed#[BCFC47F4AA4F3878]) [    ] o.a.s.c.c.ConnectionManager Waiting for client to connect to ZooKeeper
   [junit4]   2> 1917425 INFO  (zkCallback-17895-thread-1) [    ] o.a.s.c.c.ConnectionManager Watcher org.apache.solr.common.cloud.ConnectionManager@4e6b3dbc name:ZooKeeperConnection Watcher:127.0.0.1:38658 got event WatchedEvent state:SyncConnected type:None path:null path:null type:None
   [junit4]   2> 1917426 INFO  (TEST-TestSolrConfigHandlerCloud.test-seed#[BCFC47F4AA4F3878]) [    ] o.a.s.c.c.ConnectionManager Client is connected to ZooKeeper
   [junit4]   2> 1917426 INFO  (TEST-TestSolrConfigHandlerCloud.test-seed#[BCFC47F4AA4F3878]) [    ] o.a.s.c.c.SolrZkClient Using default ZkACLProvider
   [junit4]   2> 1917426 INFO  (TEST-TestSolrConfigHandlerCloud.test-seed#[BCFC47F4AA4F3878]) [n:127.0.0.1:58990_    ] o.a.s.c.ZkController Added new OnReconnect listener org.apache.solr.cloud.ZkController$$Lambda$49/715190948@56659b76
   [junit4]   2> 1917429 INFO  (TEST-TestSolrConfigHandlerCloud.test-seed#[BCFC47F4AA4F3878]) [n:127.0.0.1:58990_    ] o.a.s.c.c.ConnectionManager Waiting for client to connect to ZooKeeper
   [junit4]   2> 1917429 INFO  (zkCallback-17896-thread-1-processing-n:127.0.0.1:58990_) [n:127.0.0.1:58990_    ] o.a.s.c.c.ConnectionManager Watcher org.apache.solr.common.cloud.ConnectionManager@77e50549 name:ZooKeeperConnection Watcher:127.0.0.1:38658/solr got event WatchedEvent state:SyncConnected type:None path:null path:null type:None
   [junit4]   2> 1917429 INFO  (TEST-TestSolrConfigHandlerCloud.test-seed#[BCFC47F4AA4F3878]) [n:127.0.0.1:58990_    ] o.a.s.c.c.ConnectionManager Client is connected to ZooKeeper
   [junit4]   2> 1917433 INFO  (TEST-TestSolrConfigHandlerCloud.test-seed#[BCFC47F4AA4F3878]) [n:127.0.0.1:58990_    ] o.a.s.c.c.ZkStateReader Updating cluster state from ZooKeeper... 
   [junit4]   2> 1917433 INFO  (TEST-TestSolrConfigHandlerCloud.test-seed#[BCFC47F4AA4F3878]) [n:127.0.0.1:58990_    ] o.a.s.c.c.ZkStateReader Loaded empty cluster properties
   [junit4]   2> 1917433 INFO  (TEST-TestSolrConfigHandlerCloud.test-seed#[BCFC47F4AA4F3878]) [n:127.0.0.1:58990_    ] o.a.s.c.c.ZkStateReader Updated live nodes from ZooKeeper... (0) -> (1)
   [junit4]   2> 1917435 INFO  (TEST-TestSolrConfigHandlerCloud.test-seed#[BCFC47F4AA4F3878]) [n:127.0.0.1:58990_    ] o.a.s.c.Overseer Overseer (id=null) closing
   [junit4]   2> 1917435 INFO  (TEST-TestSolrConfigHandlerCloud.test-seed#[BCFC47F4AA4F3878]) [n:127.0.0.1:58990_    ] o.a.s.c.LeaderElector Joined leadership election with path: /overseer_elect/election/96141085987766280-127.0.0.1:58990_-n_0000000001
   [junit4]   2> 1917435 INFO  (TEST-TestSolrConfigHandlerCloud.test-seed#[BCFC47F4AA4F3878]) [n:127.0.0.1:58990_    ] o.a.s.c.LeaderElector Watching path /overseer_elect/election/96141085987766276-127.0.0.1:58203_-n_0000000000 to know if I could be the leader
   [junit4]   2> 1917435 INFO  (TEST-TestSolrConfigHandlerCloud.test-seed#[BCFC47F4AA4F3878]) [n:127.0.0.1:58990_    ] o.a.s.c.ZkController Publish node=127.0.0.1:58990_ as DOWN
   [junit4]   2> 1917438 INFO  (OverseerStateUpdate-96141085987766276-127.0.0.1:58203_-n_0000000000) [n:127.0.0.1:58203_    ] o.a.s.c.Overseer processMessage: queueSize: 1, message = {
   [junit4]   2>   "operation":"downnode",
   [junit4]   2>   "node_name":"127.0.0.1:58990_"} current state version: 3
   [junit4]   2> 1917438 INFO  (OverseerStateUpdate-96141085987766276-127.0.0.1:58203_-n_0000000000) [n:127.0.0.1:58203_    ] o.a.s.c.o.NodeMutator DownNode state invoked for node: 127.0.0.1:58990_
   [junit4]   2> 1917540 INFO  (zkCallback-17891-thread-1) [    ] o.a.s.c.c.ZkStateReader A cluster state change: [WatchedEvent state:SyncConnected type:NodeDataChanged path:/clusterstate.json], has occurred - updating... (live nodes size: [1])
   [junit4]   2> 1917541 INFO  (zkCallback-17896-thread-1-processing-n:127.0.0.1:58990_) [n:127.0.0.1:58990_    ] o.a.s.c.c.ZkStateReader A cluster state change: [WatchedEvent state:SyncConnected type:NodeDataChanged path:/clusterstate.json], has occurred - updating... (live nodes size: [1])
   [junit4]   2> 1917541 INFO  (zkCallback-17887-thread-1-processing-n:127.0.0.1:58203_) [n:127.0.0.1:58203_    ] o.a.s.c.c.ZkStateReader A cluster state change: [WatchedEvent state:SyncConnected type:NodeDataChanged path:/clusterstate.json], has occurred - updating... (live nodes size: [1])
   [junit4]   2> 1918436 INFO  (TEST-TestSolrConfigHandlerCloud.test-seed#[BCFC47F4AA4F3878]) [n:127.0.0.1:58990_    ] o.a.s.c.ZkController Register node as live in ZooKeeper:/live_nodes/127.0.0.1:58990_
   [junit4]   2> 1918437 INFO  (TEST-TestSolrConfigHandlerCloud.test-seed#[BCFC47F4AA4F3878]) [n:127.0.0.1:58990_    ] o.a.s.c.c.SolrZkClient makePath: /live_nodes/127.0.0.1:58990_
   [junit4]   2> 1918438 INFO  (zkCallback-17887-thread-1-processing-n:127.0.0.1:58203_) [n:127.0.0.1:58203_    ] o.a.s.c.c.ZkStateReader A live node change: [WatchedEvent state:SyncConnected type:NodeChildrenChanged path:/live_nodes], has occurred - updating... (live nodes size: [1])
   [junit4]   2> 1918438 INFO  (zkCallback-17891-thread-1) [    ] o.a.s.c.c.ZkStateReader A live node change: [WatchedEvent state:SyncConnected type:NodeChildrenChanged path:/live_nodes], has occurred - updating... (live nodes size: [1])
   [junit4]   2> 1918438 INFO  (zkCallback-17896-thread-1-processing-n:127.0.0.1:58990_) [n:127.0.0.1:58990_    ] o.a.s.c.c.ZkStateReader A live node change: [WatchedEvent state:SyncConnected type:NodeChildrenChanged path:/live_nodes], has occurred - updating... (live nodes size: [1])
   [junit4]   2> 1918441 INFO  (zkCallback-17891-thread-1) [    ] o.a.s.c.c.ZkStateReader Updated live nodes from ZooKeeper... (1) -> (2)
   [junit4]   2> 1918441 INFO  (zkCallback-17896-thread-1-processing-n:127.0.0.1:58990_) [n:127.0.0.1:58990_    ] o.a.s.c.c.ZkStateReader Updated live nodes from ZooKeeper... (1) -> (2)
   [junit4]   2> 1918441 INFO  (zkCallback-17887-thread-1-processing-n:127.0.0.1:58203_) [n:127.0.0.1:58203_    ] o.a.s.c.c.ZkStateReader Updated live nodes from ZooKeeper... (1) -> (2)
   [junit4]   2> 1918444 INFO  (TEST-TestSolrConfigHandlerCloud.test-seed#[BCFC47F4AA4F3878]) [n:127.0.0.1:58990_    ] o.a.s.c.CoreContainer Security conf doesn't exist. Skipping setup for authorization module.
   [junit4]   2> 1918444 INFO  (TEST-TestSolrConfigHandlerCloud.test-seed#[BCFC47F4AA4F3878]) [n:127.0.0.1:58990_    ] o.a.s.c.CoreContainer No authentication plugin used.
   [junit4]   2> 1918444 INFO  (TEST-TestSolrConfigHandlerCloud.test-seed#[BCFC47F4AA4F3878]) [n:127.0.0.1:58990_    ] o.a.s.c.CorePropertiesLocator Looking for core definitions underneath /x1/jenkins/jenkins-slave/workspace/Lucene-Solr-Tests-master/solr/build/solr-core/test/J0/temp/solr.handler.TestSolrConfigHandlerCloud_BCFC47F4AA4F3878-001/shard-1-001/cores
   [junit4]   2> 1918445 INFO  (TEST-TestSolrConfigHandlerCloud.test-seed#[BCFC47F4AA4F3878]) [n:127.0.0.1:58990_    ] o.a.s.c.CoreDescriptor Created CoreDescriptor: {name=collection1, config=solrconfig.xml, transient=false, schema=schema.xml, loadOnStartup=true, configSetProperties=configsetprops.json, collection=collection1, coreNodeName=, dataDir=data/, shard=}
   [junit4]   2> 1918445 INFO  (TEST-TestSolrConfigHandlerCloud.test-seed#[BCFC47F4AA4F3878]) [n:127.0.0.1:58990_    ] o.a.s.c.CorePropertiesLocator Found core collection1 in /x1/jenkins/jenkins-slave/workspace/Lucene-Solr-Tests-master/solr/build/solr-core/test/J0/temp/solr.handler.TestSolrConfigHandlerCloud_BCFC47F4AA4F3878-001/shard-1-001/cores/collection1
   [junit4]   2> 1918445 INFO  (TEST-TestSolrConfigHandlerCloud.test-seed#[BCFC47F4AA4F3878]) [n:127.0.0.1:58990_    ] o.a.s.c.CorePropertiesLocator Found 1 core definitions
   [junit4]   2> 1918447 INFO  (coreLoadExecutor-8318-thread-1-processing-n:127.0.0.1:58990_) [n:127.0.0.1:58990_ c:collection1   x:collection1] o.a.s.c.ZkController publishing state=down
   [junit4]   2> 1918447 INFO  (TEST-TestSolrConfigHandlerCloud.test-seed#[BCFC47F4AA4F3878]) [n:127.0.0.1:58990_    ] o.a.s.s.SolrDispatchFilter user.dir=/x1/jenkins/jenkins-slave/workspace/Lucene-Solr-Tests-master/solr/build/solr-core/test/J0
   [junit4]   2> 1918448 INFO  (coreLoadExecutor-8318-thread-1-processing-n:127.0.0.1:58990_) [n:127.0.0.1:58990_ c:collection1   x:collection1] o.a.s.c.ZkController numShards not found on descriptor - reading it from system property
   [junit4]   2> 1918448 INFO  (TEST-TestSolrConfigHandlerCloud.test-seed#[BCFC47F4AA4F3878]) [n:127.0.0.1:58990_    ] o.a.s.s.SolrDispatchFilter SolrDispatchFilter.init() done
   [junit4]   2> 1918448 INFO  (coreLoadExecutor-8318-thread-1-processing-n:127.0.0.1:58990_) [n:127.0.0.1:58990_ c:collection1   x:collection1] o.a.s.c.ZkController Collection collection1 not visible yet, but flagging it so a watch is registered when it becomes visible
   [junit4]   2> 1918448 INFO  (OverseerStateUpdate-96141085987766276-127.0.0.1:58203_-n_0000000000) [n:127.0.0.1:58203_    ] o.a.s.c.Overseer processMessage: queueSize: 1, message = {
   [junit4]   2>   "core":"collection1",
   [junit4]   2>   "roles":null,
   [junit4]   2>   "base_url":"http://127.0.0.1:58990",
   [junit4]   2>   "node_name":"127.0.0.1:58990_",
   [junit4]   2>   "numShards":"2",
   [junit4]   2>   "state":"down",
   [junit4]   2>   "shard":null,
   [junit4]   2>   "collection":"collection1",
   [junit4]   2>   "operation":"state"} current state version: 4
   [junit4]   2> 1918448 INFO  (OverseerStateUpdate-96141085987766276-127.0.0.1:58203_-n_0000000000) [n:127.0.0.1:58203_    ] o.a.s.c.o.ReplicaMutator Update state numShards=2 message={
   [junit4]   2>   "core":"collection1",
   [junit4]   2>   "roles":null,
   [junit4]   2>   "base_url":"http://127.0.0.1:58990",
   [junit4]   2>   "node_name":"127.0.0.1:58990_",
   [junit4]   2>   "numShards":"2",
   [junit4]   2>   "state":"down",
   [junit4]   2>   "shard":null,
   [junit4]   2>   "collection":"collection1",
   [junit4]   2>   "operation":"state"}
   [junit4]   2> 1918448 INFO  (OverseerStateUpdate-96141085987766276-127.0.0.1:58203_-n_0000000000) [n:127.0.0.1:58203_    ] o.a.s.c.o.ClusterStateMutator building a new cName: collection1
   [junit4]   2> 1918449 INFO  (OverseerStateUpdate-96141085987766276-127.0.0.1:58203_-n_0000000000) [n:127.0.0.1:58203_    ] o.a.s.c.o.ReplicaMutator Assigning new node to shard shard=shard2
   [junit4]   2> 1918449 INFO  (coreLoadExecutor-8318-thread-1-processing-n:127.0.0.1:58990_) [n:127.0.0.1:58990_ c:collection1   x:collection1] o.a.s.c.c.ZkStateReader Deleting data for [collection1]
   [junit4]   2> 1918450 INFO  (coreLoadExecutor-8318-thread-1-processing-n:127.0.0.1:58990_) [n:127.0.0.1:58990_ c:collection1   x:collection1] o.a.s.c.ZkController look for our core node name
   [junit4]   2> 1918550 INFO  (zkCallback-17891-thread-1) [    ] o.a.s.c.c.ZkStateReader A cluster state change: [WatchedEvent state:SyncConnected type:NodeDataChanged path:/clusterstate.json], has occurred - updating... (live nodes size: [2])
   [junit4]   2> 1918550 INFO  (zkCallback-17887-thread-1-processing-n:127.0.0.1:58203_) [n:127.0.0.1:58203_    ] o.a.s.c.c.ZkStateReader A cluster state change: [WatchedEvent state:SyncConnected type:NodeDataChanged path:/clusterstate.json], has occurred - updating... (live nodes size: [2])
   [junit4]   2> 1918550 INFO  (zkCallback-17896-thread-1-processing-n:127.0.0.1:58990_) [n:127.0.0.1:58990_    ] o.a.s.c.c.ZkStateReader A cluster state change: [WatchedEvent state:SyncConnected type:NodeDataChanged path:/clusterstate.json], has occurred - updating... (live nodes size: [2])
   [junit4]   2> 1919450 INFO  (coreLoadExecutor-8318-thread-1-processing-n:127.0.0.1:58990_) [n:127.0.0.1:58990_ c:collection1   x:collection1] o.a.s.c.ZkController waiting to find shard id in clusterstate for collection1
   [junit4]   2> 1919450 INFO  (coreLoadExecutor-8318-thread-1-processing-n:127.0.0.1:58990_) [n:127.0.0.1:58990_ c:collection1   x:collection1] o.a.s.c.ZkController Check for collection zkNode:collection1
   [junit4]   2> 1919450 INFO  (coreLoadExecutor-8318-thread-1-processing-n:127.0.0.1:58990_) [n:127.0.0.1:58990_ c:collection1   x:collection1] o.a.s.c.ZkController Collection zkNode exists
   [junit4]   2> 1919451 INFO  (coreLoadExecutor-8318-thread-1-processing-n:127.0.0.1:58990_) [n:127.0.0.1:58990_ c:collection1   x:collection1] o.a.s.c.c.ZkStateReader Load collection config from: [/collections/collection1]
   [junit4]   2> 1919451 INFO  (coreLoadExecutor-8318-thread-1-processing-n:127.0.0.1:58990_) [n:127.0.0.1:58990_ c:collection1   x:collection1] o.a.s.c.c.ZkStateReader path=[/collections/collection1] [configName]=[conf1] specified config exists in ZooKeeper
   [junit4]   2> 1919451 INFO  (coreLoadExecutor-8318-thread-1-processing-n:127.0.0.1:58990_) [n:127.0.0.1:58990_ c:collection1   x:collection1] o.a.s.c.SolrResourceLoader new SolrResourceLoader for directory: '/x1/jenkins/jenkins-slave/workspace/Lucene-Solr-Tests-master/solr/build/solr-core/test/J0/temp/solr.handler.TestSolrConfigHandlerCloud_BCFC47F4AA4F3878-001/shard-1-001/cores/collection1'
   [junit4]   2> 1919451 INFO  (coreLoadExecutor-8318-thread-1-processing-n:127.0.0.1:58990_) [n:127.0.0.1:58990_ c:collection1   x:collection1] o.a.s.c.SolrResourceLoader JNDI not configured for solr (NoInitialContextEx)
   [junit4]   2> 1919452 INFO  (coreLoadExecutor-8318-thread-1-processing-n:127.0.0.1:58990_) [n:127.0.0.1:58990_ c:collection1   x:collection1] o.a.s.c.SolrResourceLoader solr home defaulted to 'solr/' (could not find system property or JNDI)
   [junit4]   2> 1919453 INFO  (coreLoadExecutor-8318-thread-1-processing-n:127.0.0.1:58990_) [n:127.0.0.1:58990_ c:collection1   x:collection1] o.a.s.c.Config loaded config solrconfig.xml with version 0 
   [junit4]   2> 1919456 INFO  (coreLoadExecutor-8318-thread-1-processing-n:127.0.0.1:58990_) [n:127.0.0.1:58990_ c:collection1   x:collection1] o.a.s.c.SolrConfig current version of requestparams : -1
   [junit4]   2> 1919459 INFO  (coreLoadExecutor-8318-thread-1-processing-n:127.0.0.1:58990_) [n:127.0.0.1:58990_ c:collection1   x:collection1] o.a.s.c.SolrConfig Using Lucene MatchVersion: 7.0.0
   [junit4]   2> 1919466 INFO  (coreLoadExecutor-8318-thread-1-processing-n:127.0.0.1:58990_) [n:127.0.0.1:58990_ c:collection1   x:collection1] o.a.s.c.SolrConfig Loaded SolrConfig: solrconfig.xml
   [junit4]   2> 1919470 INFO  (coreLoadExecutor-8318-thread-1-processing-n:127.0.0.1:58990_) [n:127.0.0.1:58990_ c:collection1   x:collection1] o.a.s.s.IndexSchema [collection1] Schema name=test
   [junit4]   2> 1919539 INFO  (coreLoadExecutor-8318-thread-1-processing-n:127.0.0.1:58990_) [n:127.0.0.1:58990_ c:collection1   x:collection1] o.a.s.s.OpenExchangeRatesOrgProvider Initialized with rates=open-exchange-rates.json, refreshInterval=1440.
   [junit4]   2> 1919543 INFO  (coreLoadExecutor-8318-thread-1-processing-n:127.0.0.1:58990_) [n:127.0.0.1:58990_ c:collection1   x:collection1] o.a.s.s.IndexSchema default search field in schema is text
   [junit4]   2> 1919544 INFO  (coreLoadExecutor-8318-thread-1-processing-n:127.0.0.1:58990_) [n:127.0.0.1:58990_ c:collection1   x:collection1] o.a.s.s.IndexSchema unique key field: id
   [junit4]   2> 1919548 INFO  (coreLoadExecutor-8318-thread-1-processing-n:127.0.0.1:58990_) [n:127.0.0.1:58990_ c:collection1   x:collection1] o.a.s.s.FileExchangeRateProvider Reloading exchange rates from file currency.xml
   [junit4]   2> 1919550 INFO  (coreLoadExecutor-8318-thread-1-processing-n:127.0.0.1:58990_) [n:127.0.0.1:58990_ c:collection1   x:collection1] o.a.s.s.FileExchangeRateProvider Reloading exchange rates from file currency.xml
   [junit4]   2> 1919551 INFO  (coreLoadExecutor-8318-thread-1-processing-n:127.0.0.1:58990_) [n:127.0.0.1:58990_ c:collection1   x:collection1] o.a.s.s.OpenExchangeRatesOrgProvider Reloading exchange rates from open-exchange-rates.json
   [junit4]   2> 1919551 INFO  (coreLoadExecutor-8318-thread-1-processing-n:127.0.0.1:58990_) [n:127.0.0.1:58990_ c:collection1   x:collection1] o.a.s.s.OpenExchangeRatesOrgProvider Reloading exchange rates from open-exchange-rates.json
   [junit4]   2> 1919552 INFO  (coreLoadExecutor-8318-thread-1-processing-n:127.0.0.1:58990_) [n:127.0.0.1:58990_ c:collection1   x:collection1] o.a.s.c.ConfigSetProperties Did not find ConfigSet properties, assuming default properties: Can't find resource 'configsetprops.json' in classpath or '/configs/conf1', cwd=/x1/jenkins/jenkins-slave/workspace/Lucene-Solr-Tests-master/solr/build/solr-core/test/J0
   [junit4]   2> 1919552 INFO  (coreLoadExecutor-8318-thread-1-processing-n:127.0.0.1:58990_) [n:127.0.0.1:58990_ c:collection1   x:collection1] o.a.s.c.CoreContainer Creating SolrCore 'collection1' using configuration from collection collection1
   [junit4]   2> 1919552 INFO  (coreLoadExecutor-8318-thread-1-processing-n:127.0.0.1:58990_) [n:127.0.0.1:58990_ c:collection1 s:shard2 r:core_node1 x:collection1] o.a.s.c.SolrCore org.apache.solr.core.MockDirectoryFactory
   [junit4]   2> 1919552 INFO  (coreLoadExecutor-8318-thread-1-processing-n:127.0.0.1:58990_) [n:127.0.0.1:58990_ c:collection1 s:shard2 r:core_node1 x:collection1] o.a.s.c.SolrCore [[collection1] ] Opening new SolrCore at [/x1/jenkins/jenkins-slave/workspace/Lucene-Solr-Tests-master/solr/build/solr-core/test/J0/temp/solr.handler.TestSolrConfigHandlerCloud_BCFC47F4AA4F3878-001/shard-1-001/cores/collection1], dataDir=[/x1/jenkins/jenkins-slave/workspace/Lucene-Solr-Tests-master/solr/build/solr-core/test/J0/temp/solr.handler.TestSolrConfigHandlerCloud_BCFC47F4AA4F3878-001/shard-1-001/cores/collection1/data/]
   [junit4]   2> 1919553 INFO  (coreLoadExecutor-8318-thread-1-processing-n:127.0.0.1:58990_) [n:127.0.0.1:58990_ c:collection1 s:shard2 r:core_node1 x:collection1] o.a.s.c.JmxMonitoredMap JMX monitoring is enabled. Adding Solr mbeans to JMX Server: com.sun.jmx.mbeanserver.JmxMBeanServer@50f7b964
   [junit4]   2> 1919553 INFO  (coreLoadExecutor-8318-thread-1-processing-n:127.0.0.1:58990_) [n:127.0.0.1:58990_ c:collection1 s:shard2 r:core_node1 x:collection1] o.a.s.c.CachingDirectoryFactory return new directory for /x1/jenkins/jenkins-slave/workspace/Lucene-Solr-Tests-master/solr/build/solr-core/test/J0/temp/solr.handler.TestSolrConfigHandlerCloud_BCFC47F4AA4F3878-001/shard-1-001/cores/collection1/data
   [junit4]   2> 1919553 INFO  (coreLoadExecutor-8318-thread-1-processing-n:127.0.0.1:58990_) [n:127.0.0.1:58990_ c:collection1 s:shard2 r:core_node1 x:collection1] o.a.s.c.SolrCore New index directory detected: old=null new=/x1/jenkins/jenkins-slave/workspace/Lucene-Solr-Tests-master/solr/build/solr-core/test/J0/temp/solr.handler.TestSolrConfigHandlerCloud_BCFC47F4AA4F3878-001/shard-1-001/cores/collection1/data/index/
   [junit4]   2> 1919553 WARN  (coreLoadExecutor-8318-thread-1-processing-n:127.0.0.1:58990_) [n:127.0.0.1:58990_ c:collection1 s:shard2 r:core_node1 x:collection1] o.a.s.c.SolrCore [collection1] Solr index directory '/x1/jenkins/jenkins-slave/workspace/Lucene-Solr-Tests-master/solr/build/solr-core/test/J0/temp/solr.handler.TestSolrConfigHandlerCl

[...truncated too long message...]

.apache.solr.core.SolrCore.lambda$getConfListener$6(SolrCore.java:2509)
   [junit4]   2> 	at org.apache.solr.cloud.ZkController$4.run(ZkController.java:2405)
   [junit4]   2> Caused by: java.lang.InterruptedException: sleep interrupted
   [junit4]   2> 	at java.lang.Thread.sleep(Native Method)
   [junit4]   2> 	at org.apache.solr.cloud.ZkSolrResourceLoader.openResource(ZkSolrResourceLoader.java:101)
   [junit4]   2> 	... 8 more
   [junit4]   2> 1971852 WARN  (Thread-8065) [n:127.0.0.1:41185_    ] o.a.s.c.SolrCores Tried to remove core collection1 from pendingCoreOps and it wasn't there. 
   [junit4]   2> 1971852 WARN  (Thread-8065) [n:127.0.0.1:41185_    ] o.a.s.c.ZkController listener throws error
   [junit4]   2> org.apache.solr.common.SolrException: Unable to reload core [collection1]
   [junit4]   2> 	at org.apache.solr.core.CoreContainer.reload(CoreContainer.java:952)
   [junit4]   2> 	at org.apache.solr.core.SolrCore.lambda$getConfListener$6(SolrCore.java:2509)
   [junit4]   2> 	at org.apache.solr.cloud.ZkController$4.run(ZkController.java:2405)
   [junit4]   2> Caused by: org.apache.solr.common.SolrException: Could not load conf for core collection1: Error loading schema resource schema.xml
   [junit4]   2> 	at org.apache.solr.core.ConfigSetService.getConfig(ConfigSetService.java:85)
   [junit4]   2> 	at org.apache.solr.core.CoreContainer.reload(CoreContainer.java:944)
   [junit4]   2> 	... 2 more
   [junit4]   2> Caused by: org.apache.solr.common.SolrException: Error loading schema resource schema.xml
   [junit4]   2> 	at org.apache.solr.schema.IndexSchemaFactory.create(IndexSchemaFactory.java:52)
   [junit4]   2> 	at org.apache.solr.schema.IndexSchemaFactory.buildIndexSchema(IndexSchemaFactory.java:75)
   [junit4]   2> 	at org.apache.solr.core.ConfigSetService.createIndexSchema(ConfigSetService.java:107)
   [junit4]   2> 	at org.apache.solr.core.ConfigSetService.getConfig(ConfigSetService.java:78)
   [junit4]   2> 	... 3 more
   [junit4]   2> Caused by: java.io.IOException: Could not load resource=schema.xml
   [junit4]   2> 	at org.apache.solr.cloud.ZkSolrResourceLoader.openResource(ZkSolrResourceLoader.java:105)
   [junit4]   2> 	at org.apache.solr.core.SolrResourceLoader.openSchema(SolrResourceLoader.java:333)
   [junit4]   2> 	at org.apache.solr.schema.IndexSchemaFactory.create(IndexSchemaFactory.java:48)
   [junit4]   2> 	... 6 more
   [junit4]   2> Caused by: java.lang.InterruptedException: sleep interrupted
   [junit4]   2> 	at java.lang.Thread.sleep(Native Method)
   [junit4]   2> 	at org.apache.solr.cloud.ZkSolrResourceLoader.openResource(ZkSolrResourceLoader.java:101)
   [junit4]   2> 	... 8 more
   [junit4]   2> Jun 27, 2016 3:03:27 AM com.carrotsearch.randomizedtesting.ThreadLeakControl tryToInterruptAll
   [junit4]   2> INFO: All leaked threads terminated.
   [junit4]   2> NOTE: test params are: codec=DummyCompressingStoredFields(storedFieldsFormat=CompressingStoredFieldsFormat(compressionMode=DUMMY, chunkSize=5397, maxDocsPerChunk=478, blockSize=8), termVectorsFormat=CompressingTermVectorsFormat(compressionMode=DUMMY, chunkSize=5397, blockSize=8)), sim=ClassicSimilarity, locale=ar-QA, timezone=Asia/Vladivostok
   [junit4]   2> NOTE: Linux 3.13.0-85-generic amd64/Oracle Corporation 1.8.0_74 (64-bit)/cpus=4,threads=1,free=84234336,total=533200896
   [junit4]   2> NOTE: All tests run in this JVM: [AnalysisErrorHandlingTest, TestRandomDVFaceting, TestConfig, TestLuceneMatchVersion, TestSortingResponseWriter, TestDocBasedVersionConstraints, SuggestComponentTest, AnalyticsMergeStrategyTest, TestAnalyzedSuggestions, TestCustomDocTransformer, TestRemoteStreaming, ClassificationUpdateProcessorFactoryTest, ForceLeaderTest, IndexSchemaRuntimeFieldTest, HdfsSyncSliceTest, TestLazyCores, HdfsDirectoryTest, CurrencyFieldOpenExchangeTest, OverseerCollectionConfigSetProcessorTest, CreateCollectionCleanupTest, SignatureUpdateProcessorFactoryTest, URLClassifyProcessorTest, QueryResultKeyTest, DisMaxRequestHandlerTest, TestPseudoReturnFields, TestDocSet, TestSchemaNameResource, SparseHLLTest, HdfsUnloadDistributedZkTest, ResponseLogComponentTest, TestExactStatsCache, VersionInfoTest, ConjunctionSolrSpellCheckerTest, ResourceLoaderTest, DistanceUnitsTest, ReplicationFactorTest, SimpleMLTQParserTest, TestRuleBasedAuthorizationPlugin, TestAtomicUpdateErrorCases, HdfsBasicDistributedZk2Test, SolrCoreTest, SystemInfoHandlerTest, TestMinMaxOnMultiValuedField, SyncSliceTest, BasicZkTest, TestFilteredDocIdSet, TestRealTimeGet, TestLRUCache, DeleteStatusTest, TestSolr4Spatial, XsltUpdateRequestHandlerTest, BigEndianAscendingWordSerializerTest, TestComponentsName, ChangedSchemaMergeTest, TestRebalanceLeaders, TestRangeQuery, TestBinaryField, TestAddFieldRealTimeGet, FileBasedSpellCheckerTest, FacetPivotSmallTest, TestSolrQueryParserResource, SharedFSAutoReplicaFailoverTest, TestCrossCoreJoin, PingRequestHandlerTest, TestFunctionQuery, TestValueSourceCache, TestSizeLimitedDistributedMap, IgnoreCommitOptimizeUpdateProcessorFactoryTest, TestBadConfig, BasicDistributedZkTest, TestJoin, RequiredFieldsTest, TestRandomCollapseQParserPlugin, SolrCloudExampleTest, TestDefaultStatsCache, TestPivotHelperCode, ExternalFileFieldSortTest, TestLMDirichletSimilarityFactory, TestInitParams, DateFieldTest, CopyFieldTest, TestReqParamsAPI, ConcurrentDeleteAndCreateCollectionTest, TestDistribDocBasedVersion, CacheHeaderTest, StandardRequestHandlerTest, CursorPagingTest, TestStressLiveNodes, PreAnalyzedFieldTest, TestLeaderElectionZkExpiry, TestInitQParser, TestRecoveryHdfs, CheckHdfsIndexTest, TestCloudBackupRestore, TestConfigSetsAPIExclusivity, TestCloudPivotFacet, TestSolrXml, LeaderElectionIntegrationTest, TestHashPartitioner, ZkControllerTest, TestStressVersions, StatsComponentTest, HighlighterTest, DistributedQueryElevationComponentTest, TestFoldingMultitermQuery, DocValuesTest, RegexBoostProcessorTest, IndexSchemaTest, JSONWriterTest, BinaryUpdateRequestHandlerTest, CSVRequestHandlerTest, TestLFUCache, TestHighlightDedupGrouping, TestSimpleTrackingShardHandler, TestJettySolrRunner, AliasIntegrationTest, CollectionTooManyReplicasTest, DistribCursorPagingTest, DistribJoinFromCollectionTest, HttpPartitionTest, TestCryptoKeys, TestLeaderInitiatedRecoveryThread, TestMiniSolrCloudClusterBase, TestMiniSolrCloudClusterSSL, TestReplicaProperties, TestSolrCloudWithKerberosAlt, TestStressCloudBlindAtomicUpdates, TlogReplayBufferedWhileIndexingTest, HdfsBasicDistributedZkTest, HdfsChaosMonkeyNothingIsSafeTest, HdfsChaosMonkeySafeLeaderTest, HdfsCollectionsAPIDistributedZkTest, HdfsNNFailoverTest, BlobRepositoryCloudTest, CachingDirectoryFactoryTest, DirectoryFactoryTest, TestBackupRepositoryFactory, TestConfigOverlay, TestConfigSetImmutable, TestDynamicLoading, TestConfigReload, TestSolrConfigHandlerCloud]
   [junit4]   2> NOTE: reproduce with: ant test  -Dtestcase=TestSolrConfigHandlerCloud -Dtests.seed=BCFC47F4AA4F3878 -Dtests.multiplier=2 -Dtests.slow=true -Dtests.locale=ar-QA -Dtests.timezone=Asia/Vladivostok -Dtests.asserts=true -Dtests.file.encoding=US-ASCII
   [junit4] ERROR   0.00s J0 | TestSolrConfigHandlerCloud (suite) <<<
   [junit4]    > Throwable #1: com.carrotsearch.randomizedtesting.ThreadLeakError: 1 thread leaked from SUITE scope at org.apache.solr.handler.TestSolrConfigHandlerCloud: 
   [junit4]    >    1) Thread[id=75230, name=Thread-8065, state=TIMED_WAITING, group=TGRP-TestSolrConfigHandlerCloud]
   [junit4]    >         at java.lang.Thread.sleep(Native Method)
   [junit4]    >         at org.apache.solr.cloud.ZkSolrResourceLoader.openResource(ZkSolrResourceLoader.java:101)
   [junit4]    >         at org.apache.solr.core.SolrResourceLoader.openSchema(SolrResourceLoader.java:333)
   [junit4]    >         at org.apache.solr.schema.IndexSchemaFactory.create(IndexSchemaFactory.java:48)
   [junit4]    >         at org.apache.solr.schema.IndexSchemaFactory.buildIndexSchema(IndexSchemaFactory.java:75)
   [junit4]    >         at org.apache.solr.core.ConfigSetService.createIndexSchema(ConfigSetService.java:107)
   [junit4]    >         at org.apache.solr.core.ConfigSetService.getConfig(ConfigSetService.java:78)
   [junit4]    >         at org.apache.solr.core.CoreContainer.reload(CoreContainer.java:944)
   [junit4]    >         at org.apache.solr.core.SolrCore.lambda$getConfListener$6(SolrCore.java:2509)
   [junit4]    >         at org.apache.solr.core.SolrCore$$Lambda$67/1651346545.run(Unknown Source)
   [junit4]    >         at org.apache.solr.cloud.ZkController$4.run(ZkController.java:2405)
   [junit4]    > 	at __randomizedtesting.SeedInfo.seed([BCFC47F4AA4F3878]:0)
   [junit4] Completed [532/616 (1!)] on J0 in 56.46s, 1 test, 1 error <<< FAILURES!

[...truncated 294 lines...]
BUILD FAILED
/x1/jenkins/jenkins-slave/workspace/Lucene-Solr-Tests-master/build.xml:740: The following error occurred while executing this line:
/x1/jenkins/jenkins-slave/workspace/Lucene-Solr-Tests-master/build.xml:684: The following error occurred while executing this line:
/x1/jenkins/jenkins-slave/workspace/Lucene-Solr-Tests-master/build.xml:59: The following error occurred while executing this line:
/x1/jenkins/jenkins-slave/workspace/Lucene-Solr-Tests-master/solr/build.xml:233: The following error occurred while executing this line:
/x1/jenkins/jenkins-slave/workspace/Lucene-Solr-Tests-master/solr/common-build.xml:530: The following error occurred while executing this line:
/x1/jenkins/jenkins-slave/workspace/Lucene-Solr-Tests-master/lucene/common-build.xml:1427: The following error occurred while executing this line:
/x1/jenkins/jenkins-slave/workspace/Lucene-Solr-Tests-master/lucene/common-build.xml:984: There were test failures: 616 suites (10 ignored), 2590 tests, 1 suite-level error, 87 ignored (72 assumptions) [seed: BCFC47F4AA4F3878]

Total time: 73 minutes 6 seconds
Build step 'Invoke Ant' marked build as failure
Archiving artifacts
Recording test results
Email was triggered for: Failure - Any
Sending email for trigger: Failure - Any




Mime
View raw message