lucene-dev mailing list archives

Site index · List index
Message view « Date » · « Thread »
Top « Date » · « Thread »
From Policeman Jenkins Server <jenk...@thetaphi.de>
Subject [JENKINS] Lucene-Solr-5.5-Linux (32bit/jdk1.8.0_92) - Build # 316 - Still Failing!
Date Mon, 20 Jun 2016 05:35:17 GMT
Build: http://jenkins.thetaphi.de/job/Lucene-Solr-5.5-Linux/316/
Java: 32bit/jdk1.8.0_92 -server -XX:+UseConcMarkSweepGC

1 tests failed.
FAILED:  org.apache.solr.schema.TestManagedSchemaAPI.test

Error Message:
Error from server at http://127.0.0.1:46689/solr/testschemaapi_shard1_replica1: ERROR: [doc=2] unknown field 'myNewField1'

Stack Trace:
org.apache.solr.client.solrj.impl.CloudSolrClient$RouteException: Error from server at http://127.0.0.1:46689/solr/testschemaapi_shard1_replica1: ERROR: [doc=2] unknown field 'myNewField1'
	at __randomizedtesting.SeedInfo.seed([A47C1AB04B5AF6F4:2C28256AE5A69B0C]:0)
	at org.apache.solr.client.solrj.impl.CloudSolrClient.directUpdate(CloudSolrClient.java:632)
	at org.apache.solr.client.solrj.impl.CloudSolrClient.sendRequest(CloudSolrClient.java:981)
	at org.apache.solr.client.solrj.impl.CloudSolrClient.requestWithRetryOnStaleState(CloudSolrClient.java:870)
	at org.apache.solr.client.solrj.impl.CloudSolrClient.request(CloudSolrClient.java:806)
	at org.apache.solr.schema.TestManagedSchemaAPI.testAddFieldAndDocument(TestManagedSchemaAPI.java:101)
	at org.apache.solr.schema.TestManagedSchemaAPI.test(TestManagedSchemaAPI.java:69)
	at sun.reflect.NativeMethodAccessorImpl.invoke0(Native Method)
	at sun.reflect.NativeMethodAccessorImpl.invoke(NativeMethodAccessorImpl.java:62)
	at sun.reflect.DelegatingMethodAccessorImpl.invoke(DelegatingMethodAccessorImpl.java:43)
	at java.lang.reflect.Method.invoke(Method.java:498)
	at com.carrotsearch.randomizedtesting.RandomizedRunner.invoke(RandomizedRunner.java:1764)
	at com.carrotsearch.randomizedtesting.RandomizedRunner$8.evaluate(RandomizedRunner.java:871)
	at com.carrotsearch.randomizedtesting.RandomizedRunner$9.evaluate(RandomizedRunner.java:907)
	at com.carrotsearch.randomizedtesting.RandomizedRunner$10.evaluate(RandomizedRunner.java:921)
	at com.carrotsearch.randomizedtesting.rules.SystemPropertiesRestoreRule$1.evaluate(SystemPropertiesRestoreRule.java:57)
	at org.apache.lucene.util.TestRuleSetupTeardownChained$1.evaluate(TestRuleSetupTeardownChained.java:49)
	at org.apache.lucene.util.AbstractBeforeAfterRule$1.evaluate(AbstractBeforeAfterRule.java:45)
	at org.apache.lucene.util.TestRuleThreadAndTestName$1.evaluate(TestRuleThreadAndTestName.java:48)
	at org.apache.lucene.util.TestRuleIgnoreAfterMaxFailures$1.evaluate(TestRuleIgnoreAfterMaxFailures.java:64)
	at org.apache.lucene.util.TestRuleMarkFailure$1.evaluate(TestRuleMarkFailure.java:47)
	at com.carrotsearch.randomizedtesting.rules.StatementAdapter.evaluate(StatementAdapter.java:36)
	at com.carrotsearch.randomizedtesting.ThreadLeakControl$StatementRunner.run(ThreadLeakControl.java:367)
	at com.carrotsearch.randomizedtesting.ThreadLeakControl.forkTimeoutingTask(ThreadLeakControl.java:809)
	at com.carrotsearch.randomizedtesting.ThreadLeakControl$3.evaluate(ThreadLeakControl.java:460)
	at com.carrotsearch.randomizedtesting.RandomizedRunner.runSingleTest(RandomizedRunner.java:880)
	at com.carrotsearch.randomizedtesting.RandomizedRunner$5.evaluate(RandomizedRunner.java:781)
	at com.carrotsearch.randomizedtesting.RandomizedRunner$6.evaluate(RandomizedRunner.java:816)
	at com.carrotsearch.randomizedtesting.RandomizedRunner$7.evaluate(RandomizedRunner.java:827)
	at com.carrotsearch.randomizedtesting.rules.StatementAdapter.evaluate(StatementAdapter.java:36)
	at com.carrotsearch.randomizedtesting.rules.SystemPropertiesRestoreRule$1.evaluate(SystemPropertiesRestoreRule.java:57)
	at org.apache.lucene.util.AbstractBeforeAfterRule$1.evaluate(AbstractBeforeAfterRule.java:45)
	at com.carrotsearch.randomizedtesting.rules.StatementAdapter.evaluate(StatementAdapter.java:36)
	at org.apache.lucene.util.TestRuleStoreClassName$1.evaluate(TestRuleStoreClassName.java:41)
	at com.carrotsearch.randomizedtesting.rules.NoShadowingOrOverridesOnMethodsRule$1.evaluate(NoShadowingOrOverridesOnMethodsRule.java:40)
	at com.carrotsearch.randomizedtesting.rules.NoShadowingOrOverridesOnMethodsRule$1.evaluate(NoShadowingOrOverridesOnMethodsRule.java:40)
	at com.carrotsearch.randomizedtesting.rules.StatementAdapter.evaluate(StatementAdapter.java:36)
	at com.carrotsearch.randomizedtesting.rules.StatementAdapter.evaluate(StatementAdapter.java:36)
	at com.carrotsearch.randomizedtesting.rules.StatementAdapter.evaluate(StatementAdapter.java:36)
	at org.apache.lucene.util.TestRuleAssertionsRequired$1.evaluate(TestRuleAssertionsRequired.java:53)
	at org.apache.lucene.util.TestRuleMarkFailure$1.evaluate(TestRuleMarkFailure.java:47)
	at org.apache.lucene.util.TestRuleIgnoreAfterMaxFailures$1.evaluate(TestRuleIgnoreAfterMaxFailures.java:64)
	at org.apache.lucene.util.TestRuleIgnoreTestSuites$1.evaluate(TestRuleIgnoreTestSuites.java:54)
	at com.carrotsearch.randomizedtesting.rules.StatementAdapter.evaluate(StatementAdapter.java:36)
	at com.carrotsearch.randomizedtesting.ThreadLeakControl$StatementRunner.run(ThreadLeakControl.java:367)
	at java.lang.Thread.run(Thread.java:745)
Caused by: org.apache.solr.client.solrj.impl.HttpSolrClient$RemoteSolrException: Error from server at http://127.0.0.1:46689/solr/testschemaapi_shard1_replica1: ERROR: [doc=2] unknown field 'myNewField1'
	at org.apache.solr.client.solrj.impl.HttpSolrClient.executeMethod(HttpSolrClient.java:577)
	at org.apache.solr.client.solrj.impl.HttpSolrClient.request(HttpSolrClient.java:241)
	at org.apache.solr.client.solrj.impl.HttpSolrClient.request(HttpSolrClient.java:230)
	at org.apache.solr.client.solrj.impl.LBHttpSolrClient.doRequest(LBHttpSolrClient.java:372)
	at org.apache.solr.client.solrj.impl.LBHttpSolrClient.request(LBHttpSolrClient.java:325)
	at org.apache.solr.client.solrj.impl.CloudSolrClient$2.call(CloudSolrClient.java:607)
	at org.apache.solr.client.solrj.impl.CloudSolrClient$2.call(CloudSolrClient.java:604)
	at java.util.concurrent.FutureTask.run(FutureTask.java:266)
	at org.apache.solr.common.util.ExecutorUtil$MDCAwareThreadPoolExecutor$1.run(ExecutorUtil.java:231)
	at java.util.concurrent.ThreadPoolExecutor.runWorker(ThreadPoolExecutor.java:1142)
	at java.util.concurrent.ThreadPoolExecutor$Worker.run(ThreadPoolExecutor.java:617)
	... 1 more




Build Log:
[...truncated 11430 lines...]
   [junit4] Suite: org.apache.solr.schema.TestManagedSchemaAPI
   [junit4]   2> Creating dataDir: /home/jenkins/workspace/Lucene-Solr-5.5-Linux/solr/build/solr-core/test/J0/temp/solr.schema.TestManagedSchemaAPI_A47C1AB04B5AF6F4-001/init-core-data-001
   [junit4]   2> 1028706 INFO  (SUITE-TestManagedSchemaAPI-seed#[A47C1AB04B5AF6F4]-worker) [    ] o.a.s.SolrTestCaseJ4 Randomized ssl (false) and clientAuth (true)
   [junit4]   2> 1028707 INFO  (TEST-TestManagedSchemaAPI.test-seed#[A47C1AB04B5AF6F4]) [    ] o.a.s.SolrTestCaseJ4 ###Starting test
   [junit4]   2> 1028708 INFO  (TEST-TestManagedSchemaAPI.test-seed#[A47C1AB04B5AF6F4]) [    ] o.a.s.c.ZkTestServer STARTING ZK TEST SERVER
   [junit4]   2> 1028708 INFO  (Thread-2015) [    ] o.a.s.c.ZkTestServer client port:0.0.0.0/0.0.0.0:0
   [junit4]   2> 1028708 INFO  (Thread-2015) [    ] o.a.s.c.ZkTestServer Starting server
   [junit4]   2> 1028808 INFO  (TEST-TestManagedSchemaAPI.test-seed#[A47C1AB04B5AF6F4]) [    ] o.a.s.c.ZkTestServer start zk server on port:44308
   [junit4]   2> 1028808 INFO  (TEST-TestManagedSchemaAPI.test-seed#[A47C1AB04B5AF6F4]) [    ] o.a.s.c.c.SolrZkClient Using default ZkCredentialsProvider
   [junit4]   2> 1028808 INFO  (TEST-TestManagedSchemaAPI.test-seed#[A47C1AB04B5AF6F4]) [    ] o.a.s.c.c.ConnectionManager Waiting for client to connect to ZooKeeper
   [junit4]   2> 1028810 INFO  (zkCallback-683-thread-1) [    ] o.a.s.c.c.ConnectionManager Watcher org.apache.solr.common.cloud.ConnectionManager@3ccff name:ZooKeeperConnection Watcher:127.0.0.1:44308 got event WatchedEvent state:SyncConnected type:None path:null path:null type:None
   [junit4]   2> 1028810 INFO  (TEST-TestManagedSchemaAPI.test-seed#[A47C1AB04B5AF6F4]) [    ] o.a.s.c.c.ConnectionManager Client is connected to ZooKeeper
   [junit4]   2> 1028810 INFO  (TEST-TestManagedSchemaAPI.test-seed#[A47C1AB04B5AF6F4]) [    ] o.a.s.c.c.SolrZkClient Using default ZkACLProvider
   [junit4]   2> 1028811 INFO  (TEST-TestManagedSchemaAPI.test-seed#[A47C1AB04B5AF6F4]) [    ] o.a.s.c.c.SolrZkClient makePath: /solr/solr.xml
   [junit4]   2> 1028813 INFO  (jetty-launcher-682-thread-2) [    ] o.e.j.s.Server jetty-9.2.13.v20150730
   [junit4]   2> 1028813 INFO  (jetty-launcher-682-thread-1) [    ] o.e.j.s.Server jetty-9.2.13.v20150730
   [junit4]   2> 1028814 INFO  (jetty-launcher-682-thread-1) [    ] o.e.j.s.h.ContextHandler Started o.e.j.s.ServletContextHandler@3f4a89{/solr,null,AVAILABLE}
   [junit4]   2> 1028814 INFO  (jetty-launcher-682-thread-2) [    ] o.e.j.s.h.ContextHandler Started o.e.j.s.ServletContextHandler@c67790{/solr,null,AVAILABLE}
   [junit4]   2> 1028817 INFO  (jetty-launcher-682-thread-2) [    ] o.e.j.s.ServerConnector Started ServerConnector@106741c{HTTP/1.1}{127.0.0.1:45029}
   [junit4]   2> 1028817 INFO  (jetty-launcher-682-thread-2) [    ] o.e.j.s.Server Started @1030392ms
   [junit4]   2> 1028817 INFO  (jetty-launcher-682-thread-2) [    ] o.a.s.c.s.e.JettySolrRunner Jetty properties: {hostContext=/solr, hostPort=45029}
   [junit4]   2> 1028817 INFO  (jetty-launcher-682-thread-2) [    ] o.a.s.s.SolrDispatchFilter SolrDispatchFilter.init(): sun.misc.Launcher$AppClassLoader@1d16e93
   [junit4]   2> 1028817 INFO  (jetty-launcher-682-thread-2) [    ] o.a.s.c.SolrResourceLoader new SolrResourceLoader for directory: '/home/jenkins/workspace/Lucene-Solr-5.5-Linux/solr/build/solr-core/test/J0/temp/solr.schema.TestManagedSchemaAPI_A47C1AB04B5AF6F4-001/tempDir-001/node2'
   [junit4]   2> 1028817 INFO  (jetty-launcher-682-thread-2) [    ] o.a.s.c.SolrResourceLoader JNDI not configured for solr (NoInitialContextEx)
   [junit4]   2> 1028817 INFO  (jetty-launcher-682-thread-2) [    ] o.a.s.c.SolrResourceLoader solr home defaulted to 'solr/' (could not find system property or JNDI)
   [junit4]   2> 1028817 INFO  (jetty-launcher-682-thread-2) [    ] o.a.s.c.c.SolrZkClient Using default ZkCredentialsProvider
   [junit4]   2> 1028817 INFO  (jetty-launcher-682-thread-1) [    ] o.e.j.s.ServerConnector Started ServerConnector@15a391e{HTTP/1.1}{127.0.0.1:46689}
   [junit4]   2> 1028817 INFO  (jetty-launcher-682-thread-2) [    ] o.a.s.c.c.ConnectionManager Waiting for client to connect to ZooKeeper
   [junit4]   2> 1028818 INFO  (jetty-launcher-682-thread-1) [    ] o.e.j.s.Server Started @1030393ms
   [junit4]   2> 1028818 INFO  (jetty-launcher-682-thread-1) [    ] o.a.s.c.s.e.JettySolrRunner Jetty properties: {hostContext=/solr, hostPort=46689}
   [junit4]   2> 1028818 INFO  (jetty-launcher-682-thread-1) [    ] o.a.s.s.SolrDispatchFilter SolrDispatchFilter.init(): sun.misc.Launcher$AppClassLoader@1d16e93
   [junit4]   2> 1028818 INFO  (jetty-launcher-682-thread-1) [    ] o.a.s.c.SolrResourceLoader new SolrResourceLoader for directory: '/home/jenkins/workspace/Lucene-Solr-5.5-Linux/solr/build/solr-core/test/J0/temp/solr.schema.TestManagedSchemaAPI_A47C1AB04B5AF6F4-001/tempDir-001/node1'
   [junit4]   2> 1028818 INFO  (jetty-launcher-682-thread-1) [    ] o.a.s.c.SolrResourceLoader JNDI not configured for solr (NoInitialContextEx)
   [junit4]   2> 1028818 INFO  (jetty-launcher-682-thread-1) [    ] o.a.s.c.SolrResourceLoader solr home defaulted to 'solr/' (could not find system property or JNDI)
   [junit4]   2> 1028818 INFO  (zkCallback-684-thread-1) [    ] o.a.s.c.c.ConnectionManager Watcher org.apache.solr.common.cloud.ConnectionManager@14bdeb6 name:ZooKeeperConnection Watcher:127.0.0.1:44308/solr got event WatchedEvent state:SyncConnected type:None path:null path:null type:None
   [junit4]   2> 1028818 INFO  (jetty-launcher-682-thread-1) [    ] o.a.s.c.c.SolrZkClient Using default ZkCredentialsProvider
   [junit4]   2> 1028818 INFO  (jetty-launcher-682-thread-2) [    ] o.a.s.c.c.ConnectionManager Client is connected to ZooKeeper
   [junit4]   2> 1028821 INFO  (jetty-launcher-682-thread-1) [    ] o.a.s.c.c.ConnectionManager Waiting for client to connect to ZooKeeper
   [junit4]   2> 1028822 INFO  (zkCallback-685-thread-1) [    ] o.a.s.c.c.ConnectionManager Watcher org.apache.solr.common.cloud.ConnectionManager@15ed735 name:ZooKeeperConnection Watcher:127.0.0.1:44308/solr got event WatchedEvent state:SyncConnected type:None path:null path:null type:None
   [junit4]   2> 1028822 INFO  (jetty-launcher-682-thread-1) [    ] o.a.s.c.c.ConnectionManager Client is connected to ZooKeeper
   [junit4]   2> 1028822 INFO  (jetty-launcher-682-thread-1) [    ] o.a.s.c.c.SolrZkClient Using default ZkACLProvider
   [junit4]   2> 1028822 INFO  (jetty-launcher-682-thread-1) [    ] o.a.s.s.SolrDispatchFilter solr.xml found in ZooKeeper. Loading...
   [junit4]   2> 1028823 INFO  (jetty-launcher-682-thread-2) [    ] o.a.s.c.c.SolrZkClient Using default ZkACLProvider
   [junit4]   2> 1028823 INFO  (jetty-launcher-682-thread-2) [    ] o.a.s.s.SolrDispatchFilter solr.xml found in ZooKeeper. Loading...
   [junit4]   2> 1028826 INFO  (jetty-launcher-682-thread-1) [    ] o.a.s.c.CorePropertiesLocator Config-defined core root directory: /home/jenkins/workspace/Lucene-Solr-5.5-Linux/solr/build/solr-core/test/J0/temp/solr.schema.TestManagedSchemaAPI_A47C1AB04B5AF6F4-001/tempDir-001/node1/.
   [junit4]   2> 1028827 INFO  (jetty-launcher-682-thread-1) [    ] o.a.s.c.CoreContainer New CoreContainer 8106607
   [junit4]   2> 1028827 INFO  (jetty-launcher-682-thread-1) [    ] o.a.s.c.CoreContainer Loading cores into CoreContainer [instanceDir=/home/jenkins/workspace/Lucene-Solr-5.5-Linux/solr/build/solr-core/test/J0/temp/solr.schema.TestManagedSchemaAPI_A47C1AB04B5AF6F4-001/tempDir-001/node1]
   [junit4]   2> 1028827 WARN  (jetty-launcher-682-thread-1) [    ] o.a.s.c.CoreContainer Couldn't add files from /home/jenkins/workspace/Lucene-Solr-5.5-Linux/solr/build/solr-core/test/J0/temp/solr.schema.TestManagedSchemaAPI_A47C1AB04B5AF6F4-001/tempDir-001/node1/lib to classpath: /home/jenkins/workspace/Lucene-Solr-5.5-Linux/solr/build/solr-core/test/J0/temp/solr.schema.TestManagedSchemaAPI_A47C1AB04B5AF6F4-001/tempDir-001/node1/lib
   [junit4]   2> 1028827 INFO  (jetty-launcher-682-thread-2) [    ] o.a.s.c.CorePropertiesLocator Config-defined core root directory: /home/jenkins/workspace/Lucene-Solr-5.5-Linux/solr/build/solr-core/test/J0/temp/solr.schema.TestManagedSchemaAPI_A47C1AB04B5AF6F4-001/tempDir-001/node2/.
   [junit4]   2> 1028827 INFO  (jetty-launcher-682-thread-2) [    ] o.a.s.c.CoreContainer New CoreContainer 6754121
   [junit4]   2> 1028827 INFO  (jetty-launcher-682-thread-2) [    ] o.a.s.c.CoreContainer Loading cores into CoreContainer [instanceDir=/home/jenkins/workspace/Lucene-Solr-5.5-Linux/solr/build/solr-core/test/J0/temp/solr.schema.TestManagedSchemaAPI_A47C1AB04B5AF6F4-001/tempDir-001/node2]
   [junit4]   2> 1028827 INFO  (jetty-launcher-682-thread-1) [    ] o.a.s.h.c.HttpShardHandlerFactory created with socketTimeout : 90000,urlScheme : ,connTimeout : 15000,maxConnectionsPerHost : 20,maxConnections : 10000,corePoolSize : 0,maximumPoolSize : 2147483647,maxThreadIdleTime : 5,sizeOfQueue : -1,fairnessPolicy : false,useRetries : false,
   [junit4]   2> 1028827 WARN  (jetty-launcher-682-thread-2) [    ] o.a.s.c.CoreContainer Couldn't add files from /home/jenkins/workspace/Lucene-Solr-5.5-Linux/solr/build/solr-core/test/J0/temp/solr.schema.TestManagedSchemaAPI_A47C1AB04B5AF6F4-001/tempDir-001/node2/lib to classpath: /home/jenkins/workspace/Lucene-Solr-5.5-Linux/solr/build/solr-core/test/J0/temp/solr.schema.TestManagedSchemaAPI_A47C1AB04B5AF6F4-001/tempDir-001/node2/lib
   [junit4]   2> 1028827 INFO  (jetty-launcher-682-thread-2) [    ] o.a.s.h.c.HttpShardHandlerFactory created with socketTimeout : 90000,urlScheme : ,connTimeout : 15000,maxConnectionsPerHost : 20,maxConnections : 10000,corePoolSize : 0,maximumPoolSize : 2147483647,maxThreadIdleTime : 5,sizeOfQueue : -1,fairnessPolicy : false,useRetries : false,
   [junit4]   2> 1028828 INFO  (jetty-launcher-682-thread-2) [    ] o.a.s.u.UpdateShardHandler Creating UpdateShardHandler HTTP client with params: socketTimeout=340000&connTimeout=45000&retry=true
   [junit4]   2> 1028828 INFO  (jetty-launcher-682-thread-1) [    ] o.a.s.u.UpdateShardHandler Creating UpdateShardHandler HTTP client with params: socketTimeout=340000&connTimeout=45000&retry=true
   [junit4]   2> 1028828 INFO  (jetty-launcher-682-thread-2) [    ] o.a.s.l.LogWatcher SLF4J impl is org.slf4j.impl.Log4jLoggerFactory
   [junit4]   2> 1028828 INFO  (jetty-launcher-682-thread-2) [    ] o.a.s.l.LogWatcher Registering Log Listener [Log4j (org.slf4j.impl.Log4jLoggerFactory)]
   [junit4]   2> 1028828 INFO  (jetty-launcher-682-thread-2) [    ] o.a.s.c.ZkContainer Zookeeper client=127.0.0.1:44308/solr
   [junit4]   2> 1028828 INFO  (jetty-launcher-682-thread-2) [    ] o.a.s.c.ZkController zkHost includes chroot
   [junit4]   2> 1028828 INFO  (jetty-launcher-682-thread-2) [    ] o.a.s.c.c.SolrZkClient Using default ZkCredentialsProvider
   [junit4]   2> 1028828 INFO  (jetty-launcher-682-thread-1) [    ] o.a.s.l.LogWatcher SLF4J impl is org.slf4j.impl.Log4jLoggerFactory
   [junit4]   2> 1028829 INFO  (jetty-launcher-682-thread-1) [    ] o.a.s.l.LogWatcher Registering Log Listener [Log4j (org.slf4j.impl.Log4jLoggerFactory)]
   [junit4]   2> 1028829 INFO  (jetty-launcher-682-thread-1) [    ] o.a.s.c.ZkContainer Zookeeper client=127.0.0.1:44308/solr
   [junit4]   2> 1028829 INFO  (jetty-launcher-682-thread-1) [    ] o.a.s.c.ZkController zkHost includes chroot
   [junit4]   2> 1028829 INFO  (jetty-launcher-682-thread-1) [    ] o.a.s.c.c.SolrZkClient Using default ZkCredentialsProvider
   [junit4]   2> 1028829 INFO  (jetty-launcher-682-thread-2) [    ] o.a.s.c.c.ConnectionManager Waiting for client to connect to ZooKeeper
   [junit4]   2> 1028829 INFO  (jetty-launcher-682-thread-1) [    ] o.a.s.c.c.ConnectionManager Waiting for client to connect to ZooKeeper
   [junit4]   2> 1028830 INFO  (zkCallback-691-thread-1) [    ] o.a.s.c.c.ConnectionManager Watcher org.apache.solr.common.cloud.ConnectionManager@1f1ff27 name:ZooKeeperConnection Watcher:127.0.0.1:44308 got event WatchedEvent state:SyncConnected type:None path:null path:null type:None
   [junit4]   2> 1028830 INFO  (jetty-launcher-682-thread-1) [    ] o.a.s.c.c.ConnectionManager Client is connected to ZooKeeper
   [junit4]   2> 1028830 INFO  (zkCallback-690-thread-1) [    ] o.a.s.c.c.ConnectionManager Watcher org.apache.solr.common.cloud.ConnectionManager@6df6fc name:ZooKeeperConnection Watcher:127.0.0.1:44308 got event WatchedEvent state:SyncConnected type:None path:null path:null type:None
   [junit4]   2> 1028830 INFO  (jetty-launcher-682-thread-2) [    ] o.a.s.c.c.ConnectionManager Client is connected to ZooKeeper
   [junit4]   2> 1028830 INFO  (jetty-launcher-682-thread-1) [    ] o.a.s.c.c.SolrZkClient Using default ZkACLProvider
   [junit4]   2> 1028831 INFO  (jetty-launcher-682-thread-2) [    ] o.a.s.c.c.SolrZkClient Using default ZkACLProvider
   [junit4]   2> 1028831 WARN  (NIOServerCxn.Factory:0.0.0.0/0.0.0.0:0) [    ] o.a.z.s.NIOServerCnxn caught end of stream exception
   [junit4]   2> EndOfStreamException: Unable to read additional data from client sessionid 0x1556c3f5b980003, likely client has closed socket
   [junit4]   2> 	at org.apache.zookeeper.server.NIOServerCnxn.doIO(NIOServerCnxn.java:228)
   [junit4]   2> 	at org.apache.zookeeper.server.NIOServerCnxnFactory.run(NIOServerCnxnFactory.java:208)
   [junit4]   2> 	at java.lang.Thread.run(Thread.java:745)
   [junit4]   2> 1028831 INFO  (jetty-launcher-682-thread-1) [n:127.0.0.1:46689_solr    ] o.a.s.c.ZkController Added new OnReconnect listener org.apache.solr.cloud.ZkController$6@1e6a1af
   [junit4]   2> 1028831 INFO  (jetty-launcher-682-thread-1) [n:127.0.0.1:46689_solr    ] o.a.s.c.c.ConnectionManager Waiting for client to connect to ZooKeeper
   [junit4]   2> 1028832 INFO  (jetty-launcher-682-thread-2) [n:127.0.0.1:45029_solr    ] o.a.s.c.ZkController Added new OnReconnect listener org.apache.solr.cloud.ZkController$6@5f0507
   [junit4]   2> 1028832 INFO  (zkCallback-692-thread-1-processing-n:127.0.0.1:46689_solr) [n:127.0.0.1:46689_solr    ] o.a.s.c.c.ConnectionManager Watcher org.apache.solr.common.cloud.ConnectionManager@1426080 name:ZooKeeperConnection Watcher:127.0.0.1:44308/solr got event WatchedEvent state:SyncConnected type:None path:null path:null type:None
   [junit4]   2> 1028832 INFO  (jetty-launcher-682-thread-1) [n:127.0.0.1:46689_solr    ] o.a.s.c.c.ConnectionManager Client is connected to ZooKeeper
   [junit4]   2> 1028832 INFO  (jetty-launcher-682-thread-2) [n:127.0.0.1:45029_solr    ] o.a.s.c.c.ConnectionManager Waiting for client to connect to ZooKeeper
   [junit4]   2> 1028834 INFO  (jetty-launcher-682-thread-1) [n:127.0.0.1:46689_solr    ] o.a.s.c.c.SolrZkClient makePath: /overseer/queue
   [junit4]   2> 1028834 INFO  (zkCallback-693-thread-1-processing-n:127.0.0.1:45029_solr) [n:127.0.0.1:45029_solr    ] o.a.s.c.c.ConnectionManager Watcher org.apache.solr.common.cloud.ConnectionManager@1d7bb99 name:ZooKeeperConnection Watcher:127.0.0.1:44308/solr got event WatchedEvent state:SyncConnected type:None path:null path:null type:None
   [junit4]   2> 1028834 INFO  (jetty-launcher-682-thread-2) [n:127.0.0.1:45029_solr    ] o.a.s.c.c.ConnectionManager Client is connected to ZooKeeper
   [junit4]   2> 1028834 INFO  (jetty-launcher-682-thread-2) [n:127.0.0.1:45029_solr    ] o.a.s.c.c.SolrZkClient makePath: /overseer/collection-queue-work
   [junit4]   2> 1028834 INFO  (jetty-launcher-682-thread-1) [n:127.0.0.1:46689_solr    ] o.a.s.c.c.SolrZkClient makePath: /overseer/collection-queue-work
   [junit4]   2> 1028839 INFO  (jetty-launcher-682-thread-2) [n:127.0.0.1:45029_solr    ] o.a.s.c.c.SolrZkClient makePath: /overseer/collection-map-running
   [junit4]   2> 1028839 INFO  (jetty-launcher-682-thread-1) [n:127.0.0.1:46689_solr    ] o.a.s.c.c.SolrZkClient makePath: /overseer/collection-map-running
   [junit4]   2> 1028840 INFO  (jetty-launcher-682-thread-2) [n:127.0.0.1:45029_solr    ] o.a.s.c.c.SolrZkClient makePath: /overseer/collection-map-completed
   [junit4]   2> 1028840 INFO  (jetty-launcher-682-thread-1) [n:127.0.0.1:46689_solr    ] o.a.s.c.c.SolrZkClient makePath: /overseer/collection-map-completed
   [junit4]   2> 1028841 INFO  (jetty-launcher-682-thread-1) [n:127.0.0.1:46689_solr    ] o.a.s.c.c.SolrZkClient makePath: /overseer/collection-map-failure
   [junit4]   2> 1028841 INFO  (jetty-launcher-682-thread-2) [n:127.0.0.1:45029_solr    ] o.a.s.c.c.SolrZkClient makePath: /overseer/collection-map-failure
   [junit4]   2> 1028842 INFO  (jetty-launcher-682-thread-2) [n:127.0.0.1:45029_solr    ] o.a.s.c.c.SolrZkClient makePath: /live_nodes
   [junit4]   2> 1028842 INFO  (jetty-launcher-682-thread-1) [n:127.0.0.1:46689_solr    ] o.a.s.c.c.SolrZkClient makePath: /live_nodes
   [junit4]   2> 1028842 INFO  (jetty-launcher-682-thread-2) [n:127.0.0.1:45029_solr    ] o.a.s.c.c.SolrZkClient makePath: /collections
   [junit4]   2> 1028842 INFO  (jetty-launcher-682-thread-1) [n:127.0.0.1:46689_solr    ] o.a.s.c.c.SolrZkClient makePath: /collections
   [junit4]   2> 1028843 INFO  (jetty-launcher-682-thread-2) [n:127.0.0.1:45029_solr    ] o.a.s.c.c.SolrZkClient makePath: /aliases.json
   [junit4]   2> 1028843 INFO  (jetty-launcher-682-thread-1) [n:127.0.0.1:46689_solr    ] o.a.s.c.c.SolrZkClient makePath: /aliases.json
   [junit4]   2> 1028843 INFO  (jetty-launcher-682-thread-2) [n:127.0.0.1:45029_solr    ] o.a.s.c.c.SolrZkClient makePath: /clusterstate.json
   [junit4]   2> 1028843 INFO  (jetty-launcher-682-thread-1) [n:127.0.0.1:46689_solr    ] o.a.s.c.c.SolrZkClient makePath: /clusterstate.json
   [junit4]   2> 1028844 INFO  (jetty-launcher-682-thread-1) [n:127.0.0.1:46689_solr    ] o.a.s.c.c.SolrZkClient makePath: /security.json
   [junit4]   2> 1028844 INFO  (jetty-launcher-682-thread-2) [n:127.0.0.1:45029_solr    ] o.a.s.c.c.SolrZkClient makePath: /security.json
   [junit4]   2> 1028844 INFO  (jetty-launcher-682-thread-1) [n:127.0.0.1:46689_solr    ] o.a.s.c.ZkController Register node as live in ZooKeeper:/live_nodes/127.0.0.1:46689_solr
   [junit4]   2> 1028844 INFO  (jetty-launcher-682-thread-2) [n:127.0.0.1:45029_solr    ] o.a.s.c.ZkController Register node as live in ZooKeeper:/live_nodes/127.0.0.1:45029_solr
   [junit4]   2> 1028844 INFO  (jetty-launcher-682-thread-1) [n:127.0.0.1:46689_solr    ] o.a.s.c.c.SolrZkClient makePath: /live_nodes/127.0.0.1:46689_solr
   [junit4]   2> 1028845 INFO  (jetty-launcher-682-thread-2) [n:127.0.0.1:45029_solr    ] o.a.s.c.c.SolrZkClient makePath: /live_nodes/127.0.0.1:45029_solr
   [junit4]   2> 1028846 INFO  (jetty-launcher-682-thread-1) [n:127.0.0.1:46689_solr    ] o.a.s.c.c.SolrZkClient makePath: /overseer_elect
   [junit4]   2> 1028847 INFO  (jetty-launcher-682-thread-1) [n:127.0.0.1:46689_solr    ] o.a.s.c.c.SolrZkClient makePath: /overseer_elect/election
   [junit4]   2> 1028847 INFO  (jetty-launcher-682-thread-2) [n:127.0.0.1:45029_solr    ] o.a.s.c.c.SolrZkClient makePath: /overseer_elect/election
   [junit4]   2> 1028847 INFO  (jetty-launcher-682-thread-1) [n:127.0.0.1:46689_solr    ] o.a.s.c.Overseer Overseer (id=null) closing
   [junit4]   2> 1028847 INFO  (jetty-launcher-682-thread-2) [n:127.0.0.1:45029_solr    ] o.a.s.c.Overseer Overseer (id=null) closing
   [junit4]   2> 1028848 INFO  (jetty-launcher-682-thread-1) [n:127.0.0.1:46689_solr    ] o.a.s.c.LeaderElector Joined leadership election with path: /overseer_elect/election/96101986433761285-127.0.0.1:46689_solr-n_0000000000
   [junit4]   2> 1028848 INFO  (jetty-launcher-682-thread-2) [n:127.0.0.1:45029_solr    ] o.a.s.c.LeaderElector Joined leadership election with path: /overseer_elect/election/96101986433761286-127.0.0.1:45029_solr-n_0000000001
   [junit4]   2> 1028848 INFO  (jetty-launcher-682-thread-1) [n:127.0.0.1:46689_solr    ] o.a.s.c.OverseerElectionContext I am going to be the leader 127.0.0.1:46689_solr
   [junit4]   2> 1028848 INFO  (jetty-launcher-682-thread-1) [n:127.0.0.1:46689_solr    ] o.a.s.c.c.SolrZkClient makePath: /overseer_elect/leader
   [junit4]   2> 1028848 INFO  (jetty-launcher-682-thread-2) [n:127.0.0.1:45029_solr    ] o.a.s.c.LeaderElector Watching path /overseer_elect/election/96101986433761285-127.0.0.1:46689_solr-n_0000000000 to know if I could be the leader
   [junit4]   2> 1028849 INFO  (jetty-launcher-682-thread-2) [n:127.0.0.1:45029_solr    ] o.a.s.c.c.ZkStateReader Updating cluster state from ZooKeeper... 
   [junit4]   2> 1028849 INFO  (jetty-launcher-682-thread-1) [n:127.0.0.1:46689_solr    ] o.a.s.c.Overseer Overseer (id=96101986433761285-127.0.0.1:46689_solr-n_0000000000) starting
   [junit4]   2> 1028850 INFO  (jetty-launcher-682-thread-1) [n:127.0.0.1:46689_solr    ] o.a.s.c.c.SolrZkClient makePath: /overseer/queue-work
   [junit4]   2> 1028853 INFO  (jetty-launcher-682-thread-1) [n:127.0.0.1:46689_solr    ] o.a.s.c.OverseerAutoReplicaFailoverThread Starting OverseerAutoReplicaFailoverThread autoReplicaFailoverWorkLoopDelay=10000 autoReplicaFailoverWaitAfterExpiration=30000 autoReplicaFailoverBadNodeExpiration=60000
   [junit4]   2> 1028853 INFO  (jetty-launcher-682-thread-1) [n:127.0.0.1:46689_solr    ] o.a.s.c.c.ZkStateReader Updating cluster state from ZooKeeper... 
   [junit4]   2> 1028853 INFO  (OverseerCollectionConfigSetProcessor-96101986433761285-127.0.0.1:46689_solr-n_0000000000) [n:127.0.0.1:46689_solr    ] o.a.s.c.OverseerTaskProcessor Process current queue of overseer operations
   [junit4]   2> 1028854 INFO  (OverseerStateUpdate-96101986433761285-127.0.0.1:46689_solr-n_0000000000) [n:127.0.0.1:46689_solr    ] o.a.s.c.Overseer Starting to work on the main queue
   [junit4]   2> 1028876 INFO  (jetty-launcher-682-thread-2) [n:127.0.0.1:45029_solr    ] o.a.s.c.CoreContainer Security conf doesn't exist. Skipping setup for authorization module.
   [junit4]   2> 1028876 INFO  (jetty-launcher-682-thread-2) [n:127.0.0.1:45029_solr    ] o.a.s.c.CoreContainer No authentication plugin used.
   [junit4]   2> 1028877 INFO  (jetty-launcher-682-thread-1) [n:127.0.0.1:46689_solr    ] o.a.s.c.CoreContainer Security conf doesn't exist. Skipping setup for authorization module.
   [junit4]   2> 1028877 INFO  (jetty-launcher-682-thread-1) [n:127.0.0.1:46689_solr    ] o.a.s.c.CoreContainer No authentication plugin used.
   [junit4]   2> 1028877 INFO  (jetty-launcher-682-thread-2) [n:127.0.0.1:45029_solr    ] o.a.s.c.CorePropertiesLocator Looking for core definitions underneath /home/jenkins/workspace/Lucene-Solr-5.5-Linux/solr/build/solr-core/test/J0/temp/solr.schema.TestManagedSchemaAPI_A47C1AB04B5AF6F4-001/tempDir-001/node2/.
   [junit4]   2> 1028877 INFO  (jetty-launcher-682-thread-1) [n:127.0.0.1:46689_solr    ] o.a.s.c.CorePropertiesLocator Looking for core definitions underneath /home/jenkins/workspace/Lucene-Solr-5.5-Linux/solr/build/solr-core/test/J0/temp/solr.schema.TestManagedSchemaAPI_A47C1AB04B5AF6F4-001/tempDir-001/node1/.
   [junit4]   2> 1028877 INFO  (jetty-launcher-682-thread-2) [n:127.0.0.1:45029_solr    ] o.a.s.c.CorePropertiesLocator Found 0 core definitions
   [junit4]   2> 1028877 INFO  (jetty-launcher-682-thread-1) [n:127.0.0.1:46689_solr    ] o.a.s.c.CorePropertiesLocator Found 0 core definitions
   [junit4]   2> 1028878 INFO  (jetty-launcher-682-thread-1) [n:127.0.0.1:46689_solr    ] o.a.s.s.SolrDispatchFilter user.dir=/home/jenkins/workspace/Lucene-Solr-5.5-Linux/solr/build/solr-core/test/J0
   [junit4]   2> 1028878 INFO  (jetty-launcher-682-thread-1) [n:127.0.0.1:46689_solr    ] o.a.s.s.SolrDispatchFilter SolrDispatchFilter.init() done
   [junit4]   2> 1028878 INFO  (jetty-launcher-682-thread-2) [n:127.0.0.1:45029_solr    ] o.a.s.s.SolrDispatchFilter user.dir=/home/jenkins/workspace/Lucene-Solr-5.5-Linux/solr/build/solr-core/test/J0
   [junit4]   2> 1028878 INFO  (jetty-launcher-682-thread-2) [n:127.0.0.1:45029_solr    ] o.a.s.s.SolrDispatchFilter SolrDispatchFilter.init() done
   [junit4]   2> 1028878 INFO  (TEST-TestManagedSchemaAPI.test-seed#[A47C1AB04B5AF6F4]) [    ] o.a.s.c.c.SolrZkClient Using default ZkCredentialsProvider
   [junit4]   2> 1028878 INFO  (TEST-TestManagedSchemaAPI.test-seed#[A47C1AB04B5AF6F4]) [    ] o.a.s.c.c.ConnectionManager Waiting for client to connect to ZooKeeper
   [junit4]   2> 1028884 INFO  (zkCallback-694-thread-1) [    ] o.a.s.c.c.ConnectionManager Watcher org.apache.solr.common.cloud.ConnectionManager@1d85770 name:ZooKeeperConnection Watcher:127.0.0.1:44308 got event WatchedEvent state:SyncConnected type:None path:null path:null type:None
   [junit4]   2> 1028884 INFO  (TEST-TestManagedSchemaAPI.test-seed#[A47C1AB04B5AF6F4]) [    ] o.a.s.c.c.ConnectionManager Client is connected to ZooKeeper
   [junit4]   2> 1028884 INFO  (TEST-TestManagedSchemaAPI.test-seed#[A47C1AB04B5AF6F4]) [    ] o.a.s.c.c.SolrZkClient Using default ZkACLProvider
   [junit4]   2> 1028885 INFO  (TEST-TestManagedSchemaAPI.test-seed#[A47C1AB04B5AF6F4]) [    ] o.a.s.c.c.SolrZkClient Using default ZkCredentialsProvider
   [junit4]   2> 1028886 INFO  (TEST-TestManagedSchemaAPI.test-seed#[A47C1AB04B5AF6F4]) [    ] o.a.s.c.c.ConnectionManager Waiting for client to connect to ZooKeeper
   [junit4]   2> 1028886 INFO  (zkCallback-696-thread-1) [    ] o.a.s.c.c.ConnectionManager Watcher org.apache.solr.common.cloud.ConnectionManager@1f53ff7 name:ZooKeeperConnection Watcher:127.0.0.1:44308/solr got event WatchedEvent state:SyncConnected type:None path:null path:null type:None
   [junit4]   2> 1028886 INFO  (TEST-TestManagedSchemaAPI.test-seed#[A47C1AB04B5AF6F4]) [    ] o.a.s.c.c.ConnectionManager Client is connected to ZooKeeper
   [junit4]   2> 1028887 INFO  (TEST-TestManagedSchemaAPI.test-seed#[A47C1AB04B5AF6F4]) [    ] o.a.s.c.c.SolrZkClient Using default ZkACLProvider
   [junit4]   2> 1028887 INFO  (TEST-TestManagedSchemaAPI.test-seed#[A47C1AB04B5AF6F4]) [    ] o.a.s.c.c.SolrZkClient makePath: /configs/conf1/solrconfig.xml
   [junit4]   2> 1028888 INFO  (TEST-TestManagedSchemaAPI.test-seed#[A47C1AB04B5AF6F4]) [    ] o.a.s.c.c.SolrZkClient makePath: /configs/conf1/managed-schema
   [junit4]   2> 1028889 INFO  (TEST-TestManagedSchemaAPI.test-seed#[A47C1AB04B5AF6F4]) [    ] o.a.s.c.c.SolrZkClient Using default ZkCredentialsProvider
   [junit4]   2> 1028890 INFO  (TEST-TestManagedSchemaAPI.test-seed#[A47C1AB04B5AF6F4]) [    ] o.a.s.c.c.ConnectionManager Waiting for client to connect to ZooKeeper
   [junit4]   2> 1028890 INFO  (zkCallback-697-thread-1) [    ] o.a.s.c.c.ConnectionManager Watcher org.apache.solr.common.cloud.ConnectionManager@12e92d name:ZooKeeperConnection Watcher:127.0.0.1:44308/solr got event WatchedEvent state:SyncConnected type:None path:null path:null type:None
   [junit4]   2> 1028890 INFO  (TEST-TestManagedSchemaAPI.test-seed#[A47C1AB04B5AF6F4]) [    ] o.a.s.c.c.ConnectionManager Client is connected to ZooKeeper
   [junit4]   2> 1028891 INFO  (TEST-TestManagedSchemaAPI.test-seed#[A47C1AB04B5AF6F4]) [    ] o.a.s.c.c.SolrZkClient Using default ZkACLProvider
   [junit4]   2> 1028891 INFO  (TEST-TestManagedSchemaAPI.test-seed#[A47C1AB04B5AF6F4]) [    ] o.a.s.c.c.ZkStateReader Updating cluster state from ZooKeeper... 
   [junit4]   2> 1028895 INFO  (qtp6014922-5441) [n:127.0.0.1:46689_solr    ] o.a.s.h.a.CollectionsHandler Invoked Collection Action :create with params replicationFactor=2&collection.configName=conf1&name=testschemaapi&action=CREATE&numShards=1&wt=javabin&version=2 and sendToOCPQueue=true
   [junit4]   2> 1028897 INFO  (OverseerCollectionConfigSetProcessor-96101986433761285-127.0.0.1:46689_solr-n_0000000000) [n:127.0.0.1:46689_solr    ] o.a.s.c.OverseerTaskProcessor Overseer Collection Message Handler: Get the message id:/overseer/collection-queue-work/qn-0000000000 message:{
   [junit4]   2>   "name":"testschemaapi",
   [junit4]   2>   "fromApi":"true",
   [junit4]   2>   "replicationFactor":"2",
   [junit4]   2>   "collection.configName":"conf1",
   [junit4]   2>   "numShards":"1",
   [junit4]   2>   "stateFormat":"2",
   [junit4]   2>   "operation":"create"}
   [junit4]   2> 1028897 INFO  (OverseerThreadFactory-2519-thread-1-processing-n:127.0.0.1:46689_solr) [n:127.0.0.1:46689_solr    ] o.a.s.c.OverseerCollectionMessageHandler OverseerCollectionMessageHandler.processMessage : create , {
   [junit4]   2>   "name":"testschemaapi",
   [junit4]   2>   "fromApi":"true",
   [junit4]   2>   "replicationFactor":"2",
   [junit4]   2>   "collection.configName":"conf1",
   [junit4]   2>   "numShards":"1",
   [junit4]   2>   "stateFormat":"2",
   [junit4]   2>   "operation":"create"}
   [junit4]   2> 1028898 INFO  (OverseerThreadFactory-2519-thread-1-processing-n:127.0.0.1:46689_solr) [n:127.0.0.1:46689_solr    ] o.a.s.c.OverseerCollectionMessageHandler Create collection testschemaapi
   [junit4]   2> 1028898 INFO  (OverseerThreadFactory-2519-thread-1-processing-n:127.0.0.1:46689_solr) [n:127.0.0.1:46689_solr    ] o.a.s.c.OverseerCollectionMessageHandler creating collections conf node /collections/testschemaapi 
   [junit4]   2> 1028898 INFO  (OverseerThreadFactory-2519-thread-1-processing-n:127.0.0.1:46689_solr) [n:127.0.0.1:46689_solr    ] o.a.s.c.c.SolrZkClient makePath: /collections/testschemaapi
   [junit4]   2> 1028899 INFO  (zkCallback-693-thread-1-processing-n:127.0.0.1:45029_solr) [n:127.0.0.1:45029_solr    ] o.a.s.c.c.ZkStateReader A collections change: [WatchedEvent state:SyncConnected type:NodeChildrenChanged path:/collections], has occurred - updating...
   [junit4]   2> 1028899 INFO  (zkCallback-692-thread-1-processing-n:127.0.0.1:46689_solr) [n:127.0.0.1:46689_solr    ] o.a.s.c.c.ZkStateReader A collections change: [WatchedEvent state:SyncConnected type:NodeChildrenChanged path:/collections], has occurred - updating...
   [junit4]   2> 1028900 INFO  (zkCallback-697-thread-1) [    ] o.a.s.c.c.ZkStateReader A collections change: [WatchedEvent state:SyncConnected type:NodeChildrenChanged path:/collections], has occurred - updating...
   [junit4]   2> 1028901 INFO  (OverseerStateUpdate-96101986433761285-127.0.0.1:46689_solr-n_0000000000) [n:127.0.0.1:46689_solr    ] o.a.s.c.Overseer processMessage: queueSize: 1, message = {
   [junit4]   2>   "name":"testschemaapi",
   [junit4]   2>   "fromApi":"true",
   [junit4]   2>   "replicationFactor":"2",
   [junit4]   2>   "collection.configName":"conf1",
   [junit4]   2>   "numShards":"1",
   [junit4]   2>   "stateFormat":"2",
   [junit4]   2>   "operation":"create"} current state version: 0
   [junit4]   2> 1028901 INFO  (OverseerStateUpdate-96101986433761285-127.0.0.1:46689_solr-n_0000000000) [n:127.0.0.1:46689_solr    ] o.a.s.c.o.ClusterStateMutator building a new cName: testschemaapi
   [junit4]   2> 1028902 INFO  (OverseerStateUpdate-96101986433761285-127.0.0.1:46689_solr-n_0000000000) [n:127.0.0.1:46689_solr    ] o.a.s.c.o.ZkStateWriter going to create_collection /collections/testschemaapi/state.json
   [junit4]   2> 1029001 INFO  (OverseerThreadFactory-2519-thread-1-processing-n:127.0.0.1:46689_solr) [n:127.0.0.1:46689_solr    ] o.a.s.c.OverseerCollectionMessageHandler Creating SolrCores for new collection testschemaapi, shardNames [shard1] , replicationFactor : 2
   [junit4]   2> 1029001 INFO  (OverseerThreadFactory-2519-thread-1-processing-n:127.0.0.1:46689_solr) [n:127.0.0.1:46689_solr    ] o.a.s.c.OverseerCollectionMessageHandler Creating core testschemaapi_shard1_replica2 as part of shard shard1 of collection testschemaapi on 127.0.0.1:45029_solr
   [junit4]   2> 1029002 INFO  (OverseerThreadFactory-2519-thread-1-processing-n:127.0.0.1:46689_solr) [n:127.0.0.1:46689_solr    ] o.a.s.c.OverseerCollectionMessageHandler Creating core testschemaapi_shard1_replica1 as part of shard shard1 of collection testschemaapi on 127.0.0.1:46689_solr
   [junit4]   2> 1029004 INFO  (qtp6014922-5442) [n:127.0.0.1:46689_solr    ] o.a.s.h.a.CoreAdminOperation core create command qt=/admin/cores&collection.configName=conf1&name=testschemaapi_shard1_replica1&action=CREATE&numShards=1&collection=testschemaapi&shard=shard1&wt=javabin&version=2
   [junit4]   2> 1029004 INFO  (qtp6014922-5442) [n:127.0.0.1:46689_solr    ] o.a.s.c.CoreDescriptor Created CoreDescriptor: {name=testschemaapi_shard1_replica1, collection.configName=conf1, config=solrconfig.xml, transient=false, schema=schema.xml, loadOnStartup=true, configSetProperties=configsetprops.json, collection=testschemaapi, numShards=1, dataDir=data/, shard=shard1}
   [junit4]   2> 1029004 INFO  (qtp1065352-5436) [n:127.0.0.1:45029_solr    ] o.a.s.h.a.CoreAdminOperation core create command qt=/admin/cores&collection.configName=conf1&name=testschemaapi_shard1_replica2&action=CREATE&numShards=1&collection=testschemaapi&shard=shard1&wt=javabin&version=2
   [junit4]   2> 1029005 INFO  (qtp1065352-5436) [n:127.0.0.1:45029_solr    ] o.a.s.c.CoreDescriptor Created CoreDescriptor: {name=testschemaapi_shard1_replica2, collection.configName=conf1, config=solrconfig.xml, transient=false, schema=schema.xml, loadOnStartup=true, configSetProperties=configsetprops.json, collection=testschemaapi, numShards=1, dataDir=data/, shard=shard1}
   [junit4]   2> 1029005 INFO  (qtp6014922-5442) [n:127.0.0.1:46689_solr c:testschemaapi s:shard1  x:testschemaapi_shard1_replica1] o.a.s.c.ZkController publishing state=down
   [junit4]   2> 1029006 INFO  (qtp1065352-5436) [n:127.0.0.1:45029_solr c:testschemaapi s:shard1  x:testschemaapi_shard1_replica2] o.a.s.c.ZkController publishing state=down
   [junit4]   2> 1029006 INFO  (qtp6014922-5442) [n:127.0.0.1:46689_solr c:testschemaapi s:shard1  x:testschemaapi_shard1_replica1] o.a.s.c.ZkController Registering watch for collection testschemaapi
   [junit4]   2> 1029006 INFO  (qtp6014922-5442) [n:127.0.0.1:46689_solr c:testschemaapi s:shard1  x:testschemaapi_shard1_replica1] o.a.s.c.c.ZkStateReader addZkWatch [testschemaapi]
   [junit4]   2> 1029006 INFO  (OverseerStateUpdate-96101986433761285-127.0.0.1:46689_solr-n_0000000000) [n:127.0.0.1:46689_solr    ] o.a.s.c.Overseer processMessage: queueSize: 1, message = {
   [junit4]   2>   "core":"testschemaapi_shard1_replica1",
   [junit4]   2>   "roles":null,
   [junit4]   2>   "base_url":"http://127.0.0.1:46689/solr",
   [junit4]   2>   "node_name":"127.0.0.1:46689_solr",
   [junit4]   2>   "numShards":"1",
   [junit4]   2>   "state":"down",
   [junit4]   2>   "shard":"shard1",
   [junit4]   2>   "collection":"testschemaapi",
   [junit4]   2>   "operation":"state"} current state version: 0
   [junit4]   2> 1029006 INFO  (qtp6014922-5442) [n:127.0.0.1:46689_solr c:testschemaapi s:shard1  x:testschemaapi_shard1_replica1] o.a.s.c.c.ZkStateReader Add data for [testschemaapi] ver [0]
   [junit4]   2> 1029006 INFO  (qtp6014922-5442) [n:127.0.0.1:46689_solr c:testschemaapi s:shard1  x:testschemaapi_shard1_replica1] o.a.s.c.ZkController look for our core node name
   [junit4]   2> 1029006 INFO  (OverseerStateUpdate-96101986433761285-127.0.0.1:46689_solr-n_0000000000) [n:127.0.0.1:46689_solr    ] o.a.s.c.o.ReplicaMutator Update state numShards=1 message={
   [junit4]   2>   "core":"testschemaapi_shard1_replica1",
   [junit4]   2>   "roles":null,
   [junit4]   2>   "base_url":"http://127.0.0.1:46689/solr",
   [junit4]   2>   "node_name":"127.0.0.1:46689_solr",
   [junit4]   2>   "numShards":"1",
   [junit4]   2>   "state":"down",
   [junit4]   2>   "shard":"shard1",
   [junit4]   2>   "collection":"testschemaapi",
   [junit4]   2>   "operation":"state"}
   [junit4]   2> 1029006 INFO  (qtp1065352-5436) [n:127.0.0.1:45029_solr c:testschemaapi s:shard1  x:testschemaapi_shard1_replica2] o.a.s.c.ZkController Registering watch for collection testschemaapi
   [junit4]   2> 1029006 INFO  (qtp1065352-5436) [n:127.0.0.1:45029_solr c:testschemaapi s:shard1  x:testschemaapi_shard1_replica2] o.a.s.c.c.ZkStateReader addZkWatch [testschemaapi]
   [junit4]   2> 1029007 INFO  (qtp1065352-5436) [n:127.0.0.1:45029_solr c:testschemaapi s:shard1  x:testschemaapi_shard1_replica2] o.a.s.c.c.ZkStateReader Add data for [testschemaapi] ver [0]
   [junit4]   2> 1029007 INFO  (qtp1065352-5436) [n:127.0.0.1:45029_solr c:testschemaapi s:shard1  x:testschemaapi_shard1_replica2] o.a.s.c.ZkController look for our core node name
   [junit4]   2> 1029007 INFO  (OverseerStateUpdate-96101986433761285-127.0.0.1:46689_solr-n_0000000000) [n:127.0.0.1:46689_solr    ] o.a.s.c.Overseer processMessage: queueSize: 2, message = {
   [junit4]   2>   "core":"testschemaapi_shard1_replica2",
   [junit4]   2>   "roles":null,
   [junit4]   2>   "base_url":"http://127.0.0.1:45029/solr",
   [junit4]   2>   "node_name":"127.0.0.1:45029_solr",
   [junit4]   2>   "numShards":"1",
   [junit4]   2>   "state":"down",
   [junit4]   2>   "shard":"shard1",
   [junit4]   2>   "collection":"testschemaapi",
   [junit4]   2>   "operation":"state"} current state version: 0
   [junit4]   2> 1029007 INFO  (OverseerStateUpdate-96101986433761285-127.0.0.1:46689_solr-n_0000000000) [n:127.0.0.1:46689_solr    ] o.a.s.c.o.ReplicaMutator Update state numShards=1 message={
   [junit4]   2>   "core":"testschemaapi_shard1_replica2",
   [junit4]   2>   "roles":null,
   [junit4]   2>   "base_url":"http://127.0.0.1:45029/solr",
   [junit4]   2>   "node_name":"127.0.0.1:45029_solr",
   [junit4]   2>   "numShards":"1",
   [junit4]   2>   "state":"down",
   [junit4]   2>   "shard":"shard1",
   [junit4]   2>   "collection":"testschemaapi",
   [junit4]   2>   "operation":"state"}
   [junit4]   2> 1029108 INFO  (OverseerStateUpdate-96101986433761285-127.0.0.1:46689_solr-n_0000000000) [n:127.0.0.1:46689_solr    ] o.a.s.c.o.ZkStateWriter going to update_collection /collections/testschemaapi/state.json version: 0
   [junit4]   2> 1029109 INFO  (zkCallback-692-thread-1-processing-n:127.0.0.1:46689_solr) [n:127.0.0.1:46689_solr    ] o.a.s.c.c.ZkStateReader A cluster state change: [WatchedEvent state:SyncConnected type:NodeDataChanged path:/collections/testschemaapi/state.json] for collection [testschemaapi] has occurred - updating... (live nodes size: [2])
   [junit4]   2> 1029109 INFO  (zkCallback-693-thread-1-processing-n:127.0.0.1:45029_solr) [n:127.0.0.1:45029_solr    ] o.a.s.c.c.ZkStateReader A cluster state change: [WatchedEvent state:SyncConnected type:NodeDataChanged path:/collections/testschemaapi/state.json] for collection [testschemaapi] has occurred - updating... (live nodes size: [2])
   [junit4]   2> 1029109 INFO  (zkCallback-692-thread-1-processing-n:127.0.0.1:46689_solr) [n:127.0.0.1:46689_solr    ] o.a.s.c.c.ZkStateReader Updating data for [testschemaapi] from [0] to [1]
   [junit4]   2> 1029109 INFO  (zkCallback-693-thread-1-processing-n:127.0.0.1:45029_solr) [n:127.0.0.1:45029_solr    ] o.a.s.c.c.ZkStateReader Updating data for [testschemaapi] from [0] to [1]
   [junit4]   2> 1030006 INFO  (qtp6014922-5442) [n:127.0.0.1:46689_solr c:testschemaapi s:shard1  x:testschemaapi_shard1_replica1] o.a.s.c.ZkController waiting to find shard id in clusterstate for testschemaapi_shard1_replica1
   [junit4]   2> 1030006 INFO  (qtp6014922-5442) [n:127.0.0.1:46689_solr c:testschemaapi s:shard1  x:testschemaapi_shard1_replica1] o.a.s.c.ZkController Check for collection zkNode:testschemaapi
   [junit4]   2> 1030006 INFO  (qtp6014922-5442) [n:127.0.0.1:46689_solr c:testschemaapi s:shard1  x:testschemaapi_shard1_replica1] o.a.s.c.ZkController Collection zkNode exists
   [junit4]   2> 1030006 INFO  (qtp6014922-5442) [n:127.0.0.1:46689_solr c:testschemaapi s:shard1  x:testschemaapi_shard1_replica1] o.a.s.c.c.ZkStateReader Load collection config from: [/collections/testschemaapi]
   [junit4]   2> 1030007 INFO  (qtp6014922-5442) [n:127.0.0.1:46689_solr c:testschemaapi s:shard1  x:testschemaapi_shard1_replica1] o.a.s.c.c.ZkStateReader path=[/collections/testschemaapi] [configName]=[conf1] specified config exists in ZooKeeper
   [junit4]   2> 1030007 INFO  (qtp6014922-5442) [n:127.0.0.1:46689_solr c:testschemaapi s:shard1  x:testschemaapi_shard1_replica1] o.a.s.c.SolrResourceLoader new SolrResourceLoader for directory: '/home/jenkins/workspace/Lucene-Solr-5.5-Linux/solr/build/solr-core/test/J0/temp/solr.schema.TestManagedSchemaAPI_A47C1AB04B5AF6F4-001/tempDir-001/node1/testschemaapi_shard1_replica1'
   [junit4]   2> 1030007 INFO  (qtp1065352-5436) [n:127.0.0.1:45029_solr c:testschemaapi s:shard1  x:testschemaapi_shard1_replica2] o.a.s.c.ZkController waiting to find shard id in clusterstate for testschemaapi_shard1_replica2
   [junit4]   2> 1030007 INFO  (qtp1065352-5436) [n:127.0.0.1:45029_solr c:testschemaapi s:shard1  x:testschemaapi_shard1_replica2] o.a.s.c.ZkController Check for collection zkNode:testschemaapi
   [junit4]   2> 1030007 INFO  (qtp6014922-5442) [n:127.0.0.1:46689_solr c:testschemaapi s:shard1  x:testschemaapi_shard1_replica1] o.a.s.c.SolrResourceLoader JNDI not configured for solr (NoInitialContextEx)
   [junit4]   2> 1030007 INFO  (qtp6014922-5442) [n:127.0.0.1:46689_solr c:testschemaapi s:shard1  x:testschemaapi_shard1_replica1] o.a.s.c.SolrResourceLoader solr home defaulted to 'solr/' (could not find system property or JNDI)
   [junit4]   2> 1030007 INFO  (qtp1065352-5436) [n:127.0.0.1:45029_solr c:testschemaapi s:shard1  x:testschemaapi_shard1_replica2] o.a.s.c.ZkController Collection zkNode exists
   [junit4]   2> 1030007 INFO  (qtp1065352-5436) [n:127.0.0.1:45029_solr c:testschemaapi s:shard1  x:testschemaapi_shard1_replica2] o.a.s.c.c.ZkStateReader Load collection config from: [/collections/testschemaapi]
   [junit4]   2> 1030007 INFO  (qtp1065352-5436) [n:127.0.0.1:45029_solr c:testschemaapi s:shard1  x:testschemaapi_shard1_replica2] o.a.s.c.c.ZkStateReader path=[/collections/testschemaapi] [configName]=[conf1] specified config exists in ZooKeeper
   [junit4]   2> 1030007 INFO  (qtp1065352-5436) [n:127.0.0.1:45029_solr c:testschemaapi s:shard1  x:testschemaapi_shard1_replica2] o.a.s.c.SolrResourceLoader new SolrResourceLoader for directory: '/home/jenkins/workspace/Lucene-Solr-5.5-Linux/solr/build/solr-core/test/J0/temp/solr.schema.TestManagedSchemaAPI_A47C1AB04B5AF6F4-001/tempDir-001/node2/testschemaapi_shard1_replica2'
   [junit4]   2> 1030007 INFO  (qtp1065352-5436) [n:127.0.0.1:45029_solr c:testschemaapi s:shard1  x:testschemaapi_shard1_replica2] o.a.s.c.SolrResourceLoader JNDI not configured for solr (NoInitialContextEx)
   [junit4]   2> 1030007 INFO  (qtp1065352-5436) [n:127.0.0.1:45029_solr c:testschemaapi s:shard1  x:testschemaapi_shard1_replica2] o.a.s.c.SolrResourceLoader solr home defaulted to 'solr/' (could not find system property or JNDI)
   [junit4]   2> 1030008 INFO  (qtp6014922-5442) [n:127.0.0.1:46689_solr c:testschemaapi s:shard1  x:testschemaapi_shard1_replica1] o.a.s.c.Config loaded config solrconfig.xml with version 0 
   [junit4]   2> 1030008 INFO  (qtp1065352-5436) [n:127.0.0.1:45029_solr c:testschemaapi s:shard1  x:testschemaapi_shard1_replica2] o.a.s.c.Config loaded config solrconfig.xml with version 0 
   [junit4]   2> 1030011 INFO  (qtp6014922-5442) [n:127.0.0.1:46689_solr c:testschemaapi s:shard1  x:testschemaapi_shard1_replica1] o.a.s.c.SolrConfig current version of requestparams : -1
   [junit4]   2> 1030011 INFO  (qtp1065352-5436) [n:127.0.0.1:45029_solr c:testschemaapi s:shard1  x:testschemaapi_shard1_replica2] o.a.s.c.SolrConfig current version of requestparams : -1
   [junit4]   2> 1030018 INFO  (qtp6014922-5442) [n:127.0.0.1:46689_solr c:testschemaapi s:shard1  x:testschemaapi_shard1_replica1] o.a.s.c.SolrConfig Using Lucene MatchVersion: 5.5.2
   [junit4]   2> 1030018 INFO  (qtp1065352-5436) [n:127.0.0.1:45029_solr c:testschemaapi s:shard1  x:testschemaapi_shard1_replica2] o.a.s.c.SolrConfig Using Lucene MatchVersion: 5.5.2
   [junit4]   2> 1030025 INFO  (qtp1065352-5436) [n:127.0.0.1:45029_solr c:testschemaapi s:shard1  x:testschemaapi_shard1_replica2] o.a.s.c.SolrConfig Loaded SolrConfig: solrconfig.xml
   [junit4]   2> 1030048 INFO  (qtp6014922-5442) [n:127.0.0.1:46689_solr c:testschemaapi s:shard1  x:testschemaapi_shard1_replica1] o.a.s.c.SolrConfig Loaded SolrConfig: solrconfig.xml
   [junit4]   2> 1030055 INFO  (qtp6014922-5442) [n:127.0.0.1:46689_solr c:testschemaapi s:shard1  x:testschemaapi_shard1_replica1] o.a.s.s.IndexSchema [testschemaapi_shard1_replica1] Schema name=minimal
   [junit4]   2> 1030055 INFO  (qtp1065352-5436) [n:127.0.0.1:45029_solr c:testschemaapi s:shard1  x:testschemaapi_shard1_replica2] o.a.s.s.IndexSchema [testschemaapi_shard1_replica2] Schema name=minimal
   [junit4]   2> 1030058 INFO  (qtp6014922-5442) [n:127.0.0.1:46689_solr c:testschemaapi s:shard1  x:testschemaapi_shard1_replica1] o.a.s.s.IndexSchema unique key field: id
   [junit4]   2> 1030058 INFO  (qtp1065352-5436) [n:127.0.0.1:45029_solr c:testschemaapi s:shard1  x:testschemaapi_shard1_replica2] o.a.s.s.IndexSchema unique key field: id
   [junit4]   2> 1030059 INFO  (qtp6014922-5442) [n:127.0.0.1:46689_solr c:testschemaapi s:shard1  x:testschemaapi_shard1_replica1] o.a.s.c.ConfigSetProperties Did not find ConfigSet properties, assuming default properties: Can't find resource 'configsetprops.json' in classpath or '/configs/conf1', cwd=/home/jenkins/workspace/Lucene-Solr-5.5-Linux/solr/build/solr-core/test/J0
   [junit4]   2> 1030059 INFO  (qtp1065352-5436) [n:127.0.0.1:45029_solr c:testschemaapi s:shard1  x:testschemaapi_shard1_replica2] o.a.s.c.ConfigSetProperties Did not find ConfigSet properties, assuming default properties: Can't find resource 'configsetprops.json' in classpath or '/configs/conf1', cwd=/home/jenkins/workspace/Lucene-Solr-5.5-Linux/solr/build/solr-core/test/J0
   [junit4]   2> 1030059 INFO  (qtp6014922-5442) [n:127.0.0.1:46689_solr c:testschemaapi s:shard1  x:testschemaapi_shard1_replica1] o.a.s.c.CoreContainer Creating SolrCore 'testschemaapi_shard1_replica1' using configuration from collection testschemaapi
   [junit4]   2> 1030059 INFO  (qtp1065352-5436) [n:127.0.0.1:45029_solr c:testschemaapi s:shard1  x:testschemaapi_shard1_replica2] o.a.s.c.CoreContainer Creating SolrCore 'testschemaapi_shard1_replica2' using configuration from collection testschemaapi
   [junit4]   2> 1030059 INFO  (qtp6014922-5442) [n:127.0.0.1:46689_solr c:testschemaapi s:shard1 r:core_node1 x:testschemaapi_shard1_replica1] o.a.s.c.SolrCore org.apache.solr.core.MockDirectoryFactory
   [junit4]   2> 1030059 INFO  (qtp1065352-5436) [n:127.0.0.1:45029_solr c:testschemaapi s:shard1 r:core_node2 x:testschemaapi_shard1_replica2] o.a.s.c.SolrCore org.apache.solr.core.MockDirectoryFactory
   [junit4]   2> 1030059 INFO  (qtp6014922-5442) [n:127.0.0.1:46689_solr c:testschemaapi s:shard1 r:core_node1 x:testschemaapi_shard1_replica1] o.a.s.c.SolrCore [[testschemaapi_shard1_replica1] ] Opening new SolrCore at [/home/jenkins/workspace/Lucene-Solr-5.5-Linux/solr/build/solr-core/test/J0/temp/solr.schema.TestManagedSchemaAPI_A47C1AB04B5AF6F4-001/tempDir-001/node1/testschemaapi_shard1_replica1], dataDir=[/home/jenkins/workspace/Lucene-Solr-5.5-Linux/solr/build/solr-core/test/J0/temp/solr.schema.TestManagedSchemaAPI_A47C1AB04B5AF6F4-001/tempDir-001/node1/./testschemaapi_shard1_replica1/data/]
   [junit4]   2> 1030059 INFO  (qtp6014922-5442) [n:127.0.0.1:46689_solr c:testschemaapi s:shard1 r:core_node1 x:testschemaapi_shard1_replica1] o.a.s.c.SolrCore JMX monitoring not detected for core: testschemaapi_shard1_replica1
   [junit4]   2> 1030059 INFO  (qtp1065352-5436) [n:127.0.0.1:45029_solr c:testschemaapi s:shard1 r:core_node2 x:testschemaapi_shard1_replica2] o.a.s.c.SolrCore [[testschemaapi_shard1_replica2] ] Opening new SolrCore at [/home/jenkins/workspace/Lucene-Solr-5.5-Linux/solr/build/solr-core/test/J0/temp/solr.schema.TestManagedSchemaAPI_A47C1AB04B5AF6F4-001/tempDir-001/node2/testschemaapi_shard1_replica2], dataDir=[/home/jenkins/workspace/Lucene-Solr-5.5-Linux/solr/build/solr-core/test/J0/temp/solr.schema.TestManagedSchemaAPI_A47C1AB04B5AF6F4-001/tempDir-001/node2/./testschemaapi_shard1_replica2/data/]
   [junit4]   2> 1030059 INFO  (qtp1065352-5436) [n:127.0.0.1:45029_solr c:testschemaapi s:shard1 r:core_node2 x:testschemaapi_shard1_replica2] o.a.s.c.SolrCore JMX monitoring not detected for core: testschemaapi_shard1_replica2
   [junit4]   2> 1030060 INFO  (qtp6014922-5442) [n:127.0.0.1:46689_solr c:testschemaapi s:shard1 r:core_node1 x:testschemaapi_shard1_replica1] o.a.s.c.CachingDirectoryFactory return new directory for /home/jenkins/workspace/Lucene-Solr-5.5-Linux/solr/build/solr-core/test/J0/temp/solr.schema.TestManagedSchemaAPI_A47C1AB04B5AF6F4-001/tempDir-001/node1/./testschemaapi_shard1_replica1/data
   [junit4]   2> 1030060 INFO  (qtp6014922-5442) [n:127.0.0.1:46689_solr c:testschemaapi s:shard1 r:core_node1 x:testschemaapi_shard1_replica1] o.a.s.c.SolrCore New index directory detected: old=null new=/home/jenkins/workspace/Lucene-Solr-5.5-Linux/solr/build/solr-core/test/J0/temp/solr.schema.TestManagedSchemaAPI_A47C1AB04B5AF6F4-001/tempDir-001/node1/./testschemaapi_shard1_replica1/data/index/
   [junit4]   2> 1030060 WARN  (qtp6014922-5442) [n:127.0.0.1:46689_solr c:testschemaapi s:shard1 r:core_node1 x:testschemaapi_shard1_replica1] o.a.s.c.SolrCore [testschemaapi_shard1_replica1] Solr index directory '/home/jenkins/workspace/Lucene-Solr-5.5-Linux/solr/build/solr-core/test/J0/temp/solr.schema.TestManagedSchemaAPI_A47C1AB04B5AF6F4-001/tempDir-001/node1/./testschemaapi_shard1_replica1/data/index' doesn't exist. Creating new index...
   [junit4]   2> 1030060 INFO  (qtp1065352-5436) [n:127.0.0.1:45029_solr c:testschemaapi s:shard1 r:core_node2 x:testschemaapi_shard1_replica2] o.a.s.c.CachingDirectoryFactory return new directory for /home/jenkins/workspace/Lucene-Solr-5.5-Linux/solr/build/solr-core/test/J0/temp/solr.schema.TestManagedSchemaAPI_A47C1AB04B5AF6F4-001/tempDir-001/node2/./testschemaapi_shard1_replica2/data
   [junit4]   2> 1030061 INFO  (qtp1065352-5436) [n:127.0.0.1:45029_solr c:testschemaapi s:shard1 r:core_node2 x:testschemaapi_shard1_replica2] o.a.s.c.SolrCore New index directory detected: old=null new=/home/jenkins/workspace/Lucene-Solr-5.5-Linux/solr/build/solr-core/test/J0/temp/solr.schema.TestManagedSchemaAPI_A47C1AB04B5AF6F4-001/tempDir-001/node2/./testschemaapi_shard1_replica2/data/index/
   [junit4]   2> 1030061 WARN  (qtp1065352-5436) [n:127.0.0.1:45029_solr c:testschemaapi s:shard1 r:core_node2 x:testschemaapi_shard1_replica2] o.a.s.c.SolrCore [testschemaapi_shard1_replica2] Solr index directory '/home/jenkins/workspace/Lucene-Solr-5.5-Linux/solr/build/solr-core/test/J0/temp/solr.schema.TestManagedSchemaAPI_A47C1AB04B5AF6F4-001/tempDir-001/node2/./testschemaapi_shard1_replica2/data/index' doesn't exist. Creating new index...
   [junit4]   2> 1030061 INFO  (qtp6014922-5442) [n:127.0.0.1:46689_solr c:testschemaapi s:shard1 r:core_node1 x:testschemaapi_shard1_replica1] o.a.s.c.CachingDirectoryFactory return new directory for /home/jenkins/workspace/Lucene-Solr-5.5-Linux/solr/build/solr-core/test/J0/temp/solr.schema.TestManagedSchemaAPI_A47C1AB04B5AF6F4-001/tempDir-001/node1/./testschemaapi_shard1_replica1/data/index
   [junit4]   2> 1030061 INFO  (qtp1065352-5436) [n:127.0.0.1:45029_solr c:testschemaapi s:shard1 r:core_node2 x:testschemaapi_shard1_replica2] o.a.s.c.CachingDirectoryFactory return new directory for /home/jenkins/workspace/Lucene-Solr-5.5-Linux/solr/build/solr-core/test/J0/temp/solr.schema.TestManagedSchemaAPI_A47C1AB04B5AF6F4-001/tempDir-001/node2/./testschemaapi_shard1_replica2/data/index
   [junit4]   2> 1030062 INFO  (qtp6014922-5442) [n:127.0.0.1:46689_solr c:testschemaapi s:shard1 r:core_node1 x:testschemaapi_shard1_replica1] o.a.s.c.SolrDeletionPolicy SolrDeletionPolicy.onCommit: commits: num=1
   [junit4]   2> 	commit{dir=MockDirectoryWrapper(RAMDirectory@8a1cad lockFactory=org.apache.lucene.store.SingleInstanceLockFactory@14d0114),segFN=segments_1,generation=1}
   [junit4]   2> 1030062 INFO  (qtp6014922-5442) [n:127.0.0.1:46689_solr c:testschemaapi s:shard1 r:core_node1 x:testschemaapi_shard1_replica1] o.a.s.c.SolrDeletionPolicy newest commit generation = 1
   [junit4]   2> 1030062 INFO  (qtp1065352-5436) [n:127.0.0.1:45029_solr c:testschemaapi s:shard1 r:core_node2 x:testschemaapi_shard1_replica2] o.a.s.c.SolrDeletionPolicy SolrDeletionPolicy.onCommit: commits: num=1
   [junit4]   2> 	commit{dir=MockDirectoryWrapper(RAMDirectory@b0ba24 lockFactory=org.apache.lucene.store.SingleInstanceLockFactory@111e7f),segFN=segments_1,generation=1}
   [junit4]   2> 1030062 INFO  (qtp1065352-5436) [n:127.0.0.1:45029_solr c:testschemaapi s:shard1 r:core_node2 x:testschemaapi_shard1_replica2] o.a.s.c.SolrDeletionPolicy newest commit generation = 1
   [junit4]   2> 1030062 INFO  (OldIndexDirectoryCleanupThreadForCore-testschemaapi_shard1_replica1) [n:127.0.0.1:46689_solr c:testschemaapi s:shard1 r:core_node1 x:testschemaapi_shard1_replica1] o.a.s.c.SolrCore Looking for old index directories to cleanup for core testschemaapi_shard1_replica1 in /home/jenkins/workspace/Lucene-Solr-5.5-Linux/solr/build/solr-core/test/J0/temp/solr.schema.TestManagedSchemaAPI_A47C1AB04B5AF6F4-001/tempDir-001/node1/./testschemaapi_shard1_replica1/data/
   [junit4]   2> 1030062 WARN  (OldIndexDirectoryCleanupThreadForCore-testschemaapi_shard1_replica1) [n:127.0.0.1:46689_solr c:testschemaapi s:shard1 r:core_node1 x:testschemaapi_shard1_replica1] o.a.s.c.DirectoryFactory /home/jenkins/workspace/Lucene-Solr-5.5-Linux/solr/build/solr-core/test/J0/temp/solr.schema.TestManagedSchemaAPI_A47C1AB04B5AF6F4-001/tempDir-001/node1/./testschemaapi_shard1_replica1/data/ does not point to a valid data directory; skipping clean-up of old index directories.
   [junit4]   2> 1030063 INFO  (qtp6014922-5442) [n:127.0.0.1:46689_solr c:testschemaapi s:shard1 r:core_node1 x:testschemaapi_shard1_replica1] o.a.s.c.SolrCore no updateRequestProcessorChain defined as default, creating implicit default
   [junit4]   2> 1030064 INFO  (qtp6014922-5442) [n:127.0.0.1:46689_solr c:testschemaapi s:shard1 r:core_node1 x:testschemaapi_shard1_replica1] o.a.s.h.l.XMLLoader xsltCacheLifetimeSeconds=60
   [junit4]   2> 1030064 INFO  (qtp6014922-5442) [n:127.0.0.1:46689_solr c:testschemaapi s:shard1 r:core_node1 x:testschemaapi_shard1_replica1] o.a.s.h.l.XMLLoader xsltCacheLifetimeSeconds=60
   [junit4]   2> 1030065 INFO  (qtp6014922-5442) [n:127.0.0.1:46689_solr c:testschemaapi s:shard1 r:core_node1 x:testschemaapi_shard1_replica1] o.a.s.h.l.XMLLoader xsltCacheLifetimeSeconds=60
   [junit4]   2> 1030065 INFO  (qtp6014922-5442) [n:127.0.0.1:46689_solr c:testschemaapi s:shard1 r:core_node1 x:testschemaapi_shard1_replica1] o.a.s.h.l.XMLLoader xsltCacheLifetimeSeconds=60
   [junit4]   2> 1030066 INFO  (OldIndexDirectoryCleanupThreadForCore-testschemaapi_shard1_replica2) [n:127.0.0.1:45029_solr c:testschemaapi s:shard1 r:core_node2 x:testschemaapi_shard1_replica2] o.a.s.c.SolrCore Looking for old index directories to cleanup for core testschemaapi_shard1_replica2 in /home/jenkins/workspace/Lucene-Solr-5.5-Linux/solr/build/solr-core/test/J0/temp/solr.schema.TestManagedSchemaAPI_A47C1AB04B5AF6F4-001/tempDir-001/node2/./testschemaapi_shard1_replica2/data/
   [junit4]   2> 1030066 WARN  (OldIndexDirectoryCleanupThreadForCore-testschemaapi_shard1_replica2) [n:127.0.0.1:45029_solr c:testschemaapi s:shard1 r:core_node2 x:testschemaapi_shard1_replica2] o.a.s.c.DirectoryFactory /home/jenkins/workspace/Lucene-Solr-5.5-Linux/solr/build/solr-core/test/J0/temp/solr.schema.TestManagedSchemaAPI_A47C1AB04B5AF6F4-001/tempDir-001/node2/./testschemaapi_shard1_replica2/data/ does not point to a valid data directory; skipping clean-up of old index directories.
   [junit4]   2> 1030066 INFO  (qtp6014922-5442) [n:127.0.0.1:46689_solr c:testschemaapi s:shard1 r:core_node1 x:testschemaapi_shard1_replica1] o.a.s.c.RequestHandlers Registered paths: /admin/mbeans,/update/csv,/update/json/docs,/admin/luke,/select,/admin/segments,/get,/admin/system,/replication,/admin/properties,/config,/schema,/admin/plugins,/admin/logging,/update/json,/admin/threads,/admin/ping,/update,/admin/file
   [junit4]   2> 1030066 INFO  (qtp6014922-5442) [n:127.0.0.1:46689_solr c:testschemaapi s:shard1 r:core_node1 x:testschemaapi_shard1_replica1] o.a.s.c.SolrCore Using default statsCache cache: org.apache.solr.search.stats.LocalStatsCache
   [junit4]   2> 1030067 INFO  (qtp1065352-5436) [n:127.0.0.1:45029_solr c:testschemaapi s:shard1 r:core_node2 x:testschemaapi_shard1_replica2] o.a.s.c.SolrCore no updateRequestProcessorChain defined as default, creating implicit default
   [junit4]   2> 1030067 INFO  (qtp6014922-5442) [n:127.0.0.1:46689_solr c:testschemaapi s:shard1 r:core_node1 x:testschemaapi_shard1_replica1] o.a.s.u.UpdateHandler Using UpdateLog implementation: org.apache.solr.update.UpdateLog
   [junit4]   2> 1030067 INFO  (qtp6014922-5442) [n:127.0.0.1:46689_solr c:testschemaapi s:shard1 r:core_node1 x:testschemaapi_shard1_replica1] o.a.s.u.UpdateLog Initializing UpdateLog: dataDir=null defaultSyncLevel=FLUSH numRecordsToKeep=100 maxNumLogsToKeep=10 numVersionBuckets=65536
   [junit4]   2> 1030078 INFO  (qtp1065352-5436) [n:127.0.0.1:45029_solr c:testschemaapi s:shard1 r:core_node2 x:testschemaapi_shard1_replica2] o.a.s.h.l.XMLLoader xsltCacheLifetimeSeconds=60
   [junit4]   2> 1030079 INFO  (qtp6014922-5442) [n:127.0.0.1:46689_solr c:testschemaapi s:shard1 r:core_node1 x:testschemaapi_shard1_replica1] o.a.s.u.CommitTracker Hard AutoCommit: disabled
   [junit4]   2> 1030079 INFO  (qtp6014922-5442) [n:127.0.0.1:46689_solr c:testschemaapi s:shard1 r:core_node1 x:testschemaapi_shard1_replica1] o.a.s.u.CommitTracker Soft AutoCommit: disabled
   [junit4]   2> 1030079 INFO  (qtp6014922-5442) [n:127.0.0.1:46689_solr c:testschemaapi s:shard1 r:core_node1 x:testschemaapi_shard1_replica1] o.a.s.c.SolrDeletionPolicy SolrDeletionPolicy.onInit: commits: num=1
   [junit4]   2> 	commit{dir=MockDirectoryWrapper(RAMDirectory@8a1cad lockFactory=org.apache.lucene.store.SingleInstanceLockFactory@14d0114),segFN=segments_1,generation=1}
   [junit4]   2> 1030079 INFO  (qtp6014922-5442) [n:127.0.0.1:46689_solr c:testschemaapi s:shard1 r:core_node1 x:testschemaapi_shard1_replica1] o.a.s.c.SolrDeletionPolicy newest commit generation = 1
   [junit4]   2> 1030079 INFO  (qtp6014922-5442) [n:127.0.0.1:46689_solr c:testschemaapi s:shard1 r:core_node1 x:testschemaapi_shard1_replica1] o.a.s.s.SolrIndexSearcher Opening Searcher@3e7a45[testschemaapi_shard1_replica1] main
   [junit4]   2> 1030079 INFO  (qtp6014922-5442) [n:127.0.0.1:46689_solr c:testschemaapi s:shard1 r:core_node1 x:testschemaapi_shard1_replica1] o.a.s.c.c.ZkStateReader Load collection config from: [/collections/testschemaapi]
   [junit4]   2> 1030079 INFO  (qtp1065352-5436) [n:127.0.0.1:45029_solr c:testschemaapi s:shard1 r:core_node2 x:testschemaapi_shard1_replica2] o.a.s.h.l.XMLLoader xsltCacheLifetimeSeconds=60
   [junit4]   2> 1030080 INFO  (qtp1065352-5436) [n:127.0.0.1:45029_solr c:testschemaapi s:shard1 r:core_node2 x:testschemaapi_shard1_replica2] o.a.s.h.l.XMLLoader xsltCacheLifetimeSeconds=60
   [junit4]   2> 1030080 INFO  (qtp1065352-5436) [n:127.0.0.1:45029_solr c:testschemaapi s:shard1 r:core_node2 x:testschemaapi_shard1_replica2] o.a.s.h.l.XMLLoader xsltCacheLifetimeSeconds=60
   [junit4]   2> 1030082 INFO  (qtp1065352-5436) [n:127.0.0.1:45029_solr c:testschemaapi s:shard1 r:core_node2 x:testschemaapi_shard1_replica2] o.a.s.c.RequestHandlers Registered paths: /admin/mbeans,/update/csv,/update/json/docs,/admin/luke,/select,/admin/segments,/get,/admin/system,/replication,/admin/properties,/config,/schema,/admin/plugins,/admin/logging,/update/json,/admin/threads,/admin/ping,/update,/admin/file
   [junit4]   2> 1030084 INFO  (qtp6014922-5442) [n:127.0.0.1:46689_solr c:testschemaapi s:shard1 r:core_node1 x:testschemaapi_shard1_replica1] o.a.s.c.c.ZkStateReader path=[/collections/testschemaapi] [configName]=[conf1] specified config exists in ZooKeeper
   [junit4]   2> 1030085 INFO  (qtp6014922-5442) [n:127.0.0.1:46689_solr c:testschemaapi s:shard1 r:core_node1 x:testschemaapi_shard1_replica1] o.a.s.r.ManagedResourceStorage Setting up ZooKeeper-based storage for the RestManager with znodeBase: /configs/conf1
   [junit4]   2> 1030085 INFO  (qtp1065352-5436) [n:127.0.0.1:45029_solr c:testschemaapi s:shard1 r:core_node2 x:testschemaapi_shard1_replica2] o.a.s.c.SolrCore Using default statsCache cache: org.apache.solr.search.stats.LocalStatsCache
   [junit4]   2> 1030086 INFO  (qtp6014922-5442) [n:127.0.0.1:46689_solr c:testschemaapi s:shard1 r:core_node1 x:testschemaapi_shard1_replica1] o.a.s.r.ManagedResourceStorage Configured ZooKeeperStorageIO with znodeBase: /configs/conf1
   [junit4]   2> 1030086 INFO  (qtp6014922-5442) [n:127.0.0.1:46689_solr c:testschemaapi s:shard1 r:core_node1 x:testschemaapi_shard1_replica1] o.a.s.r.RestManager Initializing RestManager with initArgs: {}
   [junit4]   2> 1030086 INFO  (qtp6014922-5442) [n:127.0.0.1:46689_solr c:testschemaapi s:shard1 r:core_node1 x:testschemaapi_shard1_replica1] o.a.s.r.ManagedResourceStorage Reading _rest_managed.json using ZooKeeperStorageIO:path=/configs/conf1
   [junit4]   2> 1030086 INFO  (qtp1065352-5436) [n:127.0.0.1:45029_solr c:testschemaapi s:shard1 r:core_node2 x:testschemaapi_shard1_replica2] o.a.s.u.UpdateHandler Using UpdateLog implementation: org.apache.solr.update.UpdateLog
   [junit4]   2> 1030086 INFO  (qtp1065352-5436) [n:127.0.0.1:45029_solr c:testschemaapi s:shard1 r:core_node2 x:testschemaapi_shard1_replica2] o.a.s.u.UpdateLog Initializing UpdateLog: dataDir=null defaultSyncLevel=FLUSH numRecordsToKeep=100 maxNumLogsToKeep=10 numVersionBuckets=65536
   [junit4]   2> 1030086 INFO  (qtp6014922-5442) [n:127.0.0.1:46689_solr c:testschemaapi s:shard1 r:core_node1 x:testschemaapi_shard1_replica1] o.a.s.r.ManagedResourceStorage No data found for znode /configs/conf1/_rest_managed.json
   [junit4]   2> 1030086 INFO  (qtp6014922-5442) [n:127.0.0.1:46689_solr c:testschemaapi s:shard1 r:core_node1 x:testschemaapi_shard1_replica1] o.a.s.r.ManagedResourceStorage Loaded null at path _rest_managed.json using ZooKeeperStorageIO:path=/configs/conf1
   [junit4]   2> 1030086 INFO  (qtp6014922-5442) [n:127.0.0.1:46689_solr c:testschemaapi s:shard1 r:core_node1 x:testschemaapi_shard1_replica1] o.a.s.r.RestManager Initializing 0 registered ManagedResources
   [junit4]   2> 1030087 INFO  (qtp1065352-5436) [n:127.0.0.1:45029_solr c:testschemaapi s:shard1 r:core_node2 x:testschemaapi_shard1_replica2] o.a.s.u.CommitTracker Hard AutoCommit: disabled
   [junit4]   2> 1030087 INFO  (qtp1065352-5436) [n:127.0.0.1:45029_solr c:testschemaapi s:shard1 r:core_node2 x:testschemaapi_shard1_replica2] o.a.s.u.CommitTracker Soft AutoCommit: disabled
   [junit4]   2> 1030087 INFO  (qtp1065352-5436) [n:127.0.0.1:45029_solr c:testschemaapi s:shard1 r:core_node2 x:testschemaapi_shard1_replica2] o.a.s.c.SolrDeletionPolicy SolrDeletionPolicy.onInit: commits: num=1
   [junit4]   2> 	commit{dir=MockDirectoryWrapper(RAMDirectory@b0ba24 lockFactory=org.apache.lucene.store.SingleInstanceLockFactory@111e7f),segFN=segments_1,generation=1}
   [junit4]   2> 1030087 INFO  (qtp1065352-5436) [n:127.0.0.1:45029_solr c:testschemaapi s:shard1 r:core_node2 x:testschemaapi_shard1_replica2] o.a.s.c.SolrDeletionPolicy newest commit generation = 1
   [junit4]   2> 1030087 INFO  (qtp1065352-5436) [n:127.0.0.1:45029_solr c:testschemaapi s:shard1 r:core_node2 x:testschemaapi_shard1_replica2] o.a.s.s.SolrIndexSearcher Opening Searcher@1dcc9f3[testschemaapi_shard1_replica2] main
   [junit4]   2> 1030087 INFO  (qtp1065352-5436) [n:127.0.0.1:45029_solr c:testschemaapi s:shard1 r:core_node2 x:testschemaapi_shard1_replica2] o.a.s.c.c.ZkStateReader Load collection config from: [/collections/testschemaapi]
   [junit4]   2> 1030088 INFO  (qtp6014922-5442) [n:127.0.0.1:46689_solr c:testschemaapi s:shard1 r:core_node1 x:testschemaapi_shard1_replica1] o.a.s.s.ZkIndexSchemaReader Creating ZooKeeper watch for the managed schema at /configs/conf1/managed-schema
   [junit4]   2> 1030089 INFO  (qtp6014922-5442) [n:127.0.0.1:46689_solr c:testschemaapi s:shard1 r:core_node1 x:testschemaapi_shard1_replica1] o.a.s.c.ZkController Added new OnReconnect listener ZkIndexSchemaReader: /configs/conf1/managed-schema, uniqueCoreId: testschemaapi_shard1_replica1:631682614378926
   [junit4]   2> 1030089 INFO  (qtp6014922-5442) [n:127.0.0.1:46689_solr c:testschemaapi s:shard1 r:core_node1 x:testschemaapi_shard1_replica1] o.a.s.h.ReplicationHandler Commits will be reserved for  10000
   [junit4]   2> 1030089 INFO  (searcherExecutor-2524-thread-1-processing-n:127.0.0.1:46689_solr x:testschemaapi_shard1_replica1 s:shard1 c:testschemaapi r:core_node1) [n:127.0.0.1:46689_solr c:testschemaapi s:shard1 r:core_node1 x:testschemaapi_shard1_replica1] o.a.s.c.SolrCore [testschemaapi_shard1_replica1] Registered new searcher Searcher@3e7a45[testschemaapi_shard1_replica1] main{ExitableDirectoryReader(UninvertingDirectoryReader())}
   [junit4]   2> 1030089 INFO  (qtp6014922-5442) [n:127.0.0.1:46689_solr c:testschemaapi s:shard1 r:core_node1 x:testschemaapi_shard1_replica1] o.a.s.u.UpdateLog Looking up max value of version field to seed version buckets
   [junit4]   2> 1030089 INFO  (qtp6014922-5442) [n:127.0.0.1:46689_solr c:testschemaapi s:shard1 r:core_node1 x:testschemaapi_shard1_replica1] o.a.s.u.VersionInfo Refreshing highest value of _version_ for 65536 version buckets from index
   [junit4]   2> 1030089 INFO  (qtp6014922-5442) [n:127.0.0.1:46689_solr c:testschemaapi s:shard1 r:core_node1 x:testschemaapi_shard1_replica1] o.a.s.u.VersionInfo No terms found for _version_, cannot seed version bucket highest value from index
   [junit4]   2> 1030089 INFO  (qtp6014922-5442) [n:127.0.0.1:46689_solr c:testschemaapi s:shard1 r:core_node1 x:testschemaapi_shard1_replica1] o.a.s.u.UpdateLog Could not find max version in index or recent updates, using new clock 1537631784383021056
   [junit4]   2> 1030091 INFO  (qtp6014922-5442) [n:127.0.0.1:46689_solr c:testschemaapi s:shard1 r:core_node1 x:testschemaapi_shard1_replica1] o.a.s.u.UpdateLog Took 1.0ms to seed version buckets with highest version 1537631784383021056
   [junit4]   2> 1030091 INFO  (qtp6014922-5442) [n:127.0.0.1:46689_solr c:testschemaapi s:shard1 r:core_node1 x:testschemaapi_shard1_replica1] o.a.s.c.ZkController watch zkdir /configs/conf1
   [junit4]   2> 1030091 INFO  (qtp1065352-5436) [n:127.0.0.1:45029_solr c:testschemaapi s:shard1 r:core_node2 x:testschemaapi_shard1_replica2] o.a.s.c.c.ZkStateReader path=[/collections/testschemaapi] [configName]=[conf1] specified config exists in ZooKeeper
   [junit4]   2> 1030091 INFO  (qtp1065352-5436) [n:127.0.0.1:45029_solr c:testschemaapi s:shard1 r:core_node2 x:testschemaapi_shard1_replica2] o.a.s.r.ManagedResourceStorage Setting up ZooKeeper-based storage for the RestManager with znodeBase: /configs/conf1
   [junit4]   2> 1030091 INFO  (qtp1065352-5436) [n:127.0.0.1:45029_solr c:testschemaapi s:shard1 r:core_node2 x:testschemaapi_shard1_replica2] o.a.s.r.ManagedResourceStorage Configured ZooKeeperStorageIO with znodeBase: /configs/conf1
   [junit4]   2> 1030091 INFO  (qtp6014922-5442) [n:127.0.0.1:46689_solr c:testschemaapi s:shard1 r:core_node1 x:testschemaapi_shard1_replica1] o.a.s.c.CoreContainer registering core: testschemaapi_shard1_replica1
   [junit4]   2> 1030091 INFO  (qtp1065352-5436) [n:127.0.0.1:45029_solr c:testschemaapi s:shard1 r:core_node2 x:testschemaapi_shard1_replica2] o.a.s.r.RestManager Initializing RestManager with initArgs: {}
   [junit4]   2> 1030091 INFO  (qtp6014922-5442) [n:127.0.0.1:46689_solr c:testschemaapi s:shard1 r:core_node1 x:testschemaapi_shard1_replica1] o.a.s.c.ZkController Register replica - core:testschemaapi_shard1_replica1 address:http://127.0.0.1:46689/solr collection:testschemaapi shard:shard1
   [junit4]   2> 1030091 INFO  (qtp1065352-5436) [n:127.0.0.1:45029_solr c:testschemaapi s:shard1 r:core_node2 x:testschemaapi_shard1_replica2] o.a.s.r.ManagedResourceStorage Reading _rest_managed.json using ZooKeeperStorageIO:path=/configs/conf1
   [junit4]   2> 1030091 INFO  (qtp1065352-5436) [n:127.0.0.1:45029_solr c:testschemaapi s:shard1 r:core_node2 x:testschemaapi_shard1_replica2] o.a.s.r.ManagedResourceStorage No data found for znode /configs/conf1/_rest_managed.json
   [junit4]   2> 1030091 INFO  (qtp1065352-5436) [n:127.0.0.1:45029_solr c:testschemaapi s:shard1 r:core_node2 x:testschemaapi_shard1_replica2] o.a.s.r.ManagedResourceStorage Loaded null at path _rest_managed.json using ZooKeeperStorageIO:path=/configs/conf1
   [junit4]   2> 1030091 INFO  (qtp6014922-5442) [n:127.0.0.1:46689_solr c:testschemaapi s:shard1 r:core_node1 x:testschemaapi_shard1_replica1] o.a.s.c.c.SolrZkClient makePath: /collections/testschemaapi/leader_elect/shard1/election
   [junit4]   2> 1030091 INFO  (qtp1065352-5436) [n:127.0.0.1:45029_solr c:testschemaapi s:shard1 r:core_node2 x:testschemaapi_shard1_replica2] o.a.s.r.RestManager Initializing 0 registered ManagedResources
   [junit4]   2> 1030091 INFO  (qtp1065352-5436) [n:127.0.0.1:45029_solr c:testschemaapi s:shard1 r:core_node2 x:testschemaapi_shard1_replica2] o.a.s.s.ZkIndexSchemaReader Creating ZooKeeper watch for the managed schema at /configs/conf1/managed-schema
   [junit4]   2> 1030092 INFO  (qtp1065352-5436) [n:127.0.0.1:45029_solr c:testschemaapi s:shard1 r:core_node2 x:testschemaapi_shard1_replica2] o.a.s.c.ZkController Added new OnReconnect listener ZkIndexSchemaReader: /configs/conf1/managed-schema, uniqueCoreId: testschemaapi_shard1_replica2:631682614430754
   [junit4]   2> 1030092 INFO  (qtp1065352-5436) [n:127.0.0.1:45029_solr c:testschemaapi s:shard1 r:core_node2 x:testschemaapi_shard1_replica2] o.a.s.h.ReplicationHandler Commits will be reserved for  10000
   [junit4]   2> 1030092 INFO  (searcherExecutor-2525-thread-1-processing-n:127.0.0.1:45029_solr x:testschemaapi_shard1_replica2 s:shard1 c:testschemaapi r:core_node2) [n:127.0.0.1:45029_solr c:testschemaapi s:shard1 r:core_node2 x:testschemaapi_shard1_replica2] o.a.s.c.SolrCore [testschemaapi_shard1_replica2] Registered new searcher Searcher@1dcc9f3[testschemaapi_shard1_replica2] main{ExitableDirectoryReader(UninvertingDirectoryReader())}
   [junit4]   2> 1030092 INFO  (qtp1065352-5436) [n:127.0.0.1:45029_solr c:testschemaapi s:shard1 r:core_node2 x:testschemaapi_shard1_replica2] o.a.s.u.UpdateLog Looking up max value of version field to seed version buckets
   [junit4]   2> 1030092 INFO  (qtp1065352-5436) [n:127.0.0.1:45029_solr c:testschemaapi s:shard1 r:core_node2 x:testschemaapi_shard1_replica2] o.a.s.u.VersionInfo Refreshing highest value of _version_ for 65536 version buckets from index
   [junit4]   2> 1030092 INFO  (qtp1065352-5436) [n:127.0.0.1:45029_solr c:testschemaapi s:shard1 r:core_node2 x:testschemaapi_shard1_replica2] o.a.s.u.VersionInfo No terms found for _version_, cannot seed version bucket highest value from index
   [junit4]   2> 1030092 INFO  (qtp1065352-5436) [n:127.0.0.1:45029_solr c:testschemaapi s:shard1 r:core_node2 x:testschemaapi_shard1_replica2] o.a.s.u.UpdateLog Could not find max version in index or recent updates, using new clock 1537631784386166784
   [junit4]   2> 1030093 INFO  (qtp6014922-5442) [n:127.0.0.1:46689_solr c:testschemaapi s:shard1 r:core_node1 x:testschemaapi_shard1_replica1] o.a.s.c.LeaderElector Joined leadership election with path: /collections/testschemaapi/leader_elect/shard1/election/96101986433761285-core_node1-n_0000000000
   [junit4]   2> 1030093 INFO  (qtp6014922-5442) [n:127.0.0.1:46689_solr c:testschemaapi s:shard1 r:core_node1 x:testschemaapi_shard1_replica1] o.a.s.c.ShardLeaderElectionContext Running the leader process for shard=shard1 and weAreReplacement=false and leaderVoteWait=10000
   [junit4]   2> 1030094 INFO  (qtp6014922-5442) [n:127.0.0.1:46689_solr c:testschemaapi s:shard1 r:core_node1 x:testschemaapi_shard1_replica1] o.a.s.c.ShardLeaderElectionContext Waiting until we see more replicas up for shard shard1: total=2 found=1 timeoutin=9999ms
   [junit4]   2> 1030094 INFO  (OverseerStateUpdate-96101986433761285-127.0.0.1:46689_solr-n_0000000000) [n:127.0.0.1:46689_solr    ] o.a.s.c.Overseer processMessage: queueSize: 1, message = {
   [junit4]   2>   "operation":"leader",
   [junit4]   2>   "shard":"shard1",
   [junit4]   2>   "collection":"testschemaapi"} current state version: 0
   [junit4]   2> 1030094 INFO  (qtp1065352-5436) [n:127.0.0.1:45029_solr c:testschemaapi s:shard1 r:core_node2 x:testschemaapi_shard1_replica2] o.a.s.u.UpdateLog Took 2.0ms to seed version buckets with highest version 1537631784386166784
   [junit4]   2> 1030095 INFO  (qtp1065352-5436) [n:127.0.0.1:45029_solr c:testschemaapi s:shard1 r:core_node2 x:testschemaapi_shard1_replica2] o.a.s.c.ZkController watch zkdir /configs/conf1
   [junit4]   2> 1030095 INFO  (qtp1065352-5436) [n:127.0.0.1:45029_solr c:testschemaapi s:shard1 r:core_node2 x:testschemaapi_shard1_replica2] o.a.s.c.CoreContainer registering core: testschemaapi_shard1_replica2
   [junit4]   2> 1030095 INFO  (qtp1065352-5436) [n:127.0.0.1:45029_solr c:testschemaapi s:shard1 r:core_node2 x:testschemaapi_shard1_replica2] o.a.s.c.ZkController Register replica - core:testschemaapi_shard1_replica2 address:http://127.0.0.1:45029/solr collection:testschemaapi shard:shard1
   [junit4]   2> 1030095 INFO  (qtp1065352-5436) [n:127.0.0.1:45029_solr c:testschemaapi s:shard1 r:core_node2 x:testschemaapi_shard1_replica2] o.a.s.c.LeaderElector Joined leadership election with path: /collections/testschemaapi/leader_elect/shard1/election/96101986433761286-core_node2-n_0000000001
   [junit4]   2> 1030096 INFO  (qtp1065352-5436) [n:127.0.0.1:45029_solr c:testschemaapi s:shard1 r:core_node2 x:testschemaapi_shard1_replica2] o.a.s.c.LeaderElector Watching path /collections/testschemaapi/leader_elect/shard1/election/96101986433761285-core_node1-n_0000000000 to know if I could be the leader
   [junit4]   2> 1030195 INFO  (OverseerStateUpdate-96101986433761285-127.0.0.1:46689_solr-n_0000000000) [n:127.0.0.1:46689_solr    ] o.a.s.c.o.ZkStateWriter going to update_collection /collections/testschemaapi/state.json version: 1
   [junit4]   2> 1030195 INFO  (zkCallback-693-thread-1-processing-n:127.0.0.1:45029_solr) [n:127.0.0.1:45029_solr    ] o.a.s.c.c.ZkStateReader A cluster state change: [WatchedEvent state:SyncConnected type:NodeDataChanged path:/collections/testschemaapi/state.json] for collection [testschemaapi] has occurred - updating... (live nodes size: [2])
   [junit4]   2> 1030195 INFO  (zkCallback-692-thread-2-processing-n:127.0.0.1:46689_solr) [n:127.0.0.1:46689_solr    ] o.a.s.c.c.ZkStateReader A cluster state change: [WatchedEvent state:SyncConnected type:NodeDataChanged path:/collections/testschemaapi/state.json] for collection [testschemaapi] has occurred - updating... (live nodes size: [2])
   [junit4]   2> 1030195 INFO  (zkCallback-693-thread-1-processing-n:127.0.0.1:45029_solr) [n:127.0.0.1:45029_solr    ] o.a.s.c.c.ZkStateReader Updating data for [testschemaapi] from [1] to [2]
   [junit4]   2> 1030196 INFO  (zkCallback-692-thread-2-processing-n:127.0.0.1:46689_solr) [n:127.0.0.1:46689_solr    ] o.a.s.c.c.ZkStateReader Updating data for [testschemaapi] from [1] to [2]
   [junit4]   2> 1030594 INFO  (qtp6014922-5442) [n:127.0.0.1:46689_solr c:testschemaapi s:shard1 r:core_node1 x:testschemaapi_shard1_replica1] o.a.s.c.ShardLeaderElectionContext Enough replicas found to continue.
   [junit4]   2> 1030594 INFO  (qtp6014922-5442) [n:127.0.0.1:46689_solr c:testschemaapi s:shard1 r:core_node1 x:testschemaapi_shard1_replica1] o.a.s.c.ShardLeaderElectionContext I may be the new leader - try and sync
   [junit4]   2> 1030594 INFO  (qtp6014922-5442) [n:127.0.0.1:46689_solr c:testschemaapi s:shard1 r:core_node1 x:testschemaapi_shard1_replica1] o.a.s.c.SyncStrategy Sync replicas to http://127.0.0.1:46689/solr/testschemaapi_shard1_replica1/
   [junit4]   2> 1030594 INFO  (qtp6014922-5442) [n:127.0.0.1:46689_solr c:testschemaapi s:shard1 r:core_node1 x:testschemaapi_shard1_replica1] o.a.s.u.PeerSync PeerSync: core=testschemaapi_shard1_replica1 url=http://127.0.0.1:46689/solr START replicas=[http://127.0.0.1:45029/solr/testschemaapi_shard1_replica2/] nUpdates=100
   [junit4]   2> 1030595 INFO  (qtp6014922-5442) [n:127.0.0.1:46689_solr c:testschemaapi s:shard1 r:core_node1 x:testschemaapi_shard1_replica1] o.a.s.u.PeerSync PeerSync: core=testschemaapi_shard1_replica1 url=http://127.0.0.1:46689/solr DONE.  We have no versions.  sync failed.
   [junit4]   2> 1030595 INFO  (qtp6014922-5442) [n:127.0.0.1:46689_solr c:testschemaapi s:shard1 r:core_node1 x:testschemaapi_shard1_replica1] o.a.s.c.SyncStrategy Leader's attempt to sync with shard failed, moving to the next candidate
   [junit4]   2> 1030595 INFO  (qtp6014922-5442) [n:127.0.0.1:46689_solr c:testschemaapi s:shard1 r:core_node1 x:testschemaapi_shard1_replica1] o.a.s.c.ShardLeaderElectionContext We failed sync, but we have no versions - we can't sync in that case - we were active before, so become leader anyway
   [junit4]   2> 1030596 INFO  (qtp6014922-5442) [n:127.0.0.1:46689_solr c:testschemaapi s:shard1 r:core_node1 x:testschemaapi_shard1_replica1] o.a.s.c.c.SolrZkClient makePath: /collections/testschemaapi/leaders/shard1
   [junit4]   2> 1030596 INFO  (qtp1065352-5438) [n:127.0.0.1:45029_solr c:testschemaapi s:shard1 r:core_node2 x:testschemaapi_shard1_replica2] o.a.s.c.S.Request [testschemaapi_shard1_replica2]  webapp=/solr path=/get params={distrib=false&qt=/get&fingerprint=false&getVersions=100&wt=javabin&version=2} status=0 QTime=0
   [junit4]   2> 1030597 INFO  (qtp6014922-5442) [n:127.0.0.1:46689_solr c:testschemaapi s:shard1 r:core_node1 x:testschemaapi_shard1_replica1] o.a.s.c.ShardLeaderElectionContextBase Creating leader registration node /collections/testschemaapi/leaders/shard1/leader after winning as /collections/testschemaapi/leader_elect/shard1/election/96101986433761285-core_node1-n_0000000000
   [junit4]   2> 1030598 INFO  (qtp6014922-5442) [n:127.0.0.1:46689_solr c:testschemaapi s:shard1 r:core_node1 x:testschemaapi_shard1_replica1] o.a.s.c.ShardLeaderElectionContext I am the new leader: http://127.0.0.1:46689/solr/testschemaapi_shard1_replica1/ shard1
   [junit4]   2> 1030598 INFO  (OverseerStateUpdate-96101986433761285-127.0.0.1:46689_solr-n_0000000000) [n:127.0.0.1:46689_solr    ] o.a.s.c.Overseer processMessage: queueSize: 1, message = {
   [junit4]   2>   "operation":"leader",
   [junit4]   2>   "shard":"shard1",
   [junit4]   2>   "collection":"testschemaapi",
   [junit4]   2>   "base_url":"http://127.0.0.1:46689/solr",
   [junit4]   2>   "core":"testschemaapi_shard1_replica1",
   [junit4]   2>   "state":"active"} current state version: 0
   [junit4]   2> 1030699 INFO  (OverseerStateUpdate-96101986433761285-127.0.0.1:46689_solr-n_0000000000) [n:127.0.0.1:46689_solr    ] o.a.s.c.o.ZkStateWriter going to update_collection /collections/testschemaapi/state.json version: 2
   [junit4]   2> 1030699 INFO  (zkCallback-693-thread-1-processing-n:127.0.0.1:45029_solr) [n:127.0.0.1:45029_solr    ] o.a.s.c.c.ZkStateReader A cluster state change: [WatchedEvent state:SyncConnected type:NodeDataChanged path:/collections/testschemaapi/state.json] for collection [testschemaapi] has occurred - updating... (live nodes size: [2])
   [junit4]   2> 1030699 INFO  (zkCallback-692-thread-1-processing-n:127.0.0.1:46689_solr) [n:127.0.0.1:46689_solr    ] o.a.s.c.c.ZkStateReader A cluster state change: [WatchedEvent state:SyncConnected type:NodeDataChanged path:/collections/testschemaapi/state.json] for collection [testschemaapi] has occurred - updating... (live nodes size: [2])
   [junit4]   2> 1030700 INFO  (zkCallback-692-thread-1-processing-n:127.0.0.1:46689_solr) [n:127.0.0.1:46689_solr    ] o.a.s.c.c.ZkStateReader Updating data for [testschemaapi] from [2] to [3]
   [junit4]   2> 1030700 INFO  (zkCallback-693-thread-1-processing-n:127.0.0.1:45029_solr) [n:127.0.0.1:45029_solr    ] o.a.s.c.c.ZkStateReader Updating data for [testschemaapi] from [2] to [3]
   [junit4]   2> 1030748 INFO  (qtp6014922-5442) [n:127.0.0.1:46689_solr c:testschemaapi s:shard1 r:core_node1 x:testschemaapi_shard1_replica1] o.a.s.c.ZkController We are http://127.0.0.1:46689/solr/testschemaapi_shard1_replica1/ and leader is http://127.0.0.1:46689/solr/testschemaapi_shard1_replica1/
   [junit4]   2> 1030748 INFO  (qtp6014922-5442) [n:127.0.0.1:46689_solr c:testschemaapi s:shard1 r:core_node1 x:testschemaapi_shard1_replica1] o.a.s.c.ZkController No LogReplay needed for core=testschemaapi_shard1_replica1 baseURL=http://127.0.0.1:46689/solr
   [junit4]   2> 1030749 INFO  (qtp6014922-5442) [n:127.0.0.1:46689_solr c:testschemaapi s:shard1 r:core_node1 x:testschemaapi_shard1_replica1] o.a.s.c.ZkController I am the leader, no recovery necessary
   [junit4]   2> 1030749 INFO  (qtp6014922-5442) [n:127.0.0.1:46689_solr c:testschemaapi s:shard1 r:core_node1 x:testschemaapi_shard1_replica1] o.a.s.c.ZkController publishing state=active
   [junit4]   2> 1030750 INFO  (OverseerStateUpdate-96101986433761285-127.0.0.1:46689_solr-n_0000000000) [n:127.0.0.1:46689_solr    ] o.a.s.c.Overseer processMessage: queueSize: 1, message = {
   [junit4]   2>   "core":"testschemaapi_shard1_replica1",
   [junit4]   2>   "core_node_name":"core_node1",
   [junit4]   2>   "roles":null,
   [junit4]   2>   "base_url":"http://127.0.0.1:46689/solr",
   [junit4]   2>   "node_name":"127.0.0.1:46689_solr",
   [junit4]   2>   "numShards":"1",
   [junit4]   2>   "state":"active",
   [junit4]   2>   "shard":"shard1",
   [junit4]   2>   "collection":"testschemaapi",
   [junit4]   2>   "operation":"state"} current state version: 0
   [junit4]   2> 1030750 INFO  (OverseerStateUpdate-96101986433761285-127.0.0.1:46689_solr-n_0000000000) [n:127.0.0.1:46689_solr    ] o.a.s.c.o.ReplicaMutator Update state numShards=1 message={
   [junit4]   2>   "core":"testschemaapi_shard1_replica1",
   [junit4]   2>   "core_node_name":"core_node1",
   [junit4]   2>   "roles":null,
   [junit4]   2>   "base_url":"http://127.0.0.1:46689/solr",
   [junit4]   2>   "node_name":"127.0.0.1:46689_solr",
   [junit4]   2>   "numShards":"1",
   [junit4]   2>   "state":"active",
   [junit4]   2>   "shard":"shard1",
   [junit4]   2>   "collection":"testschemaapi",
   [junit4]   2>   "operation":"state"}
   [junit4]   2> 1030750 INFO  (qtp6014922-5442) [n:127.0.0.1:46689_solr c:testschemaapi s:shard1 r:core_node1 x:testschemaapi_shard1_replica1] o.a.s.s.HttpSolrCall [admin] webapp=null path=/admin/cores params={qt=/admin/cores&collection.configName=conf1&name=testschemaapi_shard1_replica1&action=CREATE&numShards=1&collection=testschemaapi&shard=shard1&wt=javabin&version=2} status=0 QTime=1746
   [junit4]   2> 1030851 INFO  (OverseerStateUpdate-96101986433761285-127.0.0.1:46689_solr-n_0000000000) [n:127.0.0.1:46689_solr    ] o.a.s.c.o.ZkStateWriter going to update_collection /collections/testschemaapi/state.json version: 3
   [junit4]   2> 1030851 INFO  (zkCallback-692-thread-2-processing-n:127.0.0.1:46689_solr) [n:127.0.0.1:46689_solr    ] o.a.s.c.c.ZkStateReader A cluster state change: [WatchedEvent state:SyncConnected type:NodeDataChanged path:/collections/testschemaapi/state.json] for collection [testschemaapi] has occurred - updating... (live nodes size: [2])
   [junit4]   2> 1030851 INFO  (zkCallback-693-thread-1-processing-n:127.0.0.1:45029_solr) [n:127.0.0.1:45029_solr    ] o.a.s.c.c.ZkStateReader A cluster state change: [WatchedEvent state:SyncConnected type:NodeDataChanged path:/collections/testschemaapi/state.json] for collection [testschemaapi] has occurred - updating... (live nodes size: [2])
   [junit4]   2> 1030851 INFO  (zkCallback-692-thread-2-processing-n:127.0.0.1:46689_solr) [n:127.0.0.1:46689_solr    ] o.a.s.c.c.ZkStateReader Updating data for [testschemaapi] from [3] to [4]
   [junit4]   2> 1030851 INFO  (zkCallback-693-thread-1-processing-n:127.0.0.1:45029_solr) [n:127.0.0.1:45029_solr    ] o.a.s.c.c.ZkStateReader Updating data for [testschemaapi] from [3] to [4]
   [junit4]   2> 1031096 INFO  (qtp1065352-54

[...truncated too long message...]

t4]   2> 	2	/solr/collections/testschemaapi/state.json
   [junit4]   2> 
   [junit4]   2> Maximum concurrent children watches above limit:
   [junit4]   2> 
   [junit4]   2> 	10	/solr/overseer/queue
   [junit4]   2> 	9	/solr/overseer/collection-queue-work
   [junit4]   2> 	3	/solr/live_nodes
   [junit4]   2> 	3	/solr/collections
   [junit4]   2> 	3	/solr/overseer/queue-work
   [junit4]   2> 
   [junit4]   2> 1041931 INFO  (TEST-TestManagedSchemaAPI.test-seed#[A47C1AB04B5AF6F4]) [    ] o.a.s.SolrTestCaseJ4 ###Ending test
   [junit4]   2> NOTE: reproduce with: ant test  -Dtestcase=TestManagedSchemaAPI -Dtests.method=test -Dtests.seed=A47C1AB04B5AF6F4 -Dtests.multiplier=3 -Dtests.slow=true -Dtests.locale=hu-HU -Dtests.timezone=Africa/Blantyre -Dtests.asserts=true -Dtests.file.encoding=ISO-8859-1
   [junit4] ERROR   13.2s J0 | TestManagedSchemaAPI.test <<<
   [junit4]    > Throwable #1: org.apache.solr.client.solrj.impl.CloudSolrClient$RouteException: Error from server at http://127.0.0.1:46689/solr/testschemaapi_shard1_replica1: ERROR: [doc=2] unknown field 'myNewField1'
   [junit4]    > 	at __randomizedtesting.SeedInfo.seed([A47C1AB04B5AF6F4:2C28256AE5A69B0C]:0)
   [junit4]    > 	at org.apache.solr.client.solrj.impl.CloudSolrClient.directUpdate(CloudSolrClient.java:632)
   [junit4]    > 	at org.apache.solr.client.solrj.impl.CloudSolrClient.sendRequest(CloudSolrClient.java:981)
   [junit4]    > 	at org.apache.solr.client.solrj.impl.CloudSolrClient.requestWithRetryOnStaleState(CloudSolrClient.java:870)
   [junit4]    > 	at org.apache.solr.client.solrj.impl.CloudSolrClient.request(CloudSolrClient.java:806)
   [junit4]    > 	at org.apache.solr.schema.TestManagedSchemaAPI.testAddFieldAndDocument(TestManagedSchemaAPI.java:101)
   [junit4]    > 	at org.apache.solr.schema.TestManagedSchemaAPI.test(TestManagedSchemaAPI.java:69)
   [junit4]    > 	at java.lang.Thread.run(Thread.java:745)
   [junit4]    > Caused by: org.apache.solr.client.solrj.impl.HttpSolrClient$RemoteSolrException: Error from server at http://127.0.0.1:46689/solr/testschemaapi_shard1_replica1: ERROR: [doc=2] unknown field 'myNewField1'
   [junit4]    > 	at org.apache.solr.client.solrj.impl.HttpSolrClient.executeMethod(HttpSolrClient.java:577)
   [junit4]    > 	at org.apache.solr.client.solrj.impl.HttpSolrClient.request(HttpSolrClient.java:241)
   [junit4]    > 	at org.apache.solr.client.solrj.impl.HttpSolrClient.request(HttpSolrClient.java:230)
   [junit4]    > 	at org.apache.solr.client.solrj.impl.LBHttpSolrClient.doRequest(LBHttpSolrClient.java:372)
   [junit4]    > 	at org.apache.solr.client.solrj.impl.LBHttpSolrClient.request(LBHttpSolrClient.java:325)
   [junit4]    > 	at org.apache.solr.client.solrj.impl.CloudSolrClient$2.call(CloudSolrClient.java:607)
   [junit4]    > 	at org.apache.solr.client.solrj.impl.CloudSolrClient$2.call(CloudSolrClient.java:604)
   [junit4]    > 	at java.util.concurrent.FutureTask.run(FutureTask.java:266)
   [junit4]    > 	at org.apache.solr.common.util.ExecutorUtil$MDCAwareThreadPoolExecutor$1.run(ExecutorUtil.java:231)
   [junit4]    > 	at java.util.concurrent.ThreadPoolExecutor.runWorker(ThreadPoolExecutor.java:1142)
   [junit4]    > 	at java.util.concurrent.ThreadPoolExecutor$Worker.run(ThreadPoolExecutor.java:617)
   [junit4]    > 	... 1 more
   [junit4]   2> 1041934 INFO  (SUITE-TestManagedSchemaAPI-seed#[A47C1AB04B5AF6F4]-worker) [    ] o.a.s.SolrTestCaseJ4 ###deleteCore
   [junit4]   2> NOTE: leaving temporary files on disk at: /home/jenkins/workspace/Lucene-Solr-5.5-Linux/solr/build/solr-core/test/J0/temp/solr.schema.TestManagedSchemaAPI_A47C1AB04B5AF6F4-001
   [junit4]   2> Jun 20, 2016 5:19:12 AM com.carrotsearch.randomizedtesting.ThreadLeakControl checkThreadLeaks
   [junit4]   2> WARNING: Will linger awaiting termination of 2 leaked thread(s).
   [junit4]   2> 1050302 WARN  (Thread-2053) [n:127.0.0.1:46689_solr    ] o.a.s.c.ZkController listener throws error
   [junit4]   2> org.apache.solr.common.SolrException: Unable to reload core [testschemaapi_shard1_replica1]
   [junit4]   2> 	at org.apache.solr.core.CoreContainer.reload(CoreContainer.java:921)
   [junit4]   2> 	at org.apache.solr.core.SolrCore$11.run(SolrCore.java:2623)
   [junit4]   2> 	at org.apache.solr.cloud.ZkController$5.run(ZkController.java:2480)
   [junit4]   2> Caused by: org.apache.solr.common.SolrException: Could not load conf for core testschemaapi_shard1_replica1: Unable to load reader for ConfigSet properties: configsetprops.json
   [junit4]   2> 	at org.apache.solr.core.ConfigSetService.getConfig(ConfigSetService.java:86)
   [junit4]   2> 	at org.apache.solr.core.CoreContainer.reload(CoreContainer.java:914)
   [junit4]   2> 	... 2 more
   [junit4]   2> Caused by: org.apache.solr.common.SolrException: Unable to load reader for ConfigSet properties: configsetprops.json
   [junit4]   2> 	at org.apache.solr.core.ConfigSetProperties.readFromResourceLoader(ConfigSetProperties.java:57)
   [junit4]   2> 	at org.apache.solr.core.ConfigSetService.createConfigSetProperties(ConfigSetService.java:118)
   [junit4]   2> 	at org.apache.solr.core.ConfigSetService.getConfig(ConfigSetService.java:80)
   [junit4]   2> 	... 3 more
   [junit4]   2> Caused by: java.io.IOException: We re-tried 10 times but was still unable to fetch resource=configsetprops.json from ZK
   [junit4]   2> 	at org.apache.solr.cloud.ZkSolrResourceLoader.openResource(ZkSolrResourceLoader.java:116)
   [junit4]   2> 	at org.apache.solr.core.ConfigSetProperties.readFromResourceLoader(ConfigSetProperties.java:52)
   [junit4]   2> 	... 5 more
   [junit4]   2> Caused by: org.apache.zookeeper.KeeperException$SessionExpiredException: KeeperErrorCode = Session expired for /configs/conf1/configsetprops.json
   [junit4]   2> 	at org.apache.zookeeper.KeeperException.create(KeeperException.java:127)
   [junit4]   2> 	at org.apache.zookeeper.KeeperException.create(KeeperException.java:51)
   [junit4]   2> 	at org.apache.zookeeper.ZooKeeper.exists(ZooKeeper.java:1045)
   [junit4]   2> 	at org.apache.solr.common.cloud.SolrZkClient$5.execute(SolrZkClient.java:311)
   [junit4]   2> 	at org.apache.solr.common.cloud.SolrZkClient$5.execute(SolrZkClient.java:308)
   [junit4]   2> 	at org.apache.solr.common.cloud.ZkCmdExecutor.retryOperation(ZkCmdExecutor.java:60)
   [junit4]   2> 	at org.apache.solr.common.cloud.SolrZkClient.exists(SolrZkClient.java:308)
   [junit4]   2> 	at org.apache.solr.cloud.ZkController.pathExists(ZkController.java:839)
   [junit4]   2> 	at org.apache.solr.cloud.ZkSolrResourceLoader.openResource(ZkSolrResourceLoader.java:89)
   [junit4]   2> 	... 6 more
   [junit4]   2> NOTE: test params are: codec=HighCompressionCompressingStoredFields(storedFieldsFormat=CompressingStoredFieldsFormat(compressionMode=HIGH_COMPRESSION, chunkSize=5, maxDocsPerChunk=477, blockSize=272), termVectorsFormat=CompressingTermVectorsFormat(compressionMode=HIGH_COMPRESSION, chunkSize=5, blockSize=272)), sim=RandomSimilarity(queryNorm=false,coord=no): {}, locale=hu-HU, timezone=Africa/Blantyre
   [junit4]   2> NOTE: Linux 4.4.0-24-generic i386/Oracle Corporation 1.8.0_92 (32-bit)/cpus=12,threads=1,free=135270104,total=214745088
   [junit4]   2> NOTE: All tests run in this JVM: [OutputWriterTest, RemoteQueryErrorTest, TestFieldSortValues, TestDistributedSearch, TestSolr4Spatial2, BlockDirectoryTest, LeaderElectionIntegrationTest, TestSchemaResource, AsyncCallRequestStatusResponseTest, IgnoreCommitOptimizeUpdateProcessorFactoryTest, TestObjectReleaseTracker, TestLRUStatsCache, HdfsThreadLeakTest, TestFieldTypeResource, TestDocSet, ZkNodePropsTest, LeaderFailoverAfterPartitionTest, TestRandomFaceting, TestBinaryField, AtomicUpdatesTest, BasicDistributedZkTest, TestLeaderElectionZkExpiry, TestLazyCores, BlockJoinFacetSimpleTest, TestDistribDocBasedVersion, IndexSchemaTest, TestRemoteStreaming, HdfsDirectoryFactoryTest, TestShortCircuitedRequests, TestHdfsUpdateLog, TestDistribIDF, TestMergePolicyConfig, SystemInfoHandlerTest, DistributedDebugComponentTest, MigrateRouteKeyTest, TestFaceting, TestCloudPivotFacet, TestComponentsName, SortSpecParsingTest, CacheHeaderTest, TestValueSourceCache, RollingRestartTest, TestDefaultSearchFieldResource, TestSerializedLuceneMatchVersion, RAMDirectoryFactoryTest, OverseerStatusTest, PreAnalyzedFieldTest, TestFastOutputStream, DateFieldTest, EchoParamsTest, ReturnFieldsTest, CleanupOldIndexTest, DefaultValueUpdateProcessorTest, TestOverriddenPrefixQueryForCustomFieldType, StressHdfsTest, TestPerFieldSimilarityWithDefaultOverride, HdfsBasicDistributedZkTest, BJQParserTest, PolyFieldTest, ShardSplitTest, TestRandomDVFaceting, ResourceLoaderTest, UUIDFieldTest, TestManagedSchemaAPI]
   [junit4] Completed [261/573 (1!)] on J0 in 21.76s, 1 test, 1 error <<< FAILURES!

[...truncated 985 lines...]
BUILD FAILED
/home/jenkins/workspace/Lucene-Solr-5.5-Linux/build.xml:750: The following error occurred while executing this line:
/home/jenkins/workspace/Lucene-Solr-5.5-Linux/build.xml:694: The following error occurred while executing this line:
/home/jenkins/workspace/Lucene-Solr-5.5-Linux/build.xml:59: The following error occurred while executing this line:
/home/jenkins/workspace/Lucene-Solr-5.5-Linux/solr/build.xml:233: The following error occurred while executing this line:
/home/jenkins/workspace/Lucene-Solr-5.5-Linux/solr/common-build.xml:534: The following error occurred while executing this line:
/home/jenkins/workspace/Lucene-Solr-5.5-Linux/lucene/common-build.xml:1477: The following error occurred while executing this line:
/home/jenkins/workspace/Lucene-Solr-5.5-Linux/lucene/common-build.xml:1033: There were test failures: 573 suites (7 ignored), 2319 tests, 1 error, 84 ignored (39 assumptions) [seed: A47C1AB04B5AF6F4]

Total time: 59 minutes 17 seconds
Build step 'Invoke Ant' marked build as failure
Archiving artifacts
[WARNINGS] Skipping publisher since build result is FAILURE
Recording test results
Email was triggered for: Failure - Any
Sending email for trigger: Failure - Any



Mime
View raw message