lucene-dev mailing list archives

Site index · List index
Message view « Date » · « Thread »
Top « Date » · « Thread »
From Policeman Jenkins Server <jenk...@thetaphi.de>
Subject [JENKINS] Lucene-Solr-6.1-Linux (64bit/jdk1.8.0_92) - Build # 32 - Failure!
Date Tue, 14 Jun 2016 00:20:06 GMT
Build: http://jenkins.thetaphi.de/job/Lucene-Solr-6.1-Linux/32/
Java: 64bit/jdk1.8.0_92 -XX:+UseCompressedOops -XX:+UseG1GC

1 tests failed.
FAILED:  org.apache.solr.cloud.TestMiniSolrCloudCluster.testStopAllStartAll

Error Message:
Address already in use

Stack Trace:
java.net.BindException: Address already in use
	at __randomizedtesting.SeedInfo.seed([78ABA6732D8FE0C4:E95B9006CB84DEB]:0)
	at sun.nio.ch.Net.bind0(Native Method)
	at sun.nio.ch.Net.bind(Net.java:433)
	at sun.nio.ch.Net.bind(Net.java:425)
	at sun.nio.ch.ServerSocketChannelImpl.bind(ServerSocketChannelImpl.java:223)
	at sun.nio.ch.ServerSocketAdaptor.bind(ServerSocketAdaptor.java:74)
	at org.eclipse.jetty.server.ServerConnector.open(ServerConnector.java:326)
	at org.eclipse.jetty.server.AbstractNetworkConnector.doStart(AbstractNetworkConnector.java:80)
	at org.eclipse.jetty.server.ServerConnector.doStart(ServerConnector.java:244)
	at org.eclipse.jetty.util.component.AbstractLifeCycle.start(AbstractLifeCycle.java:68)
	at org.eclipse.jetty.server.Server.doStart(Server.java:384)
	at org.eclipse.jetty.util.component.AbstractLifeCycle.start(AbstractLifeCycle.java:68)
	at org.apache.solr.client.solrj.embedded.JettySolrRunner.start(JettySolrRunner.java:327)
	at org.apache.solr.cloud.MiniSolrCloudCluster.startJettySolrRunner(MiniSolrCloudCluster.java:377)
	at org.apache.solr.cloud.TestMiniSolrCloudCluster.testStopAllStartAll(TestMiniSolrCloudCluster.java:443)
	at sun.reflect.NativeMethodAccessorImpl.invoke0(Native Method)
	at sun.reflect.NativeMethodAccessorImpl.invoke(NativeMethodAccessorImpl.java:62)
	at sun.reflect.DelegatingMethodAccessorImpl.invoke(DelegatingMethodAccessorImpl.java:43)
	at java.lang.reflect.Method.invoke(Method.java:498)
	at com.carrotsearch.randomizedtesting.RandomizedRunner.invoke(RandomizedRunner.java:1764)
	at com.carrotsearch.randomizedtesting.RandomizedRunner$8.evaluate(RandomizedRunner.java:871)
	at com.carrotsearch.randomizedtesting.RandomizedRunner$9.evaluate(RandomizedRunner.java:907)
	at com.carrotsearch.randomizedtesting.RandomizedRunner$10.evaluate(RandomizedRunner.java:921)
	at com.carrotsearch.randomizedtesting.rules.SystemPropertiesRestoreRule$1.evaluate(SystemPropertiesRestoreRule.java:57)
	at org.apache.lucene.util.TestRuleSetupTeardownChained$1.evaluate(TestRuleSetupTeardownChained.java:49)
	at org.apache.lucene.util.AbstractBeforeAfterRule$1.evaluate(AbstractBeforeAfterRule.java:45)
	at org.apache.lucene.util.TestRuleThreadAndTestName$1.evaluate(TestRuleThreadAndTestName.java:48)
	at org.apache.lucene.util.TestRuleIgnoreAfterMaxFailures$1.evaluate(TestRuleIgnoreAfterMaxFailures.java:64)
	at org.apache.lucene.util.TestRuleMarkFailure$1.evaluate(TestRuleMarkFailure.java:47)
	at com.carrotsearch.randomizedtesting.rules.StatementAdapter.evaluate(StatementAdapter.java:36)
	at com.carrotsearch.randomizedtesting.ThreadLeakControl$StatementRunner.run(ThreadLeakControl.java:367)
	at com.carrotsearch.randomizedtesting.ThreadLeakControl.forkTimeoutingTask(ThreadLeakControl.java:809)
	at com.carrotsearch.randomizedtesting.ThreadLeakControl$3.evaluate(ThreadLeakControl.java:460)
	at com.carrotsearch.randomizedtesting.RandomizedRunner.runSingleTest(RandomizedRunner.java:880)
	at com.carrotsearch.randomizedtesting.RandomizedRunner$5.evaluate(RandomizedRunner.java:781)
	at com.carrotsearch.randomizedtesting.RandomizedRunner$6.evaluate(RandomizedRunner.java:816)
	at com.carrotsearch.randomizedtesting.RandomizedRunner$7.evaluate(RandomizedRunner.java:827)
	at com.carrotsearch.randomizedtesting.rules.StatementAdapter.evaluate(StatementAdapter.java:36)
	at com.carrotsearch.randomizedtesting.rules.SystemPropertiesRestoreRule$1.evaluate(SystemPropertiesRestoreRule.java:57)
	at org.apache.lucene.util.AbstractBeforeAfterRule$1.evaluate(AbstractBeforeAfterRule.java:45)
	at com.carrotsearch.randomizedtesting.rules.StatementAdapter.evaluate(StatementAdapter.java:36)
	at org.apache.lucene.util.TestRuleStoreClassName$1.evaluate(TestRuleStoreClassName.java:41)
	at com.carrotsearch.randomizedtesting.rules.NoShadowingOrOverridesOnMethodsRule$1.evaluate(NoShadowingOrOverridesOnMethodsRule.java:40)
	at com.carrotsearch.randomizedtesting.rules.NoShadowingOrOverridesOnMethodsRule$1.evaluate(NoShadowingOrOverridesOnMethodsRule.java:40)
	at com.carrotsearch.randomizedtesting.rules.StatementAdapter.evaluate(StatementAdapter.java:36)
	at com.carrotsearch.randomizedtesting.rules.StatementAdapter.evaluate(StatementAdapter.java:36)
	at com.carrotsearch.randomizedtesting.rules.StatementAdapter.evaluate(StatementAdapter.java:36)
	at org.apache.lucene.util.TestRuleAssertionsRequired$1.evaluate(TestRuleAssertionsRequired.java:53)
	at org.apache.lucene.util.TestRuleMarkFailure$1.evaluate(TestRuleMarkFailure.java:47)
	at org.apache.lucene.util.TestRuleIgnoreAfterMaxFailures$1.evaluate(TestRuleIgnoreAfterMaxFailures.java:64)
	at org.apache.lucene.util.TestRuleIgnoreTestSuites$1.evaluate(TestRuleIgnoreTestSuites.java:54)
	at com.carrotsearch.randomizedtesting.rules.StatementAdapter.evaluate(StatementAdapter.java:36)
	at com.carrotsearch.randomizedtesting.ThreadLeakControl$StatementRunner.run(ThreadLeakControl.java:367)
	at java.lang.Thread.run(Thread.java:745)




Build Log:
[...truncated 12164 lines...]
   [junit4] Suite: org.apache.solr.cloud.TestMiniSolrCloudCluster
   [junit4]   2> 1739523 INFO  (TEST-TestMiniSolrCloudCluster.testSegmentTerminateEarly-seed#[78ABA6732D8FE0C4]) [    ] o.a.s.c.ZkTestServer STARTING ZK TEST SERVER
   [junit4]   2> 1739524 INFO  (Thread-4505) [    ] o.a.s.c.ZkTestServer client port:0.0.0.0/0.0.0.0:0
   [junit4]   2> 1739524 INFO  (Thread-4505) [    ] o.a.s.c.ZkTestServer Starting server
   [junit4]   2> 1739624 INFO  (TEST-TestMiniSolrCloudCluster.testSegmentTerminateEarly-seed#[78ABA6732D8FE0C4]) [    ] o.a.s.c.ZkTestServer start zk server on port:42594
   [junit4]   2> 1739624 INFO  (TEST-TestMiniSolrCloudCluster.testSegmentTerminateEarly-seed#[78ABA6732D8FE0C4]) [    ] o.a.s.c.c.SolrZkClient Using default ZkCredentialsProvider
   [junit4]   2> 1739624 INFO  (TEST-TestMiniSolrCloudCluster.testSegmentTerminateEarly-seed#[78ABA6732D8FE0C4]) [    ] o.a.s.c.c.ConnectionManager Waiting for client to connect to ZooKeeper
   [junit4]   2> 1739688 INFO  (zkCallback-2457-thread-1) [    ] o.a.s.c.c.ConnectionManager Watcher org.apache.solr.common.cloud.ConnectionManager@38085d16 name:ZooKeeperConnection Watcher:127.0.0.1:42594 got event WatchedEvent state:SyncConnected type:None path:null path:null type:None
   [junit4]   2> 1739688 INFO  (TEST-TestMiniSolrCloudCluster.testSegmentTerminateEarly-seed#[78ABA6732D8FE0C4]) [    ] o.a.s.c.c.ConnectionManager Client is connected to ZooKeeper
   [junit4]   2> 1739688 INFO  (TEST-TestMiniSolrCloudCluster.testSegmentTerminateEarly-seed#[78ABA6732D8FE0C4]) [    ] o.a.s.c.c.SolrZkClient Using default ZkACLProvider
   [junit4]   2> 1739688 INFO  (TEST-TestMiniSolrCloudCluster.testSegmentTerminateEarly-seed#[78ABA6732D8FE0C4]) [    ] o.a.s.c.c.SolrZkClient makePath: /solr/solr.xml
   [junit4]   2> 1739787 INFO  (jetty-launcher-2456-thread-1) [    ] o.e.j.s.Server jetty-9.3.8.v20160314
   [junit4]   2> 1739787 INFO  (jetty-launcher-2456-thread-3) [    ] o.e.j.s.Server jetty-9.3.8.v20160314
   [junit4]   2> 1739787 INFO  (jetty-launcher-2456-thread-2) [    ] o.e.j.s.Server jetty-9.3.8.v20160314
   [junit4]   2> 1739787 INFO  (jetty-launcher-2456-thread-4) [    ] o.e.j.s.Server jetty-9.3.8.v20160314
   [junit4]   2> 1739787 INFO  (jetty-launcher-2456-thread-5) [    ] o.e.j.s.Server jetty-9.3.8.v20160314
   [junit4]   2> 1739789 INFO  (jetty-launcher-2456-thread-3) [    ] o.e.j.s.h.ContextHandler Started o.e.j.s.ServletContextHandler@7c9ae3e1{/solr,null,AVAILABLE}
   [junit4]   2> 1739789 INFO  (jetty-launcher-2456-thread-5) [    ] o.e.j.s.h.ContextHandler Started o.e.j.s.ServletContextHandler@da68801{/solr,null,AVAILABLE}
   [junit4]   2> 1739789 INFO  (jetty-launcher-2456-thread-2) [    ] o.e.j.s.h.ContextHandler Started o.e.j.s.ServletContextHandler@449681be{/solr,null,AVAILABLE}
   [junit4]   2> 1739789 INFO  (jetty-launcher-2456-thread-1) [    ] o.e.j.s.h.ContextHandler Started o.e.j.s.ServletContextHandler@70e0637c{/solr,null,AVAILABLE}
   [junit4]   2> 1739789 INFO  (jetty-launcher-2456-thread-4) [    ] o.e.j.s.h.ContextHandler Started o.e.j.s.ServletContextHandler@14b8ce99{/solr,null,AVAILABLE}
   [junit4]   2> 1739790 INFO  (jetty-launcher-2456-thread-2) [    ] o.e.j.s.ServerConnector Started ServerConnector@2b8f9d58{HTTP/1.1,[http/1.1]}{127.0.0.1:36510}
   [junit4]   2> 1739790 INFO  (jetty-launcher-2456-thread-1) [    ] o.e.j.s.ServerConnector Started ServerConnector@5d5f459e{HTTP/1.1,[http/1.1]}{127.0.0.1:42735}
   [junit4]   2> 1739790 INFO  (jetty-launcher-2456-thread-2) [    ] o.e.j.s.Server Started @1742142ms
   [junit4]   2> 1739790 INFO  (jetty-launcher-2456-thread-1) [    ] o.e.j.s.Server Started @1742142ms
   [junit4]   2> 1739790 INFO  (jetty-launcher-2456-thread-2) [    ] o.a.s.c.s.e.JettySolrRunner Jetty properties: {hostContext=/solr, hostPort=36510}
   [junit4]   2> 1739790 INFO  (jetty-launcher-2456-thread-4) [    ] o.e.j.s.ServerConnector Started ServerConnector@26321238{HTTP/1.1,[http/1.1]}{127.0.0.1:37274}
   [junit4]   2> 1739790 INFO  (jetty-launcher-2456-thread-5) [    ] o.e.j.s.ServerConnector Started ServerConnector@6057ef31{HTTP/1.1,[http/1.1]}{127.0.0.1:43220}
   [junit4]   2> 1739790 INFO  (jetty-launcher-2456-thread-3) [    ] o.e.j.s.ServerConnector Started ServerConnector@643f20d0{HTTP/1.1,[http/1.1]}{127.0.0.1:33309}
   [junit4]   2> 1739790 INFO  (jetty-launcher-2456-thread-5) [    ] o.e.j.s.Server Started @1742142ms
   [junit4]   2> 1739790 INFO  (jetty-launcher-2456-thread-3) [    ] o.e.j.s.Server Started @1742142ms
   [junit4]   2> 1739790 INFO  (jetty-launcher-2456-thread-5) [    ] o.a.s.c.s.e.JettySolrRunner Jetty properties: {hostContext=/solr, hostPort=43220}
   [junit4]   2> 1739790 INFO  (jetty-launcher-2456-thread-3) [    ] o.a.s.c.s.e.JettySolrRunner Jetty properties: {hostContext=/solr, hostPort=33309}
   [junit4]   2> 1739790 INFO  (jetty-launcher-2456-thread-2) [    ] o.a.s.s.SolrDispatchFilter SolrDispatchFilter.init(): sun.misc.Launcher$AppClassLoader@73d16e93
   [junit4]   2> 1739790 INFO  (jetty-launcher-2456-thread-5) [    ] o.a.s.s.SolrDispatchFilter SolrDispatchFilter.init(): sun.misc.Launcher$AppClassLoader@73d16e93
   [junit4]   2> 1739791 INFO  (jetty-launcher-2456-thread-3) [    ] o.a.s.s.SolrDispatchFilter SolrDispatchFilter.init(): sun.misc.Launcher$AppClassLoader@73d16e93
   [junit4]   2> 1739791 INFO  (jetty-launcher-2456-thread-5) [    ] o.a.s.c.SolrResourceLoader new SolrResourceLoader for directory: '/home/jenkins/workspace/Lucene-Solr-6.1-Linux/solr/build/solr-core/test/J2/temp/solr.cloud.TestMiniSolrCloudCluster_78ABA6732D8FE0C4-001/tempDir-001/node5'
   [junit4]   2> 1739791 INFO  (jetty-launcher-2456-thread-3) [    ] o.a.s.c.SolrResourceLoader new SolrResourceLoader for directory: '/home/jenkins/workspace/Lucene-Solr-6.1-Linux/solr/build/solr-core/test/J2/temp/solr.cloud.TestMiniSolrCloudCluster_78ABA6732D8FE0C4-001/tempDir-001/node3'
   [junit4]   2> 1739790 INFO  (jetty-launcher-2456-thread-4) [    ] o.e.j.s.Server Started @1742142ms
   [junit4]   2> 1739790 INFO  (jetty-launcher-2456-thread-1) [    ] o.a.s.c.s.e.JettySolrRunner Jetty properties: {hostContext=/solr, hostPort=42735}
   [junit4]   2> 1739791 INFO  (jetty-launcher-2456-thread-3) [    ] o.a.s.c.SolrResourceLoader JNDI not configured for solr (NoInitialContextEx)
   [junit4]   2> 1739791 INFO  (jetty-launcher-2456-thread-4) [    ] o.a.s.c.s.e.JettySolrRunner Jetty properties: {hostContext=/solr, hostPort=37274}
   [junit4]   2> 1739791 INFO  (jetty-launcher-2456-thread-1) [    ] o.a.s.s.SolrDispatchFilter SolrDispatchFilter.init(): sun.misc.Launcher$AppClassLoader@73d16e93
   [junit4]   2> 1739791 INFO  (jetty-launcher-2456-thread-5) [    ] o.a.s.c.SolrResourceLoader JNDI not configured for solr (NoInitialContextEx)
   [junit4]   2> 1739791 INFO  (jetty-launcher-2456-thread-1) [    ] o.a.s.c.SolrResourceLoader new SolrResourceLoader for directory: '/home/jenkins/workspace/Lucene-Solr-6.1-Linux/solr/build/solr-core/test/J2/temp/solr.cloud.TestMiniSolrCloudCluster_78ABA6732D8FE0C4-001/tempDir-001/node1'
   [junit4]   2> 1739791 INFO  (jetty-launcher-2456-thread-2) [    ] o.a.s.c.SolrResourceLoader new SolrResourceLoader for directory: '/home/jenkins/workspace/Lucene-Solr-6.1-Linux/solr/build/solr-core/test/J2/temp/solr.cloud.TestMiniSolrCloudCluster_78ABA6732D8FE0C4-001/tempDir-001/node2'
   [junit4]   2> 1739791 INFO  (jetty-launcher-2456-thread-1) [    ] o.a.s.c.SolrResourceLoader JNDI not configured for solr (NoInitialContextEx)
   [junit4]   2> 1739791 INFO  (jetty-launcher-2456-thread-2) [    ] o.a.s.c.SolrResourceLoader JNDI not configured for solr (NoInitialContextEx)
   [junit4]   2> 1739791 INFO  (jetty-launcher-2456-thread-1) [    ] o.a.s.c.SolrResourceLoader solr home defaulted to 'solr/' (could not find system property or JNDI)
   [junit4]   2> 1739791 INFO  (jetty-launcher-2456-thread-2) [    ] o.a.s.c.SolrResourceLoader solr home defaulted to 'solr/' (could not find system property or JNDI)
   [junit4]   2> 1739791 INFO  (jetty-launcher-2456-thread-5) [    ] o.a.s.c.SolrResourceLoader solr home defaulted to 'solr/' (could not find system property or JNDI)
   [junit4]   2> 1739791 INFO  (jetty-launcher-2456-thread-4) [    ] o.a.s.s.SolrDispatchFilter SolrDispatchFilter.init(): sun.misc.Launcher$AppClassLoader@73d16e93
   [junit4]   2> 1739791 INFO  (jetty-launcher-2456-thread-3) [    ] o.a.s.c.SolrResourceLoader solr home defaulted to 'solr/' (could not find system property or JNDI)
   [junit4]   2> 1739791 INFO  (jetty-launcher-2456-thread-4) [    ] o.a.s.c.SolrResourceLoader new SolrResourceLoader for directory: '/home/jenkins/workspace/Lucene-Solr-6.1-Linux/solr/build/solr-core/test/J2/temp/solr.cloud.TestMiniSolrCloudCluster_78ABA6732D8FE0C4-001/tempDir-001/node4'
   [junit4]   2> 1739791 INFO  (jetty-launcher-2456-thread-5) [    ] o.a.s.c.c.SolrZkClient Using default ZkCredentialsProvider
   [junit4]   2> 1739791 INFO  (jetty-launcher-2456-thread-2) [    ] o.a.s.c.c.SolrZkClient Using default ZkCredentialsProvider
   [junit4]   2> 1739791 INFO  (jetty-launcher-2456-thread-4) [    ] o.a.s.c.SolrResourceLoader JNDI not configured for solr (NoInitialContextEx)
   [junit4]   2> 1739791 INFO  (jetty-launcher-2456-thread-1) [    ] o.a.s.c.c.SolrZkClient Using default ZkCredentialsProvider
   [junit4]   2> 1739792 INFO  (jetty-launcher-2456-thread-4) [    ] o.a.s.c.SolrResourceLoader solr home defaulted to 'solr/' (could not find system property or JNDI)
   [junit4]   2> 1739792 INFO  (jetty-launcher-2456-thread-3) [    ] o.a.s.c.c.SolrZkClient Using default ZkCredentialsProvider
   [junit4]   2> 1739792 INFO  (jetty-launcher-2456-thread-4) [    ] o.a.s.c.c.SolrZkClient Using default ZkCredentialsProvider
   [junit4]   2> 1739794 INFO  (jetty-launcher-2456-thread-5) [    ] o.a.s.c.c.ConnectionManager Waiting for client to connect to ZooKeeper
   [junit4]   2> 1739794 INFO  (jetty-launcher-2456-thread-2) [    ] o.a.s.c.c.ConnectionManager Waiting for client to connect to ZooKeeper
   [junit4]   2> 1739794 INFO  (jetty-launcher-2456-thread-3) [    ] o.a.s.c.c.ConnectionManager Waiting for client to connect to ZooKeeper
   [junit4]   2> 1739794 INFO  (jetty-launcher-2456-thread-4) [    ] o.a.s.c.c.ConnectionManager Waiting for client to connect to ZooKeeper
   [junit4]   2> 1739794 INFO  (jetty-launcher-2456-thread-1) [    ] o.a.s.c.c.ConnectionManager Waiting for client to connect to ZooKeeper
   [junit4]   2> 1739808 INFO  (zkCallback-2460-thread-1) [    ] o.a.s.c.c.ConnectionManager Watcher org.apache.solr.common.cloud.ConnectionManager@67b1f6a2 name:ZooKeeperConnection Watcher:127.0.0.1:42594/solr got event WatchedEvent state:SyncConnected type:None path:null path:null type:None
   [junit4]   2> 1739808 INFO  (jetty-launcher-2456-thread-5) [    ] o.a.s.c.c.ConnectionManager Client is connected to ZooKeeper
   [junit4]   2> 1739809 INFO  (jetty-launcher-2456-thread-5) [    ] o.a.s.c.c.SolrZkClient Using default ZkACLProvider
   [junit4]   2> 1739828 INFO  (jetty-launcher-2456-thread-5) [    ] o.a.s.s.SolrDispatchFilter solr.xml found in ZooKeeper. Loading...
   [junit4]   2> 1739828 INFO  (zkCallback-2459-thread-1) [    ] o.a.s.c.c.ConnectionManager Watcher org.apache.solr.common.cloud.ConnectionManager@16d13224 name:ZooKeeperConnection Watcher:127.0.0.1:42594/solr got event WatchedEvent state:SyncConnected type:None path:null path:null type:None
   [junit4]   2> 1739828 INFO  (zkCallback-2462-thread-1) [    ] o.a.s.c.c.ConnectionManager Watcher org.apache.solr.common.cloud.ConnectionManager@177c9140 name:ZooKeeperConnection Watcher:127.0.0.1:42594/solr got event WatchedEvent state:SyncConnected type:None path:null path:null type:None
   [junit4]   2> 1739828 INFO  (zkCallback-2461-thread-1) [    ] o.a.s.c.c.ConnectionManager Watcher org.apache.solr.common.cloud.ConnectionManager@758cff6a name:ZooKeeperConnection Watcher:127.0.0.1:42594/solr got event WatchedEvent state:SyncConnected type:None path:null path:null type:None
   [junit4]   2> 1739828 INFO  (zkCallback-2458-thread-1) [    ] o.a.s.c.c.ConnectionManager Watcher org.apache.solr.common.cloud.ConnectionManager@2e1be30f name:ZooKeeperConnection Watcher:127.0.0.1:42594/solr got event WatchedEvent state:SyncConnected type:None path:null path:null type:None
   [junit4]   2> 1739828 INFO  (jetty-launcher-2456-thread-3) [    ] o.a.s.c.c.ConnectionManager Client is connected to ZooKeeper
   [junit4]   2> 1739828 INFO  (jetty-launcher-2456-thread-4) [    ] o.a.s.c.c.ConnectionManager Client is connected to ZooKeeper
   [junit4]   2> 1739828 INFO  (jetty-launcher-2456-thread-2) [    ] o.a.s.c.c.ConnectionManager Client is connected to ZooKeeper
   [junit4]   2> 1739828 INFO  (jetty-launcher-2456-thread-1) [    ] o.a.s.c.c.ConnectionManager Client is connected to ZooKeeper
   [junit4]   2> 1739828 INFO  (jetty-launcher-2456-thread-4) [    ] o.a.s.c.c.SolrZkClient Using default ZkACLProvider
   [junit4]   2> 1739828 INFO  (jetty-launcher-2456-thread-3) [    ] o.a.s.c.c.SolrZkClient Using default ZkACLProvider
   [junit4]   2> 1739829 INFO  (jetty-launcher-2456-thread-2) [    ] o.a.s.c.c.SolrZkClient Using default ZkACLProvider
   [junit4]   2> 1739829 INFO  (jetty-launcher-2456-thread-1) [    ] o.a.s.c.c.SolrZkClient Using default ZkACLProvider
   [junit4]   2> 1739829 INFO  (jetty-launcher-2456-thread-4) [    ] o.a.s.s.SolrDispatchFilter solr.xml found in ZooKeeper. Loading...
   [junit4]   2> 1739829 INFO  (jetty-launcher-2456-thread-3) [    ] o.a.s.s.SolrDispatchFilter solr.xml found in ZooKeeper. Loading...
   [junit4]   2> 1739829 INFO  (jetty-launcher-2456-thread-2) [    ] o.a.s.s.SolrDispatchFilter solr.xml found in ZooKeeper. Loading...
   [junit4]   2> 1739829 INFO  (jetty-launcher-2456-thread-1) [    ] o.a.s.s.SolrDispatchFilter solr.xml found in ZooKeeper. Loading...
   [junit4]   2> 1739851 INFO  (jetty-launcher-2456-thread-4) [    ] o.a.s.c.CorePropertiesLocator Config-defined core root directory: /home/jenkins/workspace/Lucene-Solr-6.1-Linux/solr/build/solr-core/test/J2/temp/solr.cloud.TestMiniSolrCloudCluster_78ABA6732D8FE0C4-001/tempDir-001/node4/.
   [junit4]   2> 1739851 INFO  (jetty-launcher-2456-thread-5) [    ] o.a.s.c.CorePropertiesLocator Config-defined core root directory: /home/jenkins/workspace/Lucene-Solr-6.1-Linux/solr/build/solr-core/test/J2/temp/solr.cloud.TestMiniSolrCloudCluster_78ABA6732D8FE0C4-001/tempDir-001/node5/.
   [junit4]   2> 1739851 INFO  (jetty-launcher-2456-thread-4) [    ] o.a.s.c.CoreContainer New CoreContainer 442267947
   [junit4]   2> 1739851 INFO  (jetty-launcher-2456-thread-5) [    ] o.a.s.c.CoreContainer New CoreContainer 895315841
   [junit4]   2> 1739851 INFO  (jetty-launcher-2456-thread-4) [    ] o.a.s.c.CoreContainer Loading cores into CoreContainer [instanceDir=/home/jenkins/workspace/Lucene-Solr-6.1-Linux/solr/build/solr-core/test/J2/temp/solr.cloud.TestMiniSolrCloudCluster_78ABA6732D8FE0C4-001/tempDir-001/node4]
   [junit4]   2> 1739851 INFO  (jetty-launcher-2456-thread-5) [    ] o.a.s.c.CoreContainer Loading cores into CoreContainer [instanceDir=/home/jenkins/workspace/Lucene-Solr-6.1-Linux/solr/build/solr-core/test/J2/temp/solr.cloud.TestMiniSolrCloudCluster_78ABA6732D8FE0C4-001/tempDir-001/node5]
   [junit4]   2> 1739851 WARN  (NIOServerCxn.Factory:0.0.0.0/0.0.0.0:0) [    ] o.a.z.s.NIOServerCnxn caught end of stream exception
   [junit4]   2> EndOfStreamException: Unable to read additional data from client sessionid 0x1554c41c2ea0001, likely client has closed socket
   [junit4]   2> 	at org.apache.zookeeper.server.NIOServerCnxn.doIO(NIOServerCnxn.java:228)
   [junit4]   2> 	at org.apache.zookeeper.server.NIOServerCnxnFactory.run(NIOServerCnxnFactory.java:208)
   [junit4]   2> 	at java.lang.Thread.run(Thread.java:745)
   [junit4]   2> 1739851 WARN  (jetty-launcher-2456-thread-5) [    ] o.a.s.c.CoreContainer Couldn't add files from /home/jenkins/workspace/Lucene-Solr-6.1-Linux/solr/build/solr-core/test/J2/temp/solr.cloud.TestMiniSolrCloudCluster_78ABA6732D8FE0C4-001/tempDir-001/node5/lib to classpath: /home/jenkins/workspace/Lucene-Solr-6.1-Linux/solr/build/solr-core/test/J2/temp/solr.cloud.TestMiniSolrCloudCluster_78ABA6732D8FE0C4-001/tempDir-001/node5/lib
   [junit4]   2> 1739851 WARN  (jetty-launcher-2456-thread-4) [    ] o.a.s.c.CoreContainer Couldn't add files from /home/jenkins/workspace/Lucene-Solr-6.1-Linux/solr/build/solr-core/test/J2/temp/solr.cloud.TestMiniSolrCloudCluster_78ABA6732D8FE0C4-001/tempDir-001/node4/lib to classpath: /home/jenkins/workspace/Lucene-Solr-6.1-Linux/solr/build/solr-core/test/J2/temp/solr.cloud.TestMiniSolrCloudCluster_78ABA6732D8FE0C4-001/tempDir-001/node4/lib
   [junit4]   2> 1739851 INFO  (jetty-launcher-2456-thread-5) [    ] o.a.s.h.c.HttpShardHandlerFactory created with socketTimeout : 90000,urlScheme : ,connTimeout : 15000,maxConnectionsPerHost : 20,maxConnections : 10000,corePoolSize : 0,maximumPoolSize : 2147483647,maxThreadIdleTime : 5,sizeOfQueue : -1,fairnessPolicy : false,useRetries : false,
   [junit4]   2> 1739851 INFO  (jetty-launcher-2456-thread-4) [    ] o.a.s.h.c.HttpShardHandlerFactory created with socketTimeout : 90000,urlScheme : ,connTimeout : 15000,maxConnectionsPerHost : 20,maxConnections : 10000,corePoolSize : 0,maximumPoolSize : 2147483647,maxThreadIdleTime : 5,sizeOfQueue : -1,fairnessPolicy : false,useRetries : false,
   [junit4]   2> 1739852 INFO  (jetty-launcher-2456-thread-5) [    ] o.a.s.u.UpdateShardHandler Creating UpdateShardHandler HTTP client with params: socketTimeout=340000&connTimeout=45000&retry=true
   [junit4]   2> 1739852 INFO  (jetty-launcher-2456-thread-4) [    ] o.a.s.u.UpdateShardHandler Creating UpdateShardHandler HTTP client with params: socketTimeout=340000&connTimeout=45000&retry=true
   [junit4]   2> 1739852 INFO  (jetty-launcher-2456-thread-5) [    ] o.a.s.l.LogWatcher SLF4J impl is org.slf4j.impl.Log4jLoggerFactory
   [junit4]   2> 1739852 INFO  (jetty-launcher-2456-thread-4) [    ] o.a.s.l.LogWatcher SLF4J impl is org.slf4j.impl.Log4jLoggerFactory
   [junit4]   2> 1739852 INFO  (jetty-launcher-2456-thread-5) [    ] o.a.s.l.LogWatcher Registering Log Listener [Log4j (org.slf4j.impl.Log4jLoggerFactory)]
   [junit4]   2> 1739852 INFO  (jetty-launcher-2456-thread-4) [    ] o.a.s.l.LogWatcher Registering Log Listener [Log4j (org.slf4j.impl.Log4jLoggerFactory)]
   [junit4]   2> 1739852 INFO  (jetty-launcher-2456-thread-4) [    ] o.a.s.c.ZkContainer Zookeeper client=127.0.0.1:42594/solr
   [junit4]   2> 1739852 INFO  (jetty-launcher-2456-thread-5) [    ] o.a.s.c.ZkContainer Zookeeper client=127.0.0.1:42594/solr
   [junit4]   2> 1739852 INFO  (jetty-launcher-2456-thread-4) [    ] o.a.s.c.ZkController zkHost includes chroot
   [junit4]   2> 1739852 INFO  (jetty-launcher-2456-thread-5) [    ] o.a.s.c.ZkController zkHost includes chroot
   [junit4]   2> 1739853 INFO  (jetty-launcher-2456-thread-4) [    ] o.a.s.c.c.SolrZkClient Using default ZkCredentialsProvider
   [junit4]   2> 1739853 INFO  (jetty-launcher-2456-thread-5) [    ] o.a.s.c.c.SolrZkClient Using default ZkCredentialsProvider
   [junit4]   2> 1739853 INFO  (jetty-launcher-2456-thread-4) [    ] o.a.s.c.c.ConnectionManager Waiting for client to connect to ZooKeeper
   [junit4]   2> 1739853 INFO  (jetty-launcher-2456-thread-5) [    ] o.a.s.c.c.ConnectionManager Waiting for client to connect to ZooKeeper
   [junit4]   2> 1739866 INFO  (jetty-launcher-2456-thread-1) [    ] o.a.s.c.CorePropertiesLocator Config-defined core root directory: /home/jenkins/workspace/Lucene-Solr-6.1-Linux/solr/build/solr-core/test/J2/temp/solr.cloud.TestMiniSolrCloudCluster_78ABA6732D8FE0C4-001/tempDir-001/node1/.
   [junit4]   2> 1739866 INFO  (jetty-launcher-2456-thread-3) [    ] o.a.s.c.CorePropertiesLocator Config-defined core root directory: /home/jenkins/workspace/Lucene-Solr-6.1-Linux/solr/build/solr-core/test/J2/temp/solr.cloud.TestMiniSolrCloudCluster_78ABA6732D8FE0C4-001/tempDir-001/node3/.
   [junit4]   2> 1739866 INFO  (jetty-launcher-2456-thread-2) [    ] o.a.s.c.CorePropertiesLocator Config-defined core root directory: /home/jenkins/workspace/Lucene-Solr-6.1-Linux/solr/build/solr-core/test/J2/temp/solr.cloud.TestMiniSolrCloudCluster_78ABA6732D8FE0C4-001/tempDir-001/node2/.
   [junit4]   2> 1739866 INFO  (jetty-launcher-2456-thread-3) [    ] o.a.s.c.CoreContainer New CoreContainer 1930170952
   [junit4]   2> 1739866 INFO  (jetty-launcher-2456-thread-2) [    ] o.a.s.c.CoreContainer New CoreContainer 1603842052
   [junit4]   2> 1739866 INFO  (jetty-launcher-2456-thread-3) [    ] o.a.s.c.CoreContainer Loading cores into CoreContainer [instanceDir=/home/jenkins/workspace/Lucene-Solr-6.1-Linux/solr/build/solr-core/test/J2/temp/solr.cloud.TestMiniSolrCloudCluster_78ABA6732D8FE0C4-001/tempDir-001/node3]
   [junit4]   2> 1739866 INFO  (jetty-launcher-2456-thread-2) [    ] o.a.s.c.CoreContainer Loading cores into CoreContainer [instanceDir=/home/jenkins/workspace/Lucene-Solr-6.1-Linux/solr/build/solr-core/test/J2/temp/solr.cloud.TestMiniSolrCloudCluster_78ABA6732D8FE0C4-001/tempDir-001/node2]
   [junit4]   2> 1739866 INFO  (jetty-launcher-2456-thread-1) [    ] o.a.s.c.CoreContainer New CoreContainer 308019116
   [junit4]   2> 1739866 INFO  (jetty-launcher-2456-thread-1) [    ] o.a.s.c.CoreContainer Loading cores into CoreContainer [instanceDir=/home/jenkins/workspace/Lucene-Solr-6.1-Linux/solr/build/solr-core/test/J2/temp/solr.cloud.TestMiniSolrCloudCluster_78ABA6732D8FE0C4-001/tempDir-001/node1]
   [junit4]   2> 1739866 WARN  (jetty-launcher-2456-thread-3) [    ] o.a.s.c.CoreContainer Couldn't add files from /home/jenkins/workspace/Lucene-Solr-6.1-Linux/solr/build/solr-core/test/J2/temp/solr.cloud.TestMiniSolrCloudCluster_78ABA6732D8FE0C4-001/tempDir-001/node3/lib to classpath: /home/jenkins/workspace/Lucene-Solr-6.1-Linux/solr/build/solr-core/test/J2/temp/solr.cloud.TestMiniSolrCloudCluster_78ABA6732D8FE0C4-001/tempDir-001/node3/lib
   [junit4]   2> 1739866 WARN  (jetty-launcher-2456-thread-1) [    ] o.a.s.c.CoreContainer Couldn't add files from /home/jenkins/workspace/Lucene-Solr-6.1-Linux/solr/build/solr-core/test/J2/temp/solr.cloud.TestMiniSolrCloudCluster_78ABA6732D8FE0C4-001/tempDir-001/node1/lib to classpath: /home/jenkins/workspace/Lucene-Solr-6.1-Linux/solr/build/solr-core/test/J2/temp/solr.cloud.TestMiniSolrCloudCluster_78ABA6732D8FE0C4-001/tempDir-001/node1/lib
   [junit4]   2> 1739866 INFO  (jetty-launcher-2456-thread-3) [    ] o.a.s.h.c.HttpShardHandlerFactory created with socketTimeout : 90000,urlScheme : ,connTimeout : 15000,maxConnectionsPerHost : 20,maxConnections : 10000,corePoolSize : 0,maximumPoolSize : 2147483647,maxThreadIdleTime : 5,sizeOfQueue : -1,fairnessPolicy : false,useRetries : false,
   [junit4]   2> 1739866 INFO  (jetty-launcher-2456-thread-1) [    ] o.a.s.h.c.HttpShardHandlerFactory created with socketTimeout : 90000,urlScheme : ,connTimeout : 15000,maxConnectionsPerHost : 20,maxConnections : 10000,corePoolSize : 0,maximumPoolSize : 2147483647,maxThreadIdleTime : 5,sizeOfQueue : -1,fairnessPolicy : false,useRetries : false,
   [junit4]   2> 1739866 WARN  (jetty-launcher-2456-thread-2) [    ] o.a.s.c.CoreContainer Couldn't add files from /home/jenkins/workspace/Lucene-Solr-6.1-Linux/solr/build/solr-core/test/J2/temp/solr.cloud.TestMiniSolrCloudCluster_78ABA6732D8FE0C4-001/tempDir-001/node2/lib to classpath: /home/jenkins/workspace/Lucene-Solr-6.1-Linux/solr/build/solr-core/test/J2/temp/solr.cloud.TestMiniSolrCloudCluster_78ABA6732D8FE0C4-001/tempDir-001/node2/lib
   [junit4]   2> 1739866 INFO  (jetty-launcher-2456-thread-2) [    ] o.a.s.h.c.HttpShardHandlerFactory created with socketTimeout : 90000,urlScheme : ,connTimeout : 15000,maxConnectionsPerHost : 20,maxConnections : 10000,corePoolSize : 0,maximumPoolSize : 2147483647,maxThreadIdleTime : 5,sizeOfQueue : -1,fairnessPolicy : false,useRetries : false,
   [junit4]   2> 1739867 INFO  (jetty-launcher-2456-thread-3) [    ] o.a.s.u.UpdateShardHandler Creating UpdateShardHandler HTTP client with params: socketTimeout=340000&connTimeout=45000&retry=true
   [junit4]   2> 1739867 INFO  (jetty-launcher-2456-thread-1) [    ] o.a.s.u.UpdateShardHandler Creating UpdateShardHandler HTTP client with params: socketTimeout=340000&connTimeout=45000&retry=true
   [junit4]   2> 1739867 INFO  (jetty-launcher-2456-thread-2) [    ] o.a.s.u.UpdateShardHandler Creating UpdateShardHandler HTTP client with params: socketTimeout=340000&connTimeout=45000&retry=true
   [junit4]   2> 1739867 INFO  (jetty-launcher-2456-thread-3) [    ] o.a.s.l.LogWatcher SLF4J impl is org.slf4j.impl.Log4jLoggerFactory
   [junit4]   2> 1739867 INFO  (jetty-launcher-2456-thread-1) [    ] o.a.s.l.LogWatcher SLF4J impl is org.slf4j.impl.Log4jLoggerFactory
   [junit4]   2> 1739867 INFO  (jetty-launcher-2456-thread-3) [    ] o.a.s.l.LogWatcher Registering Log Listener [Log4j (org.slf4j.impl.Log4jLoggerFactory)]
   [junit4]   2> 1739867 INFO  (jetty-launcher-2456-thread-1) [    ] o.a.s.l.LogWatcher Registering Log Listener [Log4j (org.slf4j.impl.Log4jLoggerFactory)]
   [junit4]   2> 1739867 INFO  (jetty-launcher-2456-thread-2) [    ] o.a.s.l.LogWatcher SLF4J impl is org.slf4j.impl.Log4jLoggerFactory
   [junit4]   2> 1739867 INFO  (jetty-launcher-2456-thread-1) [    ] o.a.s.c.ZkContainer Zookeeper client=127.0.0.1:42594/solr
   [junit4]   2> 1739867 INFO  (jetty-launcher-2456-thread-3) [    ] o.a.s.c.ZkContainer Zookeeper client=127.0.0.1:42594/solr
   [junit4]   2> 1739867 INFO  (jetty-launcher-2456-thread-2) [    ] o.a.s.l.LogWatcher Registering Log Listener [Log4j (org.slf4j.impl.Log4jLoggerFactory)]
   [junit4]   2> 1739867 INFO  (jetty-launcher-2456-thread-1) [    ] o.a.s.c.ZkController zkHost includes chroot
   [junit4]   2> 1739867 INFO  (jetty-launcher-2456-thread-3) [    ] o.a.s.c.ZkController zkHost includes chroot
   [junit4]   2> 1739867 INFO  (jetty-launcher-2456-thread-2) [    ] o.a.s.c.ZkContainer Zookeeper client=127.0.0.1:42594/solr
   [junit4]   2> 1739867 INFO  (jetty-launcher-2456-thread-3) [    ] o.a.s.c.c.SolrZkClient Using default ZkCredentialsProvider
   [junit4]   2> 1739868 INFO  (jetty-launcher-2456-thread-2) [    ] o.a.s.c.ZkController zkHost includes chroot
   [junit4]   2> 1739867 INFO  (jetty-launcher-2456-thread-1) [    ] o.a.s.c.c.SolrZkClient Using default ZkCredentialsProvider
   [junit4]   2> 1739868 INFO  (jetty-launcher-2456-thread-2) [    ] o.a.s.c.c.SolrZkClient Using default ZkCredentialsProvider
   [junit4]   2> 1739868 INFO  (jetty-launcher-2456-thread-3) [    ] o.a.s.c.c.ConnectionManager Waiting for client to connect to ZooKeeper
   [junit4]   2> 1739868 INFO  (jetty-launcher-2456-thread-1) [    ] o.a.s.c.c.ConnectionManager Waiting for client to connect to ZooKeeper
   [junit4]   2> 1739868 INFO  (jetty-launcher-2456-thread-2) [    ] o.a.s.c.c.ConnectionManager Waiting for client to connect to ZooKeeper
   [junit4]   2> 1739895 INFO  (zkCallback-2467-thread-1) [    ] o.a.s.c.c.ConnectionManager Watcher org.apache.solr.common.cloud.ConnectionManager@68ad603b name:ZooKeeperConnection Watcher:127.0.0.1:42594 got event WatchedEvent state:SyncConnected type:None path:null path:null type:None
   [junit4]   2> 1739895 INFO  (zkCallback-2468-thread-1) [    ] o.a.s.c.c.ConnectionManager Watcher org.apache.solr.common.cloud.ConnectionManager@21ebcd47 name:ZooKeeperConnection Watcher:127.0.0.1:42594 got event WatchedEvent state:SyncConnected type:None path:null path:null type:None
   [junit4]   2> 1739895 INFO  (jetty-launcher-2456-thread-4) [    ] o.a.s.c.c.ConnectionManager Client is connected to ZooKeeper
   [junit4]   2> 1739895 INFO  (jetty-launcher-2456-thread-5) [    ] o.a.s.c.c.ConnectionManager Client is connected to ZooKeeper
   [junit4]   2> 1739895 INFO  (jetty-launcher-2456-thread-4) [    ] o.a.s.c.c.SolrZkClient Using default ZkACLProvider
   [junit4]   2> 1739895 INFO  (jetty-launcher-2456-thread-5) [    ] o.a.s.c.c.SolrZkClient Using default ZkACLProvider
   [junit4]   2> 1739912 INFO  (zkCallback-2475-thread-1) [    ] o.a.s.c.c.ConnectionManager Watcher org.apache.solr.common.cloud.ConnectionManager@7eb73bb2 name:ZooKeeperConnection Watcher:127.0.0.1:42594 got event WatchedEvent state:SyncConnected type:None path:null path:null type:None
   [junit4]   2> 1739912 INFO  (zkCallback-2476-thread-1) [    ] o.a.s.c.c.ConnectionManager Watcher org.apache.solr.common.cloud.ConnectionManager@1a5984ce name:ZooKeeperConnection Watcher:127.0.0.1:42594 got event WatchedEvent state:SyncConnected type:None path:null path:null type:None
   [junit4]   2> 1739912 INFO  (jetty-launcher-2456-thread-1) [    ] o.a.s.c.c.ConnectionManager Client is connected to ZooKeeper
   [junit4]   2> 1739913 INFO  (zkCallback-2477-thread-1) [    ] o.a.s.c.c.ConnectionManager Watcher org.apache.solr.common.cloud.ConnectionManager@7be169ff name:ZooKeeperConnection Watcher:127.0.0.1:42594 got event WatchedEvent state:SyncConnected type:None path:null path:null type:None
   [junit4]   2> 1739912 INFO  (jetty-launcher-2456-thread-3) [    ] o.a.s.c.c.ConnectionManager Client is connected to ZooKeeper
   [junit4]   2> 1739913 INFO  (jetty-launcher-2456-thread-2) [    ] o.a.s.c.c.ConnectionManager Client is connected to ZooKeeper
   [junit4]   2> 1739913 INFO  (jetty-launcher-2456-thread-1) [    ] o.a.s.c.c.SolrZkClient Using default ZkACLProvider
   [junit4]   2> 1739913 INFO  (jetty-launcher-2456-thread-3) [    ] o.a.s.c.c.SolrZkClient Using default ZkACLProvider
   [junit4]   2> 1739913 INFO  (jetty-launcher-2456-thread-2) [    ] o.a.s.c.c.SolrZkClient Using default ZkACLProvider
   [junit4]   2> 1739925 WARN  (NIOServerCxn.Factory:0.0.0.0/0.0.0.0:0) [    ] o.a.z.s.NIOServerCnxn caught end of stream exception
   [junit4]   2> EndOfStreamException: Unable to read additional data from client sessionid 0x1554c41c2ea0007, likely client has closed socket
   [junit4]   2> 	at org.apache.zookeeper.server.NIOServerCnxn.doIO(NIOServerCnxn.java:228)
   [junit4]   2> 	at org.apache.zookeeper.server.NIOServerCnxnFactory.run(NIOServerCnxnFactory.java:208)
   [junit4]   2> 	at java.lang.Thread.run(Thread.java:745)
   [junit4]   2> 1739925 INFO  (jetty-launcher-2456-thread-4) [n:127.0.0.1:37274_solr    ] o.a.s.c.ZkController Added new OnReconnect listener org.apache.solr.cloud.ZkController$$Lambda$80/1740287535@2d21f775
   [junit4]   2> 1739925 INFO  (jetty-launcher-2456-thread-5) [n:127.0.0.1:43220_solr    ] o.a.s.c.ZkController Added new OnReconnect listener org.apache.solr.cloud.ZkController$$Lambda$80/1740287535@64eaffac
   [junit4]   2> 1739925 INFO  (jetty-launcher-2456-thread-4) [n:127.0.0.1:37274_solr    ] o.a.s.c.c.ConnectionManager Waiting for client to connect to ZooKeeper
   [junit4]   2> 1739925 INFO  (jetty-launcher-2456-thread-5) [n:127.0.0.1:43220_solr    ] o.a.s.c.c.ConnectionManager Waiting for client to connect to ZooKeeper
   [junit4]   2> 1739937 INFO  (jetty-launcher-2456-thread-1) [n:127.0.0.1:42735_solr    ] o.a.s.c.ZkController Added new OnReconnect listener org.apache.solr.cloud.ZkController$$Lambda$80/1740287535@77ebf066
   [junit4]   2> 1739937 INFO  (jetty-launcher-2456-thread-3) [n:127.0.0.1:33309_solr    ] o.a.s.c.ZkController Added new OnReconnect listener org.apache.solr.cloud.ZkController$$Lambda$80/1740287535@32ef7c00
   [junit4]   2> 1739937 WARN  (NIOServerCxn.Factory:0.0.0.0/0.0.0.0:0) [    ] o.a.z.s.NIOServerCnxn caught end of stream exception
   [junit4]   2> EndOfStreamException: Unable to read additional data from client sessionid 0x1554c41c2ea0009, likely client has closed socket
   [junit4]   2> 	at org.apache.zookeeper.server.NIOServerCnxn.doIO(NIOServerCnxn.java:228)
   [junit4]   2> 	at org.apache.zookeeper.server.NIOServerCnxnFactory.run(NIOServerCnxnFactory.java:208)
   [junit4]   2> 	at java.lang.Thread.run(Thread.java:745)
   [junit4]   2> 1739937 INFO  (jetty-launcher-2456-thread-1) [n:127.0.0.1:42735_solr    ] o.a.s.c.c.ConnectionManager Waiting for client to connect to ZooKeeper
   [junit4]   2> 1739937 INFO  (jetty-launcher-2456-thread-3) [n:127.0.0.1:33309_solr    ] o.a.s.c.c.ConnectionManager Waiting for client to connect to ZooKeeper
   [junit4]   2> 1739937 INFO  (jetty-launcher-2456-thread-2) [n:127.0.0.1:36510_solr    ] o.a.s.c.ZkController Added new OnReconnect listener org.apache.solr.cloud.ZkController$$Lambda$80/1740287535@7c1c86c1
   [junit4]   2> 1739937 INFO  (jetty-launcher-2456-thread-2) [n:127.0.0.1:36510_solr    ] o.a.s.c.c.ConnectionManager Waiting for client to connect to ZooKeeper
   [junit4]   2> 1739947 INFO  (zkCallback-2478-thread-1-processing-n:127.0.0.1:37274_solr) [n:127.0.0.1:37274_solr    ] o.a.s.c.c.ConnectionManager Watcher org.apache.solr.common.cloud.ConnectionManager@688ef71b name:ZooKeeperConnection Watcher:127.0.0.1:42594/solr got event WatchedEvent state:SyncConnected type:None path:null path:null type:None
   [junit4]   2> 1739947 INFO  (zkCallback-2479-thread-1-processing-n:127.0.0.1:43220_solr) [n:127.0.0.1:43220_solr    ] o.a.s.c.c.ConnectionManager Watcher org.apache.solr.common.cloud.ConnectionManager@5dba35b7 name:ZooKeeperConnection Watcher:127.0.0.1:42594/solr got event WatchedEvent state:SyncConnected type:None path:null path:null type:None
   [junit4]   2> 1739947 INFO  (jetty-launcher-2456-thread-4) [n:127.0.0.1:37274_solr    ] o.a.s.c.c.ConnectionManager Client is connected to ZooKeeper
   [junit4]   2> 1739947 INFO  (jetty-launcher-2456-thread-5) [n:127.0.0.1:43220_solr    ] o.a.s.c.c.ConnectionManager Client is connected to ZooKeeper
   [junit4]   2> 1739971 INFO  (zkCallback-2481-thread-1-processing-n:127.0.0.1:33309_solr) [n:127.0.0.1:33309_solr    ] o.a.s.c.c.ConnectionManager Watcher org.apache.solr.common.cloud.ConnectionManager@3c6a97c7 name:ZooKeeperConnection Watcher:127.0.0.1:42594/solr got event WatchedEvent state:SyncConnected type:None path:null path:null type:None
   [junit4]   2> 1739971 INFO  (zkCallback-2480-thread-1-processing-n:127.0.0.1:42735_solr) [n:127.0.0.1:42735_solr    ] o.a.s.c.c.ConnectionManager Watcher org.apache.solr.common.cloud.ConnectionManager@60b90d98 name:ZooKeeperConnection Watcher:127.0.0.1:42594/solr got event WatchedEvent state:SyncConnected type:None path:null path:null type:None
   [junit4]   2> 1739971 INFO  (zkCallback-2482-thread-1-processing-n:127.0.0.1:36510_solr) [n:127.0.0.1:36510_solr    ] o.a.s.c.c.ConnectionManager Watcher org.apache.solr.common.cloud.ConnectionManager@5f53fb29 name:ZooKeeperConnection Watcher:127.0.0.1:42594/solr got event WatchedEvent state:SyncConnected type:None path:null path:null type:None
   [junit4]   2> 1739971 INFO  (jetty-launcher-2456-thread-1) [n:127.0.0.1:42735_solr    ] o.a.s.c.c.ConnectionManager Client is connected to ZooKeeper
   [junit4]   2> 1739971 INFO  (jetty-launcher-2456-thread-3) [n:127.0.0.1:33309_solr    ] o.a.s.c.c.ConnectionManager Client is connected to ZooKeeper
   [junit4]   2> 1739971 INFO  (jetty-launcher-2456-thread-2) [n:127.0.0.1:36510_solr    ] o.a.s.c.c.ConnectionManager Client is connected to ZooKeeper
   [junit4]   2> 1739991 INFO  (jetty-launcher-2456-thread-5) [n:127.0.0.1:43220_solr    ] o.a.s.c.c.SolrZkClient makePath: /overseer/queue
   [junit4]   2> 1739991 INFO  (jetty-launcher-2456-thread-4) [n:127.0.0.1:37274_solr    ] o.a.s.c.c.SolrZkClient makePath: /overseer/queue
   [junit4]   2> 1739991 INFO  (jetty-launcher-2456-thread-1) [n:127.0.0.1:42735_solr    ] o.a.s.c.c.SolrZkClient makePath: /overseer/queue
   [junit4]   2> 1739991 INFO  (jetty-launcher-2456-thread-2) [n:127.0.0.1:36510_solr    ] o.a.s.c.c.SolrZkClient makePath: /overseer/queue
   [junit4]   2> 1739991 INFO  (jetty-launcher-2456-thread-3) [n:127.0.0.1:33309_solr    ] o.a.s.c.c.SolrZkClient makePath: /overseer/queue
   [junit4]   2> 1740042 INFO  (jetty-launcher-2456-thread-5) [n:127.0.0.1:43220_solr    ] o.a.s.c.c.SolrZkClient makePath: /overseer/collection-queue-work
   [junit4]   2> 1740042 INFO  (jetty-launcher-2456-thread-4) [n:127.0.0.1:37274_solr    ] o.a.s.c.c.SolrZkClient makePath: /overseer/collection-queue-work
   [junit4]   2> 1740065 INFO  (jetty-launcher-2456-thread-1) [n:127.0.0.1:42735_solr    ] o.a.s.c.c.SolrZkClient makePath: /overseer/collection-queue-work
   [junit4]   2> 1740065 INFO  (jetty-launcher-2456-thread-2) [n:127.0.0.1:36510_solr    ] o.a.s.c.c.SolrZkClient makePath: /overseer/collection-queue-work
   [junit4]   2> 1740065 INFO  (jetty-launcher-2456-thread-3) [n:127.0.0.1:33309_solr    ] o.a.s.c.c.SolrZkClient makePath: /overseer/collection-queue-work
   [junit4]   2> 1740169 INFO  (jetty-launcher-2456-thread-4) [n:127.0.0.1:37274_solr    ] o.a.s.c.c.SolrZkClient makePath: /overseer/collection-map-running
   [junit4]   2> 1740169 INFO  (jetty-launcher-2456-thread-5) [n:127.0.0.1:43220_solr    ] o.a.s.c.c.SolrZkClient makePath: /overseer/collection-map-running
   [junit4]   2> 1740181 INFO  (jetty-launcher-2456-thread-2) [n:127.0.0.1:36510_solr    ] o.a.s.c.c.SolrZkClient makePath: /overseer/collection-map-running
   [junit4]   2> 1740181 INFO  (jetty-launcher-2456-thread-1) [n:127.0.0.1:42735_solr    ] o.a.s.c.c.SolrZkClient makePath: /overseer/collection-map-running
   [junit4]   2> 1740181 INFO  (jetty-launcher-2456-thread-3) [n:127.0.0.1:33309_solr    ] o.a.s.c.c.SolrZkClient makePath: /overseer/collection-map-running
   [junit4]   2> 1740251 INFO  (jetty-launcher-2456-thread-4) [n:127.0.0.1:37274_solr    ] o.a.s.c.c.SolrZkClient makePath: /overseer/collection-map-completed
   [junit4]   2> 1740251 INFO  (jetty-launcher-2456-thread-5) [n:127.0.0.1:43220_solr    ] o.a.s.c.c.SolrZkClient makePath: /overseer/collection-map-completed
   [junit4]   2> 1740267 INFO  (jetty-launcher-2456-thread-2) [n:127.0.0.1:36510_solr    ] o.a.s.c.c.SolrZkClient makePath: /overseer/collection-map-completed
   [junit4]   2> 1740267 INFO  (jetty-launcher-2456-thread-3) [n:127.0.0.1:33309_solr    ] o.a.s.c.c.SolrZkClient makePath: /overseer/collection-map-completed
   [junit4]   2> 1740267 INFO  (jetty-launcher-2456-thread-1) [n:127.0.0.1:42735_solr    ] o.a.s.c.c.SolrZkClient makePath: /overseer/collection-map-completed
   [junit4]   2> 1740345 INFO  (jetty-launcher-2456-thread-5) [n:127.0.0.1:43220_solr    ] o.a.s.c.c.SolrZkClient makePath: /overseer/collection-map-failure
   [junit4]   2> 1740345 INFO  (jetty-launcher-2456-thread-4) [n:127.0.0.1:37274_solr    ] o.a.s.c.c.SolrZkClient makePath: /overseer/collection-map-failure
   [junit4]   2> 1740346 INFO  (jetty-launcher-2456-thread-1) [n:127.0.0.1:42735_solr    ] o.a.s.c.c.SolrZkClient makePath: /overseer/collection-map-failure
   [junit4]   2> 1740345 INFO  (jetty-launcher-2456-thread-3) [n:127.0.0.1:33309_solr    ] o.a.s.c.c.SolrZkClient makePath: /overseer/collection-map-failure
   [junit4]   2> 1740345 INFO  (jetty-launcher-2456-thread-2) [n:127.0.0.1:36510_solr    ] o.a.s.c.c.SolrZkClient makePath: /overseer/collection-map-failure
   [junit4]   2> 1740376 INFO  (jetty-launcher-2456-thread-3) [n:127.0.0.1:33309_solr    ] o.a.s.c.c.SolrZkClient makePath: /live_nodes
   [junit4]   2> 1740376 INFO  (jetty-launcher-2456-thread-5) [n:127.0.0.1:43220_solr    ] o.a.s.c.c.SolrZkClient makePath: /live_nodes
   [junit4]   2> 1740376 INFO  (jetty-launcher-2456-thread-2) [n:127.0.0.1:36510_solr    ] o.a.s.c.c.SolrZkClient makePath: /live_nodes
   [junit4]   2> 1740376 INFO  (jetty-launcher-2456-thread-4) [n:127.0.0.1:37274_solr    ] o.a.s.c.c.SolrZkClient makePath: /live_nodes
   [junit4]   2> 1740376 INFO  (jetty-launcher-2456-thread-1) [n:127.0.0.1:42735_solr    ] o.a.s.c.c.SolrZkClient makePath: /live_nodes
   [junit4]   2> 1740387 INFO  (jetty-launcher-2456-thread-5) [n:127.0.0.1:43220_solr    ] o.a.s.c.c.SolrZkClient makePath: /collections
   [junit4]   2> 1740387 INFO  (jetty-launcher-2456-thread-4) [n:127.0.0.1:37274_solr    ] o.a.s.c.c.SolrZkClient makePath: /collections
   [junit4]   2> 1740387 INFO  (jetty-launcher-2456-thread-1) [n:127.0.0.1:42735_solr    ] o.a.s.c.c.SolrZkClient makePath: /collections
   [junit4]   2> 1740387 INFO  (jetty-launcher-2456-thread-3) [n:127.0.0.1:33309_solr    ] o.a.s.c.c.SolrZkClient makePath: /collections
   [junit4]   2> 1740387 INFO  (jetty-launcher-2456-thread-2) [n:127.0.0.1:36510_solr    ] o.a.s.c.c.SolrZkClient makePath: /collections
   [junit4]   2> 1740405 INFO  (jetty-launcher-2456-thread-5) [n:127.0.0.1:43220_solr    ] o.a.s.c.c.SolrZkClient makePath: /aliases.json
   [junit4]   2> 1740405 INFO  (jetty-launcher-2456-thread-1) [n:127.0.0.1:42735_solr    ] o.a.s.c.c.SolrZkClient makePath: /aliases.json
   [junit4]   2> 1740406 INFO  (jetty-launcher-2456-thread-2) [n:127.0.0.1:36510_solr    ] o.a.s.c.c.SolrZkClient makePath: /aliases.json
   [junit4]   2> 1740406 INFO  (jetty-launcher-2456-thread-3) [n:127.0.0.1:33309_solr    ] o.a.s.c.c.SolrZkClient makePath: /aliases.json
   [junit4]   2> 1740405 INFO  (jetty-launcher-2456-thread-4) [n:127.0.0.1:37274_solr    ] o.a.s.c.c.SolrZkClient makePath: /aliases.json
   [junit4]   2> 1740425 INFO  (jetty-launcher-2456-thread-5) [n:127.0.0.1:43220_solr    ] o.a.s.c.c.SolrZkClient makePath: /clusterstate.json
   [junit4]   2> 1740425 INFO  (jetty-launcher-2456-thread-2) [n:127.0.0.1:36510_solr    ] o.a.s.c.c.SolrZkClient makePath: /clusterstate.json
   [junit4]   2> 1740426 INFO  (jetty-launcher-2456-thread-1) [n:127.0.0.1:42735_solr    ] o.a.s.c.c.SolrZkClient makePath: /clusterstate.json
   [junit4]   2> 1740426 INFO  (jetty-launcher-2456-thread-3) [n:127.0.0.1:33309_solr    ] o.a.s.c.c.SolrZkClient makePath: /clusterstate.json
   [junit4]   2> 1740426 INFO  (jetty-launcher-2456-thread-4) [n:127.0.0.1:37274_solr    ] o.a.s.c.c.SolrZkClient makePath: /clusterstate.json
   [junit4]   2> 1740436 INFO  (jetty-launcher-2456-thread-3) [n:127.0.0.1:33309_solr    ] o.a.s.c.c.SolrZkClient makePath: /security.json
   [junit4]   2> 1740436 INFO  (jetty-launcher-2456-thread-5) [n:127.0.0.1:43220_solr    ] o.a.s.c.c.SolrZkClient makePath: /security.json
   [junit4]   2> 1740436 INFO  (jetty-launcher-2456-thread-2) [n:127.0.0.1:36510_solr    ] o.a.s.c.c.SolrZkClient makePath: /security.json
   [junit4]   2> 1740451 INFO  (jetty-launcher-2456-thread-1) [n:127.0.0.1:42735_solr    ] o.a.s.c.c.SolrZkClient makePath: /security.json
   [junit4]   2> 1740467 INFO  (jetty-launcher-2456-thread-4) [n:127.0.0.1:37274_solr    ] o.a.s.c.c.ZkStateReader Updating cluster state from ZooKeeper... 
   [junit4]   2> 1740467 INFO  (jetty-launcher-2456-thread-3) [n:127.0.0.1:33309_solr    ] o.a.s.c.c.ZkStateReader Updating cluster state from ZooKeeper... 
   [junit4]   2> 1740469 INFO  (jetty-launcher-2456-thread-5) [n:127.0.0.1:43220_solr    ] o.a.s.c.c.ZkStateReader Updating cluster state from ZooKeeper... 
   [junit4]   2> 1740469 INFO  (jetty-launcher-2456-thread-2) [n:127.0.0.1:36510_solr    ] o.a.s.c.c.ZkStateReader Updating cluster state from ZooKeeper... 
   [junit4]   2> 1740483 INFO  (jetty-launcher-2456-thread-1) [n:127.0.0.1:42735_solr    ] o.a.s.c.c.ZkStateReader Updating cluster state from ZooKeeper... 
   [junit4]   2> 1740484 INFO  (jetty-launcher-2456-thread-5) [n:127.0.0.1:43220_solr    ] o.a.s.c.c.ZkStateReader Loaded empty cluster properties
   [junit4]   2> 1740484 INFO  (jetty-launcher-2456-thread-2) [n:127.0.0.1:36510_solr    ] o.a.s.c.c.ZkStateReader Loaded empty cluster properties
   [junit4]   2> 1740483 INFO  (jetty-launcher-2456-thread-4) [n:127.0.0.1:37274_solr    ] o.a.s.c.c.ZkStateReader Loaded empty cluster properties
   [junit4]   2> 1740483 INFO  (jetty-launcher-2456-thread-3) [n:127.0.0.1:33309_solr    ] o.a.s.c.c.ZkStateReader Loaded empty cluster properties
   [junit4]   2> 1740485 INFO  (jetty-launcher-2456-thread-1) [n:127.0.0.1:42735_solr    ] o.a.s.c.c.ZkStateReader Loaded empty cluster properties
   [junit4]   2> 1740485 INFO  (jetty-launcher-2456-thread-5) [n:127.0.0.1:43220_solr    ] o.a.s.c.c.ZkStateReader Updated live nodes from ZooKeeper... (0) -> (0)
   [junit4]   2> 1740485 INFO  (jetty-launcher-2456-thread-2) [n:127.0.0.1:36510_solr    ] o.a.s.c.c.ZkStateReader Updated live nodes from ZooKeeper... (0) -> (0)
   [junit4]   2> 1740485 INFO  (jetty-launcher-2456-thread-4) [n:127.0.0.1:37274_solr    ] o.a.s.c.c.ZkStateReader Updated live nodes from ZooKeeper... (0) -> (0)
   [junit4]   2> 1740486 INFO  (jetty-launcher-2456-thread-3) [n:127.0.0.1:33309_solr    ] o.a.s.c.c.ZkStateReader Updated live nodes from ZooKeeper... (0) -> (0)
   [junit4]   2> 1740486 INFO  (jetty-launcher-2456-thread-1) [n:127.0.0.1:42735_solr    ] o.a.s.c.c.ZkStateReader Updated live nodes from ZooKeeper... (0) -> (0)
   [junit4]   2> 1740487 INFO  (jetty-launcher-2456-thread-2) [n:127.0.0.1:36510_solr    ] o.a.s.c.c.SolrZkClient makePath: /overseer_elect
   [junit4]   2> 1740487 INFO  (jetty-launcher-2456-thread-5) [n:127.0.0.1:43220_solr    ] o.a.s.c.c.SolrZkClient makePath: /overseer_elect
   [junit4]   2> 1740487 INFO  (jetty-launcher-2456-thread-1) [n:127.0.0.1:42735_solr    ] o.a.s.c.c.SolrZkClient makePath: /overseer_elect
   [junit4]   2> 1740487 INFO  (jetty-launcher-2456-thread-3) [n:127.0.0.1:33309_solr    ] o.a.s.c.c.SolrZkClient makePath: /overseer_elect
   [junit4]   2> 1740487 INFO  (jetty-launcher-2456-thread-4) [n:127.0.0.1:37274_solr    ] o.a.s.c.c.SolrZkClient makePath: /overseer_elect
   [junit4]   2> 1740521 INFO  (jetty-launcher-2456-thread-2) [n:127.0.0.1:36510_solr    ] o.a.s.c.c.SolrZkClient makePath: /overseer_elect/election
   [junit4]   2> 1740521 INFO  (jetty-launcher-2456-thread-5) [n:127.0.0.1:43220_solr    ] o.a.s.c.c.SolrZkClient makePath: /overseer_elect/election
   [junit4]   2> 1740521 INFO  (jetty-launcher-2456-thread-1) [n:127.0.0.1:42735_solr    ] o.a.s.c.c.SolrZkClient makePath: /overseer_elect/election
   [junit4]   2> 1740521 INFO  (jetty-launcher-2456-thread-4) [n:127.0.0.1:37274_solr    ] o.a.s.c.c.SolrZkClient makePath: /overseer_elect/election
   [junit4]   2> 1740521 INFO  (jetty-launcher-2456-thread-3) [n:127.0.0.1:33309_solr    ] o.a.s.c.c.SolrZkClient makePath: /overseer_elect/election
   [junit4]   2> 1740552 INFO  (jetty-launcher-2456-thread-5) [n:127.0.0.1:43220_solr    ] o.a.s.c.Overseer Overseer (id=null) closing
   [junit4]   2> 1740552 INFO  (jetty-launcher-2456-thread-1) [n:127.0.0.1:42735_solr    ] o.a.s.c.Overseer Overseer (id=null) closing
   [junit4]   2> 1740552 INFO  (jetty-launcher-2456-thread-2) [n:127.0.0.1:36510_solr    ] o.a.s.c.Overseer Overseer (id=null) closing
   [junit4]   2> 1740560 INFO  (jetty-launcher-2456-thread-3) [n:127.0.0.1:33309_solr    ] o.a.s.c.Overseer Overseer (id=null) closing
   [junit4]   2> 1740560 INFO  (jetty-launcher-2456-thread-4) [n:127.0.0.1:37274_solr    ] o.a.s.c.Overseer Overseer (id=null) closing
   [junit4]   2> 1740577 INFO  (jetty-launcher-2456-thread-5) [n:127.0.0.1:43220_solr    ] o.a.s.c.LeaderElector Joined leadership election with path: /overseer_elect/election/96066812385034252-127.0.0.1:43220_solr-n_0000000000
   [junit4]   2> 1740577 INFO  (jetty-launcher-2456-thread-1) [n:127.0.0.1:42735_solr    ] o.a.s.c.LeaderElector Joined leadership election with path: /overseer_elect/election/96066812385034254-127.0.0.1:42735_solr-n_0000000001
   [junit4]   2> 1740577 INFO  (jetty-launcher-2456-thread-2) [n:127.0.0.1:36510_solr    ] o.a.s.c.LeaderElector Joined leadership election with path: /overseer_elect/election/96066812385034255-127.0.0.1:36510_solr-n_0000000002
   [junit4]   2> 1740596 INFO  (jetty-launcher-2456-thread-3) [n:127.0.0.1:33309_solr    ] o.a.s.c.LeaderElector Joined leadership election with path: /overseer_elect/election/96066812385034253-127.0.0.1:33309_solr-n_0000000003
   [junit4]   2> 1740596 INFO  (jetty-launcher-2456-thread-4) [n:127.0.0.1:37274_solr    ] o.a.s.c.LeaderElector Joined leadership election with path: /overseer_elect/election/96066812385034251-127.0.0.1:37274_solr-n_0000000004
   [junit4]   2> 1740596 INFO  (jetty-launcher-2456-thread-5) [n:127.0.0.1:43220_solr    ] o.a.s.c.OverseerElectionContext I am going to be the leader 127.0.0.1:43220_solr
   [junit4]   2> 1740596 INFO  (jetty-launcher-2456-thread-5) [n:127.0.0.1:43220_solr    ] o.a.s.c.c.SolrZkClient makePath: /overseer_elect/leader
   [junit4]   2> 1740596 INFO  (jetty-launcher-2456-thread-1) [n:127.0.0.1:42735_solr    ] o.a.s.c.LeaderElector Watching path /overseer_elect/election/96066812385034252-127.0.0.1:43220_solr-n_0000000000 to know if I could be the leader
   [junit4]   2> 1740597 INFO  (jetty-launcher-2456-thread-2) [n:127.0.0.1:36510_solr    ] o.a.s.c.LeaderElector Watching path /overseer_elect/election/96066812385034254-127.0.0.1:42735_solr-n_0000000001 to know if I could be the leader
   [junit4]   2> 1740597 INFO  (jetty-launcher-2456-thread-3) [n:127.0.0.1:33309_solr    ] o.a.s.c.LeaderElector Watching path /overseer_elect/election/96066812385034255-127.0.0.1:36510_solr-n_0000000002 to know if I could be the leader
   [junit4]   2> 1740597 INFO  (jetty-launcher-2456-thread-1) [n:127.0.0.1:42735_solr    ] o.a.s.c.ZkController Register node as live in ZooKeeper:/live_nodes/127.0.0.1:42735_solr
   [junit4]   2> 1740597 INFO  (jetty-launcher-2456-thread-2) [n:127.0.0.1:36510_solr    ] o.a.s.c.ZkController Register node as live in ZooKeeper:/live_nodes/127.0.0.1:36510_solr
   [junit4]   2> 1740597 INFO  (jetty-launcher-2456-thread-4) [n:127.0.0.1:37274_solr    ] o.a.s.c.LeaderElector Watching path /overseer_elect/election/96066812385034253-127.0.0.1:33309_solr-n_0000000003 to know if I could be the leader
   [junit4]   2> 1740597 INFO  (jetty-launcher-2456-thread-3) [n:127.0.0.1:33309_solr    ] o.a.s.c.ZkController Register node as live in ZooKeeper:/live_nodes/127.0.0.1:33309_solr
   [junit4]   2> 1740636 INFO  (jetty-launcher-2456-thread-4) [n:127.0.0.1:37274_solr    ] o.a.s.c.ZkController Register node as live in ZooKeeper:/live_nodes/127.0.0.1:37274_solr
   [junit4]   2> 1740636 INFO  (jetty-launcher-2456-thread-1) [n:127.0.0.1:42735_solr    ] o.a.s.c.c.SolrZkClient makePath: /live_nodes/127.0.0.1:42735_solr
   [junit4]   2> 1740636 INFO  (jetty-launcher-2456-thread-3) [n:127.0.0.1:33309_solr    ] o.a.s.c.c.SolrZkClient makePath: /live_nodes/127.0.0.1:33309_solr
   [junit4]   2> 1740636 INFO  (jetty-launcher-2456-thread-2) [n:127.0.0.1:36510_solr    ] o.a.s.c.c.SolrZkClient makePath: /live_nodes/127.0.0.1:36510_solr
   [junit4]   2> 1740636 INFO  (jetty-launcher-2456-thread-5) [n:127.0.0.1:43220_solr    ] o.a.s.c.Overseer Overseer (id=96066812385034252-127.0.0.1:43220_solr-n_0000000000) starting
   [junit4]   2> 1740639 INFO  (jetty-launcher-2456-thread-4) [n:127.0.0.1:37274_solr    ] o.a.s.c.c.SolrZkClient makePath: /live_nodes/127.0.0.1:37274_solr
   [junit4]   2> 1740678 INFO  (zkCallback-2479-thread-1-processing-n:127.0.0.1:43220_solr) [n:127.0.0.1:43220_solr    ] o.a.s.c.c.ZkStateReader A live node change: [WatchedEvent state:SyncConnected type:NodeChildrenChanged path:/live_nodes], has occurred - updating... (live nodes size: [0])
   [junit4]   2> 1740678 INFO  (zkCallback-2481-thread-1-processing-n:127.0.0.1:33309_solr) [n:127.0.0.1:33309_solr    ] o.a.s.c.c.ZkStateReader A live node change: [WatchedEvent state:SyncConnected type:NodeChildrenChanged path:/live_nodes], has occurred - updating... (live nodes size: [0])
   [junit4]   2> 1740678 INFO  (zkCallback-2480-thread-1-processing-n:127.0.0.1:42735_solr) [n:127.0.0.1:42735_solr    ] o.a.s.c.c.ZkStateReader A live node change: [WatchedEvent state:SyncConnected type:NodeChildrenChanged path:/live_nodes], has occurred - updating... (live nodes size: [0])
   [junit4]   2> 1740678 INFO  (zkCallback-2478-thread-1-processing-n:127.0.0.1:37274_solr) [n:127.0.0.1:37274_solr    ] o.a.s.c.c.ZkStateReader A live node change: [WatchedEvent state:SyncConnected type:NodeChildrenChanged path:/live_nodes], has occurred - updating... (live nodes size: [0])
   [junit4]   2> 1740678 INFO  (zkCallback-2482-thread-1-processing-n:127.0.0.1:36510_solr) [n:127.0.0.1:36510_solr    ] o.a.s.c.c.ZkStateReader A live node change: [WatchedEvent state:SyncConnected type:NodeChildrenChanged path:/live_nodes], has occurred - updating... (live nodes size: [0])
   [junit4]   2> 1740694 INFO  (zkCallback-2479-thread-1-processing-n:127.0.0.1:43220_solr) [n:127.0.0.1:43220_solr    ] o.a.s.c.c.ZkStateReader Updated live nodes from ZooKeeper... (0) -> (3)
   [junit4]   2> 1740694 INFO  (zkCallback-2478-thread-1-processing-n:127.0.0.1:37274_solr) [n:127.0.0.1:37274_solr    ] o.a.s.c.c.ZkStateReader Updated live nodes from ZooKeeper... (0) -> (3)
   [junit4]   2> 1740694 INFO  (zkCallback-2480-thread-1-processing-n:127.0.0.1:42735_solr) [n:127.0.0.1:42735_solr    ] o.a.s.c.c.ZkStateReader Updated live nodes from ZooKeeper... (0) -> (3)
   [junit4]   2> 1740694 INFO  (zkCallback-2482-thread-1-processing-n:127.0.0.1:36510_solr) [n:127.0.0.1:36510_solr    ] o.a.s.c.c.ZkStateReader Updated live nodes from ZooKeeper... (0) -> (3)
   [junit4]   2> 1740694 INFO  (zkCallback-2481-thread-1-processing-n:127.0.0.1:33309_solr) [n:127.0.0.1:33309_solr    ] o.a.s.c.c.ZkStateReader Updated live nodes from ZooKeeper... (0) -> (3)
   [junit4]   2> 1740701 INFO  (jetty-launcher-2456-thread-3) [n:127.0.0.1:33309_solr    ] o.a.s.c.CoreContainer Security conf doesn't exist. Skipping setup for authorization module.
   [junit4]   2> 1740701 INFO  (jetty-launcher-2456-thread-3) [n:127.0.0.1:33309_solr    ] o.a.s.c.CoreContainer No authentication plugin used.
   [junit4]   2> 1740702 INFO  (jetty-launcher-2456-thread-3) [n:127.0.0.1:33309_solr    ] o.a.s.c.CorePropertiesLocator Looking for core definitions underneath /home/jenkins/workspace/Lucene-Solr-6.1-Linux/solr/build/solr-core/test/J2/temp/solr.cloud.TestMiniSolrCloudCluster_78ABA6732D8FE0C4-001/tempDir-001/node3/.
   [junit4]   2> 1740702 INFO  (jetty-launcher-2456-thread-3) [n:127.0.0.1:33309_solr    ] o.a.s.c.CorePropertiesLocator Found 0 core definitions
   [junit4]   2> 1740704 INFO  (jetty-launcher-2456-thread-2) [n:127.0.0.1:36510_solr    ] o.a.s.c.CoreContainer Security conf doesn't exist. Skipping setup for authorization module.
   [junit4]   2> 1740704 INFO  (jetty-launcher-2456-thread-2) [n:127.0.0.1:36510_solr    ] o.a.s.c.CoreContainer No authentication plugin used.
   [junit4]   2> 1740704 INFO  (jetty-launcher-2456-thread-2) [n:127.0.0.1:36510_solr    ] o.a.s.c.CorePropertiesLocator Looking for core definitions underneath /home/jenkins/workspace/Lucene-Solr-6.1-Linux/solr/build/solr-core/test/J2/temp/solr.cloud.TestMiniSolrCloudCluster_78ABA6732D8FE0C4-001/tempDir-001/node2/.
   [junit4]   2> 1740704 INFO  (jetty-launcher-2456-thread-2) [n:127.0.0.1:36510_solr    ] o.a.s.c.CorePropertiesLocator Found 0 core definitions
   [junit4]   2> 1740714 INFO  (jetty-launcher-2456-thread-1) [n:127.0.0.1:42735_solr    ] o.a.s.c.CoreContainer Security conf doesn't exist. Skipping setup for authorization module.
   [junit4]   2> 1740714 INFO  (jetty-launcher-2456-thread-1) [n:127.0.0.1:42735_solr    ] o.a.s.c.CoreContainer No authentication plugin used.
   [junit4]   2> 1740715 INFO  (jetty-launcher-2456-thread-1) [n:127.0.0.1:42735_solr    ] o.a.s.c.CorePropertiesLocator Looking for core definitions underneath /home/jenkins/workspace/Lucene-Solr-6.1-Linux/solr/build/solr-core/test/J2/temp/solr.cloud.TestMiniSolrCloudCluster_78ABA6732D8FE0C4-001/tempDir-001/node1/.
   [junit4]   2> 1740715 INFO  (jetty-launcher-2456-thread-1) [n:127.0.0.1:42735_solr    ] o.a.s.c.CorePropertiesLocator Found 0 core definitions
   [junit4]   2> 1740716 INFO  (zkCallback-2480-thread-1-processing-n:127.0.0.1:42735_solr) [n:127.0.0.1:42735_solr    ] o.a.s.c.c.ZkStateReader A live node change: [WatchedEvent state:SyncConnected type:NodeChildrenChanged path:/live_nodes], has occurred - updating... (live nodes size: [3])
   [junit4]   2> 1740716 INFO  (zkCallback-2481-thread-1-processing-n:127.0.0.1:33309_solr) [n:127.0.0.1:33309_solr    ] o.a.s.c.c.ZkStateReader A live node change: [WatchedEvent state:SyncConnected type:NodeChildrenChanged path:/live_nodes], has occurred - updating... (live nodes size: [3])
   [junit4]   2> 1740716 INFO  (zkCallback-2482-thread-1-processing-n:127.0.0.1:36510_solr) [n:127.0.0.1:36510_solr    ] o.a.s.c.c.ZkStateReader A live node change: [WatchedEvent state:SyncConnected type:NodeChildrenChanged path:/live_nodes], has occurred - updating... (live nodes size: [3])
   [junit4]   2> 1740716 INFO  (zkCallback-2479-thread-1-processing-n:127.0.0.1:43220_solr) [n:127.0.0.1:43220_solr    ] o.a.s.c.c.ZkStateReader A live node change: [WatchedEvent state:SyncConnected type:NodeChildrenChanged path:/live_nodes], has occurred - updating... (live nodes size: [3])
   [junit4]   2> 1740716 INFO  (zkCallback-2478-thread-1-processing-n:127.0.0.1:37274_solr) [n:127.0.0.1:37274_solr    ] o.a.s.c.c.ZkStateReader A live node change: [WatchedEvent state:SyncConnected type:NodeChildrenChanged path:/live_nodes], has occurred - updating... (live nodes size: [3])
   [junit4]   2> 1740716 INFO  (jetty-launcher-2456-thread-2) [n:127.0.0.1:36510_solr    ] o.a.s.s.SolrDispatchFilter user.dir=/home/jenkins/workspace/Lucene-Solr-6.1-Linux/solr/build/solr-core/test/J2
   [junit4]   2> 1740716 INFO  (jetty-launcher-2456-thread-2) [n:127.0.0.1:36510_solr    ] o.a.s.s.SolrDispatchFilter SolrDispatchFilter.init() done
   [junit4]   2> 1740716 INFO  (zkCallback-2480-thread-1-processing-n:127.0.0.1:42735_solr) [n:127.0.0.1:42735_solr    ] o.a.s.c.c.ZkStateReader Updated live nodes from ZooKeeper... (3) -> (4)
   [junit4]   2> 1740716 INFO  (jetty-launcher-2456-thread-1) [n:127.0.0.1:42735_solr    ] o.a.s.s.SolrDispatchFilter user.dir=/home/jenkins/workspace/Lucene-Solr-6.1-Linux/solr/build/solr-core/test/J2
   [junit4]   2> 1740716 INFO  (jetty-launcher-2456-thread-1) [n:127.0.0.1:42735_solr    ] o.a.s.s.SolrDispatchFilter SolrDispatchFilter.init() done
   [junit4]   2> 1740716 INFO  (zkCallback-2479-thread-1-processing-n:127.0.0.1:43220_solr) [n:127.0.0.1:43220_solr    ] o.a.s.c.c.ZkStateReader Updated live nodes from ZooKeeper... (3) -> (4)
   [junit4]   2> 1740717 INFO  (zkCallback-2482-thread-1-processing-n:127.0.0.1:36510_solr) [n:127.0.0.1:36510_solr    ] o.a.s.c.c.ZkStateReader Updated live nodes from ZooKeeper... (3) -> (4)
   [junit4]   2> 1740716 INFO  (jetty-launcher-2456-thread-3) [n:127.0.0.1:33309_solr    ] o.a.s.s.SolrDispatchFilter user.dir=/home/jenkins/workspace/Lucene-Solr-6.1-Linux/solr/build/solr-core/test/J2
   [junit4]   2> 1740717 INFO  (jetty-launcher-2456-thread-3) [n:127.0.0.1:33309_solr    ] o.a.s.s.SolrDispatchFilter SolrDispatchFilter.init() done
   [junit4]   2> 1740716 INFO  (zkCallback-2481-thread-1-processing-n:127.0.0.1:33309_solr) [n:127.0.0.1:33309_solr    ] o.a.s.c.c.ZkStateReader Updated live nodes from ZooKeeper... (3) -> (4)
   [junit4]   2> 1740724 INFO  (jetty-launcher-2456-thread-4) [n:127.0.0.1:37274_solr    ] o.a.s.c.CoreContainer Security conf doesn't exist. Skipping setup for authorization module.
   [junit4]   2> 1740724 INFO  (jetty-launcher-2456-thread-4) [n:127.0.0.1:37274_solr    ] o.a.s.c.CoreContainer No authentication plugin used.
   [junit4]   2> 1740724 INFO  (jetty-launcher-2456-thread-4) [n:127.0.0.1:37274_solr    ] o.a.s.c.CorePropertiesLocator Looking for core definitions underneath /home/jenkins/workspace/Lucene-Solr-6.1-Linux/solr/build/solr-core/test/J2/temp/solr.cloud.TestMiniSolrCloudCluster_78ABA6732D8FE0C4-001/tempDir-001/node4/.
   [junit4]   2> 1740724 INFO  (jetty-launcher-2456-thread-4) [n:127.0.0.1:37274_solr    ] o.a.s.c.CorePropertiesLocator Found 0 core definitions
   [junit4]   2> 1740739 INFO  (zkCallback-2478-thread-1-processing-n:127.0.0.1:37274_solr) [n:127.0.0.1:37274_solr    ] o.a.s.c.c.ZkStateReader Updated live nodes from ZooKeeper... (3) -> (4)
   [junit4]   2> 1740739 INFO  (jetty-launcher-2456-thread-4) [n:127.0.0.1:37274_solr    ] o.a.s.s.SolrDispatchFilter user.dir=/home/jenkins/workspace/Lucene-Solr-6.1-Linux/solr/build/solr-core/test/J2
   [junit4]   2> 1740739 INFO  (jetty-launcher-2456-thread-4) [n:127.0.0.1:37274_solr    ] o.a.s.s.SolrDispatchFilter SolrDispatchFilter.init() done
   [junit4]   2> 1740739 INFO  (jetty-launcher-2456-thread-5) [n:127.0.0.1:43220_solr    ] o.a.s.c.c.SolrZkClient makePath: /overseer/queue-work
   [junit4]   2> 1740852 INFO  (jetty-launcher-2456-thread-5) [n:127.0.0.1:43220_solr    ] o.a.s.c.OverseerAutoReplicaFailoverThread Starting OverseerAutoReplicaFailoverThread autoReplicaFailoverWorkLoopDelay=10000 autoReplicaFailoverWaitAfterExpiration=30000 autoReplicaFailoverBadNodeExpiration=60000
   [junit4]   2> 1740853 INFO  (OverseerCollectionConfigSetProcessor-96066812385034252-127.0.0.1:43220_solr-n_0000000000) [n:127.0.0.1:43220_solr    ] o.a.s.c.OverseerTaskProcessor Process current queue of overseer operations
   [junit4]   2> 1740853 INFO  (OverseerStateUpdate-96066812385034252-127.0.0.1:43220_solr-n_0000000000) [n:127.0.0.1:43220_solr    ] o.a.s.c.Overseer Starting to work on the main queue
   [junit4]   2> 1740853 INFO  (jetty-launcher-2456-thread-5) [n:127.0.0.1:43220_solr    ] o.a.s.c.ZkController Publish node=127.0.0.1:43220_solr as DOWN
   [junit4]   2> 1740861 INFO  (OverseerStateUpdate-96066812385034252-127.0.0.1:43220_solr-n_0000000000) [n:127.0.0.1:43220_solr    ] o.a.s.c.c.ZkStateReader Updated live nodes from ZooKeeper... (4) -> (4)
   [junit4]   2> 1740889 INFO  (OverseerStateUpdate-96066812385034252-127.0.0.1:43220_solr-n_0000000000) [n:127.0.0.1:43220_solr    ] o.a.s.c.Overseer processMessage: queueSize: 1, message = {
   [junit4]   2>   "operation":"downnode",
   [junit4]   2>   "node_name":"127.0.0.1:43220_solr"} current state version: 0
   [junit4]   2> 1740889 INFO  (OverseerStateUpdate-96066812385034252-127.0.0.1:43220_solr-n_0000000000) [n:127.0.0.1:43220_solr    ] o.a.s.c.o.NodeMutator DownNode state invoked for node: 127.0.0.1:43220_solr
   [junit4]   2> 1741889 INFO  (jetty-launcher-2456-thread-5) [n:127.0.0.1:43220_solr    ] o.a.s.c.ZkController Register node as live in ZooKeeper:/live_nodes/127.0.0.1:43220_solr
   [junit4]   2> 1741908 INFO  (jetty-launcher-2456-thread-5) [n:127.0.0.1:43220_solr    ] o.a.s.c.c.SolrZkClient makePath: /live_nodes/127.0.0.1:43220_solr
   [junit4]   2> 1741919 INFO  (zkCallback-2479-thread-1-processing-n:127.0.0.1:43220_solr) [n:127.0.0.1:43220_solr    ] o.a.s.c.c.ZkStateReader A live node change: [WatchedEvent state:SyncConnected type:NodeChildrenChanged path:/live_nodes], has occurred - updating... (live nodes size: [4])
   [junit4]   2> 1741919 INFO  (zkCallback-2478-thread-1-processing-n:127.0.0.1:37274_solr) [n:127.0.0.1:37274_solr    ] o.a.s.c.c.ZkStateReader A live node change: [WatchedEvent state:SyncConnected type:NodeChildrenChanged path:/live_nodes], has occurred - updating... (live nodes size: [4])
   [junit4]   2> 1741919 INFO  (zkCallback-2482-thread-1-processing-n:127.0.0.1:36510_solr) [n:127.0.0.1:36510_solr    ] o.a.s.c.c.ZkStateReader A live node change: [WatchedEvent state:SyncConnected type:NodeChildrenChanged path:/live_nodes], has occurred - updating... (live nodes size: [4])
   [junit4]   2> 1741919 INFO  (zkCallback-2480-thread-1-processing-n:127.0.0.1:42735_solr) [n:127.0.0.1:42735_solr    ] o.a.s.c.c.ZkStateReader A live node change: [WatchedEvent state:SyncConnected type:NodeChildrenChanged path:/live_nodes], has occurred - updating... (live nodes size: [4])
   [junit4]   2> 1741919 INFO  (zkCallback-2478-thread-1-processing-n:127.0.0.1:37274_solr) [n:127.0.0.1:37274_solr    ] o.a.s.c.c.ZkStateReader Updated live nodes from ZooKeeper... (4) -> (5)
   [junit4]   2> 1741919 INFO  (zkCallback-2481-thread-1-processing-n:127.0.0.1:33309_solr) [n:127.0.0.1:33309_solr    ] o.a.s.c.c.ZkStateReader A live node change: [WatchedEvent state:SyncConnected type:NodeChildrenChanged path:/live_nodes], has occurred - updating... (live nodes size: [4])
   [junit4]   2> 1741919 INFO  (zkCallback-2482-thread-1-processing-n:127.0.0.1:36510_solr) [n:127.0.0.1:36510_solr    ] o.a.s.c.c.ZkStateReader Updated live nodes from ZooKeeper... (4) -> (5)
   [junit4]   2> 1741919 INFO  (zkCallback-2480-thread-1-processing-n:127.0.0.1:42735_solr) [n:127.0.0.1:42735_solr    ] o.a.s.c.c.ZkStateReader Updated live nodes from ZooKeeper... (4) -> (5)
   [junit4]   2> 1741919 INFO  (zkCallback-2481-thread-1-processing-n:127.0.0.1:33309_solr) [n:127.0.0.1:33309_solr    ] o.a.s.c.c.ZkStateReader Updated live nodes from ZooKeeper... (4) -> (5)
   [junit4]   2> 1741919 INFO  (zkCallback-2479-thread-1-processing-n:127.0.0.1:43220_solr) [n:127.0.0.1:43220_solr    ] o.a.s.c.c.ZkStateReader Updated live nodes from ZooKeeper... (4) -> (5)
   [junit4]   2> 1741932 INFO  (jetty-launcher-2456-thread-5) [n:127.0.0.1:43220_solr    ] o.a.s.c.CoreContainer Security conf doesn't exist. Skipping setup for authorization module.
   [junit4]   2> 1741932 INFO  (jetty-launcher-2456-thread-5) [n:127.0.0.1:43220_solr    ] o.a.s.c.CoreContainer No authentication plugin used.
   [junit4]   2> 1741932 INFO  (jetty-launcher-2456-thread-5) [n:127.0.0.1:43220_solr    ] o.a.s.c.CorePropertiesLocator Looking for core definitions underneath /home/jenkins/workspace/Lucene-Solr-6.1-Linux/solr/build/solr-core/test/J2/temp/solr.cloud.TestMiniSolrCloudCluster_78ABA6732D8FE0C4-001/tempDir-001/node5/.
   [junit4]   2> 1741932 INFO  (jetty-launcher-2456-thread-5) [n:127.0.0.1:43220_solr    ] o.a.s.c.CorePropertiesLocator Found 0 core definitions
   [junit4]   2> 1741933 INFO  (jetty-launcher-2456-thread-5) [n:127.0.0.1:43220_solr    ] o.a.s.s.SolrDispatchFilter user.dir=/home/jenkins/workspace/Lucene-Solr-6.1-Linux/solr/build/solr-core/test/J2
   [junit4]   2> 1741933 INFO  (jetty-launcher-2456-thread-5) [n:127.0.0.1:43220_solr    ] o.a.s.s.SolrDispatchFilter SolrDispatchFilter.init() done
   [junit4]   2> 1741933 INFO  (TEST-TestMiniSolrCloudCluster.testSegmentTerminateEarly-seed#[78ABA6732D8FE0C4]) [    ] o.a.s.c.c.SolrZkClient Using default ZkCredentialsProvider
   [junit4]   2> 1741933 INFO  (TEST-TestMiniSolrCloudCluster.testSegmentTerminateEarly-seed#[78ABA6732D8FE0C4]) [    ] o.a.s.c.c.ConnectionManager Waiting for client to connect to ZooKeeper
   [junit4]   2> 1741956 INFO  (zkCallback-2488-thread-1) [    ] o.a.s.c.c.ConnectionManager Watcher org.apache.solr.common.cloud.ConnectionManager@205de481 name:ZooKeeperConnection Watcher:127.0.0.1:42594 got event WatchedEvent state:SyncConnected type:None path:null path:null type:None
   [junit4]   2> 1741956 INFO  (TEST-TestMiniSolrCloudCluster.testSegmentTerminateEarly-seed#[78ABA6732D8FE0C4]) [    ] o.a.s.c.c.ConnectionManager Client is connected to ZooKeeper
   [junit4]   2> 1741956 INFO  (TEST-TestMiniSolrCloudCluster.testSegmentTerminateEarly-seed#[78ABA6732D8FE0C4]) [    ] o.a.s.c.c.SolrZkClient Using default ZkACLProvider
   [junit4]   2> 1741958 INFO  (TEST-TestMiniSolrCloudCluster.testSegmentTerminateEarly-seed#[78ABA6732D8FE0C4]) [    ] o.a.s.c.s.i.CloudSolrClient Final constructed zkHost string: 127.0.0.1:42594/solr
   [junit4]   2> 1741959 INFO  (TEST-TestMiniSolrCloudCluster.testSegmentTerminateEarly-seed#[78ABA6732D8FE0C4]) [    ] o.a.s.c.c.SolrZkClient Using default ZkCredentialsProvider
   [junit4]   2> 1741959 INFO  (TEST-TestMiniSolrCloudCluster.testSegmentTerminateEarly-seed#[78ABA6732D8FE0C4]) [    ] o.a.s.c.c.ConnectionManager Waiting for client to connect to ZooKeeper
   [junit4]   2> 1741978 INFO  (zkCallback-2490-thread-1) [    ] o.a.s.c.c.ConnectionManager Watcher org.apache.solr.common.cloud.ConnectionManager@722ccaea name:ZooKeeperConnection Watcher:127.0.0.1:42594/solr got event WatchedEvent state:SyncConnected type:None path:null path:null type:None
   [junit4]   2> 1741978 INFO  (TEST-TestMiniSolrCloudCluster.testSegmentTerminateEarly-seed#[78ABA6732D8FE0C4]) [    ] o.a.s.c.c.ConnectionManager Client is connected to ZooKeeper
   [junit4]   2> 1741979 INFO  (TEST-TestMiniSolrCloudCluster.testSegmentTerminateEarly-seed#[78ABA6732D8FE0C4]) [    ] o.a.s.c.c.SolrZkClient Using default ZkACLProvider
   [junit4]   2> 1741979 INFO  (TEST-TestMiniSolrCloudCluster.testSegmentTerminateEarly-seed#[78ABA6732D8FE0C4]) [    ] o.a.s.c.c.SolrZkClient makePath: /configs/solrCloudCollectionConfig/protwords.txt
   [junit4]   2> 1742000 INFO  (TEST-TestMiniSolrCloudCluster.testSegmentTerminateEarly-seed#[78ABA6732D8FE0C4]) [    ] o.a.s.c.c.SolrZkClient makePath: /configs/solrCloudCollectionConfig/solrconfig-delaying-component.xml
   [junit4]   2> 1742022 INFO  (TEST-TestMiniSolrCloudCluster.testSegmentTerminateEarly-seed#[78ABA6732D8FE0C4]) [    ] o.a.s.c.c.SolrZkClient makePath: /configs/solrCloudCollectionConfig/bad_solrconfig.xml
   [junit4]   2> 1742032 INFO  (TEST-TestMiniSolrCloudCluster.testSegmentTerminateEarly-seed#[78ABA6732D8FE0C4]) [    ] o.a.s.c.c.SolrZkClient makePath: /configs/solrCloudCollectionConfig/solrconfig-sortingmergepolicyfactory.xml
   [junit4]   2> 1742065 INFO  (TEST-TestMiniSolrCloudCluster.testSegmentTerminateEarly-seed#[78ABA6732D8FE0C4]) [    ] o.a.s.c.c.SolrZkClient makePath: /configs/solrCloudCollectionConfig/solrconfig-nocache.xml
   [junit4]   2> 1742079 INFO  (TEST-TestMiniSolrCloudCluster.testSegmentTerminateEarly-seed#[78ABA6732D8FE0C4]) [    ] o.a.s.c.c.SolrZkClient makePath: /configs/solrCloudCollectionConfig/solrconfig-implicitproperties.xml
   [junit4]   2> 1742095 INFO  (TEST-TestMiniSolrCloudCluster.testSegmentTerminateEarly-seed#[78ABA6732D8FE0C4]) [    ] o.a.s.c.c.SolrZkClient makePath: /configs/solrCloudCollectionConfig/solrconfig-mergepolicy-legacy.xml
   [junit4]   2> 1742105 INFO  (TEST-TestMiniSolrCloudCluster.testSegmentTerminateEarly-seed#[78ABA6732D8FE0C4]) [    ] o.a.s.c.c.SolrZkClient makePath: /configs/solrCloudCollectionConfig/bad-schema-uniquekey-uses-default.xml
   [junit4]   2> 1742111 INFO  (TEST-TestMiniSolrCloudCluster.testSegmentTerminateEarly-seed#[78ABA6732D8FE0C4]) [    ] o.a.s.c.c.SolrZkClient makePath: /configs/solrCloudCollectionConfig/bad-schema-sim-default-has-no-explicit-sim.xml
   [junit4]   2> 1742121 INFO  (TEST-TestMiniSolrCloudCluster.testSegmentTerminateEarly-seed#[78ABA6732D8FE0C4]) [    ] o.a.s.c.c.SolrZkClient makePath: /configs/solrCloudCollectionConfig/bad-schema-uniquekey-multivalued.xml
   [junit4]   2> 1742124 INFO  (TEST-TestMiniSolrCloudCluster.testSegmentTerminateEarly-seed#[78ABA6732D8FE0C4]) [    ] o.a.s.c.c.SolrZkClient makePath: /configs/solrCloudCollectionConfig/analyzingInfixSuggest.txt
   [junit4]   2> 1742135 INFO  (TEST-TestMiniSolrCloudCluster.testSegmentTerminateEarly-seed#[78ABA6732D8FE0C4]) [    ] o.a.s.c.c.SolrZkClient makePath: /configs/solrCloudCollectionConfig/missleading.extension.updateprocessor.js.txt
   [junit4]   2> 1742151 INFO  (TEST-TestMiniSolrCloudCluster.testSegmentTerminateEarly-seed#[78ABA6732D8FE0C4]) [    ] o.a.s.c.c.SolrZkClient makePath: /configs/solrCloudCollectionConfig/bad-schema-multiple-asterisk-copyfield-source-should-fail-test.xml
   [junit4]   2> 1742154 INFO  (TEST-TestMiniSolrCloudCluster.testSegmentTerminateEarly-seed#[78ABA6732D8FE0C4]) [    ] o.a.s.c.c.SolrZkClient makePath: /configs/solrCloudCollectionConfig/schema-replication2.xml
   [junit4]   2> 1742158 INFO  (TEST-TestMiniSolrCloudCluster.testSegmentTerminateEarly-seed#[78ABA6732D8FE0C4]) [    ] o.a.s.c.c.SolrZkClient makePath: /configs/solrCloudCollectionConfig/solrconfig-infostream-logging.xml
   [junit4]   2> 1742190 INFO  (TEST-TestMiniSolrCloudCluster.testSegmentTerminateEarly-seed#[78ABA6732D8FE0C4]) [    ] o.a.s.c.c.SolrZkClient makePath: /configs/solrCloudCollectionConfig/solrconfig-collapseqparser.xml
   [junit4]   2> 1742209 INFO  (TEST-TestMiniSolrCloudCluster.testSegmentTerminateEarly-seed#[78ABA6732D8FE0C4]) [    ] o.a.s.c.c.SolrZkClient makePath: /configs/solrCloudCollectionConfig/bad-schema-currency-ft-bogus-code-in-xml.xml
   [junit4]   2> 1742219 INFO  (TEST-TestMiniSolrCloudCluster.testSegmentTerminateEarly-seed#[78ABA6732D8FE0C4]) [    ] o.a.s.c.c.SolrZkClient makePath: /configs/solrCloudCollectionConfig/old_synonyms.txt
   [junit4]   2> 1742233 INFO  (TEST-TestMiniSolrCloudCluster.testSegmentTerminateEarly-seed#[78ABA6732D8FE0C4]) [    ] o.a.s.c.c.SolrZkClient makePath: /configs/solrCloudCollectionConfig/enumsConfig.xml
   [junit4]   2> 1742249 INFO  (TEST-TestMiniSolrCloudCluster.testSegmentTerminateEarly-seed#[78ABA6732D8FE0C4]) [    ] o.a.s.c.c.SolrZkClient makePath: /configs/solrCloudCollectionConfig/solrconfig-script-updateprocessor.xml
   [junit4]   2> 1742264 INFO  (TEST-TestMiniSolrCloudCluster.testSegmentTerminateEarly-seed#[78ABA6732D8FE0C4]) [    ] o.a.s.c.c.SolrZkClient makePath: /configs/solrCloudCollectionConfig/schema-add-schema-fields-update-processor.xml
   [junit4]   2> 1742270 INFO  (TEST-TestMiniSolrCloudCluster.testSegmentTerminateEarly-seed#[78ABA6732D8FE0C4]) [    ] o.a.s.c.c.SolrZkClient makePath: /configs/solrCloudCollectionConfig/solrconfig-mergepolicyfactory-nocfs.xml
   [junit4]   2> 1742273 INFO  (TEST-TestMiniSolrCloudCluster.testSegmentTerminateEarly-seed#[78ABA6732D8FE0C4]) [    ] o.a.s.c.c.SolrZkClient makePath: /configs/solrCloudCollectionConfig/bad-schema-sweetspot-both-tf.xml
   [junit4]   2> 1742278 INFO  (TEST-TestMiniSolrCloudCluster.testSegmentTerminateEarly-seed#[78ABA6732D8FE0C4]) [    ] o.a.s.c.c.SolrZkClient makePath: /configs/solrCloudCollectionConfig/schema-phrasesuggest.xml
   [junit4]   2> 1742287 INFO  (TEST-TestMiniSolrCloudCluster.testSegmentTerminateEarly-seed#[78ABA6732D8FE0C4]) [    ] o.a.s.c.c.SolrZkClient makePath: /configs/solrCloudCollectionConfig/solrconfig.xml
   [junit4]   2> 1742306 INFO  (TEST-TestMiniSolrCloudCluster.testSegmentTerminateEarly-seed#[78ABA6732D8FE0C4]) [    ] o.a.s.c.c.SolrZkClient makePath: /configs/solrCloudCollectionConfig/solrconfig-delpolicy1.xml
   [junit4]   2> 1742308 INFO  (TEST-TestMiniSolrCloudCluster.testSegmentTerminateEarly-seed#[78ABA6732D8FE0C4]) [    ] o.a.s.c.c.SolrZkClient makePath: /configs/solrCloudCollectionConfig/schema-sim.xml
   [junit4]   2> 1742321 INFO  (TEST-TestMiniSolrCloudCluster.testSegmentTerminateEarly-seed#[78ABA6732D8FE0C4]) [    ] o.a.s.c.c.SolrZkClient makePath: /configs/solrCloudCollectionConfig/schema15.xml
   [junit4]   2> 1742334 INFO  (TEST-TestMiniSolrCloudCluster.testSegmentTerminateEarly-seed#[78ABA6732D8FE0C4]) [    ] o.a.s.c.c.SolrZkClient makePath: /configs/solrCloudCollectionConfig/schema-sql.xml
   [junit4]   2> 1742352 INFO  (TEST-TestMiniSolrCloudCluster.testSegmentTerminateEarly-seed#[78ABA6732D8FE0C4]) [    ] o.a.s.c.c.SolrZkClient makePath: /configs/solrCloudCollectionConfig/bad-schema-misplaced-asterisk-copyfield-source-should-fail-test.xml
   [junit4]   2> 1742368 INFO  (TEST-TestMiniSolrCloudCluster.testSegmentTerminateEarly-seed#[78ABA6732D8FE0C4]) [    ] o.a.s.c.c.SolrZkClient makePath: /configs/solrCloudCollectionConfig/stemdict.txt
   [junit4]   2> 1742370 INFO  (TEST-TestMiniSolrCloudCluster.testSegmentTerminateEarly-seed#[78ABA6732D8FE0C4]) [    ] o.a.s.c.c.SolrZkClient makePath: /configs/solrCloudCollectionConfig/hunspell-test.aff
   [junit4]   2> 1742383 INFO  (TEST-TestMiniSolrCloudCluster.testSegmentTerminateEarly-seed#[78ABA6732D8FE0C4]) [    ] o.a.s.c.c.SolrZkClient makePath: /configs/solrCloudCollectionConfig/solrconfig-sql.xml
   [junit4]   2> 1742397 INFO  (TEST-TestMiniSolrCloudCluster.testSegmentTerminateEarly-seed#[78ABA6732D8FE0C4]) [    ] o.a.s.c.c.SolrZkClient makePath: /configs/solrCloudCollectionConfig/solrconfig-spatial.xml
   [junit4]   2> 1742400 INFO  (TEST-TestMiniSolrCloudCluster.testSegmentTerminateEarly-seed#[78ABA6732D8FE0C4]) [    ] o.a.s.c.c.SolrZkClient makePath: /configs/solrCloudCollectionConfig/solrconfig-slave1.xml
   [junit4]   2> 1742420 INFO  (TEST-TestMiniSolrCloudCluster.testSegmentTerminateEarly-seed#[78ABA6732D8FE0C4]) [    ] o.a.s.c.c.SolrZkClient makePath: /configs/solrCloudCollectionConfig/bad-schema-dup-fieldType.xml
   [junit4]   2> 1742435 INFO  (TEST-TestMiniSolrCloudCluster.testSegmentTerminateEarly-seed#[78ABA6732D8FE0C4]) [    ] o.a.s.c.c.SolrZkClient makePath: /configs/solrCloudCollectionConfig/bad-schema-external-filefield.xml
   [junit4]   2> 1742450 INFO  (TEST-TestMiniSolrCloudCluster.testSegmentTerminateEarly-seed#[78ABA6732D8FE0C4]) [    ] o.a.s.c.c.SolrZkClient makePath: /configs/solrCloudCollectionConfig/solrconfig-query-parser-init.xml
   [junit4]   2> 1742469 INFO  (TEST-TestMiniSolrCloudCluster.testSegmentTerminateEarly-seed#[78ABA6732D8FE0C4]) [    ] o.a.s.c.c.SolrZkClient makePath: /configs/solrCloudCollectionConfig/bad-solrconfig-nrtmode.xml
   [junit4]   2> 1742495 INFO  (TEST-TestMiniSolrCloudCluster.testSegmentTerminateEarly-seed#[78ABA6732D8FE0C4]) [    ] o.a.s.c.c.SolrZkClient makePath: /configs/solrCloudCollectionConfig/schema-complex-phrase.xml
   [junit4]   2> 1742527 INFO  (TEST-TestMiniSolrCloudCluster.testSegmentTerminateEarly-seed#[78ABA6732D8FE0C4]) [    ] o.a.s.c.c.SolrZkClient makePath: /configs/solrCloudCollectionConfig/conditional.updateprocessor.js
   [junit4]   2> 1742530 INFO  (TEST-TestMiniSolrCloudCluster.testSegmentTerminateEarly-seed#[78ABA6732D8FE0C4]) [    ] o.a.s.c.c.SolrZkClient makePath: /configs/solrCloudCollectionConfig/bad-schema-analyzer-class-and-nested.xml
   [junit4]   2> 1742550 INFO  (TEST-TestMiniSolrCloudCluster.testSegmentTerminateEarly-seed#[78ABA6732D8FE0C4]) [    ] o.a.s.c.c.SolrZkClient makePath: /configs/solrCloudCollectionConfig/schema-eff.xml
   [junit4]   2> 1742559 INFO  (TEST-TestMiniSolrCloudCluster.testSegmentTerminateEarly-seed#[78ABA6732D8FE0C4]) [    ] o.a.s.c.c.SolrZkClient makePath: /configs/solrCloudCollectionConfig/schema-folding.xml
   [junit4]   2> 1742591 INFO  (TEST-TestMiniSolrCloudCluster.testSegmentTerminateEarly-seed#[78ABA6732D8FE0C4]) [    ] o.a.s.c.c.SolrZkClient makePath: /configs/solrCloudCollectionConfig/solrconfig-tieredmergepolicyfactory.xml
   [junit4]   2> 1742626 INFO  (TEST-TestMiniSolrCloudCluster.testSegmentTerminateEarly-seed#[78ABA6732D8FE0C4]) [    ] o.a.s.c.c.SolrZkClient makePath: /configs/solrCloudCollectionConfig/schema-simpleqpplugin.xml
   [junit4]   2> 1742636 INFO  (TEST-TestMiniSolrCloudCluster.testSegmentTerminateEarly-seed#[78ABA6732D8FE0C4]) [    ] o.a.s.c.c.SolrZkClient makePath: /configs/solrCloudCollectionConfig/solrconfig-hash.xml
   [junit4]   2> 1742656 INFO  (TEST-TestMiniSolrCloudCluster.testSegmentTerminateEarly-seed#[78ABA6732D8FE0C4]) [    ] o.a.s.c.c.SolrZkClient makePath: /configs/solrCloudCollectionConfig/stopwords.txt
   [junit4]   2> 1742668 INFO  (TEST-TestMiniSolrCloudCluster.testSegmentTerminateEarly-seed#[78ABA6732D8FE0C4]) [    ] o.a.s.c.c.SolrZkClient makePath: /configs/solrCloudCollectionConfig/bad-schema-dynamicfield-required.xml
   [junit4]   2> 1742672 INFO  (TEST-TestMiniSolrCloudCluster.testSegmentTerminateEarly-seed#[78ABA6732D8FE0C4]) [    ] o.a.s.c.c.SolrZkClient makePath: /configs/solrCloudCollectionConfig/solrconfig-mergepolicy-nocfs.xml
   [junit4]   2> 1742686 INFO  (TEST-TestMiniSolrCloudCluster.testSegmentTerminateEarly-seed#[78ABA6732D8FE0C4]) [    ] o.a.s.c.c.SolrZkClient makePath: /configs/solrCloudCollectionConfig/bad-solrconfig-bogus-scriptengine-name.xml
   [junit4]   2> 1742705 INFO  (TEST-TestMiniSolrCloudCluster.testSegmentTerminateEarly-seed#[78ABA6732D8FE0C4]) [    ] o.a.s.c.c.SolrZkClient makePath: /configs/solrCloudCollectionConfig/throw.error.on.add.updateprocessor.js
   [junit4]   2> 1742715 INFO  (TEST-TestMiniSolrCloudCluster.testSegmentTerminateEarly-seed#[78ABA6732D8FE0C4]) [    ] o.a.s.c.c.SolrZkClient makePath: /configs/solrCloudCollectionConfig/solrconfig-minimal.xml
   [junit4]   2> 1742744 INFO  (TEST-TestMiniSolrCloudCluster.testSegmentTerminateEarly-seed#[78ABA6732D8FE0C4]) [    ] o.a.s.c.c.SolrZkClient makePath: /configs/solrCloudCollectionConfig/solrconfig-defaults.xml
   [junit4]   2> 1742753 INFO  (TEST-TestMiniSolrCloudCluster.testSegmentTerminateEarly-seed#[78ABA6732D8FE0C4]) [    ] o.a.s.c.c.SolrZkClient makePath: /configs/solrCloudCollectionConfig/blendedInfixSuggest.txt
   [junit4]   2> 1742756 INFO  (TEST-TestMiniSolrCloudCluster.testSegmentTerminateEarly-seed#[78ABA6732D8FE0C4]) [    ] o.a.s.c.c.SolrZkClient makePath: /configs/solrCloudCollectionConfig/solrconfig-postingshighlight.xml
   [junit4]   2> 1742773 INFO  (TEST-TestMiniSolrCloudCluster.testSegmentTerminateEarly-seed#[78ABA6732D8FE0C4]) [    ] o.a.s.c.c.SolrZkClient makePath: /configs/solrCloudCollectionConfig/schema-docValuesJoin.xml
   [junit4]   2> 1742790 INFO  (TEST-TestMiniSolrCloudCluster.testSegmentTerminateEarly-seed#[78ABA6732D8FE0C4]) [    ] o.a.s.c.c.SolrZkClient makePath: /configs/solrCloudCollectionConfig/schema-docValues.xml
   [junit4]   2> 1742819 INFO  (TEST-TestMiniSolrCloudCluster.testSegmentTerminateEarly-seed#[78ABA6732D8FE0C4]) [    ] o.a.s.c.c.SolrZkClient makePath: /configs/solrCloudCollectionConfig/bad-schema-misplaced-asterisk-copyfield-dest-should-fail-test.xml
   [junit4]   2> 1742834 INFO  (TEST-TestMiniSolrCloudCluster.testSegmentTerminateEarly-seed#[78ABA6732D8FE0C4]) [    ] o.a.s.c.c.SolrZkClient makePath: /configs/solrCloudCollectionConfig/schema-snippet-types.incl
   [junit4]   2> 1742838 INFO  (TEST-TestMiniSolrCloudCluster.testSegmentTerminateEarly-seed#[78ABA6732D8FE0C4]) [    ] o.a.s.c.c.SolrZkClient makePath: /configs/solrCloudCollectionConfig/schema-minimal.xml
   [junit4]   2> 1742841 INFO  (TEST-TestMiniSolrCloudCluster.testSegmentTerminateEarly-seed#[78ABA6732D8FE0C4]) [    ] o.a.s.c.c.SolrZkClient makePath: /configs/solrCloudCollectionConfig/solrconfig.snippet.randomindexconfig.xml
   [junit4]   2> 1742847 INFO  (TEST-TestMiniSolrCloudCluster.testSegmentTerminateEarly-seed#[78ABA6732D8FE0C4]) [    ] o.a.s.c.c.SolrZkClient makePath: /configs/solrCloudCollectionConfig/schema-collate.xml
   [junit4]   2> 1742852 INFO  (TEST-TestMiniSolrCloudCluster.testSegmentTerminateEarly-seed#[78ABA6732D8FE0C4]) [    ] o.a.s.c.c.SolrZkClient makePath: /configs/solrCloudCollectionConfig/schema-rest.xml
   [junit4]   2> 1742885 INFO  (TEST-TestMiniSolrCloudCluster.testSegmentTerminateEarly-seed#[78ABA6732D8FE0C4]) [    ] o.a.s.c.c.SolrZkClient makePath: /configs/solrCloudCollectionConfig/bad-schema-codec-global-vs-ft-mismatch.xml
   [junit4]   2> 1742900 INFO  (TEST-TestMiniSolrCloudCluster.testSegmentTerminateEarly-seed#[78ABA6732D8FE0C4]) [    ] o.a.s.c.c.SolrZkClient makePath: /configs/solrCloudCollectionConfig/bad-schema-not-indexed-but-norms.xml
   [junit4]   2> 1742902 INFO  (TEST-TestMiniSolrCloudCluster.testSegmentTerminateEarly-seed#[78ABA6732D8FE0C4]) [    ] o.a.s.c.c.SolrZkClient makePath: /configs/solrCloudCollectionConfig/phrasesuggest.txt
   [junit4]   2> 1742904 INFO  (TEST-TestMiniSolrCloudCluster.testSegmentTerminateEarly-seed#[78ABA6732D8FE0C4]) [    ] o.a.s.c.c.SolrZkClient makePath: /configs/solrCloudCollectionConfig/stopwordsWrongEncoding.txt
   [junit4]   2> 1742906 INFO  (TEST-TestMiniSolrCloudCluster.testSegmentTerminateEarly-seed#[78ABA6732D8FE0C4]) [    ] o.a.s.c.c.SolrZkClient makePath: /configs/solrCloudCollectionConfig/solrconfig-logmergepolicy.xml
   [junit4]   2> 1742918 INFO  (TEST-TestMiniSolrCloudCluster.testSegmentTerminateEarly-seed#[78ABA6732D8FE0C4]) [    ] o.a.s.c.c.SolrZkClient makePath: /configs/solrCloudCollectionConfig/solrconfig-plugcollector.xml
   [junit4]   2> 1742938 INFO  (TEST-TestMiniSolrCloudCluster.testSegmentTerminateEarly-seed#[78ABA6732D8FE0C4]) [    ] o.a.s.c.c.SolrZkClient makePath: /configs/solrCloudCollectionConfig/solrconfig-noopregen.xml
   [junit4]   2> 1742940 INFO  (TEST-TestMiniSolrCloudCluster.testSegmentTerminateEarly-seed#[78ABA6732D8FE0C4]) [    ] o.a.s.c.c.SolrZkClient makePath: /configs/solrCloudCollectionConfig/solrconfig-analytics-query.xml
   [junit4]   2> 1742946 INFO  (TEST-TestMiniSolrCloudCluster.testSegmentTerminateEarly-seed#[78ABA6732D8FE0C4]) [    ] o.a.s.c.c.SolrZkClient makePath: /configs/solrCloudCollectionConfig/stoptypes-1.txt
   [junit4]   2> 1742948 INFO  (TEST-TestMiniSolrCloudCluster.testSegmentTerminateEarly-seed#[78ABA6732D8FE0C4]) [    ] o.a.s.c.c.SolrZkClient makePath: /configs/solrCloudCollectionConfig/solrconfig-warmer-randommergepolicyfactory.xml
   [junit4]   2> 1742953 INFO  (TEST-TestMiniSolrCloudCluster.testSegmentTerminateEarly-seed#[78ABA6732D8FE0C4]) [    ] o.a.s.c.c.SolrZkClient makePath: /configs/solrCloudCollectionConfig/schema-spatial.xml
   [junit4]   2> 1742961 INFO  (TEST-TestMiniSolrCloudCluster.testSegmentTerminateEarly-seed#[78ABA6732D8FE0C4]) [    ] o.a.s.c.c.SolrZkClient makePath: /configs/solrCloudCollectionConfig/schema-spellchecker.xml
   [junit4]   2> 1742981 INFO  (TEST-TestMiniSolrCloudCluster.testSegmentTerminateEarly-seed#[78ABA6732D8FE0C4]) [    ] o.a.s.c.c.SolrZkClient makePath: /configs/solrCloudCollectionConfig/schema-minimal-atomic-stress.xml
   [junit4]   2> 1742987 INFO  (TEST-TestMiniSolrCloudCluster.testSegmentTerminateEarly-seed#[78ABA6732D8FE0C4]) [    ] o.a.s.c.c.SolrZkClient makePath: /configs/s

[...truncated too long message...]

 o.e.j.s.ServletContextHandler@5f6f5863{/solr,null,UNAVAILABLE}
   [junit4]   2> 1931926 INFO  (TEST-TestMiniSolrCloudCluster.testStopAllStartAll-seed#[78ABA6732D8FE0C4]) [    ] o.a.s.c.ZkTestServer connecting to 127.0.0.1:34833 34833
   [junit4]   2> 1937025 INFO  (Thread-4823) [    ] o.a.s.c.ZkTestServer connecting to 127.0.0.1:34833 34833
   [junit4]   2> 1937025 WARN  (Thread-4823) [    ] o.a.s.c.ZkTestServer Watch limit violations: 
   [junit4]   2> Maximum concurrent create/delete watches above limit:
   [junit4]   2> 
   [junit4]   2> 	8	/solr/aliases.json
   [junit4]   2> 	8	/solr/clusterprops.json
   [junit4]   2> 	6	/solr/security.json
   [junit4]   2> 	5	/solr/configs/solrCloudCollectionConfig
   [junit4]   2> 
   [junit4]   2> Maximum concurrent data watches above limit:
   [junit4]   2> 
   [junit4]   2> 	8	/solr/clusterstate.json
   [junit4]   2> 	4	/solr/collections/testStopAllStartAllCollection/state.json
   [junit4]   2> 	3	/solr/overseer_elect/election/96066819647733775-127.0.0.1:41090_solr-n_0000000000
   [junit4]   2> 	2	/solr/overseer_elect/election/96066819647733772-127.0.0.1:36315_solr-n_0000000001
   [junit4]   2> 
   [junit4]   2> Maximum concurrent children watches above limit:
   [junit4]   2> 
   [junit4]   2> 	77	/solr/overseer/collection-queue-work
   [junit4]   2> 	20	/solr/overseer/queue
   [junit4]   2> 	8	/solr/collections
   [junit4]   2> 	7	/solr/live_nodes
   [junit4]   2> 	4	/solr/overseer/queue-work
   [junit4]   2> 
   [junit4]   2> NOTE: reproduce with: ant test  -Dtestcase=TestMiniSolrCloudCluster -Dtests.method=testStopAllStartAll -Dtests.seed=78ABA6732D8FE0C4 -Dtests.multiplier=3 -Dtests.slow=true -Dtests.locale=et-EE -Dtests.timezone=Africa/Nouakchott -Dtests.asserts=true -Dtests.file.encoding=ISO-8859-1
   [junit4] ERROR   86.7s J2 | TestMiniSolrCloudCluster.testStopAllStartAll <<<
   [junit4]    > Throwable #1: java.net.BindException: Address already in use
   [junit4]    > 	at __randomizedtesting.SeedInfo.seed([78ABA6732D8FE0C4:E95B9006CB84DEB]:0)
   [junit4]    > 	at sun.nio.ch.Net.bind0(Native Method)
   [junit4]    > 	at sun.nio.ch.Net.bind(Net.java:433)
   [junit4]    > 	at sun.nio.ch.Net.bind(Net.java:425)
   [junit4]    > 	at sun.nio.ch.ServerSocketChannelImpl.bind(ServerSocketChannelImpl.java:223)
   [junit4]    > 	at sun.nio.ch.ServerSocketAdaptor.bind(ServerSocketAdaptor.java:74)
   [junit4]    > 	at org.eclipse.jetty.server.ServerConnector.open(ServerConnector.java:326)
   [junit4]    > 	at org.eclipse.jetty.server.AbstractNetworkConnector.doStart(AbstractNetworkConnector.java:80)
   [junit4]    > 	at org.eclipse.jetty.server.ServerConnector.doStart(ServerConnector.java:244)
   [junit4]    > 	at org.eclipse.jetty.util.component.AbstractLifeCycle.start(AbstractLifeCycle.java:68)
   [junit4]    > 	at org.eclipse.jetty.server.Server.doStart(Server.java:384)
   [junit4]    > 	at org.eclipse.jetty.util.component.AbstractLifeCycle.start(AbstractLifeCycle.java:68)
   [junit4]    > 	at org.apache.solr.client.solrj.embedded.JettySolrRunner.start(JettySolrRunner.java:327)
   [junit4]    > 	at org.apache.solr.cloud.MiniSolrCloudCluster.startJettySolrRunner(MiniSolrCloudCluster.java:377)
   [junit4]    > 	at org.apache.solr.cloud.TestMiniSolrCloudCluster.testStopAllStartAll(TestMiniSolrCloudCluster.java:443)
   [junit4]    > 	at java.lang.Thread.run(Thread.java:745)
   [junit4]   2> NOTE: leaving temporary files on disk at: /home/jenkins/workspace/Lucene-Solr-6.1-Linux/solr/build/solr-core/test/J2/temp/solr.cloud.TestMiniSolrCloudCluster_78ABA6732D8FE0C4-001
   [junit4]   2> NOTE: test params are: codec=Asserting(Lucene60): {quad_l1=PostingsFormat(name=Direct), range_facet_l_dv=PostingsFormat(name=MockRandom), _version_=PostingsFormat(name=LuceneVarGapFixedInterval), multiDefault=Lucene50(blocksize=128), intDefault=PostingsFormat(name=LuceneVarGapFixedInterval), id=PostingsFormat(name=MockRandom), range_facet_i_dv=PostingsFormat(name=LuceneVarGapFixedInterval), odd_l1=PostingsFormat(name=MockRandom), range_facet_l=PostingsFormat(name=LuceneVarGapFixedInterval), timestamp=PostingsFormat(name=LuceneVarGapFixedInterval)}, docValues:{range_facet_l_dv=DocValuesFormat(name=Asserting), range_facet_i_dv=DocValuesFormat(name=Direct), timestamp=DocValuesFormat(name=Direct)}, maxPointsInLeafNode=172, maxMBSortInHeap=6.341701437615763, sim=ClassicSimilarity, locale=et-EE, timezone=Africa/Nouakchott
   [junit4]   2> NOTE: Linux 4.4.0-24-generic amd64/Oracle Corporation 1.8.0_92 (64-bit)/cpus=12,threads=1,free=248609856,total=536870912
   [junit4]   2> NOTE: All tests run in this JVM: [DistributedFacetPivotLargeTest, TestUseDocValuesAsStored2, SearchHandlerTest, TestShardHandlerFactory, TestSearcherReuse, VMParamsZkACLAndCredentialsProvidersTest, TestAuthorizationFramework, TestRawTransformer, OverseerTest, CloneFieldUpdateProcessorFactoryTest, TestFreeTextSuggestions, RegexBoostProcessorTest, AutoCommitTest, TestSortByMinMaxFunction, TestTestInjection, TestSolrQueryParser, TestCopyFieldCollectionResource, TestSolrIndexConfig, LeaderFailoverAfterPartitionTest, TestTrackingShardHandlerFactory, TestUninvertingReader, CloudMLTQParserTest, ClusterStateTest, DistributedFacetPivotSmallTest, DirectUpdateHandlerOptimizeTest, TestUtils, UnloadDistributedZkTest, TestSolrJ, PluginInfoTest, TestCoreDiscovery, TestChildDocTransformer, CoreAdminHandlerTest, TestStressCloudBlindAtomicUpdates, TestDynamicLoading, BlockJoinFacetRandomTest, TestManagedSchemaAPI, CollectionsAPISolrJTest, TestTolerantUpdateProcessorRandomCloud, TestJmxMonitoredMap, DistributedVersionInfoTest, TestSort, TestRestoreCore, StatelessScriptUpdateProcessorFactoryTest, TestCloudSchemaless, TestCryptoKeys, CurrencyFieldXmlFileTest, DateMathParserTest, TestGroupingSearch, TestFieldTypeCollectionResource, TestFieldCacheSortRandom, TermVectorComponentDistributedTest, TestDistribIDF, TestSuggestSpellingConverter, TestSerializedLuceneMatchVersion, TestMissingGroups, DeleteShardTest, TestJsonFacets, DistribDocExpirationUpdateProcessorTest, DirectUpdateHandlerTest, BadCopyFieldTest, TestObjectReleaseTracker, CircularListTest, HLLSerializationTest, LeaderElectionTest, TestJmxIntegration, TestPerFieldSimilarityWithDefaultOverride, TestIntervalFaceting, TestPHPSerializedResponseWriter, TestSha256AuthenticationProvider, TestWriterPerf, TestConfigSetsAPI, HdfsDirectoryFactoryTest, StatsComponentTest, TestDFISimilarityFactory, TestRandomRequestDistribution, TestCSVResponseWriter, TestTolerantSearch, CdcrRequestHandlerTest, TestExclusionRuleCollectionAccess, RecoveryZkTest, SuggesterTSTTest, TestUniqueKeyFieldResource, TestPerFieldSimilarity, ShowFileRequestHandlerTest, TestLockTree, DistributedQueryComponentOptimizationTest, SpatialHeatmapFacetsTest, TestCharFilters, TestExtendedDismaxParser, TestGeoJSONResponseWriter, TestScoreJoinQPNoScore, OverseerStatusTest, BinaryUpdateRequestHandlerTest, TestStressRecovery, TestElisionMultitermQuery, TestZkChroot, TestIndexSearcher, HdfsRestartWhileUpdatingTest, ClusterStateUpdateTest, TestRandomFaceting, TestFaceting, TestRecovery, TestHashPartitioner, DistributedSpellCheckComponentTest, TestStressReorder, DistributedTermsComponentTest, TestCoreContainer, TestSolr4Spatial, SolrCmdDistributorTest, BasicFunctionalityTest, SimplePostToolTest, AnalysisAfterCoreReloadTest, TestFoldingMultitermQuery, DocValuesTest, XmlUpdateRequestHandlerTest, TermVectorComponentTest, MoreLikeThisHandlerTest, IndexSchemaRuntimeFieldTest, TestCollationField, MBeansHandlerTest, JsonLoaderTest, HighlighterConfigTest, AlternateDirectoryTest, CopyFieldTest, SampleTest, TestSearchPerf, MinimalSchemaTest, OutputWriterTest, TestPostingsSolrHighlighter, TestLuceneMatchVersion, SpellPossibilityIteratorTest, TestXIncludeConfig, EchoParamsTest, TestSweetSpotSimilarityFactory, TestIBSimilarityFactory, TestBM25SimilarityFactory, TimeZoneUtilsTest, ScriptEngineTest, TestFastLRUCache, PreAnalyzedFieldTest, SpellingQueryConverterTest, TestDocumentBuilder, SliceStateTest, SystemInfoHandlerTest, DistributedMLTComponentTest, TestRTGBase, CursorPagingTest, DistributedIntervalFacetingTest, TestHighlightDedupGrouping, TestEmbeddedSolrServerConstructors, TestJettySolrRunner, ActionThrottleTest, AssignTest, AsyncMigrateRouteKeyTest, ConnectionManagerTest, DeleteInactiveReplicaTest, DistribJoinFromCollectionTest, LeaderInitiatedRecoveryOnCommitTest, OutOfBoxZkACLAndCredentialsProvidersTest, OverriddenZkACLAndCredentialsProvidersTest, RemoteQueryErrorTest, SolrCloudExampleTest, TestCloudBackupRestore, TestCloudDeleteByQuery, TestCloudInspectUtil, TestCloudPivotFacet, TestCollectionAPI, TestConfigSetsAPIExclusivity, TestMiniSolrCloudCluster]
   [junit4] Completed [499/614 (1!)] on J2 in 197.52s, 7 tests, 1 error <<< FAILURES!

[...truncated 385 lines...]
BUILD FAILED
/home/jenkins/workspace/Lucene-Solr-6.1-Linux/build.xml:740: The following error occurred while executing this line:
/home/jenkins/workspace/Lucene-Solr-6.1-Linux/build.xml:684: The following error occurred while executing this line:
/home/jenkins/workspace/Lucene-Solr-6.1-Linux/build.xml:59: The following error occurred while executing this line:
/home/jenkins/workspace/Lucene-Solr-6.1-Linux/solr/build.xml:233: The following error occurred while executing this line:
/home/jenkins/workspace/Lucene-Solr-6.1-Linux/solr/common-build.xml:531: The following error occurred while executing this line:
/home/jenkins/workspace/Lucene-Solr-6.1-Linux/lucene/common-build.xml:1427: The following error occurred while executing this line:
/home/jenkins/workspace/Lucene-Solr-6.1-Linux/lucene/common-build.xml:984: There were test failures: 614 suites (10 ignored), 2580 tests, 1 error, 116 ignored (72 assumptions) [seed: 78ABA6732D8FE0C4]

Total time: 64 minutes 24 seconds
Build step 'Invoke Ant' marked build as failure
Archiving artifacts
[WARNINGS] Skipping publisher since build result is FAILURE
Recording test results
Email was triggered for: Failure - Any
Sending email for trigger: Failure - Any



Mime
View raw message