lucene-dev mailing list archives

Site index · List index
Message view « Date » · « Thread »
Top « Date » · « Thread »
From Policeman Jenkins Server <jenk...@thetaphi.de>
Subject [JENKINS-EA] Lucene-Solr-master-Linux (64bit/jdk-9-ea+120) - Build # 16861 - Still Failing!
Date Sun, 29 May 2016 18:44:54 GMT
Build: http://jenkins.thetaphi.de/job/Lucene-Solr-master-Linux/16861/
Java: 64bit/jdk-9-ea+120 -XX:+UseCompressedOops -XX:+UseConcMarkSweepGC

1 tests failed.
FAILED:  org.apache.solr.util.SolrPluginUtilsTest.testInvokeSetters

Error Message:
argument type mismatch

Stack Trace:
java.lang.IllegalArgumentException: argument type mismatch
	at __randomizedtesting.SeedInfo.seed([70AFB5A556314C54:19B01EA5A3072EFF]:0)
	at jdk.internal.reflect.NativeMethodAccessorImpl.invoke0(java.base@9-ea/Native Method)
	at jdk.internal.reflect.NativeMethodAccessorImpl.invoke(java.base@9-ea/NativeMethodAccessorImpl.java:62)
	at jdk.internal.reflect.DelegatingMethodAccessorImpl.invoke(java.base@9-ea/DelegatingMethodAccessorImpl.java:43)
	at java.lang.reflect.Method.invoke(java.base@9-ea/Method.java:531)
	at org.apache.solr.util.SolrPluginUtils.invokeSetters(SolrPluginUtils.java:1071)
	at org.apache.solr.util.SolrPluginUtilsTest.implTestInvokeSetters(SolrPluginUtilsTest.java:482)
	at org.apache.solr.util.SolrPluginUtilsTest.testInvokeSetters(SolrPluginUtilsTest.java:474)
	at jdk.internal.reflect.NativeMethodAccessorImpl.invoke0(java.base@9-ea/Native Method)
	at jdk.internal.reflect.NativeMethodAccessorImpl.invoke(java.base@9-ea/NativeMethodAccessorImpl.java:62)
	at jdk.internal.reflect.DelegatingMethodAccessorImpl.invoke(java.base@9-ea/DelegatingMethodAccessorImpl.java:43)
	at java.lang.reflect.Method.invoke(java.base@9-ea/Method.java:531)
	at com.carrotsearch.randomizedtesting.RandomizedRunner.invoke(RandomizedRunner.java:1764)
	at com.carrotsearch.randomizedtesting.RandomizedRunner$8.evaluate(RandomizedRunner.java:871)
	at com.carrotsearch.randomizedtesting.RandomizedRunner$9.evaluate(RandomizedRunner.java:907)
	at com.carrotsearch.randomizedtesting.RandomizedRunner$10.evaluate(RandomizedRunner.java:921)
	at com.carrotsearch.randomizedtesting.rules.SystemPropertiesRestoreRule$1.evaluate(SystemPropertiesRestoreRule.java:57)
	at org.apache.lucene.util.TestRuleSetupTeardownChained$1.evaluate(TestRuleSetupTeardownChained.java:49)
	at org.apache.lucene.util.AbstractBeforeAfterRule$1.evaluate(AbstractBeforeAfterRule.java:45)
	at org.apache.lucene.util.TestRuleThreadAndTestName$1.evaluate(TestRuleThreadAndTestName.java:48)
	at org.apache.lucene.util.TestRuleIgnoreAfterMaxFailures$1.evaluate(TestRuleIgnoreAfterMaxFailures.java:64)
	at org.apache.lucene.util.TestRuleMarkFailure$1.evaluate(TestRuleMarkFailure.java:47)
	at com.carrotsearch.randomizedtesting.rules.StatementAdapter.evaluate(StatementAdapter.java:36)
	at com.carrotsearch.randomizedtesting.ThreadLeakControl$StatementRunner.run(ThreadLeakControl.java:367)
	at com.carrotsearch.randomizedtesting.ThreadLeakControl.forkTimeoutingTask(ThreadLeakControl.java:809)
	at com.carrotsearch.randomizedtesting.ThreadLeakControl$3.evaluate(ThreadLeakControl.java:460)
	at com.carrotsearch.randomizedtesting.RandomizedRunner.runSingleTest(RandomizedRunner.java:880)
	at com.carrotsearch.randomizedtesting.RandomizedRunner$5.evaluate(RandomizedRunner.java:781)
	at com.carrotsearch.randomizedtesting.RandomizedRunner$6.evaluate(RandomizedRunner.java:816)
	at com.carrotsearch.randomizedtesting.RandomizedRunner$7.evaluate(RandomizedRunner.java:827)
	at com.carrotsearch.randomizedtesting.rules.StatementAdapter.evaluate(StatementAdapter.java:36)
	at com.carrotsearch.randomizedtesting.rules.SystemPropertiesRestoreRule$1.evaluate(SystemPropertiesRestoreRule.java:57)
	at org.apache.lucene.util.AbstractBeforeAfterRule$1.evaluate(AbstractBeforeAfterRule.java:45)
	at com.carrotsearch.randomizedtesting.rules.StatementAdapter.evaluate(StatementAdapter.java:36)
	at org.apache.lucene.util.TestRuleStoreClassName$1.evaluate(TestRuleStoreClassName.java:41)
	at com.carrotsearch.randomizedtesting.rules.NoShadowingOrOverridesOnMethodsRule$1.evaluate(NoShadowingOrOverridesOnMethodsRule.java:40)
	at com.carrotsearch.randomizedtesting.rules.NoShadowingOrOverridesOnMethodsRule$1.evaluate(NoShadowingOrOverridesOnMethodsRule.java:40)
	at com.carrotsearch.randomizedtesting.rules.StatementAdapter.evaluate(StatementAdapter.java:36)
	at com.carrotsearch.randomizedtesting.rules.StatementAdapter.evaluate(StatementAdapter.java:36)
	at com.carrotsearch.randomizedtesting.rules.StatementAdapter.evaluate(StatementAdapter.java:36)
	at org.apache.lucene.util.TestRuleAssertionsRequired$1.evaluate(TestRuleAssertionsRequired.java:53)
	at org.apache.lucene.util.TestRuleMarkFailure$1.evaluate(TestRuleMarkFailure.java:47)
	at org.apache.lucene.util.TestRuleIgnoreAfterMaxFailures$1.evaluate(TestRuleIgnoreAfterMaxFailures.java:64)
	at org.apache.lucene.util.TestRuleIgnoreTestSuites$1.evaluate(TestRuleIgnoreTestSuites.java:54)
	at com.carrotsearch.randomizedtesting.rules.StatementAdapter.evaluate(StatementAdapter.java:36)
	at com.carrotsearch.randomizedtesting.ThreadLeakControl$StatementRunner.run(ThreadLeakControl.java:367)
	at java.lang.Thread.run(java.base@9-ea/Thread.java:843)




Build Log:
[...truncated 11698 lines...]
   [junit4] Suite: org.apache.solr.util.SolrPluginUtilsTest
   [junit4]   2> Creating dataDir: /home/jenkins/workspace/Lucene-Solr-master-Linux/solr/build/solr-core/test/J1/temp/solr.util.SolrPluginUtilsTest_70AFB5A556314C54-001/init-core-data-001
   [junit4]   2> 923720 INFO  (SUITE-SolrPluginUtilsTest-seed#[70AFB5A556314C54]-worker)
[    ] o.a.s.SolrTestCaseJ4 Randomized ssl (true) and clientAuth (false)
   [junit4]   2> 923722 INFO  (SUITE-SolrPluginUtilsTest-seed#[70AFB5A556314C54]-worker)
[    ] o.a.s.SolrTestCaseJ4 ####initCore
   [junit4]   2> 923723 INFO  (SUITE-SolrPluginUtilsTest-seed#[70AFB5A556314C54]-worker)
[    ] o.a.s.c.SolrResourceLoader new SolrResourceLoader for directory: '/home/jenkins/workspace/Lucene-Solr-master-Linux/solr/core/src/test-files/solr/collection1'
   [junit4]   2> 923723 INFO  (SUITE-SolrPluginUtilsTest-seed#[70AFB5A556314C54]-worker)
[    ] o.a.s.c.SolrResourceLoader JNDI not configured for solr (NoInitialContextEx)
   [junit4]   2> 923723 INFO  (SUITE-SolrPluginUtilsTest-seed#[70AFB5A556314C54]-worker)
[    ] o.a.s.c.SolrResourceLoader using system property solr.solr.home: /home/jenkins/workspace/Lucene-Solr-master-Linux/solr/core/src/test-files/solr
   [junit4]   2> 923723 INFO  (SUITE-SolrPluginUtilsTest-seed#[70AFB5A556314C54]-worker)
[    ] o.a.s.c.SolrResourceLoader Adding 'file:/home/jenkins/workspace/Lucene-Solr-master-Linux/solr/core/src/test-files/solr/collection1/lib/classes/'
to classloader
   [junit4]   2> 923723 INFO  (SUITE-SolrPluginUtilsTest-seed#[70AFB5A556314C54]-worker)
[    ] o.a.s.c.SolrResourceLoader Adding 'file:/home/jenkins/workspace/Lucene-Solr-master-Linux/solr/core/src/test-files/solr/collection1/lib/README'
to classloader
   [junit4]   2> 923742 INFO  (SUITE-SolrPluginUtilsTest-seed#[70AFB5A556314C54]-worker)
[    ] o.a.s.c.SolrConfig current version of requestparams : -1
   [junit4]   2> 923754 INFO  (SUITE-SolrPluginUtilsTest-seed#[70AFB5A556314C54]-worker)
[    ] o.a.s.c.SolrConfig Using Lucene MatchVersion: 7.0.0
   [junit4]   2> 923779 INFO  (SUITE-SolrPluginUtilsTest-seed#[70AFB5A556314C54]-worker)
[    ] o.a.s.c.SolrConfig Loaded SolrConfig: solrconfig.xml
   [junit4]   2> 923785 INFO  (SUITE-SolrPluginUtilsTest-seed#[70AFB5A556314C54]-worker)
[    ] o.a.s.s.IndexSchema [null] Schema name=test
   [junit4]   2> 923878 INFO  (SUITE-SolrPluginUtilsTest-seed#[70AFB5A556314C54]-worker)
[    ] o.a.s.s.OpenExchangeRatesOrgProvider Initialized with rates=open-exchange-rates.json,
refreshInterval=1440.
   [junit4]   2> 923882 INFO  (SUITE-SolrPluginUtilsTest-seed#[70AFB5A556314C54]-worker)
[    ] o.a.s.s.IndexSchema default search field in schema is text
   [junit4]   2> 923883 INFO  (SUITE-SolrPluginUtilsTest-seed#[70AFB5A556314C54]-worker)
[    ] o.a.s.s.IndexSchema unique key field: id
   [junit4]   2> 923885 INFO  (SUITE-SolrPluginUtilsTest-seed#[70AFB5A556314C54]-worker)
[    ] o.a.s.s.FileExchangeRateProvider Reloading exchange rates from file currency.xml
   [junit4]   2> 923886 INFO  (SUITE-SolrPluginUtilsTest-seed#[70AFB5A556314C54]-worker)
[    ] o.a.s.s.FileExchangeRateProvider Reloading exchange rates from file currency.xml
   [junit4]   2> 923887 INFO  (SUITE-SolrPluginUtilsTest-seed#[70AFB5A556314C54]-worker)
[    ] o.a.s.s.OpenExchangeRatesOrgProvider Reloading exchange rates from open-exchange-rates.json
   [junit4]   2> 923887 INFO  (SUITE-SolrPluginUtilsTest-seed#[70AFB5A556314C54]-worker)
[    ] o.a.s.s.OpenExchangeRatesOrgProvider Reloading exchange rates from open-exchange-rates.json
   [junit4]   2> 923887 INFO  (SUITE-SolrPluginUtilsTest-seed#[70AFB5A556314C54]-worker)
[    ] o.a.s.c.SolrResourceLoader JNDI not configured for solr (NoInitialContextEx)
   [junit4]   2> 923887 INFO  (SUITE-SolrPluginUtilsTest-seed#[70AFB5A556314C54]-worker)
[    ] o.a.s.c.SolrResourceLoader using system property solr.solr.home: /home/jenkins/workspace/Lucene-Solr-master-Linux/solr/core/src/test-files/solr
   [junit4]   2> 923887 INFO  (SUITE-SolrPluginUtilsTest-seed#[70AFB5A556314C54]-worker)
[    ] o.a.s.c.SolrResourceLoader new SolrResourceLoader for directory: '/home/jenkins/workspace/Lucene-Solr-master-Linux/solr/core/src/test-files/solr'
   [junit4]   2> 923887 INFO  (SUITE-SolrPluginUtilsTest-seed#[70AFB5A556314C54]-worker)
[    ] o.a.s.c.SolrResourceLoader JNDI not configured for solr (NoInitialContextEx)
   [junit4]   2> 923887 INFO  (SUITE-SolrPluginUtilsTest-seed#[70AFB5A556314C54]-worker)
[    ] o.a.s.c.SolrResourceLoader using system property solr.solr.home: /home/jenkins/workspace/Lucene-Solr-master-Linux/solr/core/src/test-files/solr
   [junit4]   2> 923888 INFO  (SUITE-SolrPluginUtilsTest-seed#[70AFB5A556314C54]-worker)
[    ] o.a.s.c.CoreContainer New CoreContainer 753038255
   [junit4]   2> 923888 INFO  (SUITE-SolrPluginUtilsTest-seed#[70AFB5A556314C54]-worker)
[    ] o.a.s.c.CoreContainer Loading cores into CoreContainer [instanceDir=/home/jenkins/workspace/Lucene-Solr-master-Linux/solr/core/src/test-files/solr]
   [junit4]   2> 923888 WARN  (SUITE-SolrPluginUtilsTest-seed#[70AFB5A556314C54]-worker)
[    ] o.a.s.c.CoreContainer Couldn't add files from /home/jenkins/workspace/Lucene-Solr-master-Linux/solr/core/src/test-files/solr/lib
to classpath: /home/jenkins/workspace/Lucene-Solr-master-Linux/solr/core/src/test-files/solr/lib
   [junit4]   2> 923888 INFO  (SUITE-SolrPluginUtilsTest-seed#[70AFB5A556314C54]-worker)
[    ] o.a.s.h.c.HttpShardHandlerFactory created with socketTimeout : 600000,connTimeout :
60000,maxConnectionsPerHost : 20,maxConnections : 10000,corePoolSize : 0,maximumPoolSize :
2147483647,maxThreadIdleTime : 5,sizeOfQueue : -1,fairnessPolicy : false,
   [junit4]   2> 923890 INFO  (SUITE-SolrPluginUtilsTest-seed#[70AFB5A556314C54]-worker)
[    ] o.a.s.u.UpdateShardHandler Creating UpdateShardHandler HTTP client with params: 
   [junit4]   2> 923890 INFO  (SUITE-SolrPluginUtilsTest-seed#[70AFB5A556314C54]-worker)
[    ] o.a.s.l.LogWatcher SLF4J impl is org.slf4j.impl.Log4jLoggerFactory
   [junit4]   2> 923890 INFO  (SUITE-SolrPluginUtilsTest-seed#[70AFB5A556314C54]-worker)
[    ] o.a.s.l.LogWatcher Registering Log Listener [Log4j (org.slf4j.impl.Log4jLoggerFactory)]
   [junit4]   2> 923890 INFO  (SUITE-SolrPluginUtilsTest-seed#[70AFB5A556314C54]-worker)
[    ] o.a.s.c.CoreContainer Security conf doesn't exist. Skipping setup for authorization
module.
   [junit4]   2> 923890 INFO  (SUITE-SolrPluginUtilsTest-seed#[70AFB5A556314C54]-worker)
[    ] o.a.s.c.CoreContainer No authentication plugin used.
   [junit4]   2> 923891 INFO  (SUITE-SolrPluginUtilsTest-seed#[70AFB5A556314C54]-worker)
[    ] o.a.s.c.CoreDescriptor Created CoreDescriptor: {schema=schema.xml, dataDir=/home/jenkins/workspace/Lucene-Solr-master-Linux/solr/build/solr-core/test/J1/temp/solr.util.SolrPluginUtilsTest_70AFB5A556314C54-001/init-core-data-001,
collection=collection1, loadOnStartup=true, transient=false, name=collection1, shard=shard1,
config=solrconfig.xml, configSetProperties=configsetprops.json}
   [junit4]   2> 923891 INFO  (coreLoadExecutor-3987-thread-1) [    ] o.a.s.c.SolrResourceLoader
new SolrResourceLoader for directory: '/home/jenkins/workspace/Lucene-Solr-master-Linux/solr/core/src/test-files/solr/collection1'
   [junit4]   2> 923891 INFO  (coreLoadExecutor-3987-thread-1) [    ] o.a.s.c.SolrResourceLoader
JNDI not configured for solr (NoInitialContextEx)
   [junit4]   2> 923891 INFO  (coreLoadExecutor-3987-thread-1) [    ] o.a.s.c.SolrResourceLoader
using system property solr.solr.home: /home/jenkins/workspace/Lucene-Solr-master-Linux/solr/core/src/test-files/solr
   [junit4]   2> 923892 INFO  (coreLoadExecutor-3987-thread-1) [    ] o.a.s.c.SolrResourceLoader
Adding 'file:/home/jenkins/workspace/Lucene-Solr-master-Linux/solr/core/src/test-files/solr/collection1/lib/classes/'
to classloader
   [junit4]   2> 923892 INFO  (coreLoadExecutor-3987-thread-1) [    ] o.a.s.c.SolrResourceLoader
Adding 'file:/home/jenkins/workspace/Lucene-Solr-master-Linux/solr/core/src/test-files/solr/collection1/lib/README'
to classloader
   [junit4]   2> 923904 INFO  (coreLoadExecutor-3987-thread-1) [    ] o.a.s.c.SolrConfig
current version of requestparams : -1
   [junit4]   2> 923913 INFO  (coreLoadExecutor-3987-thread-1) [    ] o.a.s.c.SolrConfig
Using Lucene MatchVersion: 7.0.0
   [junit4]   2> 923929 INFO  (coreLoadExecutor-3987-thread-1) [    ] o.a.s.c.SolrConfig
Loaded SolrConfig: solrconfig.xml
   [junit4]   2> 923931 INFO  (coreLoadExecutor-3987-thread-1) [    ] o.a.s.s.IndexSchema
[collection1] Schema name=test
   [junit4]   2> 924002 INFO  (coreLoadExecutor-3987-thread-1) [    ] o.a.s.s.OpenExchangeRatesOrgProvider
Initialized with rates=open-exchange-rates.json, refreshInterval=1440.
   [junit4]   2> 924007 INFO  (coreLoadExecutor-3987-thread-1) [    ] o.a.s.s.IndexSchema
default search field in schema is text
   [junit4]   2> 924008 INFO  (coreLoadExecutor-3987-thread-1) [    ] o.a.s.s.IndexSchema
unique key field: id
   [junit4]   2> 924012 INFO  (coreLoadExecutor-3987-thread-1) [    ] o.a.s.s.FileExchangeRateProvider
Reloading exchange rates from file currency.xml
   [junit4]   2> 924013 INFO  (coreLoadExecutor-3987-thread-1) [    ] o.a.s.s.FileExchangeRateProvider
Reloading exchange rates from file currency.xml
   [junit4]   2> 924014 INFO  (coreLoadExecutor-3987-thread-1) [    ] o.a.s.s.OpenExchangeRatesOrgProvider
Reloading exchange rates from open-exchange-rates.json
   [junit4]   2> 924014 INFO  (coreLoadExecutor-3987-thread-1) [    ] o.a.s.s.OpenExchangeRatesOrgProvider
Reloading exchange rates from open-exchange-rates.json
   [junit4]   2> 924016 INFO  (coreLoadExecutor-3987-thread-1) [    ] o.a.s.c.ConfigSetProperties
Did not find ConfigSet properties, assuming default properties: Can't find resource 'configsetprops.json'
in classpath or '/home/jenkins/workspace/Lucene-Solr-master-Linux/solr/core/src/test-files/solr/collection1'
   [junit4]   2> 924016 INFO  (coreLoadExecutor-3987-thread-1) [    ] o.a.s.c.CoreContainer
Creating SolrCore 'collection1' using configuration from instancedir /home/jenkins/workspace/Lucene-Solr-master-Linux/solr/core/src/test-files/solr/collection1
   [junit4]   2> 924016 INFO  (coreLoadExecutor-3987-thread-1) [    ] o.a.s.c.SolrCore
org.apache.solr.core.MockDirectoryFactory
   [junit4]   2> 924016 INFO  (coreLoadExecutor-3987-thread-1) [    ] o.a.s.c.SolrCore
[[collection1] ] Opening new SolrCore at [/home/jenkins/workspace/Lucene-Solr-master-Linux/solr/core/src/test-files/solr/collection1],
dataDir=[/home/jenkins/workspace/Lucene-Solr-master-Linux/solr/build/solr-core/test/J1/temp/solr.util.SolrPluginUtilsTest_70AFB5A556314C54-001/init-core-data-001/]
   [junit4]   2> 924016 INFO  (coreLoadExecutor-3987-thread-1) [    ] o.a.s.c.JmxMonitoredMap
JMX monitoring is enabled. Adding Solr mbeans to JMX Server: com.sun.jmx.mbeanserver.JmxMBeanServer@1f2797d5
   [junit4]   2> 924017 INFO  (coreLoadExecutor-3987-thread-1) [    ] o.a.s.c.CachingDirectoryFactory
return new directory for /home/jenkins/workspace/Lucene-Solr-master-Linux/solr/build/solr-core/test/J1/temp/solr.util.SolrPluginUtilsTest_70AFB5A556314C54-001/init-core-data-001
   [junit4]   2> 924017 INFO  (coreLoadExecutor-3987-thread-1) [    ] o.a.s.c.SolrCore
New index directory detected: old=null new=/home/jenkins/workspace/Lucene-Solr-master-Linux/solr/build/solr-core/test/J1/temp/solr.util.SolrPluginUtilsTest_70AFB5A556314C54-001/init-core-data-001/index/
   [junit4]   2> 924017 WARN  (coreLoadExecutor-3987-thread-1) [    ] o.a.s.c.SolrCore
[collection1] Solr index directory '/home/jenkins/workspace/Lucene-Solr-master-Linux/solr/build/solr-core/test/J1/temp/solr.util.SolrPluginUtilsTest_70AFB5A556314C54-001/init-core-data-001/index'
doesn't exist. Creating new index...
   [junit4]   2> 924017 INFO  (coreLoadExecutor-3987-thread-1) [    ] o.a.s.c.CachingDirectoryFactory
return new directory for /home/jenkins/workspace/Lucene-Solr-master-Linux/solr/build/solr-core/test/J1/temp/solr.util.SolrPluginUtilsTest_70AFB5A556314C54-001/init-core-data-001/index
   [junit4]   2> 924017 INFO  (coreLoadExecutor-3987-thread-1) [    ] o.a.s.u.RandomMergePolicy
RandomMergePolicy wrapping class org.apache.lucene.index.AlcoholicMergePolicy: [AlcoholicMergePolicy:
minMergeSize=0, mergeFactor=10, maxMergeSize=405355592, maxMergeSizeForForcedMerge=9223372036854775807,
calibrateSizeByDeletes=true, maxMergeDocs=2147483647, maxCFSSegmentSizeMB=8.796093022207999E12,
noCFSRatio=0.1]
   [junit4]   2> 924018 INFO  (coreLoadExecutor-3987-thread-1) [    ] o.a.s.c.SolrDeletionPolicy
SolrDeletionPolicy.onCommit: commits: num=1
   [junit4]   2> 	commit{dir=MockDirectoryWrapper(RAMDirectory@e3d588b lockFactory=org.apache.lucene.store.SingleInstanceLockFactory@194fdb07),segFN=segments_1,generation=1}
   [junit4]   2> 924018 INFO  (coreLoadExecutor-3987-thread-1) [    ] o.a.s.c.SolrDeletionPolicy
newest commit generation = 1
   [junit4]   2> 924018 INFO  (OldIndexDirectoryCleanupThreadForCore-collection1) [   
] o.a.s.c.SolrCore Looking for old index directories to cleanup for core collection1 in /home/jenkins/workspace/Lucene-Solr-master-Linux/solr/build/solr-core/test/J1/temp/solr.util.SolrPluginUtilsTest_70AFB5A556314C54-001/init-core-data-001/
   [junit4]   2> 924020 INFO  (coreLoadExecutor-3987-thread-1) [    ] o.a.s.u.p.UpdateRequestProcessorChain
creating updateRequestProcessorChain "dedupe"
   [junit4]   2> 924020 INFO  (coreLoadExecutor-3987-thread-1) [    ] o.a.s.u.p.UpdateRequestProcessorChain
inserting DistributedUpdateProcessorFactory into updateRequestProcessorChain "dedupe"
   [junit4]   2> 924020 INFO  (coreLoadExecutor-3987-thread-1) [    ] o.a.s.u.p.UpdateRequestProcessorChain
creating updateRequestProcessorChain "dedupe-allfields"
   [junit4]   2> 924020 INFO  (coreLoadExecutor-3987-thread-1) [    ] o.a.s.u.p.UpdateRequestProcessorChain
inserting DistributedUpdateProcessorFactory into updateRequestProcessorChain "dedupe-allfields"
   [junit4]   2> 924021 INFO  (coreLoadExecutor-3987-thread-1) [    ] o.a.s.u.p.UpdateRequestProcessorChain
creating updateRequestProcessorChain "stored_sig"
   [junit4]   2> 924021 INFO  (coreLoadExecutor-3987-thread-1) [    ] o.a.s.u.p.UpdateRequestProcessorChain
inserting DistributedUpdateProcessorFactory into updateRequestProcessorChain "stored_sig"
   [junit4]   2> 924021 INFO  (coreLoadExecutor-3987-thread-1) [    ] o.a.s.u.p.UpdateRequestProcessorChain
creating updateRequestProcessorChain "uniq-fields"
   [junit4]   2> 924021 INFO  (coreLoadExecutor-3987-thread-1) [    ] o.a.s.u.p.UpdateRequestProcessorChain
inserting DistributedUpdateProcessorFactory into updateRequestProcessorChain "uniq-fields"
   [junit4]   2> 924021 INFO  (coreLoadExecutor-3987-thread-1) [    ] o.a.s.u.p.UpdateRequestProcessorChain
creating updateRequestProcessorChain "distrib-dup-test-chain-explicit"
   [junit4]   2> 924021 INFO  (coreLoadExecutor-3987-thread-1) [    ] o.a.s.u.p.UpdateRequestProcessorChain
creating updateRequestProcessorChain "distrib-dup-test-chain-implicit"
   [junit4]   2> 924021 INFO  (coreLoadExecutor-3987-thread-1) [    ] o.a.s.u.p.UpdateRequestProcessorChain
inserting DistributedUpdateProcessorFactory into updateRequestProcessorChain "distrib-dup-test-chain-implicit"
   [junit4]   2> 924021 INFO  (coreLoadExecutor-3987-thread-1) [    ] o.a.s.c.SolrCore
no updateRequestProcessorChain defined as default, creating implicit default
   [junit4]   2> 924023 INFO  (coreLoadExecutor-3987-thread-1) [    ] o.a.s.h.l.XMLLoader
xsltCacheLifetimeSeconds=60
   [junit4]   2> 924024 INFO  (coreLoadExecutor-3987-thread-1) [    ] o.a.s.h.l.XMLLoader
xsltCacheLifetimeSeconds=60
   [junit4]   2> 924024 INFO  (coreLoadExecutor-3987-thread-1) [    ] o.a.s.h.l.XMLLoader
xsltCacheLifetimeSeconds=60
   [junit4]   2> 924025 INFO  (coreLoadExecutor-3987-thread-1) [    ] o.a.s.h.l.XMLLoader
xsltCacheLifetimeSeconds=60
   [junit4]   2> 924027 INFO  (coreLoadExecutor-3987-thread-1) [    ] o.a.s.c.PluginBag
requestHandler : 'lazy' created with startup=lazy 
   [junit4]   2> 924028 INFO  (coreLoadExecutor-3987-thread-1) [    ] o.a.s.c.RequestHandlers
Registered paths: /admin/mbeans,standard,spellCheckCompRH,lazy,/update/json/docs,/admin/luke,/export,spellCheckWithWordbreak_Direct,tvrh,/get,/admin/properties,/update/json,mltrh,/admin/threads,/search-facet-def,/update/csv,/sql,/graph,/search-facet-invariants,/admin/segments,spellCheckCompRH1,/mlt,/admin/system,/replication,dismax,defaults,/config,/stream,/schema,/admin/plugins,/admin/logging,spellCheckWithWordbreak,mock,/admin/ping,/update,/admin/file,/terms,spellCheckCompRH_Direct,/debug/dump
   [junit4]   2> 924028 INFO  (coreLoadExecutor-3987-thread-1) [    ] o.a.s.c.SolrCore
Using default statsCache cache: org.apache.solr.search.stats.LocalStatsCache
   [junit4]   2> 924028 INFO  (coreLoadExecutor-3987-thread-1) [    ] o.a.s.u.UpdateHandler
Using UpdateLog implementation: org.apache.solr.update.UpdateLog
   [junit4]   2> 924028 INFO  (coreLoadExecutor-3987-thread-1) [    ] o.a.s.u.UpdateLog
Initializing UpdateLog: dataDir= defaultSyncLevel=FLUSH numRecordsToKeep=100 maxNumLogsToKeep=10
numVersionBuckets=65536
   [junit4]   2> 924029 INFO  (coreLoadExecutor-3987-thread-1) [    ] o.a.s.u.CommitTracker
Hard AutoCommit: disabled
   [junit4]   2> 924029 INFO  (coreLoadExecutor-3987-thread-1) [    ] o.a.s.u.CommitTracker
Soft AutoCommit: disabled
   [junit4]   2> 924029 INFO  (coreLoadExecutor-3987-thread-1) [    ] o.a.s.u.RandomMergePolicy
RandomMergePolicy wrapping class org.apache.lucene.index.LogByteSizeMergePolicy: [LogByteSizeMergePolicy:
minMergeSize=1677721, mergeFactor=13, maxMergeSize=2147483648, maxMergeSizeForForcedMerge=9223372036854775807,
calibrateSizeByDeletes=true, maxMergeDocs=2147483647, maxCFSSegmentSizeMB=8.796093022207999E12,
noCFSRatio=1.0]
   [junit4]   2> 924029 INFO  (coreLoadExecutor-3987-thread-1) [    ] o.a.s.c.SolrDeletionPolicy
SolrDeletionPolicy.onInit: commits: num=1
   [junit4]   2> 	commit{dir=MockDirectoryWrapper(RAMDirectory@e3d588b lockFactory=org.apache.lucene.store.SingleInstanceLockFactory@194fdb07),segFN=segments_1,generation=1}
   [junit4]   2> 924029 INFO  (coreLoadExecutor-3987-thread-1) [    ] o.a.s.c.SolrDeletionPolicy
newest commit generation = 1
   [junit4]   2> 924029 INFO  (coreLoadExecutor-3987-thread-1) [    ] o.a.s.s.SolrIndexSearcher
Opening [Searcher@4f1d2c4b[collection1] main]
   [junit4]   2> 924029 INFO  (coreLoadExecutor-3987-thread-1) [    ] o.a.s.r.RestManager
Initializing RestManager with initArgs: {storageIO=org.apache.solr.rest.ManagedResourceStorage$InMemoryStorageIO}
   [junit4]   2> 924030 INFO  (coreLoadExecutor-3987-thread-1) [    ] o.a.s.r.ManagedResourceStorage
Reading _rest_managed.json using InMemoryStorage
   [junit4]   2> 924030 INFO  (coreLoadExecutor-3987-thread-1) [    ] o.a.s.r.RestManager
Initializing 0 registered ManagedResources
   [junit4]   2> 924030 INFO  (coreLoadExecutor-3987-thread-1) [    ] o.a.s.h.c.SpellCheckComponent
Initializing spell checkers
   [junit4]   2> 924064 INFO  (coreLoadExecutor-3987-thread-1) [    ] o.a.s.s.DirectSolrSpellChecker
init: {name=direct,classname=DirectSolrSpellChecker,field=lowerfilt,minQueryLength=3}
   [junit4]   2> 924224 INFO  (coreLoadExecutor-3987-thread-1) [    ] o.a.s.h.ReplicationHandler
Commits will be reserved for  10000
   [junit4]   2> 924224 INFO  (searcherExecutor-3988-thread-1) [    ] o.a.s.h.c.SpellCheckComponent
Loading spell index for spellchecker: default
   [junit4]   2> 924225 INFO  (searcherExecutor-3988-thread-1) [    ] o.a.s.h.c.SpellCheckComponent
Loading spell index for spellchecker: direct
   [junit4]   2> 924225 INFO  (searcherExecutor-3988-thread-1) [    ] o.a.s.h.c.SpellCheckComponent
Loading spell index for spellchecker: wordbreak
   [junit4]   2> 924225 INFO  (searcherExecutor-3988-thread-1) [    ] o.a.s.h.c.SpellCheckComponent
Loading spell index for spellchecker: multipleFields
   [junit4]   2> 924225 INFO  (coreLoadExecutor-3987-thread-1) [    ] o.a.s.u.UpdateLog
Looking up max value of version field to seed version buckets
   [junit4]   2> 924225 INFO  (coreLoadExecutor-3987-thread-1) [    ] o.a.s.u.VersionInfo
Refreshing highest value of _version_ for 65536 version buckets from index
   [junit4]   2> 924225 INFO  (coreLoadExecutor-3987-thread-1) [    ] o.a.s.u.VersionInfo
No terms found for _version_, cannot seed version bucket highest value from index
   [junit4]   2> 924225 INFO  (coreLoadExecutor-3987-thread-1) [    ] o.a.s.u.UpdateLog
Could not find max version in index or recent updates, using new clock 1535688345622937600
   [junit4]   2> 924225 INFO  (searcherExecutor-3988-thread-1) [    ] o.a.s.h.c.SpellCheckComponent
Loading spell index for spellchecker: jarowinkler
   [junit4]   2> 924225 INFO  (searcherExecutor-3988-thread-1) [    ] o.a.s.h.c.SpellCheckComponent
Loading spell index for spellchecker: external
   [junit4]   2> 924225 INFO  (searcherExecutor-3988-thread-1) [    ] o.a.s.h.c.SpellCheckComponent
Loading spell index for spellchecker: freq
   [junit4]   2> 924225 INFO  (searcherExecutor-3988-thread-1) [    ] o.a.s.h.c.SpellCheckComponent
Loading spell index for spellchecker: fqcn
   [junit4]   2> 924225 INFO  (searcherExecutor-3988-thread-1) [    ] o.a.s.h.c.SpellCheckComponent
Loading spell index for spellchecker: perDict
   [junit4]   2> 924226 INFO  (searcherExecutor-3988-thread-1) [    ] o.a.s.c.SolrCore
[collection1] Registered new searcher Searcher@4f1d2c4b[collection1] main{ExitableDirectoryReader(UninvertingDirectoryReader())}
   [junit4]   2> 924226 INFO  (coreLoadExecutor-3987-thread-1) [    ] o.a.s.u.UpdateLog
Took 1.0ms to seed version buckets with highest version 1535688345622937600
   [junit4]   2> 924227 INFO  (coreLoadExecutor-3987-thread-1) [    ] o.a.s.c.CoreContainer
registering core: collection1
   [junit4]   2> 924228 INFO  (SUITE-SolrPluginUtilsTest-seed#[70AFB5A556314C54]-worker)
[    ] o.a.s.SolrTestCaseJ4 ####initCore end
   [junit4]   2> 924230 INFO  (TEST-SolrPluginUtilsTest.testInvokeSetters-seed#[70AFB5A556314C54])
[    ] o.a.s.SolrTestCaseJ4 ###Starting testInvokeSetters
   [junit4]   2> 924231 INFO  (TEST-SolrPluginUtilsTest.testInvokeSetters-seed#[70AFB5A556314C54])
[    ] o.a.s.SolrTestCaseJ4 ###Ending testInvokeSetters
   [junit4]   2> NOTE: reproduce with: ant test  -Dtestcase=SolrPluginUtilsTest -Dtests.method=testInvokeSetters
-Dtests.seed=70AFB5A556314C54 -Dtests.multiplier=3 -Dtests.slow=true -Dtests.locale=sl -Dtests.timezone=Etc/Greenwich
-Dtests.asserts=true -Dtests.file.encoding=US-ASCII
   [junit4] ERROR   0.00s J1 | SolrPluginUtilsTest.testInvokeSetters <<<
   [junit4]    > Throwable #1: java.lang.IllegalArgumentException: argument type mismatch
   [junit4]    > 	at __randomizedtesting.SeedInfo.seed([70AFB5A556314C54:19B01EA5A3072EFF]:0)
   [junit4]    > 	at jdk.internal.reflect.NativeMethodAccessorImpl.invoke0(java.base@9-ea/Native
Method)
   [junit4]    > 	at jdk.internal.reflect.NativeMethodAccessorImpl.invoke(java.base@9-ea/NativeMethodAccessorImpl.java:62)
   [junit4]    > 	at jdk.internal.reflect.DelegatingMethodAccessorImpl.invoke(java.base@9-ea/DelegatingMethodAccessorImpl.java:43)
   [junit4]    > 	at org.apache.solr.util.SolrPluginUtils.invokeSetters(SolrPluginUtils.java:1071)
   [junit4]    > 	at org.apache.solr.util.SolrPluginUtilsTest.implTestInvokeSetters(SolrPluginUtilsTest.java:482)
   [junit4]    > 	at org.apache.solr.util.SolrPluginUtilsTest.testInvokeSetters(SolrPluginUtilsTest.java:474)
   [junit4]    > 	at jdk.internal.reflect.NativeMethodAccessorImpl.invoke0(java.base@9-ea/Native
Method)
   [junit4]    > 	at jdk.internal.reflect.NativeMethodAccessorImpl.invoke(java.base@9-ea/NativeMethodAccessorImpl.java:62)
   [junit4]    > 	at jdk.internal.reflect.DelegatingMethodAccessorImpl.invoke(java.base@9-ea/DelegatingMethodAccessorImpl.java:43)
   [junit4]    > 	at java.lang.Thread.run(java.base@9-ea/Thread.java:843)
   [junit4]   2> 924233 INFO  (TEST-SolrPluginUtilsTest.testParseFieldBoosts-seed#[70AFB5A556314C54])
[    ] o.a.s.SolrTestCaseJ4 ###Starting testParseFieldBoosts
   [junit4]   2> 924233 INFO  (TEST-SolrPluginUtilsTest.testParseFieldBoosts-seed#[70AFB5A556314C54])
[    ] o.a.s.SolrTestCaseJ4 ###Ending testParseFieldBoosts
   [junit4]   2> 924234 INFO  (TEST-SolrPluginUtilsTest.testDisjunctionMaxQueryParser-seed#[70AFB5A556314C54])
[    ] o.a.s.SolrTestCaseJ4 ###Starting testDisjunctionMaxQueryParser
   [junit4]   2> 924235 INFO  (TEST-SolrPluginUtilsTest.testDisjunctionMaxQueryParser-seed#[70AFB5A556314C54])
[    ] o.a.s.SolrTestCaseJ4 ###Ending testDisjunctionMaxQueryParser
   [junit4]   2> 924236 INFO  (TEST-SolrPluginUtilsTest.testDocListConversion-seed#[70AFB5A556314C54])
[    ] o.a.s.SolrTestCaseJ4 ###Starting testDocListConversion
   [junit4]   2> 924237 INFO  (TEST-SolrPluginUtilsTest.testDocListConversion-seed#[70AFB5A556314C54])
[    ] o.a.s.u.p.LogUpdateProcessorFactory [collection1]  webapp=null path=null params={}{add=[3234
(1535688345634471936)]} 0 0
   [junit4]   2> 924238 INFO  (TEST-SolrPluginUtilsTest.testDocListConversion-seed#[70AFB5A556314C54])
[    ] o.a.s.u.p.LogUpdateProcessorFactory [collection1]  webapp=null path=null params={}{add=[3235
(1535688345636569088)]} 0 0
   [junit4]   2> 924239 INFO  (TEST-SolrPluginUtilsTest.testDocListConversion-seed#[70AFB5A556314C54])
[    ] o.a.s.u.p.LogUpdateProcessorFactory [collection1]  webapp=null path=null params={}{add=[3236
(1535688345637617664)]} 0 0
   [junit4]   2> 924239 INFO  (TEST-SolrPluginUtilsTest.testDocListConversion-seed#[70AFB5A556314C54])
[    ] o.a.s.u.DirectUpdateHandler2 start commit{,optimize=false,openSearcher=true,waitSearcher=true,expungeDeletes=false,softCommit=false,prepareCommit=false}
   [junit4]   2> 924242 INFO  (TEST-SolrPluginUtilsTest.testDocListConversion-seed#[70AFB5A556314C54])
[    ] o.a.s.c.SolrDeletionPolicy SolrDeletionPolicy.onCommit: commits: num=2
   [junit4]   2> 	commit{dir=MockDirectoryWrapper(RAMDirectory@e3d588b lockFactory=org.apache.lucene.store.SingleInstanceLockFactory@194fdb07),segFN=segments_1,generation=1}
   [junit4]   2> 	commit{dir=MockDirectoryWrapper(RAMDirectory@e3d588b lockFactory=org.apache.lucene.store.SingleInstanceLockFactory@194fdb07),segFN=segments_2,generation=2}
   [junit4]   2> 924242 INFO  (TEST-SolrPluginUtilsTest.testDocListConversion-seed#[70AFB5A556314C54])
[    ] o.a.s.c.SolrDeletionPolicy newest commit generation = 2
   [junit4]   2> 924243 INFO  (TEST-SolrPluginUtilsTest.testDocListConversion-seed#[70AFB5A556314C54])
[    ] o.a.s.s.SolrIndexSearcher Opening [Searcher@370ab604[collection1] main]
   [junit4]   2> 924243 INFO  (TEST-SolrPluginUtilsTest.testDocListConversion-seed#[70AFB5A556314C54])
[    ] o.a.s.u.DirectUpdateHandler2 end_commit_flush
   [junit4]   2> 924244 INFO  (searcherExecutor-3988-thread-1) [    ] o.a.s.c.SolrCore
[collection1] Registered new searcher Searcher@370ab604[collection1] main{ExitableDirectoryReader(UninvertingDirectoryReader(Uninverting(_0(7.0.0):C3)))}
   [junit4]   2> 924244 INFO  (TEST-SolrPluginUtilsTest.testDocListConversion-seed#[70AFB5A556314C54])
[    ] o.a.s.u.p.LogUpdateProcessorFactory [collection1]  webapp=null path=null params={}{commit=}
0 5
   [junit4]   2> 924244 INFO  (TEST-SolrPluginUtilsTest.testDocListConversion-seed#[70AFB5A556314C54])
[    ] o.a.s.SolrTestCaseJ4 ###Ending testDocListConversion
   [junit4]   2> 924245 INFO  (TEST-SolrPluginUtilsTest.testMinShouldMatchAutoRelax-seed#[70AFB5A556314C54])
[    ] o.a.s.SolrTestCaseJ4 ###Starting testMinShouldMatchAutoRelax
   [junit4]   2> 924246 INFO  (TEST-SolrPluginUtilsTest.testMinShouldMatchAutoRelax-seed#[70AFB5A556314C54])
[    ] o.a.s.SolrTestCaseJ4 ###Ending testMinShouldMatchAutoRelax
   [junit4]   2> 924246 INFO  (TEST-SolrPluginUtilsTest.testStripIllegalOperators-seed#[70AFB5A556314C54])
[    ] o.a.s.SolrTestCaseJ4 ###Starting testStripIllegalOperators
   [junit4]   2> 924247 INFO  (TEST-SolrPluginUtilsTest.testStripIllegalOperators-seed#[70AFB5A556314C54])
[    ] o.a.s.SolrTestCaseJ4 ###Ending testStripIllegalOperators
   [junit4]   2> 924248 INFO  (TEST-SolrPluginUtilsTest.testMinShouldMatchCalculator-seed#[70AFB5A556314C54])
[    ] o.a.s.SolrTestCaseJ4 ###Starting testMinShouldMatchCalculator
   [junit4]   2> 924248 INFO  (TEST-SolrPluginUtilsTest.testMinShouldMatchCalculator-seed#[70AFB5A556314C54])
[    ] o.a.s.SolrTestCaseJ4 ###Ending testMinShouldMatchCalculator
   [junit4]   2> 924249 INFO  (TEST-SolrPluginUtilsTest.testPartialEscape-seed#[70AFB5A556314C54])
[    ] o.a.s.SolrTestCaseJ4 ###Starting testPartialEscape
   [junit4]   2> 924249 INFO  (TEST-SolrPluginUtilsTest.testPartialEscape-seed#[70AFB5A556314C54])
[    ] o.a.s.SolrTestCaseJ4 ###Ending testPartialEscape
   [junit4]   2> 924250 INFO  (TEST-SolrPluginUtilsTest.testStripUnbalancedQuotes-seed#[70AFB5A556314C54])
[    ] o.a.s.SolrTestCaseJ4 ###Starting testStripUnbalancedQuotes
   [junit4]   2> 924250 INFO  (TEST-SolrPluginUtilsTest.testStripUnbalancedQuotes-seed#[70AFB5A556314C54])
[    ] o.a.s.SolrTestCaseJ4 ###Ending testStripUnbalancedQuotes
   [junit4]   2> 924250 INFO  (SUITE-SolrPluginUtilsTest-seed#[70AFB5A556314C54]-worker)
[    ] o.a.s.SolrTestCaseJ4 ###deleteCore
   [junit4]   2> 924250 INFO  (SUITE-SolrPluginUtilsTest-seed#[70AFB5A556314C54]-worker)
[    ] o.a.s.c.CoreContainer Shutting down CoreContainer instance=753038255
   [junit4]   2> 924250 INFO  (coreCloseExecutor-3993-thread-1) [    ] o.a.s.c.SolrCore
[collection1]  CLOSING SolrCore org.apache.solr.core.SolrCore@dec0a46
   [junit4]   2> 924250 INFO  (coreCloseExecutor-3993-thread-1) [    ] o.a.s.u.DirectUpdateHandler2
closing DirectUpdateHandler2{commits=1,autocommits=0,soft autocommits=0,optimizes=0,rollbacks=0,expungeDeletes=0,docsPending=0,adds=0,deletesById=0,deletesByQuery=0,errors=0,cumulative_adds=3,cumulative_deletesById=0,cumulative_deletesByQuery=0,cumulative_errors=0,transaction_logs_total_size=251,transaction_logs_total_number=1}
   [junit4]   2> 924250 INFO  (coreCloseExecutor-3993-thread-1) [    ] o.a.s.u.SolrCoreState
Closing SolrCoreState
   [junit4]   2> 924250 INFO  (coreCloseExecutor-3993-thread-1) [    ] o.a.s.u.DefaultSolrCoreState
SolrCoreState ref count has reached 0 - closing IndexWriter
   [junit4]   2> 924250 INFO  (coreCloseExecutor-3993-thread-1) [    ] o.a.s.u.DefaultSolrCoreState
closing IndexWriter with IndexWriterCloser
   [junit4]   2> 924250 INFO  (coreCloseExecutor-3993-thread-1) [    ] o.a.s.c.SolrCore
[collection1] Closing main searcher on request.
   [junit4]   2> 924256 INFO  (coreCloseExecutor-3993-thread-1) [    ] o.a.s.c.CachingDirectoryFactory
Closing MockDirectoryFactory - 2 directories currently being tracked
   [junit4]   2> 924256 INFO  (coreCloseExecutor-3993-thread-1) [    ] o.a.s.c.CachingDirectoryFactory
looking to close /home/jenkins/workspace/Lucene-Solr-master-Linux/solr/build/solr-core/test/J1/temp/solr.util.SolrPluginUtilsTest_70AFB5A556314C54-001/init-core-data-001
[CachedDir<<refCount=0;path=/home/jenkins/workspace/Lucene-Solr-master-Linux/solr/build/solr-core/test/J1/temp/solr.util.SolrPluginUtilsTest_70AFB5A556314C54-001/init-core-data-001;done=false>>]
   [junit4]   2> 924256 INFO  (coreCloseExecutor-3993-thread-1) [    ] o.a.s.c.CachingDirectoryFactory
Closing directory, CoreContainer#isShutdown=true
   [junit4]   2> 924256 INFO  (coreCloseExecutor-3993-thread-1) [    ] o.a.s.c.CachingDirectoryFactory
Closing directory: /home/jenkins/workspace/Lucene-Solr-master-Linux/solr/build/solr-core/test/J1/temp/solr.util.SolrPluginUtilsTest_70AFB5A556314C54-001/init-core-data-001
   [junit4]   2> 924256 INFO  (coreCloseExecutor-3993-thread-1) [    ] o.a.s.c.CachingDirectoryFactory
looking to close /home/jenkins/workspace/Lucene-Solr-master-Linux/solr/build/solr-core/test/J1/temp/solr.util.SolrPluginUtilsTest_70AFB5A556314C54-001/init-core-data-001/index
[CachedDir<<refCount=0;path=/home/jenkins/workspace/Lucene-Solr-master-Linux/solr/build/solr-core/test/J1/temp/solr.util.SolrPluginUtilsTest_70AFB5A556314C54-001/init-core-data-001/index;done=false>>]
   [junit4]   2> 924256 INFO  (coreCloseExecutor-3993-thread-1) [    ] o.a.s.c.CachingDirectoryFactory
Closing directory, CoreContainer#isShutdown=true
   [junit4]   2> 924256 INFO  (coreCloseExecutor-3993-thread-1) [    ] o.a.s.c.CachingDirectoryFactory
Closing directory: /home/jenkins/workspace/Lucene-Solr-master-Linux/solr/build/solr-core/test/J1/temp/solr.util.SolrPluginUtilsTest_70AFB5A556314C54-001/init-core-data-001/index
   [junit4]   2> NOTE: leaving temporary files on disk at: /home/jenkins/workspace/Lucene-Solr-master-Linux/solr/build/solr-core/test/J1/temp/solr.util.SolrPluginUtilsTest_70AFB5A556314C54-001
   [junit4]   2> NOTE: test params are: codec=Asserting(Lucene62): {val_dynamic=PostingsFormat(name=LuceneFixedGap),
range_facet_l_dv=PostingsFormat(name=LuceneFixedGap), _version_=FSTOrd50, multiDefault=PostingsFormat(name=LuceneVarGapFixedInterval),
val_i=PostingsFormat(name=LuceneFixedGap), intDefault=FSTOrd50, dynamic_val=PostingsFormat(name=LuceneFixedGap),
id=PostingsFormat(name=LuceneFixedGap), range_facet_i_dv=FSTOrd50, range_facet_l=FSTOrd50,
timestamp=FSTOrd50}, docValues:{range_facet_l_dv=DocValuesFormat(name=Memory), range_facet_i_dv=DocValuesFormat(name=Lucene54),
timestamp=DocValuesFormat(name=Lucene54)}, maxPointsInLeafNode=98, maxMBSortInHeap=6.114359963266631,
sim=ClassicSimilarity, locale=sl, timezone=Etc/Greenwich
   [junit4]   2> NOTE: Linux 4.4.0-21-generic amd64/Oracle Corporation 9-ea (64-bit)/cpus=12,threads=1,free=127456576,total=515899392
   [junit4]   2> NOTE: All tests run in this JVM: [BlockCacheTest, AliasIntegrationTest,
ConjunctionSolrSpellCheckerTest, TestQuerySenderNoQuery, TestSolrCoreProperties, AnalysisErrorHandlingTest,
DirectSolrSpellCheckerTest, TestSlowCompositeReaderWrapper, HdfsTlogReplayBufferedWhileIndexingTest,
StressHdfsTest, TestFieldCacheWithThreads, TestShardHandlerFactory, EnumFieldTest, DistributedFacetPivotLargeTest,
SuggesterFSTTest, NumericFieldsTest, SortByFunctionTest, VMParamsZkACLAndCredentialsProvidersTest,
TestCoreContainer, ZkControllerTest, TestManagedStopFilterFactory, TestCodecSupport, TestSimpleTrackingShardHandler,
TestMinMaxOnMultiValuedField, RestartWhileUpdatingTest, BigEndianAscendingWordSerializerTest,
TestNonDefinedSimilarityFactory, LeaderInitiatedRecoveryOnShardRestartTest, TestStressVersions,
SegmentsInfoRequestHandlerTest, BasicFunctionalityTest, ZkStateWriterTest, HdfsRestartWhileUpdatingTest,
TestSolrXml, RecoveryAfterSoftCommitTest, TestPartialUpdateDeduplication, TestSolrConfigHandlerConcurrent,
TestCloudManagedSchema, TestBulkSchemaAPI, TestAddFieldRealTimeGet, TestSolrFieldCacheMBean,
CdcrReplicationHandlerTest, TestFilteredDocIdSet, OpenCloseCoreStressTest, DeleteReplicaTest,
TestTolerantUpdateProcessorRandomCloud, TestExactStatsCache, TestQueryTypes, DistributedFacetPivotSmallTest,
MergeStrategyTest, TestSimpleQParserPlugin, TestWordDelimiterFilterFactory, SolrInfoMBeanTest,
TestQuerySenderListener, TestSolrQueryParserDefaultOperatorResource, VersionInfoTest, TestCloudDeleteByQuery,
BlockJoinFacetSimpleTest, SparseHLLTest, TestInitQParser, ConvertedLegacyTest, TestSystemIdResolver,
TestRuleBasedAuthorizationPlugin, PKIAuthenticationIntegrationTest, IndexBasedSpellCheckerTest,
TestManagedResource, TestQueryUtils, SpatialFilterTest, TestHashPartitioner, TestDynamicLoading,
ConfigSetsAPITest, FullHLLTest, TestBM25SimilarityFactory, HdfsNNFailoverTest, ClusterStateUpdateTest,
TestTrie, ZkSolrClientTest, TestDownShardTolerantSearch, FastVectorHighlighterTest, TimeZoneUtilsTest,
TestLFUCache, TestSolrQueryResponse, CachingDirectoryFactoryTest, SolrXmlInZkTest, BJQParserTest,
TestBinaryResponseWriter, TestFastLRUCache, LoggingHandlerTest, TestInitParams, ChaosMonkeySafeLeaderTest,
TermVectorComponentTest, HighlighterTest, ChaosMonkeyNothingIsSafeTest, TestUpdate, DistributedMLTComponentTest,
CollectionReloadTest, SharedFSAutoReplicaFailoverUtilsTest, TestConfigSetImmutable, BasicDistributedZk2Test,
CollectionsAPIDistributedZkTest, DistributedSpellCheckComponentTest, StatsComponentTest, QueryElevationComponentTest,
PeerSyncTest, DirectUpdateHandlerTest, ShowFileRequestHandlerTest, CurrencyFieldXmlFileTest,
SolrIndexSplitterTest, SimplePostToolTest, SignatureUpdateProcessorFactoryTest, TestExtendedDismaxParser,
SpellCheckCollatorTest, CoreAdminHandlerTest, SuggesterTSTTest, SuggesterTest, TestStressLucene,
SuggesterWFSTTest, TestCSVLoader, NoCacheHeaderTest, WordBreakSolrSpellCheckerTest, SchemaVersionSpecificBehaviorTest,
TestAtomicUpdateErrorCases, StatelessScriptUpdateProcessorFactoryTest, CacheHeaderTest, DisMaxRequestHandlerTest,
TestReversedWildcardFilterFactory, XmlUpdateRequestHandlerTest, TestIndexingPerformance, FieldAnalysisRequestHandlerTest,
SolrPluginUtilsTest]
   [junit4] Completed [377/611 (1!)] on J1 in 0.55s, 9 tests, 1 error <<< FAILURES!

[...truncated 768 lines...]
BUILD FAILED
/home/jenkins/workspace/Lucene-Solr-master-Linux/build.xml:740: The following error occurred
while executing this line:
/home/jenkins/workspace/Lucene-Solr-master-Linux/build.xml:684: The following error occurred
while executing this line:
/home/jenkins/workspace/Lucene-Solr-master-Linux/build.xml:59: The following error occurred
while executing this line:
/home/jenkins/workspace/Lucene-Solr-master-Linux/solr/build.xml:233: The following error occurred
while executing this line:
/home/jenkins/workspace/Lucene-Solr-master-Linux/solr/common-build.xml:531: The following
error occurred while executing this line:
/home/jenkins/workspace/Lucene-Solr-master-Linux/lucene/common-build.xml:1427: The following
error occurred while executing this line:
/home/jenkins/workspace/Lucene-Solr-master-Linux/lucene/common-build.xml:984: There were test
failures: 611 suites (10 ignored), 2558 tests, 1 error, 118 ignored (72 assumptions) [seed:
70AFB5A556314C54]

Total time: 54 minutes 21 seconds
Build step 'Invoke Ant' marked build as failure
Archiving artifacts
[WARNINGS] Skipping publisher since build result is FAILURE
Recording test results
Email was triggered for: Failure - Any
Sending email for trigger: Failure - Any



Mime
View raw message