lucene-dev mailing list archives

Site index · List index
Message view « Date » · « Thread »
Top « Date » · « Thread »
From Policeman Jenkins Server <jenk...@thetaphi.de>
Subject [JENKINS] Lucene-Solr-6.x-Linux (32bit/jdk1.8.0_92) - Build # 740 - Failure!
Date Thu, 26 May 2016 00:07:11 GMT
Build: http://jenkins.thetaphi.de/job/Lucene-Solr-6.x-Linux/740/
Java: 32bit/jdk1.8.0_92 -client -XX:+UseConcMarkSweepGC

1 tests failed.
FAILED:  org.apache.solr.schema.TestManagedSchemaAPI.test

Error Message:
Error from server at http://127.0.0.1:43623/solr/testschemaapi_shard1_replica1: ERROR: [doc=2] unknown field 'myNewField1'

Stack Trace:
org.apache.solr.client.solrj.impl.CloudSolrClient$RouteException: Error from server at http://127.0.0.1:43623/solr/testschemaapi_shard1_replica1: ERROR: [doc=2] unknown field 'myNewField1'
	at __randomizedtesting.SeedInfo.seed([3AC9536D3434E164:B29D6CB79AC88C9C]:0)
	at org.apache.solr.client.solrj.impl.CloudSolrClient.directUpdate(CloudSolrClient.java:697)
	at org.apache.solr.client.solrj.impl.CloudSolrClient.sendRequest(CloudSolrClient.java:1109)
	at org.apache.solr.client.solrj.impl.CloudSolrClient.requestWithRetryOnStaleState(CloudSolrClient.java:998)
	at org.apache.solr.client.solrj.impl.CloudSolrClient.request(CloudSolrClient.java:934)
	at org.apache.solr.schema.TestManagedSchemaAPI.testAddFieldAndDocument(TestManagedSchemaAPI.java:86)
	at org.apache.solr.schema.TestManagedSchemaAPI.test(TestManagedSchemaAPI.java:55)
	at sun.reflect.NativeMethodAccessorImpl.invoke0(Native Method)
	at sun.reflect.NativeMethodAccessorImpl.invoke(NativeMethodAccessorImpl.java:62)
	at sun.reflect.DelegatingMethodAccessorImpl.invoke(DelegatingMethodAccessorImpl.java:43)
	at java.lang.reflect.Method.invoke(Method.java:498)
	at com.carrotsearch.randomizedtesting.RandomizedRunner.invoke(RandomizedRunner.java:1764)
	at com.carrotsearch.randomizedtesting.RandomizedRunner$8.evaluate(RandomizedRunner.java:871)
	at com.carrotsearch.randomizedtesting.RandomizedRunner$9.evaluate(RandomizedRunner.java:907)
	at com.carrotsearch.randomizedtesting.RandomizedRunner$10.evaluate(RandomizedRunner.java:921)
	at com.carrotsearch.randomizedtesting.rules.SystemPropertiesRestoreRule$1.evaluate(SystemPropertiesRestoreRule.java:57)
	at org.apache.lucene.util.TestRuleSetupTeardownChained$1.evaluate(TestRuleSetupTeardownChained.java:49)
	at org.apache.lucene.util.AbstractBeforeAfterRule$1.evaluate(AbstractBeforeAfterRule.java:45)
	at org.apache.lucene.util.TestRuleThreadAndTestName$1.evaluate(TestRuleThreadAndTestName.java:48)
	at org.apache.lucene.util.TestRuleIgnoreAfterMaxFailures$1.evaluate(TestRuleIgnoreAfterMaxFailures.java:64)
	at org.apache.lucene.util.TestRuleMarkFailure$1.evaluate(TestRuleMarkFailure.java:47)
	at com.carrotsearch.randomizedtesting.rules.StatementAdapter.evaluate(StatementAdapter.java:36)
	at com.carrotsearch.randomizedtesting.ThreadLeakControl$StatementRunner.run(ThreadLeakControl.java:367)
	at com.carrotsearch.randomizedtesting.ThreadLeakControl.forkTimeoutingTask(ThreadLeakControl.java:809)
	at com.carrotsearch.randomizedtesting.ThreadLeakControl$3.evaluate(ThreadLeakControl.java:460)
	at com.carrotsearch.randomizedtesting.RandomizedRunner.runSingleTest(RandomizedRunner.java:880)
	at com.carrotsearch.randomizedtesting.RandomizedRunner$5.evaluate(RandomizedRunner.java:781)
	at com.carrotsearch.randomizedtesting.RandomizedRunner$6.evaluate(RandomizedRunner.java:816)
	at com.carrotsearch.randomizedtesting.RandomizedRunner$7.evaluate(RandomizedRunner.java:827)
	at com.carrotsearch.randomizedtesting.rules.StatementAdapter.evaluate(StatementAdapter.java:36)
	at com.carrotsearch.randomizedtesting.rules.SystemPropertiesRestoreRule$1.evaluate(SystemPropertiesRestoreRule.java:57)
	at org.apache.lucene.util.AbstractBeforeAfterRule$1.evaluate(AbstractBeforeAfterRule.java:45)
	at com.carrotsearch.randomizedtesting.rules.StatementAdapter.evaluate(StatementAdapter.java:36)
	at org.apache.lucene.util.TestRuleStoreClassName$1.evaluate(TestRuleStoreClassName.java:41)
	at com.carrotsearch.randomizedtesting.rules.NoShadowingOrOverridesOnMethodsRule$1.evaluate(NoShadowingOrOverridesOnMethodsRule.java:40)
	at com.carrotsearch.randomizedtesting.rules.NoShadowingOrOverridesOnMethodsRule$1.evaluate(NoShadowingOrOverridesOnMethodsRule.java:40)
	at com.carrotsearch.randomizedtesting.rules.StatementAdapter.evaluate(StatementAdapter.java:36)
	at com.carrotsearch.randomizedtesting.rules.StatementAdapter.evaluate(StatementAdapter.java:36)
	at com.carrotsearch.randomizedtesting.rules.StatementAdapter.evaluate(StatementAdapter.java:36)
	at org.apache.lucene.util.TestRuleAssertionsRequired$1.evaluate(TestRuleAssertionsRequired.java:53)
	at org.apache.lucene.util.TestRuleMarkFailure$1.evaluate(TestRuleMarkFailure.java:47)
	at org.apache.lucene.util.TestRuleIgnoreAfterMaxFailures$1.evaluate(TestRuleIgnoreAfterMaxFailures.java:64)
	at org.apache.lucene.util.TestRuleIgnoreTestSuites$1.evaluate(TestRuleIgnoreTestSuites.java:54)
	at com.carrotsearch.randomizedtesting.rules.StatementAdapter.evaluate(StatementAdapter.java:36)
	at com.carrotsearch.randomizedtesting.ThreadLeakControl$StatementRunner.run(ThreadLeakControl.java:367)
	at java.lang.Thread.run(Thread.java:745)
Caused by: org.apache.solr.client.solrj.impl.HttpSolrClient$RemoteSolrException: Error from server at http://127.0.0.1:43623/solr/testschemaapi_shard1_replica1: ERROR: [doc=2] unknown field 'myNewField1'
	at org.apache.solr.client.solrj.impl.HttpSolrClient.executeMethod(HttpSolrClient.java:590)
	at org.apache.solr.client.solrj.impl.HttpSolrClient.request(HttpSolrClient.java:259)
	at org.apache.solr.client.solrj.impl.HttpSolrClient.request(HttpSolrClient.java:248)
	at org.apache.solr.client.solrj.impl.LBHttpSolrClient.doRequest(LBHttpSolrClient.java:404)
	at org.apache.solr.client.solrj.impl.LBHttpSolrClient.request(LBHttpSolrClient.java:357)
	at org.apache.solr.client.solrj.impl.CloudSolrClient.lambda$directUpdate$0(CloudSolrClient.java:674)
	at java.util.concurrent.FutureTask.run(FutureTask.java:266)
	at org.apache.solr.common.util.ExecutorUtil$MDCAwareThreadPoolExecutor.lambda$execute$0(ExecutorUtil.java:229)
	at java.util.concurrent.ThreadPoolExecutor.runWorker(ThreadPoolExecutor.java:1142)
	at java.util.concurrent.ThreadPoolExecutor$Worker.run(ThreadPoolExecutor.java:617)
	... 1 more




Build Log:
[...truncated 11371 lines...]
   [junit4] Suite: org.apache.solr.schema.TestManagedSchemaAPI
   [junit4]   2> Creating dataDir: /home/jenkins/workspace/Lucene-Solr-6.x-Linux/solr/build/solr-core/test/J2/temp/solr.schema.TestManagedSchemaAPI_3AC9536D3434E164-001/init-core-data-001
   [junit4]   2> 1437303 WARN  (SUITE-TestManagedSchemaAPI-seed#[3AC9536D3434E164]-worker) [    ] o.a.s.SolrTestCaseJ4 startTrackingSearchers: numOpens=90 numCloses=90
   [junit4]   2> 1437304 INFO  (SUITE-TestManagedSchemaAPI-seed#[3AC9536D3434E164]-worker) [    ] o.a.s.SolrTestCaseJ4 Randomized ssl (false) and clientAuth (false)
   [junit4]   2> 1437305 INFO  (SUITE-TestManagedSchemaAPI-seed#[3AC9536D3434E164]-worker) [    ] o.a.s.c.ZkTestServer STARTING ZK TEST SERVER
   [junit4]   2> 1437306 INFO  (Thread-2626) [    ] o.a.s.c.ZkTestServer client port:0.0.0.0/0.0.0.0:0
   [junit4]   2> 1437306 INFO  (Thread-2626) [    ] o.a.s.c.ZkTestServer Starting server
   [junit4]   2> 1437406 INFO  (SUITE-TestManagedSchemaAPI-seed#[3AC9536D3434E164]-worker) [    ] o.a.s.c.ZkTestServer start zk server on port:36608
   [junit4]   2> 1437406 INFO  (SUITE-TestManagedSchemaAPI-seed#[3AC9536D3434E164]-worker) [    ] o.a.s.c.c.SolrZkClient Using default ZkCredentialsProvider
   [junit4]   2> 1437407 INFO  (SUITE-TestManagedSchemaAPI-seed#[3AC9536D3434E164]-worker) [    ] o.a.s.c.c.ConnectionManager Waiting for client to connect to ZooKeeper
   [junit4]   2> 1437408 INFO  (zkCallback-1573-thread-1) [    ] o.a.s.c.c.ConnectionManager Watcher org.apache.solr.common.cloud.ConnectionManager@16f665d name:ZooKeeperConnection Watcher:127.0.0.1:36608 got event WatchedEvent state:SyncConnected type:None path:null path:null type:None
   [junit4]   2> 1437408 INFO  (SUITE-TestManagedSchemaAPI-seed#[3AC9536D3434E164]-worker) [    ] o.a.s.c.c.ConnectionManager Client is connected to ZooKeeper
   [junit4]   2> 1437409 INFO  (SUITE-TestManagedSchemaAPI-seed#[3AC9536D3434E164]-worker) [    ] o.a.s.c.c.SolrZkClient Using default ZkACLProvider
   [junit4]   2> 1437409 INFO  (SUITE-TestManagedSchemaAPI-seed#[3AC9536D3434E164]-worker) [    ] o.a.s.c.c.SolrZkClient makePath: /solr/solr.xml
   [junit4]   2> 1437412 INFO  (jetty-launcher-1572-thread-2) [    ] o.e.j.s.Server jetty-9.3.8.v20160314
   [junit4]   2> 1437412 INFO  (jetty-launcher-1572-thread-1) [    ] o.e.j.s.Server jetty-9.3.8.v20160314
   [junit4]   2> 1437413 INFO  (jetty-launcher-1572-thread-1) [    ] o.e.j.s.h.ContextHandler Started o.e.j.s.ServletContextHandler@1ea4102{/solr,null,AVAILABLE}
   [junit4]   2> 1437413 INFO  (jetty-launcher-1572-thread-2) [    ] o.e.j.s.h.ContextHandler Started o.e.j.s.ServletContextHandler@170da71{/solr,null,AVAILABLE}
   [junit4]   2> 1437415 INFO  (jetty-launcher-1572-thread-2) [    ] o.e.j.s.ServerConnector Started ServerConnector@c0efec{HTTP/1.1,[http/1.1]}{127.0.0.1:43623}
   [junit4]   2> 1437415 INFO  (jetty-launcher-1572-thread-1) [    ] o.e.j.s.ServerConnector Started ServerConnector@69fb75{HTTP/1.1,[http/1.1]}{127.0.0.1:40943}
   [junit4]   2> 1437415 INFO  (jetty-launcher-1572-thread-2) [    ] o.e.j.s.Server Started @1438618ms
   [junit4]   2> 1437415 INFO  (jetty-launcher-1572-thread-1) [    ] o.e.j.s.Server Started @1438618ms
   [junit4]   2> 1437415 INFO  (jetty-launcher-1572-thread-2) [    ] o.a.s.c.s.e.JettySolrRunner Jetty properties: {hostContext=/solr, hostPort=43623}
   [junit4]   2> 1437415 INFO  (jetty-launcher-1572-thread-1) [    ] o.a.s.c.s.e.JettySolrRunner Jetty properties: {hostContext=/solr, hostPort=40943}
   [junit4]   2> 1437415 INFO  (jetty-launcher-1572-thread-2) [    ] o.a.s.s.SolrDispatchFilter SolrDispatchFilter.init(): sun.misc.Launcher$AppClassLoader@1d16e93
   [junit4]   2> 1437415 INFO  (jetty-launcher-1572-thread-1) [    ] o.a.s.s.SolrDispatchFilter SolrDispatchFilter.init(): sun.misc.Launcher$AppClassLoader@1d16e93
   [junit4]   2> 1437415 INFO  (jetty-launcher-1572-thread-2) [    ] o.a.s.c.SolrResourceLoader new SolrResourceLoader for directory: '/home/jenkins/workspace/Lucene-Solr-6.x-Linux/solr/build/solr-core/test/J2/temp/solr.schema.TestManagedSchemaAPI_3AC9536D3434E164-001/tempDir-001/node2'
   [junit4]   2> 1437415 INFO  (jetty-launcher-1572-thread-1) [    ] o.a.s.c.SolrResourceLoader new SolrResourceLoader for directory: '/home/jenkins/workspace/Lucene-Solr-6.x-Linux/solr/build/solr-core/test/J2/temp/solr.schema.TestManagedSchemaAPI_3AC9536D3434E164-001/tempDir-001/node1'
   [junit4]   2> 1437415 INFO  (jetty-launcher-1572-thread-2) [    ] o.a.s.c.SolrResourceLoader JNDI not configured for solr (NoInitialContextEx)
   [junit4]   2> 1437416 INFO  (jetty-launcher-1572-thread-1) [    ] o.a.s.c.SolrResourceLoader JNDI not configured for solr (NoInitialContextEx)
   [junit4]   2> 1437416 INFO  (jetty-launcher-1572-thread-2) [    ] o.a.s.c.SolrResourceLoader solr home defaulted to 'solr/' (could not find system property or JNDI)
   [junit4]   2> 1437416 INFO  (jetty-launcher-1572-thread-1) [    ] o.a.s.c.SolrResourceLoader solr home defaulted to 'solr/' (could not find system property or JNDI)
   [junit4]   2> 1437416 INFO  (jetty-launcher-1572-thread-2) [    ] o.a.s.c.c.SolrZkClient Using default ZkCredentialsProvider
   [junit4]   2> 1437416 INFO  (jetty-launcher-1572-thread-1) [    ] o.a.s.c.c.SolrZkClient Using default ZkCredentialsProvider
   [junit4]   2> 1437416 INFO  (jetty-launcher-1572-thread-2) [    ] o.a.s.c.c.ConnectionManager Waiting for client to connect to ZooKeeper
   [junit4]   2> 1437416 INFO  (jetty-launcher-1572-thread-1) [    ] o.a.s.c.c.ConnectionManager Waiting for client to connect to ZooKeeper
   [junit4]   2> 1437417 INFO  (zkCallback-1574-thread-1) [    ] o.a.s.c.c.ConnectionManager Watcher org.apache.solr.common.cloud.ConnectionManager@69b20d name:ZooKeeperConnection Watcher:127.0.0.1:36608/solr got event WatchedEvent state:SyncConnected type:None path:null path:null type:None
   [junit4]   2> 1437417 INFO  (jetty-launcher-1572-thread-2) [    ] o.a.s.c.c.ConnectionManager Client is connected to ZooKeeper
   [junit4]   2> 1437417 INFO  (zkCallback-1575-thread-1) [    ] o.a.s.c.c.ConnectionManager Watcher org.apache.solr.common.cloud.ConnectionManager@74f888 name:ZooKeeperConnection Watcher:127.0.0.1:36608/solr got event WatchedEvent state:SyncConnected type:None path:null path:null type:None
   [junit4]   2> 1437417 INFO  (jetty-launcher-1572-thread-2) [    ] o.a.s.c.c.SolrZkClient Using default ZkACLProvider
   [junit4]   2> 1437417 INFO  (jetty-launcher-1572-thread-1) [    ] o.a.s.c.c.ConnectionManager Client is connected to ZooKeeper
   [junit4]   2> 1437418 INFO  (jetty-launcher-1572-thread-1) [    ] o.a.s.c.c.SolrZkClient Using default ZkACLProvider
   [junit4]   2> 1437418 INFO  (jetty-launcher-1572-thread-2) [    ] o.a.s.s.SolrDispatchFilter solr.xml found in ZooKeeper. Loading...
   [junit4]   2> 1437418 INFO  (jetty-launcher-1572-thread-1) [    ] o.a.s.s.SolrDispatchFilter solr.xml found in ZooKeeper. Loading...
   [junit4]   2> 1437426 INFO  (jetty-launcher-1572-thread-1) [    ] o.a.s.c.CorePropertiesLocator Config-defined core root directory: /home/jenkins/workspace/Lucene-Solr-6.x-Linux/solr/build/solr-core/test/J2/temp/solr.schema.TestManagedSchemaAPI_3AC9536D3434E164-001/tempDir-001/node1/.
   [junit4]   2> 1437426 WARN  (NIOServerCxn.Factory:0.0.0.0/0.0.0.0:0) [    ] o.a.z.s.NIOServerCnxn caught end of stream exception
   [junit4]   2> EndOfStreamException: Unable to read additional data from client sessionid 0x154ea4f7aec0001, likely client has closed socket
   [junit4]   2> 	at org.apache.zookeeper.server.NIOServerCnxn.doIO(NIOServerCnxn.java:228)
   [junit4]   2> 	at org.apache.zookeeper.server.NIOServerCnxnFactory.run(NIOServerCnxnFactory.java:208)
   [junit4]   2> 	at java.lang.Thread.run(Thread.java:745)
   [junit4]   2> 1437426 INFO  (jetty-launcher-1572-thread-2) [    ] o.a.s.c.CorePropertiesLocator Config-defined core root directory: /home/jenkins/workspace/Lucene-Solr-6.x-Linux/solr/build/solr-core/test/J2/temp/solr.schema.TestManagedSchemaAPI_3AC9536D3434E164-001/tempDir-001/node2/.
   [junit4]   2> 1437426 INFO  (jetty-launcher-1572-thread-1) [    ] o.a.s.c.CoreContainer New CoreContainer 223139
   [junit4]   2> 1437426 INFO  (jetty-launcher-1572-thread-1) [    ] o.a.s.c.CoreContainer Loading cores into CoreContainer [instanceDir=/home/jenkins/workspace/Lucene-Solr-6.x-Linux/solr/build/solr-core/test/J2/temp/solr.schema.TestManagedSchemaAPI_3AC9536D3434E164-001/tempDir-001/node1]
   [junit4]   2> 1437426 INFO  (jetty-launcher-1572-thread-2) [    ] o.a.s.c.CoreContainer New CoreContainer 25482984
   [junit4]   2> 1437427 INFO  (jetty-launcher-1572-thread-2) [    ] o.a.s.c.CoreContainer Loading cores into CoreContainer [instanceDir=/home/jenkins/workspace/Lucene-Solr-6.x-Linux/solr/build/solr-core/test/J2/temp/solr.schema.TestManagedSchemaAPI_3AC9536D3434E164-001/tempDir-001/node2]
   [junit4]   2> 1437427 WARN  (jetty-launcher-1572-thread-1) [    ] o.a.s.c.CoreContainer Couldn't add files from /home/jenkins/workspace/Lucene-Solr-6.x-Linux/solr/build/solr-core/test/J2/temp/solr.schema.TestManagedSchemaAPI_3AC9536D3434E164-001/tempDir-001/node1/lib to classpath: /home/jenkins/workspace/Lucene-Solr-6.x-Linux/solr/build/solr-core/test/J2/temp/solr.schema.TestManagedSchemaAPI_3AC9536D3434E164-001/tempDir-001/node1/lib
   [junit4]   2> 1437427 WARN  (jetty-launcher-1572-thread-2) [    ] o.a.s.c.CoreContainer Couldn't add files from /home/jenkins/workspace/Lucene-Solr-6.x-Linux/solr/build/solr-core/test/J2/temp/solr.schema.TestManagedSchemaAPI_3AC9536D3434E164-001/tempDir-001/node2/lib to classpath: /home/jenkins/workspace/Lucene-Solr-6.x-Linux/solr/build/solr-core/test/J2/temp/solr.schema.TestManagedSchemaAPI_3AC9536D3434E164-001/tempDir-001/node2/lib
   [junit4]   2> 1437427 INFO  (jetty-launcher-1572-thread-1) [    ] o.a.s.h.c.HttpShardHandlerFactory created with socketTimeout : 90000,urlScheme : ,connTimeout : 15000,maxConnectionsPerHost : 20,maxConnections : 10000,corePoolSize : 0,maximumPoolSize : 2147483647,maxThreadIdleTime : 5,sizeOfQueue : -1,fairnessPolicy : false,useRetries : false,
   [junit4]   2> 1437427 INFO  (jetty-launcher-1572-thread-2) [    ] o.a.s.h.c.HttpShardHandlerFactory created with socketTimeout : 90000,urlScheme : ,connTimeout : 15000,maxConnectionsPerHost : 20,maxConnections : 10000,corePoolSize : 0,maximumPoolSize : 2147483647,maxThreadIdleTime : 5,sizeOfQueue : -1,fairnessPolicy : false,useRetries : false,
   [junit4]   2> 1437428 INFO  (jetty-launcher-1572-thread-1) [    ] o.a.s.u.UpdateShardHandler Creating UpdateShardHandler HTTP client with params: socketTimeout=340000&connTimeout=45000&retry=true
   [junit4]   2> 1437428 INFO  (jetty-launcher-1572-thread-2) [    ] o.a.s.u.UpdateShardHandler Creating UpdateShardHandler HTTP client with params: socketTimeout=340000&connTimeout=45000&retry=true
   [junit4]   2> 1437429 INFO  (jetty-launcher-1572-thread-1) [    ] o.a.s.l.LogWatcher SLF4J impl is org.slf4j.impl.Log4jLoggerFactory
   [junit4]   2> 1437429 INFO  (jetty-launcher-1572-thread-1) [    ] o.a.s.l.LogWatcher Registering Log Listener [Log4j (org.slf4j.impl.Log4jLoggerFactory)]
   [junit4]   2> 1437429 INFO  (jetty-launcher-1572-thread-1) [    ] o.a.s.c.ZkContainer Zookeeper client=127.0.0.1:36608/solr
   [junit4]   2> 1437429 INFO  (jetty-launcher-1572-thread-1) [    ] o.a.s.c.ZkController zkHost includes chroot
   [junit4]   2> 1437429 INFO  (jetty-launcher-1572-thread-2) [    ] o.a.s.l.LogWatcher SLF4J impl is org.slf4j.impl.Log4jLoggerFactory
   [junit4]   2> 1437429 INFO  (jetty-launcher-1572-thread-1) [    ] o.a.s.c.c.SolrZkClient Using default ZkCredentialsProvider
   [junit4]   2> 1437429 INFO  (jetty-launcher-1572-thread-2) [    ] o.a.s.l.LogWatcher Registering Log Listener [Log4j (org.slf4j.impl.Log4jLoggerFactory)]
   [junit4]   2> 1437430 INFO  (jetty-launcher-1572-thread-2) [    ] o.a.s.c.ZkContainer Zookeeper client=127.0.0.1:36608/solr
   [junit4]   2> 1437430 INFO  (jetty-launcher-1572-thread-2) [    ] o.a.s.c.ZkController zkHost includes chroot
   [junit4]   2> 1437430 INFO  (jetty-launcher-1572-thread-2) [    ] o.a.s.c.c.SolrZkClient Using default ZkCredentialsProvider
   [junit4]   2> 1437430 INFO  (jetty-launcher-1572-thread-1) [    ] o.a.s.c.c.ConnectionManager Waiting for client to connect to ZooKeeper
   [junit4]   2> 1437430 INFO  (jetty-launcher-1572-thread-2) [    ] o.a.s.c.c.ConnectionManager Waiting for client to connect to ZooKeeper
   [junit4]   2> 1437431 INFO  (zkCallback-1580-thread-1) [    ] o.a.s.c.c.ConnectionManager Watcher org.apache.solr.common.cloud.ConnectionManager@1823442 name:ZooKeeperConnection Watcher:127.0.0.1:36608 got event WatchedEvent state:SyncConnected type:None path:null path:null type:None
   [junit4]   2> 1437431 INFO  (jetty-launcher-1572-thread-1) [    ] o.a.s.c.c.ConnectionManager Client is connected to ZooKeeper
   [junit4]   2> 1437431 INFO  (zkCallback-1581-thread-1) [    ] o.a.s.c.c.ConnectionManager Watcher org.apache.solr.common.cloud.ConnectionManager@fb9745 name:ZooKeeperConnection Watcher:127.0.0.1:36608 got event WatchedEvent state:SyncConnected type:None path:null path:null type:None
   [junit4]   2> 1437431 INFO  (jetty-launcher-1572-thread-2) [    ] o.a.s.c.c.ConnectionManager Client is connected to ZooKeeper
   [junit4]   2> 1437431 INFO  (jetty-launcher-1572-thread-1) [    ] o.a.s.c.c.SolrZkClient Using default ZkACLProvider
   [junit4]   2> 1437431 INFO  (jetty-launcher-1572-thread-2) [    ] o.a.s.c.c.SolrZkClient Using default ZkACLProvider
   [junit4]   2> 1437432 INFO  (jetty-launcher-1572-thread-1) [n:127.0.0.1:40943_solr    ] o.a.s.c.ZkController Added new OnReconnect listener org.apache.solr.cloud.ZkController$$Lambda$37/10139133@148479e
   [junit4]   2> 1437432 INFO  (jetty-launcher-1572-thread-2) [n:127.0.0.1:43623_solr    ] o.a.s.c.ZkController Added new OnReconnect listener org.apache.solr.cloud.ZkController$$Lambda$37/10139133@151ccd2
   [junit4]   2> 1437432 INFO  (jetty-launcher-1572-thread-1) [n:127.0.0.1:40943_solr    ] o.a.s.c.c.ConnectionManager Waiting for client to connect to ZooKeeper
   [junit4]   2> 1437433 INFO  (jetty-launcher-1572-thread-2) [n:127.0.0.1:43623_solr    ] o.a.s.c.c.ConnectionManager Waiting for client to connect to ZooKeeper
   [junit4]   2> 1437433 INFO  (zkCallback-1582-thread-1-processing-n:127.0.0.1:40943_solr) [n:127.0.0.1:40943_solr    ] o.a.s.c.c.ConnectionManager Watcher org.apache.solr.common.cloud.ConnectionManager@a23641 name:ZooKeeperConnection Watcher:127.0.0.1:36608/solr got event WatchedEvent state:SyncConnected type:None path:null path:null type:None
   [junit4]   2> 1437433 INFO  (jetty-launcher-1572-thread-1) [n:127.0.0.1:40943_solr    ] o.a.s.c.c.ConnectionManager Client is connected to ZooKeeper
   [junit4]   2> 1437433 INFO  (zkCallback-1583-thread-1-processing-n:127.0.0.1:43623_solr) [n:127.0.0.1:43623_solr    ] o.a.s.c.c.ConnectionManager Watcher org.apache.solr.common.cloud.ConnectionManager@5b04b5 name:ZooKeeperConnection Watcher:127.0.0.1:36608/solr got event WatchedEvent state:SyncConnected type:None path:null path:null type:None
   [junit4]   2> 1437433 INFO  (jetty-launcher-1572-thread-2) [n:127.0.0.1:43623_solr    ] o.a.s.c.c.ConnectionManager Client is connected to ZooKeeper
   [junit4]   2> 1437435 INFO  (jetty-launcher-1572-thread-2) [n:127.0.0.1:43623_solr    ] o.a.s.c.c.SolrZkClient makePath: /overseer/queue
   [junit4]   2> 1437435 INFO  (jetty-launcher-1572-thread-1) [n:127.0.0.1:40943_solr    ] o.a.s.c.c.SolrZkClient makePath: /overseer/queue
   [junit4]   2> 1437437 INFO  (jetty-launcher-1572-thread-1) [n:127.0.0.1:40943_solr    ] o.a.s.c.c.SolrZkClient makePath: /overseer/collection-queue-work
   [junit4]   2> 1437437 INFO  (jetty-launcher-1572-thread-2) [n:127.0.0.1:43623_solr    ] o.a.s.c.c.SolrZkClient makePath: /overseer/collection-queue-work
   [junit4]   2> 1437438 INFO  (jetty-launcher-1572-thread-2) [n:127.0.0.1:43623_solr    ] o.a.s.c.c.SolrZkClient makePath: /overseer/collection-map-running
   [junit4]   2> 1437438 INFO  (jetty-launcher-1572-thread-1) [n:127.0.0.1:40943_solr    ] o.a.s.c.c.SolrZkClient makePath: /overseer/collection-map-running
   [junit4]   2> 1437439 INFO  (jetty-launcher-1572-thread-1) [n:127.0.0.1:40943_solr    ] o.a.s.c.c.SolrZkClient makePath: /overseer/collection-map-completed
   [junit4]   2> 1437440 INFO  (jetty-launcher-1572-thread-2) [n:127.0.0.1:43623_solr    ] o.a.s.c.c.SolrZkClient makePath: /overseer/collection-map-completed
   [junit4]   2> 1437441 INFO  (jetty-launcher-1572-thread-1) [n:127.0.0.1:40943_solr    ] o.a.s.c.c.SolrZkClient makePath: /overseer/collection-map-failure
   [junit4]   2> 1437441 INFO  (jetty-launcher-1572-thread-2) [n:127.0.0.1:43623_solr    ] o.a.s.c.c.SolrZkClient makePath: /overseer/collection-map-failure
   [junit4]   2> 1437441 INFO  (jetty-launcher-1572-thread-2) [n:127.0.0.1:43623_solr    ] o.a.s.c.c.SolrZkClient makePath: /live_nodes
   [junit4]   2> 1437441 INFO  (jetty-launcher-1572-thread-1) [n:127.0.0.1:40943_solr    ] o.a.s.c.c.SolrZkClient makePath: /live_nodes
   [junit4]   2> 1437442 INFO  (jetty-launcher-1572-thread-1) [n:127.0.0.1:40943_solr    ] o.a.s.c.c.SolrZkClient makePath: /collections
   [junit4]   2> 1437442 INFO  (jetty-launcher-1572-thread-2) [n:127.0.0.1:43623_solr    ] o.a.s.c.c.SolrZkClient makePath: /collections
   [junit4]   2> 1437443 INFO  (jetty-launcher-1572-thread-2) [n:127.0.0.1:43623_solr    ] o.a.s.c.c.SolrZkClient makePath: /aliases.json
   [junit4]   2> 1437443 INFO  (jetty-launcher-1572-thread-1) [n:127.0.0.1:40943_solr    ] o.a.s.c.c.SolrZkClient makePath: /aliases.json
   [junit4]   2> 1437443 INFO  (jetty-launcher-1572-thread-1) [n:127.0.0.1:40943_solr    ] o.a.s.c.c.SolrZkClient makePath: /clusterstate.json
   [junit4]   2> 1437443 INFO  (jetty-launcher-1572-thread-2) [n:127.0.0.1:43623_solr    ] o.a.s.c.c.SolrZkClient makePath: /clusterstate.json
   [junit4]   2> 1437444 INFO  (jetty-launcher-1572-thread-1) [n:127.0.0.1:40943_solr    ] o.a.s.c.c.SolrZkClient makePath: /security.json
   [junit4]   2> 1437444 INFO  (jetty-launcher-1572-thread-2) [n:127.0.0.1:43623_solr    ] o.a.s.c.c.SolrZkClient makePath: /security.json
   [junit4]   2> 1437444 INFO  (jetty-launcher-1572-thread-2) [n:127.0.0.1:43623_solr    ] o.a.s.c.c.ZkStateReader Updating cluster state from ZooKeeper... 
   [junit4]   2> 1437445 INFO  (jetty-launcher-1572-thread-1) [n:127.0.0.1:40943_solr    ] o.a.s.c.c.ZkStateReader Updating cluster state from ZooKeeper... 
   [junit4]   2> 1437445 INFO  (jetty-launcher-1572-thread-1) [n:127.0.0.1:40943_solr    ] o.a.s.c.c.ZkStateReader Loaded empty cluster properties
   [junit4]   2> 1437445 INFO  (jetty-launcher-1572-thread-2) [n:127.0.0.1:43623_solr    ] o.a.s.c.c.ZkStateReader Loaded empty cluster properties
   [junit4]   2> 1437445 INFO  (jetty-launcher-1572-thread-1) [n:127.0.0.1:40943_solr    ] o.a.s.c.c.ZkStateReader Updated live nodes from ZooKeeper... (0) -> (0)
   [junit4]   2> 1437445 INFO  (jetty-launcher-1572-thread-2) [n:127.0.0.1:43623_solr    ] o.a.s.c.c.ZkStateReader Updated live nodes from ZooKeeper... (0) -> (0)
   [junit4]   2> 1437447 INFO  (jetty-launcher-1572-thread-2) [n:127.0.0.1:43623_solr    ] o.a.s.c.c.SolrZkClient makePath: /overseer_elect
   [junit4]   2> 1437448 INFO  (jetty-launcher-1572-thread-1) [n:127.0.0.1:40943_solr    ] o.a.s.c.c.SolrZkClient makePath: /overseer_elect
   [junit4]   2> 1437448 INFO  (jetty-launcher-1572-thread-1) [n:127.0.0.1:40943_solr    ] o.a.s.c.c.SolrZkClient makePath: /overseer_elect/election
   [junit4]   2> 1437448 INFO  (jetty-launcher-1572-thread-2) [n:127.0.0.1:43623_solr    ] o.a.s.c.c.SolrZkClient makePath: /overseer_elect/election
   [junit4]   2> 1437449 INFO  (jetty-launcher-1572-thread-2) [n:127.0.0.1:43623_solr    ] o.a.s.c.Overseer Overseer (id=null) closing
   [junit4]   2> 1437449 INFO  (jetty-launcher-1572-thread-1) [n:127.0.0.1:40943_solr    ] o.a.s.c.Overseer Overseer (id=null) closing
   [junit4]   2> 1437449 INFO  (jetty-launcher-1572-thread-1) [n:127.0.0.1:40943_solr    ] o.a.s.c.LeaderElector Joined leadership election with path: /overseer_elect/election/95959119167225861-127.0.0.1:40943_solr-n_0000000000
   [junit4]   2> 1437449 INFO  (jetty-launcher-1572-thread-2) [n:127.0.0.1:43623_solr    ] o.a.s.c.LeaderElector Joined leadership election with path: /overseer_elect/election/95959119167225862-127.0.0.1:43623_solr-n_0000000001
   [junit4]   2> 1437449 INFO  (jetty-launcher-1572-thread-1) [n:127.0.0.1:40943_solr    ] o.a.s.c.OverseerElectionContext I am going to be the leader 127.0.0.1:40943_solr
   [junit4]   2> 1437449 INFO  (jetty-launcher-1572-thread-1) [n:127.0.0.1:40943_solr    ] o.a.s.c.c.SolrZkClient makePath: /overseer_elect/leader
   [junit4]   2> 1437450 INFO  (jetty-launcher-1572-thread-2) [n:127.0.0.1:43623_solr    ] o.a.s.c.LeaderElector Watching path /overseer_elect/election/95959119167225861-127.0.0.1:40943_solr-n_0000000000 to know if I could be the leader
   [junit4]   2> 1437450 INFO  (jetty-launcher-1572-thread-2) [n:127.0.0.1:43623_solr    ] o.a.s.c.ZkController Register node as live in ZooKeeper:/live_nodes/127.0.0.1:43623_solr
   [junit4]   2> 1437450 INFO  (jetty-launcher-1572-thread-2) [n:127.0.0.1:43623_solr    ] o.a.s.c.c.SolrZkClient makePath: /live_nodes/127.0.0.1:43623_solr
   [junit4]   2> 1437450 INFO  (jetty-launcher-1572-thread-1) [n:127.0.0.1:40943_solr    ] o.a.s.c.Overseer Overseer (id=95959119167225861-127.0.0.1:40943_solr-n_0000000000) starting
   [junit4]   2> 1437451 INFO  (zkCallback-1582-thread-1-processing-n:127.0.0.1:40943_solr) [n:127.0.0.1:40943_solr    ] o.a.s.c.c.ZkStateReader A live node change: [WatchedEvent state:SyncConnected type:NodeChildrenChanged path:/live_nodes], has occurred - updating... (live nodes size: [0])
   [junit4]   2> 1437451 INFO  (zkCallback-1583-thread-1-processing-n:127.0.0.1:43623_solr) [n:127.0.0.1:43623_solr    ] o.a.s.c.c.ZkStateReader A live node change: [WatchedEvent state:SyncConnected type:NodeChildrenChanged path:/live_nodes], has occurred - updating... (live nodes size: [0])
   [junit4]   2> 1437451 INFO  (zkCallback-1582-thread-1-processing-n:127.0.0.1:40943_solr) [n:127.0.0.1:40943_solr    ] o.a.s.c.c.ZkStateReader Updated live nodes from ZooKeeper... (0) -> (1)
   [junit4]   2> 1437452 INFO  (zkCallback-1583-thread-1-processing-n:127.0.0.1:43623_solr) [n:127.0.0.1:43623_solr    ] o.a.s.c.c.ZkStateReader Updated live nodes from ZooKeeper... (0) -> (1)
   [junit4]   2> 1437452 INFO  (jetty-launcher-1572-thread-1) [n:127.0.0.1:40943_solr    ] o.a.s.c.c.SolrZkClient makePath: /overseer/queue-work
   [junit4]   2> 1437459 INFO  (jetty-launcher-1572-thread-1) [n:127.0.0.1:40943_solr    ] o.a.s.c.OverseerAutoReplicaFailoverThread Starting OverseerAutoReplicaFailoverThread autoReplicaFailoverWorkLoopDelay=10000 autoReplicaFailoverWaitAfterExpiration=30000 autoReplicaFailoverBadNodeExpiration=60000
   [junit4]   2> 1437459 INFO  (OverseerCollectionConfigSetProcessor-95959119167225861-127.0.0.1:40943_solr-n_0000000000) [n:127.0.0.1:40943_solr    ] o.a.s.c.OverseerTaskProcessor Process current queue of overseer operations
   [junit4]   2> 1437460 INFO  (OverseerStateUpdate-95959119167225861-127.0.0.1:40943_solr-n_0000000000) [n:127.0.0.1:40943_solr    ] o.a.s.c.Overseer Starting to work on the main queue
   [junit4]   2> 1437460 INFO  (jetty-launcher-1572-thread-1) [n:127.0.0.1:40943_solr    ] o.a.s.c.ZkController Publish node=127.0.0.1:40943_solr as DOWN
   [junit4]   2> 1437461 INFO  (OverseerStateUpdate-95959119167225861-127.0.0.1:40943_solr-n_0000000000) [n:127.0.0.1:40943_solr    ] o.a.s.c.c.ZkStateReader Updated live nodes from ZooKeeper... (1) -> (1)
   [junit4]   2> 1437462 INFO  (OverseerStateUpdate-95959119167225861-127.0.0.1:40943_solr-n_0000000000) [n:127.0.0.1:40943_solr    ] o.a.s.c.Overseer processMessage: queueSize: 1, message = {
   [junit4]   2>   "operation":"downnode",
   [junit4]   2>   "node_name":"127.0.0.1:40943_solr"} current state version: 0
   [junit4]   2> 1437462 INFO  (OverseerStateUpdate-95959119167225861-127.0.0.1:40943_solr-n_0000000000) [n:127.0.0.1:40943_solr    ] o.a.s.c.o.NodeMutator DownNode state invoked for node: 127.0.0.1:40943_solr
   [junit4]   2> 1437487 INFO  (jetty-launcher-1572-thread-2) [n:127.0.0.1:43623_solr    ] o.a.s.c.CoreContainer Security conf doesn't exist. Skipping setup for authorization module.
   [junit4]   2> 1437487 INFO  (jetty-launcher-1572-thread-2) [n:127.0.0.1:43623_solr    ] o.a.s.c.CoreContainer No authentication plugin used.
   [junit4]   2> 1437488 INFO  (jetty-launcher-1572-thread-2) [n:127.0.0.1:43623_solr    ] o.a.s.c.CorePropertiesLocator Looking for core definitions underneath /home/jenkins/workspace/Lucene-Solr-6.x-Linux/solr/build/solr-core/test/J2/temp/solr.schema.TestManagedSchemaAPI_3AC9536D3434E164-001/tempDir-001/node2/.
   [junit4]   2> 1437488 INFO  (jetty-launcher-1572-thread-2) [n:127.0.0.1:43623_solr    ] o.a.s.c.CorePropertiesLocator Found 0 core definitions
   [junit4]   2> 1437489 INFO  (jetty-launcher-1572-thread-2) [n:127.0.0.1:43623_solr    ] o.a.s.s.SolrDispatchFilter user.dir=/home/jenkins/workspace/Lucene-Solr-6.x-Linux/solr/build/solr-core/test/J2
   [junit4]   2> 1437489 INFO  (jetty-launcher-1572-thread-2) [n:127.0.0.1:43623_solr    ] o.a.s.s.SolrDispatchFilter SolrDispatchFilter.init() done
   [junit4]   2> 1438461 INFO  (jetty-launcher-1572-thread-1) [n:127.0.0.1:40943_solr    ] o.a.s.c.ZkController Register node as live in ZooKeeper:/live_nodes/127.0.0.1:40943_solr
   [junit4]   2> 1438462 INFO  (jetty-launcher-1572-thread-1) [n:127.0.0.1:40943_solr    ] o.a.s.c.c.SolrZkClient makePath: /live_nodes/127.0.0.1:40943_solr
   [junit4]   2> 1438462 INFO  (zkCallback-1582-thread-1-processing-n:127.0.0.1:40943_solr) [n:127.0.0.1:40943_solr    ] o.a.s.c.c.ZkStateReader A live node change: [WatchedEvent state:SyncConnected type:NodeChildrenChanged path:/live_nodes], has occurred - updating... (live nodes size: [1])
   [junit4]   2> 1438462 INFO  (zkCallback-1583-thread-1-processing-n:127.0.0.1:43623_solr) [n:127.0.0.1:43623_solr    ] o.a.s.c.c.ZkStateReader A live node change: [WatchedEvent state:SyncConnected type:NodeChildrenChanged path:/live_nodes], has occurred - updating... (live nodes size: [1])
   [junit4]   2> 1438463 INFO  (zkCallback-1582-thread-1-processing-n:127.0.0.1:40943_solr) [n:127.0.0.1:40943_solr    ] o.a.s.c.c.ZkStateReader Updated live nodes from ZooKeeper... (1) -> (2)
   [junit4]   2> 1438463 INFO  (zkCallback-1583-thread-1-processing-n:127.0.0.1:43623_solr) [n:127.0.0.1:43623_solr    ] o.a.s.c.c.ZkStateReader Updated live nodes from ZooKeeper... (1) -> (2)
   [junit4]   2> 1438481 INFO  (jetty-launcher-1572-thread-1) [n:127.0.0.1:40943_solr    ] o.a.s.c.CoreContainer Security conf doesn't exist. Skipping setup for authorization module.
   [junit4]   2> 1438481 INFO  (jetty-launcher-1572-thread-1) [n:127.0.0.1:40943_solr    ] o.a.s.c.CoreContainer No authentication plugin used.
   [junit4]   2> 1438481 INFO  (jetty-launcher-1572-thread-1) [n:127.0.0.1:40943_solr    ] o.a.s.c.CorePropertiesLocator Looking for core definitions underneath /home/jenkins/workspace/Lucene-Solr-6.x-Linux/solr/build/solr-core/test/J2/temp/solr.schema.TestManagedSchemaAPI_3AC9536D3434E164-001/tempDir-001/node1/.
   [junit4]   2> 1438481 INFO  (jetty-launcher-1572-thread-1) [n:127.0.0.1:40943_solr    ] o.a.s.c.CorePropertiesLocator Found 0 core definitions
   [junit4]   2> 1438482 INFO  (jetty-launcher-1572-thread-1) [n:127.0.0.1:40943_solr    ] o.a.s.s.SolrDispatchFilter user.dir=/home/jenkins/workspace/Lucene-Solr-6.x-Linux/solr/build/solr-core/test/J2
   [junit4]   2> 1438482 INFO  (jetty-launcher-1572-thread-1) [n:127.0.0.1:40943_solr    ] o.a.s.s.SolrDispatchFilter SolrDispatchFilter.init() done
   [junit4]   2> 1438482 INFO  (SUITE-TestManagedSchemaAPI-seed#[3AC9536D3434E164]-worker) [    ] o.a.s.c.c.SolrZkClient Using default ZkCredentialsProvider
   [junit4]   2> 1438482 INFO  (SUITE-TestManagedSchemaAPI-seed#[3AC9536D3434E164]-worker) [    ] o.a.s.c.c.ConnectionManager Waiting for client to connect to ZooKeeper
   [junit4]   2> 1438483 INFO  (zkCallback-1586-thread-1) [    ] o.a.s.c.c.ConnectionManager Watcher org.apache.solr.common.cloud.ConnectionManager@1d316b3 name:ZooKeeperConnection Watcher:127.0.0.1:36608 got event WatchedEvent state:SyncConnected type:None path:null path:null type:None
   [junit4]   2> 1438483 INFO  (SUITE-TestManagedSchemaAPI-seed#[3AC9536D3434E164]-worker) [    ] o.a.s.c.c.ConnectionManager Client is connected to ZooKeeper
   [junit4]   2> 1438483 INFO  (SUITE-TestManagedSchemaAPI-seed#[3AC9536D3434E164]-worker) [    ] o.a.s.c.c.SolrZkClient Using default ZkACLProvider
   [junit4]   2> 1438484 INFO  (SUITE-TestManagedSchemaAPI-seed#[3AC9536D3434E164]-worker) [    ] o.a.s.c.s.i.CloudSolrClient Final constructed zkHost string: 127.0.0.1:36608/solr
   [junit4]   2> 1438484 INFO  (SUITE-TestManagedSchemaAPI-seed#[3AC9536D3434E164]-worker) [    ] o.a.s.c.c.SolrZkClient Using default ZkCredentialsProvider
   [junit4]   2> 1438484 INFO  (SUITE-TestManagedSchemaAPI-seed#[3AC9536D3434E164]-worker) [    ] o.a.s.c.c.ConnectionManager Waiting for client to connect to ZooKeeper
   [junit4]   2> 1438485 INFO  (zkCallback-1589-thread-1) [    ] o.a.s.c.c.ConnectionManager Watcher org.apache.solr.common.cloud.ConnectionManager@74b608 name:ZooKeeperConnection Watcher:127.0.0.1:36608/solr got event WatchedEvent state:SyncConnected type:None path:null path:null type:None
   [junit4]   2> 1438485 INFO  (SUITE-TestManagedSchemaAPI-seed#[3AC9536D3434E164]-worker) [    ] o.a.s.c.c.ConnectionManager Client is connected to ZooKeeper
   [junit4]   2> 1438486 INFO  (SUITE-TestManagedSchemaAPI-seed#[3AC9536D3434E164]-worker) [    ] o.a.s.c.c.SolrZkClient Using default ZkACLProvider
   [junit4]   2> 1438486 INFO  (SUITE-TestManagedSchemaAPI-seed#[3AC9536D3434E164]-worker) [    ] o.a.s.c.c.ZkStateReader Updating cluster state from ZooKeeper... 
   [junit4]   2> 1438486 INFO  (SUITE-TestManagedSchemaAPI-seed#[3AC9536D3434E164]-worker) [    ] o.a.s.c.c.ZkStateReader Loaded empty cluster properties
   [junit4]   2> 1438486 INFO  (SUITE-TestManagedSchemaAPI-seed#[3AC9536D3434E164]-worker) [    ] o.a.s.c.c.ZkStateReader Updated live nodes from ZooKeeper... (0) -> (2)
   [junit4]   2> 1438487 INFO  (SUITE-TestManagedSchemaAPI-seed#[3AC9536D3434E164]-worker) [    ] o.a.s.c.c.SolrZkClient makePath: /configs/conf1/solrconfig.xml
   [junit4]   2> 1438489 INFO  (SUITE-TestManagedSchemaAPI-seed#[3AC9536D3434E164]-worker) [    ] o.a.s.c.c.SolrZkClient makePath: /configs/conf1/managed-schema
   [junit4]   2> 1438504 INFO  (TEST-TestManagedSchemaAPI.test-seed#[3AC9536D3434E164]) [    ] o.a.s.SolrTestCaseJ4 ###Starting test
   [junit4]   2> 1438508 INFO  (qtp7561503-8097) [n:127.0.0.1:40943_solr    ] o.a.s.h.a.CollectionsHandler Invoked Collection Action :create with params replicationFactor=2&collection.configName=conf1&name=testschemaapi&action=CREATE&numShards=1&wt=javabin&version=2 and sendToOCPQueue=true
   [junit4]   2> 1438510 INFO  (OverseerCollectionConfigSetProcessor-95959119167225861-127.0.0.1:40943_solr-n_0000000000) [n:127.0.0.1:40943_solr    ] o.a.s.c.OverseerTaskProcessor Overseer Collection Message Handler: Get the message id:/overseer/collection-queue-work/qn-0000000000 message:{
   [junit4]   2>   "name":"testschemaapi",
   [junit4]   2>   "fromApi":"true",
   [junit4]   2>   "replicationFactor":"2",
   [junit4]   2>   "collection.configName":"conf1",
   [junit4]   2>   "numShards":"1",
   [junit4]   2>   "stateFormat":"2",
   [junit4]   2>   "operation":"create"}
   [junit4]   2> 1438510 INFO  (OverseerThreadFactory-3257-thread-1-processing-n:127.0.0.1:40943_solr) [n:127.0.0.1:40943_solr    ] o.a.s.c.OverseerCollectionMessageHandler OverseerCollectionMessageHandler.processMessage : create , {
   [junit4]   2>   "name":"testschemaapi",
   [junit4]   2>   "fromApi":"true",
   [junit4]   2>   "replicationFactor":"2",
   [junit4]   2>   "collection.configName":"conf1",
   [junit4]   2>   "numShards":"1",
   [junit4]   2>   "stateFormat":"2",
   [junit4]   2>   "operation":"create"}
   [junit4]   2> 1438510 INFO  (OverseerThreadFactory-3257-thread-1-processing-n:127.0.0.1:40943_solr) [n:127.0.0.1:40943_solr    ] o.a.s.c.OverseerCollectionMessageHandler Create collection testschemaapi
   [junit4]   2> 1438510 INFO  (OverseerThreadFactory-3257-thread-1-processing-n:127.0.0.1:40943_solr) [n:127.0.0.1:40943_solr    ] o.a.s.c.OverseerCollectionMessageHandler creating collections conf node /collections/testschemaapi 
   [junit4]   2> 1438510 INFO  (OverseerThreadFactory-3257-thread-1-processing-n:127.0.0.1:40943_solr) [n:127.0.0.1:40943_solr    ] o.a.s.c.c.SolrZkClient makePath: /collections/testschemaapi
   [junit4]   2> 1438511 INFO  (zkCallback-1583-thread-1-processing-n:127.0.0.1:43623_solr) [n:127.0.0.1:43623_solr    ] o.a.s.c.c.ZkStateReader A collections change: [WatchedEvent state:SyncConnected type:NodeChildrenChanged path:/collections], has occurred - updating...
   [junit4]   2> 1438511 INFO  (zkCallback-1582-thread-1-processing-n:127.0.0.1:40943_solr) [n:127.0.0.1:40943_solr    ] o.a.s.c.c.ZkStateReader A collections change: [WatchedEvent state:SyncConnected type:NodeChildrenChanged path:/collections], has occurred - updating...
   [junit4]   2> 1438511 INFO  (zkCallback-1589-thread-1) [    ] o.a.s.c.c.ZkStateReader A collections change: [WatchedEvent state:SyncConnected type:NodeChildrenChanged path:/collections], has occurred - updating...
   [junit4]   2> 1438513 INFO  (OverseerStateUpdate-95959119167225861-127.0.0.1:40943_solr-n_0000000000) [n:127.0.0.1:40943_solr    ] o.a.s.c.Overseer processMessage: queueSize: 1, message = {
   [junit4]   2>   "name":"testschemaapi",
   [junit4]   2>   "fromApi":"true",
   [junit4]   2>   "replicationFactor":"2",
   [junit4]   2>   "collection.configName":"conf1",
   [junit4]   2>   "numShards":"1",
   [junit4]   2>   "stateFormat":"2",
   [junit4]   2>   "operation":"create"} current state version: 0
   [junit4]   2> 1438513 INFO  (OverseerStateUpdate-95959119167225861-127.0.0.1:40943_solr-n_0000000000) [n:127.0.0.1:40943_solr    ] o.a.s.c.o.ClusterStateMutator building a new cName: testschemaapi
   [junit4]   2> 1438513 INFO  (OverseerStateUpdate-95959119167225861-127.0.0.1:40943_solr-n_0000000000) [n:127.0.0.1:40943_solr    ] o.a.s.c.o.ZkStateWriter going to create_collection /collections/testschemaapi/state.json
   [junit4]   2> 1438613 INFO  (OverseerThreadFactory-3257-thread-1-processing-n:127.0.0.1:40943_solr) [n:127.0.0.1:40943_solr    ] o.a.s.c.OverseerCollectionMessageHandler Creating SolrCores for new collection testschemaapi, shardNames [shard1] , replicationFactor : 2
   [junit4]   2> 1438613 INFO  (OverseerThreadFactory-3257-thread-1-processing-n:127.0.0.1:40943_solr) [n:127.0.0.1:40943_solr    ] o.a.s.c.OverseerCollectionMessageHandler Creating core testschemaapi_shard1_replica1 as part of shard shard1 of collection testschemaapi on 127.0.0.1:43623_solr
   [junit4]   2> 1438613 INFO  (OverseerThreadFactory-3257-thread-1-processing-n:127.0.0.1:40943_solr) [n:127.0.0.1:40943_solr    ] o.a.s.c.OverseerCollectionMessageHandler Creating core testschemaapi_shard1_replica2 as part of shard shard1 of collection testschemaapi on 127.0.0.1:40943_solr
   [junit4]   2> 1438616 INFO  (qtp10816715-8098) [n:127.0.0.1:43623_solr    ] o.a.s.h.a.CoreAdminOperation core create command qt=/admin/cores&collection.configName=conf1&name=testschemaapi_shard1_replica1&action=CREATE&numShards=1&collection=testschemaapi&shard=shard1&wt=javabin&version=2
   [junit4]   2> 1438616 INFO  (qtp7561503-8101) [n:127.0.0.1:40943_solr    ] o.a.s.h.a.CoreAdminOperation core create command qt=/admin/cores&collection.configName=conf1&name=testschemaapi_shard1_replica2&action=CREATE&numShards=1&collection=testschemaapi&shard=shard1&wt=javabin&version=2
   [junit4]   2> 1438616 INFO  (qtp7561503-8101) [n:127.0.0.1:40943_solr    ] o.a.s.c.CoreDescriptor Created CoreDescriptor: {name=testschemaapi_shard1_replica2, collection.configName=conf1, config=solrconfig.xml, transient=false, schema=schema.xml, loadOnStartup=true, configSetProperties=configsetprops.json, collection=testschemaapi, numShards=1, dataDir=data/, shard=shard1}
   [junit4]   2> 1438616 INFO  (qtp10816715-8098) [n:127.0.0.1:43623_solr    ] o.a.s.c.CoreDescriptor Created CoreDescriptor: {name=testschemaapi_shard1_replica1, collection.configName=conf1, config=solrconfig.xml, transient=false, schema=schema.xml, loadOnStartup=true, configSetProperties=configsetprops.json, collection=testschemaapi, numShards=1, dataDir=data/, shard=shard1}
   [junit4]   2> 1438616 INFO  (qtp7561503-8101) [n:127.0.0.1:40943_solr c:testschemaapi s:shard1  x:testschemaapi_shard1_replica2] o.a.s.c.ZkController publishing state=down
   [junit4]   2> 1438616 INFO  (qtp10816715-8098) [n:127.0.0.1:43623_solr c:testschemaapi s:shard1  x:testschemaapi_shard1_replica1] o.a.s.c.ZkController publishing state=down
   [junit4]   2> 1438617 INFO  (qtp10816715-8098) [n:127.0.0.1:43623_solr c:testschemaapi s:shard1  x:testschemaapi_shard1_replica1] o.a.s.c.ZkController Registering watch for collection testschemaapi
   [junit4]   2> 1438617 INFO  (qtp7561503-8101) [n:127.0.0.1:40943_solr c:testschemaapi s:shard1  x:testschemaapi_shard1_replica2] o.a.s.c.ZkController Registering watch for collection testschemaapi
   [junit4]   2> 1438617 INFO  (OverseerStateUpdate-95959119167225861-127.0.0.1:40943_solr-n_0000000000) [n:127.0.0.1:40943_solr    ] o.a.s.c.Overseer processMessage: queueSize: 2, message = {
   [junit4]   2>   "core":"testschemaapi_shard1_replica2",
   [junit4]   2>   "roles":null,
   [junit4]   2>   "base_url":"http://127.0.0.1:40943/solr",
   [junit4]   2>   "node_name":"127.0.0.1:40943_solr",
   [junit4]   2>   "numShards":"1",
   [junit4]   2>   "state":"down",
   [junit4]   2>   "shard":"shard1",
   [junit4]   2>   "collection":"testschemaapi",
   [junit4]   2>   "operation":"state"} current state version: 0
   [junit4]   2> 1438618 INFO  (qtp10816715-8098) [n:127.0.0.1:43623_solr c:testschemaapi s:shard1  x:testschemaapi_shard1_replica1] o.a.s.c.c.ZkStateReader Add data for [testschemaapi] ver [0]
   [junit4]   2> 1438618 INFO  (OverseerStateUpdate-95959119167225861-127.0.0.1:40943_solr-n_0000000000) [n:127.0.0.1:40943_solr    ] o.a.s.c.o.ReplicaMutator Update state numShards=1 message={
   [junit4]   2>   "core":"testschemaapi_shard1_replica2",
   [junit4]   2>   "roles":null,
   [junit4]   2>   "base_url":"http://127.0.0.1:40943/solr",
   [junit4]   2>   "node_name":"127.0.0.1:40943_solr",
   [junit4]   2>   "numShards":"1",
   [junit4]   2>   "state":"down",
   [junit4]   2>   "shard":"shard1",
   [junit4]   2>   "collection":"testschemaapi",
   [junit4]   2>   "operation":"state"}
   [junit4]   2> 1438618 INFO  (qtp7561503-8101) [n:127.0.0.1:40943_solr c:testschemaapi s:shard1  x:testschemaapi_shard1_replica2] o.a.s.c.c.ZkStateReader Add data for [testschemaapi] ver [0]
   [junit4]   2> 1438618 INFO  (qtp10816715-8098) [n:127.0.0.1:43623_solr c:testschemaapi s:shard1  x:testschemaapi_shard1_replica1] o.a.s.c.ZkController look for our core node name
   [junit4]   2> 1438618 INFO  (qtp7561503-8101) [n:127.0.0.1:40943_solr c:testschemaapi s:shard1  x:testschemaapi_shard1_replica2] o.a.s.c.ZkController look for our core node name
   [junit4]   2> 1438619 INFO  (OverseerStateUpdate-95959119167225861-127.0.0.1:40943_solr-n_0000000000) [n:127.0.0.1:40943_solr    ] o.a.s.c.Overseer processMessage: queueSize: 2, message = {
   [junit4]   2>   "core":"testschemaapi_shard1_replica1",
   [junit4]   2>   "roles":null,
   [junit4]   2>   "base_url":"http://127.0.0.1:43623/solr",
   [junit4]   2>   "node_name":"127.0.0.1:43623_solr",
   [junit4]   2>   "numShards":"1",
   [junit4]   2>   "state":"down",
   [junit4]   2>   "shard":"shard1",
   [junit4]   2>   "collection":"testschemaapi",
   [junit4]   2>   "operation":"state"} current state version: 0
   [junit4]   2> 1438619 INFO  (OverseerStateUpdate-95959119167225861-127.0.0.1:40943_solr-n_0000000000) [n:127.0.0.1:40943_solr    ] o.a.s.c.o.ReplicaMutator Update state numShards=1 message={
   [junit4]   2>   "core":"testschemaapi_shard1_replica1",
   [junit4]   2>   "roles":null,
   [junit4]   2>   "base_url":"http://127.0.0.1:43623/solr",
   [junit4]   2>   "node_name":"127.0.0.1:43623_solr",
   [junit4]   2>   "numShards":"1",
   [junit4]   2>   "state":"down",
   [junit4]   2>   "shard":"shard1",
   [junit4]   2>   "collection":"testschemaapi",
   [junit4]   2>   "operation":"state"}
   [junit4]   2> 1438720 INFO  (OverseerStateUpdate-95959119167225861-127.0.0.1:40943_solr-n_0000000000) [n:127.0.0.1:40943_solr    ] o.a.s.c.o.ZkStateWriter going to update_collection /collections/testschemaapi/state.json version: 0
   [junit4]   2> 1438721 INFO  (zkCallback-1582-thread-1-processing-n:127.0.0.1:40943_solr) [n:127.0.0.1:40943_solr    ] o.a.s.c.c.ZkStateReader A cluster state change: [WatchedEvent state:SyncConnected type:NodeDataChanged path:/collections/testschemaapi/state.json] for collection [testschemaapi] has occurred - updating... (live nodes size: [2])
   [junit4]   2> 1438721 INFO  (zkCallback-1583-thread-1-processing-n:127.0.0.1:43623_solr) [n:127.0.0.1:43623_solr    ] o.a.s.c.c.ZkStateReader A cluster state change: [WatchedEvent state:SyncConnected type:NodeDataChanged path:/collections/testschemaapi/state.json] for collection [testschemaapi] has occurred - updating... (live nodes size: [2])
   [junit4]   2> 1438721 INFO  (zkCallback-1582-thread-1-processing-n:127.0.0.1:40943_solr) [n:127.0.0.1:40943_solr    ] o.a.s.c.c.ZkStateReader Updating data for [testschemaapi] from [0] to [1]
   [junit4]   2> 1438721 INFO  (zkCallback-1583-thread-1-processing-n:127.0.0.1:43623_solr) [n:127.0.0.1:43623_solr    ] o.a.s.c.c.ZkStateReader Updating data for [testschemaapi] from [0] to [1]
   [junit4]   2> 1439618 INFO  (qtp10816715-8098) [n:127.0.0.1:43623_solr c:testschemaapi s:shard1  x:testschemaapi_shard1_replica1] o.a.s.c.ZkController waiting to find shard id in clusterstate for testschemaapi_shard1_replica1
   [junit4]   2> 1439618 INFO  (qtp7561503-8101) [n:127.0.0.1:40943_solr c:testschemaapi s:shard1  x:testschemaapi_shard1_replica2] o.a.s.c.ZkController waiting to find shard id in clusterstate for testschemaapi_shard1_replica2
   [junit4]   2> 1439618 INFO  (qtp10816715-8098) [n:127.0.0.1:43623_solr c:testschemaapi s:shard1  x:testschemaapi_shard1_replica1] o.a.s.c.ZkController Check for collection zkNode:testschemaapi
   [junit4]   2> 1439618 INFO  (qtp7561503-8101) [n:127.0.0.1:40943_solr c:testschemaapi s:shard1  x:testschemaapi_shard1_replica2] o.a.s.c.ZkController Check for collection zkNode:testschemaapi
   [junit4]   2> 1439619 INFO  (qtp10816715-8098) [n:127.0.0.1:43623_solr c:testschemaapi s:shard1  x:testschemaapi_shard1_replica1] o.a.s.c.ZkController Collection zkNode exists
   [junit4]   2> 1439619 INFO  (qtp7561503-8101) [n:127.0.0.1:40943_solr c:testschemaapi s:shard1  x:testschemaapi_shard1_replica2] o.a.s.c.ZkController Collection zkNode exists
   [junit4]   2> 1439619 INFO  (qtp10816715-8098) [n:127.0.0.1:43623_solr c:testschemaapi s:shard1  x:testschemaapi_shard1_replica1] o.a.s.c.c.ZkStateReader Load collection config from: [/collections/testschemaapi]
   [junit4]   2> 1439619 INFO  (qtp7561503-8101) [n:127.0.0.1:40943_solr c:testschemaapi s:shard1  x:testschemaapi_shard1_replica2] o.a.s.c.c.ZkStateReader Load collection config from: [/collections/testschemaapi]
   [junit4]   2> 1439619 INFO  (qtp10816715-8098) [n:127.0.0.1:43623_solr c:testschemaapi s:shard1  x:testschemaapi_shard1_replica1] o.a.s.c.c.ZkStateReader path=[/collections/testschemaapi] [configName]=[conf1] specified config exists in ZooKeeper
   [junit4]   2> 1439619 INFO  (qtp10816715-8098) [n:127.0.0.1:43623_solr c:testschemaapi s:shard1  x:testschemaapi_shard1_replica1] o.a.s.c.SolrResourceLoader new SolrResourceLoader for directory: '/home/jenkins/workspace/Lucene-Solr-6.x-Linux/solr/build/solr-core/test/J2/temp/solr.schema.TestManagedSchemaAPI_3AC9536D3434E164-001/tempDir-001/node2/testschemaapi_shard1_replica1'
   [junit4]   2> 1439619 INFO  (qtp7561503-8101) [n:127.0.0.1:40943_solr c:testschemaapi s:shard1  x:testschemaapi_shard1_replica2] o.a.s.c.c.ZkStateReader path=[/collections/testschemaapi] [configName]=[conf1] specified config exists in ZooKeeper
   [junit4]   2> 1439619 INFO  (qtp7561503-8101) [n:127.0.0.1:40943_solr c:testschemaapi s:shard1  x:testschemaapi_shard1_replica2] o.a.s.c.SolrResourceLoader new SolrResourceLoader for directory: '/home/jenkins/workspace/Lucene-Solr-6.x-Linux/solr/build/solr-core/test/J2/temp/solr.schema.TestManagedSchemaAPI_3AC9536D3434E164-001/tempDir-001/node1/testschemaapi_shard1_replica2'
   [junit4]   2> 1439619 INFO  (qtp10816715-8098) [n:127.0.0.1:43623_solr c:testschemaapi s:shard1  x:testschemaapi_shard1_replica1] o.a.s.c.SolrResourceLoader JNDI not configured for solr (NoInitialContextEx)
   [junit4]   2> 1439619 INFO  (qtp10816715-8098) [n:127.0.0.1:43623_solr c:testschemaapi s:shard1  x:testschemaapi_shard1_replica1] o.a.s.c.SolrResourceLoader solr home defaulted to 'solr/' (could not find system property or JNDI)
   [junit4]   2> 1439620 INFO  (qtp7561503-8101) [n:127.0.0.1:40943_solr c:testschemaapi s:shard1  x:testschemaapi_shard1_replica2] o.a.s.c.SolrResourceLoader JNDI not configured for solr (NoInitialContextEx)
   [junit4]   2> 1439620 INFO  (qtp7561503-8101) [n:127.0.0.1:40943_solr c:testschemaapi s:shard1  x:testschemaapi_shard1_replica2] o.a.s.c.SolrResourceLoader solr home defaulted to 'solr/' (could not find system property or JNDI)
   [junit4]   2> 1439621 INFO  (qtp10816715-8098) [n:127.0.0.1:43623_solr c:testschemaapi s:shard1  x:testschemaapi_shard1_replica1] o.a.s.c.Config loaded config solrconfig.xml with version 0 
   [junit4]   2> 1439621 INFO  (qtp7561503-8101) [n:127.0.0.1:40943_solr c:testschemaapi s:shard1  x:testschemaapi_shard1_replica2] o.a.s.c.Config loaded config solrconfig.xml with version 0 
   [junit4]   2> 1439626 INFO  (qtp10816715-8098) [n:127.0.0.1:43623_solr c:testschemaapi s:shard1  x:testschemaapi_shard1_replica1] o.a.s.c.SolrConfig current version of requestparams : -1
   [junit4]   2> 1439626 INFO  (qtp7561503-8101) [n:127.0.0.1:40943_solr c:testschemaapi s:shard1  x:testschemaapi_shard1_replica2] o.a.s.c.SolrConfig current version of requestparams : -1
   [junit4]   2> 1439633 INFO  (qtp7561503-8101) [n:127.0.0.1:40943_solr c:testschemaapi s:shard1  x:testschemaapi_shard1_replica2] o.a.s.c.SolrConfig Using Lucene MatchVersion: 6.1.0
   [junit4]   2> 1439633 INFO  (qtp10816715-8098) [n:127.0.0.1:43623_solr c:testschemaapi s:shard1  x:testschemaapi_shard1_replica1] o.a.s.c.SolrConfig Using Lucene MatchVersion: 6.1.0
   [junit4]   2> 1439639 INFO  (qtp10816715-8098) [n:127.0.0.1:43623_solr c:testschemaapi s:shard1  x:testschemaapi_shard1_replica1] o.a.s.c.SolrConfig Loaded SolrConfig: solrconfig.xml
   [junit4]   2> 1439640 INFO  (qtp7561503-8101) [n:127.0.0.1:40943_solr c:testschemaapi s:shard1  x:testschemaapi_shard1_replica2] o.a.s.c.SolrConfig Loaded SolrConfig: solrconfig.xml
   [junit4]   2> 1439643 INFO  (qtp10816715-8098) [n:127.0.0.1:43623_solr c:testschemaapi s:shard1  x:testschemaapi_shard1_replica1] o.a.s.s.IndexSchema [testschemaapi_shard1_replica1] Schema name=minimal
   [junit4]   2> 1439645 INFO  (qtp7561503-8101) [n:127.0.0.1:40943_solr c:testschemaapi s:shard1  x:testschemaapi_shard1_replica2] o.a.s.s.IndexSchema [testschemaapi_shard1_replica2] Schema name=minimal
   [junit4]   2> 1439647 INFO  (qtp10816715-8098) [n:127.0.0.1:43623_solr c:testschemaapi s:shard1  x:testschemaapi_shard1_replica1] o.a.s.s.IndexSchema unique key field: id
   [junit4]   2> 1439648 INFO  (qtp10816715-8098) [n:127.0.0.1:43623_solr c:testschemaapi s:shard1  x:testschemaapi_shard1_replica1] o.a.s.c.ConfigSetProperties Did not find ConfigSet properties, assuming default properties: Can't find resource 'configsetprops.json' in classpath or '/configs/conf1', cwd=/home/jenkins/workspace/Lucene-Solr-6.x-Linux/solr/build/solr-core/test/J2
   [junit4]   2> 1439648 INFO  (qtp10816715-8098) [n:127.0.0.1:43623_solr c:testschemaapi s:shard1  x:testschemaapi_shard1_replica1] o.a.s.c.CoreContainer Creating SolrCore 'testschemaapi_shard1_replica1' using configuration from collection testschemaapi
   [junit4]   2> 1439648 INFO  (qtp10816715-8098) [n:127.0.0.1:43623_solr c:testschemaapi s:shard1 r:core_node2 x:testschemaapi_shard1_replica1] o.a.s.c.SolrCore org.apache.solr.core.MockDirectoryFactory
   [junit4]   2> 1439648 INFO  (qtp10816715-8098) [n:127.0.0.1:43623_solr c:testschemaapi s:shard1 r:core_node2 x:testschemaapi_shard1_replica1] o.a.s.c.SolrCore [[testschemaapi_shard1_replica1] ] Opening new SolrCore at [/home/jenkins/workspace/Lucene-Solr-6.x-Linux/solr/build/solr-core/test/J2/temp/solr.schema.TestManagedSchemaAPI_3AC9536D3434E164-001/tempDir-001/node2/testschemaapi_shard1_replica1], dataDir=[/home/jenkins/workspace/Lucene-Solr-6.x-Linux/solr/build/solr-core/test/J2/temp/solr.schema.TestManagedSchemaAPI_3AC9536D3434E164-001/tempDir-001/node2/./testschemaapi_shard1_replica1/data/]
   [junit4]   2> 1439648 INFO  (qtp10816715-8098) [n:127.0.0.1:43623_solr c:testschemaapi s:shard1 r:core_node2 x:testschemaapi_shard1_replica1] o.a.s.c.SolrCore JMX monitoring not detected for core: testschemaapi_shard1_replica1
   [junit4]   2> 1439649 INFO  (qtp7561503-8101) [n:127.0.0.1:40943_solr c:testschemaapi s:shard1  x:testschemaapi_shard1_replica2] o.a.s.s.IndexSchema unique key field: id
   [junit4]   2> 1439649 INFO  (qtp10816715-8098) [n:127.0.0.1:43623_solr c:testschemaapi s:shard1 r:core_node2 x:testschemaapi_shard1_replica1] o.a.s.c.CachingDirectoryFactory return new directory for /home/jenkins/workspace/Lucene-Solr-6.x-Linux/solr/build/solr-core/test/J2/temp/solr.schema.TestManagedSchemaAPI_3AC9536D3434E164-001/tempDir-001/node2/./testschemaapi_shard1_replica1/data
   [junit4]   2> 1439649 INFO  (qtp10816715-8098) [n:127.0.0.1:43623_solr c:testschemaapi s:shard1 r:core_node2 x:testschemaapi_shard1_replica1] o.a.s.c.SolrCore New index directory detected: old=null new=/home/jenkins/workspace/Lucene-Solr-6.x-Linux/solr/build/solr-core/test/J2/temp/solr.schema.TestManagedSchemaAPI_3AC9536D3434E164-001/tempDir-001/node2/./testschemaapi_shard1_replica1/data/index/
   [junit4]   2> 1439649 WARN  (qtp10816715-8098) [n:127.0.0.1:43623_solr c:testschemaapi s:shard1 r:core_node2 x:testschemaapi_shard1_replica1] o.a.s.c.SolrCore [testschemaapi_shard1_replica1] Solr index directory '/home/jenkins/workspace/Lucene-Solr-6.x-Linux/solr/build/solr-core/test/J2/temp/solr.schema.TestManagedSchemaAPI_3AC9536D3434E164-001/tempDir-001/node2/./testschemaapi_shard1_replica1/data/index' doesn't exist. Creating new index...
   [junit4]   2> 1439649 INFO  (qtp7561503-8101) [n:127.0.0.1:40943_solr c:testschemaapi s:shard1  x:testschemaapi_shard1_replica2] o.a.s.c.ConfigSetProperties Did not find ConfigSet properties, assuming default properties: Can't find resource 'configsetprops.json' in classpath or '/configs/conf1', cwd=/home/jenkins/workspace/Lucene-Solr-6.x-Linux/solr/build/solr-core/test/J2
   [junit4]   2> 1439650 INFO  (qtp7561503-8101) [n:127.0.0.1:40943_solr c:testschemaapi s:shard1  x:testschemaapi_shard1_replica2] o.a.s.c.CoreContainer Creating SolrCore 'testschemaapi_shard1_replica2' using configuration from collection testschemaapi
   [junit4]   2> 1439650 INFO  (qtp10816715-8098) [n:127.0.0.1:43623_solr c:testschemaapi s:shard1 r:core_node2 x:testschemaapi_shard1_replica1] o.a.s.c.CachingDirectoryFactory return new directory for /home/jenkins/workspace/Lucene-Solr-6.x-Linux/solr/build/solr-core/test/J2/temp/solr.schema.TestManagedSchemaAPI_3AC9536D3434E164-001/tempDir-001/node2/./testschemaapi_shard1_replica1/data/index
   [junit4]   2> 1439650 INFO  (qtp7561503-8101) [n:127.0.0.1:40943_solr c:testschemaapi s:shard1 r:core_node1 x:testschemaapi_shard1_replica2] o.a.s.c.SolrCore org.apache.solr.core.MockDirectoryFactory
   [junit4]   2> 1439650 INFO  (qtp7561503-8101) [n:127.0.0.1:40943_solr c:testschemaapi s:shard1 r:core_node1 x:testschemaapi_shard1_replica2] o.a.s.c.SolrCore [[testschemaapi_shard1_replica2] ] Opening new SolrCore at [/home/jenkins/workspace/Lucene-Solr-6.x-Linux/solr/build/solr-core/test/J2/temp/solr.schema.TestManagedSchemaAPI_3AC9536D3434E164-001/tempDir-001/node1/testschemaapi_shard1_replica2], dataDir=[/home/jenkins/workspace/Lucene-Solr-6.x-Linux/solr/build/solr-core/test/J2/temp/solr.schema.TestManagedSchemaAPI_3AC9536D3434E164-001/tempDir-001/node1/./testschemaapi_shard1_replica2/data/]
   [junit4]   2> 1439650 INFO  (qtp7561503-8101) [n:127.0.0.1:40943_solr c:testschemaapi s:shard1 r:core_node1 x:testschemaapi_shard1_replica2] o.a.s.c.SolrCore JMX monitoring not detected for core: testschemaapi_shard1_replica2
   [junit4]   2> 1439650 INFO  (qtp10816715-8098) [n:127.0.0.1:43623_solr c:testschemaapi s:shard1 r:core_node2 x:testschemaapi_shard1_replica1] o.a.s.c.SolrDeletionPolicy SolrDeletionPolicy.onCommit: commits: num=1
   [junit4]   2> 	commit{dir=MockDirectoryWrapper(RAMDirectory@bf7819 lockFactory=org.apache.lucene.store.SingleInstanceLockFactory@1ffde6f),segFN=segments_1,generation=1}
   [junit4]   2> 1439651 INFO  (qtp10816715-8098) [n:127.0.0.1:43623_solr c:testschemaapi s:shard1 r:core_node2 x:testschemaapi_shard1_replica1] o.a.s.c.SolrDeletionPolicy newest commit generation = 1
   [junit4]   2> 1439651 INFO  (OldIndexDirectoryCleanupThreadForCore-testschemaapi_shard1_replica1) [n:127.0.0.1:43623_solr c:testschemaapi s:shard1 r:core_node2 x:testschemaapi_shard1_replica1] o.a.s.c.SolrCore Looking for old index directories to cleanup for core testschemaapi_shard1_replica1 in /home/jenkins/workspace/Lucene-Solr-6.x-Linux/solr/build/solr-core/test/J2/temp/solr.schema.TestManagedSchemaAPI_3AC9536D3434E164-001/tempDir-001/node2/./testschemaapi_shard1_replica1/data/
   [junit4]   2> 1439651 WARN  (OldIndexDirectoryCleanupThreadForCore-testschemaapi_shard1_replica1) [n:127.0.0.1:43623_solr c:testschemaapi s:shard1 r:core_node2 x:testschemaapi_shard1_replica1] o.a.s.c.DirectoryFactory /home/jenkins/workspace/Lucene-Solr-6.x-Linux/solr/build/solr-core/test/J2/temp/solr.schema.TestManagedSchemaAPI_3AC9536D3434E164-001/tempDir-001/node2/./testschemaapi_shard1_replica1/data/ does not point to a valid data directory; skipping clean-up of old index directories.
   [junit4]   2> 1439651 INFO  (qtp7561503-8101) [n:127.0.0.1:40943_solr c:testschemaapi s:shard1 r:core_node1 x:testschemaapi_shard1_replica2] o.a.s.c.CachingDirectoryFactory return new directory for /home/jenkins/workspace/Lucene-Solr-6.x-Linux/solr/build/solr-core/test/J2/temp/solr.schema.TestManagedSchemaAPI_3AC9536D3434E164-001/tempDir-001/node1/./testschemaapi_shard1_replica2/data
   [junit4]   2> 1439652 INFO  (qtp7561503-8101) [n:127.0.0.1:40943_solr c:testschemaapi s:shard1 r:core_node1 x:testschemaapi_shard1_replica2] o.a.s.c.SolrCore New index directory detected: old=null new=/home/jenkins/workspace/Lucene-Solr-6.x-Linux/solr/build/solr-core/test/J2/temp/solr.schema.TestManagedSchemaAPI_3AC9536D3434E164-001/tempDir-001/node1/./testschemaapi_shard1_replica2/data/index/
   [junit4]   2> 1439652 WARN  (qtp7561503-8101) [n:127.0.0.1:40943_solr c:testschemaapi s:shard1 r:core_node1 x:testschemaapi_shard1_replica2] o.a.s.c.SolrCore [testschemaapi_shard1_replica2] Solr index directory '/home/jenkins/workspace/Lucene-Solr-6.x-Linux/solr/build/solr-core/test/J2/temp/solr.schema.TestManagedSchemaAPI_3AC9536D3434E164-001/tempDir-001/node1/./testschemaapi_shard1_replica2/data/index' doesn't exist. Creating new index...
   [junit4]   2> 1439652 INFO  (qtp7561503-8101) [n:127.0.0.1:40943_solr c:testschemaapi s:shard1 r:core_node1 x:testschemaapi_shard1_replica2] o.a.s.c.CachingDirectoryFactory return new directory for /home/jenkins/workspace/Lucene-Solr-6.x-Linux/solr/build/solr-core/test/J2/temp/solr.schema.TestManagedSchemaAPI_3AC9536D3434E164-001/tempDir-001/node1/./testschemaapi_shard1_replica2/data/index
   [junit4]   2> 1439653 INFO  (qtp7561503-8101) [n:127.0.0.1:40943_solr c:testschemaapi s:shard1 r:core_node1 x:testschemaapi_shard1_replica2] o.a.s.c.SolrDeletionPolicy SolrDeletionPolicy.onCommit: commits: num=1
   [junit4]   2> 	commit{dir=MockDirectoryWrapper(RAMDirectory@17a00f lockFactory=org.apache.lucene.store.SingleInstanceLockFactory@1dead0f),segFN=segments_1,generation=1}
   [junit4]   2> 1439653 INFO  (qtp7561503-8101) [n:127.0.0.1:40943_solr c:testschemaapi s:shard1 r:core_node1 x:testschemaapi_shard1_replica2] o.a.s.c.SolrDeletionPolicy newest commit generation = 1
   [junit4]   2> 1439653 INFO  (qtp10816715-8098) [n:127.0.0.1:43623_solr c:testschemaapi s:shard1 r:core_node2 x:testschemaapi_shard1_replica1] o.a.s.c.SolrCore no updateRequestProcessorChain defined as default, creating implicit default
   [junit4]   2> 1439653 INFO  (OldIndexDirectoryCleanupThreadForCore-testschemaapi_shard1_replica2) [n:127.0.0.1:40943_solr c:testschemaapi s:shard1 r:core_node1 x:testschemaapi_shard1_replica2] o.a.s.c.SolrCore Looking for old index directories to cleanup for core testschemaapi_shard1_replica2 in /home/jenkins/workspace/Lucene-Solr-6.x-Linux/solr/build/solr-core/test/J2/temp/solr.schema.TestManagedSchemaAPI_3AC9536D3434E164-001/tempDir-001/node1/./testschemaapi_shard1_replica2/data/
   [junit4]   2> 1439653 WARN  (OldIndexDirectoryCleanupThreadForCore-testschemaapi_shard1_replica2) [n:127.0.0.1:40943_solr c:testschemaapi s:shard1 r:core_node1 x:testschemaapi_shard1_replica2] o.a.s.c.DirectoryFactory /home/jenkins/workspace/Lucene-Solr-6.x-Linux/solr/build/solr-core/test/J2/temp/solr.schema.TestManagedSchemaAPI_3AC9536D3434E164-001/tempDir-001/node1/./testschemaapi_shard1_replica2/data/ does not point to a valid data directory; skipping clean-up of old index directories.
   [junit4]   2> 1439656 INFO  (qtp7561503-8101) [n:127.0.0.1:40943_solr c:testschemaapi s:shard1 r:core_node1 x:testschemaapi_shard1_replica2] o.a.s.c.SolrCore no updateRequestProcessorChain defined as default, creating implicit default
   [junit4]   2> 1439656 INFO  (qtp10816715-8098) [n:127.0.0.1:43623_solr c:testschemaapi s:shard1 r:core_node2 x:testschemaapi_shard1_replica1] o.a.s.h.l.XMLLoader xsltCacheLifetimeSeconds=60
   [junit4]   2> 1439657 INFO  (qtp10816715-8098) [n:127.0.0.1:43623_solr c:testschemaapi s:shard1 r:core_node2 x:testschemaapi_shard1_replica1] o.a.s.h.l.XMLLoader xsltCacheLifetimeSeconds=60
   [junit4]   2> 1439657 INFO  (qtp7561503-8101) [n:127.0.0.1:40943_solr c:testschemaapi s:shard1 r:core_node1 x:testschemaapi_shard1_replica2] o.a.s.h.l.XMLLoader xsltCacheLifetimeSeconds=60
   [junit4]   2> 1439657 INFO  (qtp10816715-8098) [n:127.0.0.1:43623_solr c:testschemaapi s:shard1 r:core_node2 x:testschemaapi_shard1_replica1] o.a.s.h.l.XMLLoader xsltCacheLifetimeSeconds=60
   [junit4]   2> 1439658 INFO  (qtp7561503-8101) [n:127.0.0.1:40943_solr c:testschemaapi s:shard1 r:core_node1 x:testschemaapi_shard1_replica2] o.a.s.h.l.XMLLoader xsltCacheLifetimeSeconds=60
   [junit4]   2> 1439658 INFO  (qtp10816715-8098) [n:127.0.0.1:43623_solr c:testschemaapi s:shard1 r:core_node2 x:testschemaapi_shard1_replica1] o.a.s.h.l.XMLLoader xsltCacheLifetimeSeconds=60
   [junit4]   2> 1439659 INFO  (qtp7561503-8101) [n:127.0.0.1:40943_solr c:testschemaapi s:shard1 r:core_node1 x:testschemaapi_shard1_replica2] o.a.s.h.l.XMLLoader xsltCacheLifetimeSeconds=60
   [junit4]   2> 1439660 INFO  (qtp7561503-8101) [n:127.0.0.1:40943_solr c:testschemaapi s:shard1 r:core_node1 x:testschemaapi_shard1_replica2] o.a.s.h.l.XMLLoader xsltCacheLifetimeSeconds=60
   [junit4]   2> 1439660 INFO  (qtp10816715-8098) [n:127.0.0.1:43623_solr c:testschemaapi s:shard1 r:core_node2 x:testschemaapi_shard1_replica1] o.a.s.c.RequestHandlers Registered paths: /admin/mbeans,/update/csv,/sql,/update/json/docs,/admin/luke,/graph,/export,/select,/admin/segments,/get,/admin/system,/replication,/admin/properties,/config,/stream,/schema,/admin/plugins,/admin/logging,/update/json,/admin/ping,/admin/threads,/update,/admin/file
   [junit4]   2> 1439660 INFO  (qtp10816715-8098) [n:127.0.0.1:43623_solr c:testschemaapi s:shard1 r:core_node2 x:testschemaapi_shard1_replica1] o.a.s.c.SolrCore Using default statsCache cache: org.apache.solr.search.stats.LocalStatsCache
   [junit4]   2> 1439660 INFO  (qtp10816715-8098) [n:127.0.0.1:43623_solr c:testschemaapi s:shard1 r:core_node2 x:testschemaapi_shard1_replica1] o.a.s.u.UpdateHandler Using UpdateLog implementation: org.apache.solr.update.UpdateLog
   [junit4]   2> 1439660 INFO  (qtp10816715-8098) [n:127.0.0.1:43623_solr c:testschemaapi s:shard1 r:core_node2 x:testschemaapi_shard1_replica1] o.a.s.u.UpdateLog Initializing UpdateLog: dataDir=null defaultSyncLevel=FLUSH numRecordsToKeep=100 maxNumLogsToKeep=10 numVersionBuckets=65536
   [junit4]   2> 1439661 INFO  (qtp10816715-8098) [n:127.0.0.1:43623_solr c:testschemaapi s:shard1 r:core_node2 x:testschemaapi_shard1_replica1] o.a.s.u.CommitTracker Hard AutoCommit: disabled
   [junit4]   2> 1439661 INFO  (qtp7561503-8101) [n:127.0.0.1:40943_solr c:testschemaapi s:shard1 r:core_node1 x:testschemaapi_shard1_replica2] o.a.s.c.RequestHandlers Registered paths: /admin/mbeans,/update/csv,/sql,/update/json/docs,/admin/luke,/graph,/export,/select,/admin/segments,/get,/admin/system,/replication,/admin/properties,/config,/stream,/schema,/admin/plugins,/admin/logging,/update/json,/admin/ping,/admin/threads,/update,/admin/file
   [junit4]   2> 1439661 INFO  (qtp10816715-8098) [n:127.0.0.1:43623_solr c:testschemaapi s:shard1 r:core_node2 x:testschemaapi_shard1_replica1] o.a.s.u.CommitTracker Soft AutoCommit: disabled
   [junit4]   2> 1439661 INFO  (qtp7561503-8101) [n:127.0.0.1:40943_solr c:testschemaapi s:shard1 r:core_node1 x:testschemaapi_shard1_replica2] o.a.s.c.SolrCore Using default statsCache cache: org.apache.solr.search.stats.LocalStatsCache
   [junit4]   2> 1439662 INFO  (qtp7561503-8101) [n:127.0.0.1:40943_solr c:testschemaapi s:shard1 r:core_node1 x:testschemaapi_shard1_replica2] o.a.s.u.UpdateHandler Using UpdateLog implementation: org.apache.solr.update.UpdateLog
   [junit4]   2> 1439662 INFO  (qtp10816715-8098) [n:127.0.0.1:43623_solr c:testschemaapi s:shard1 r:core_node2 x:testschemaapi_shard1_replica1] o.a.s.c.SolrDeletionPolicy SolrDeletionPolicy.onInit: commits: num=1
   [junit4]   2> 	commit{dir=MockDirectoryWrapper(RAMDirectory@bf7819 lockFactory=org.apache.lucene.store.SingleInstanceLockFactory@1ffde6f),segFN=segments_1,generation=1}
   [junit4]   2> 1439662 INFO  (qtp7561503-8101) [n:127.0.0.1:40943_solr c:testschemaapi s:shard1 r:core_node1 x:testschemaapi_shard1_replica2] o.a.s.u.UpdateLog Initializing UpdateLog: dataDir=null defaultSyncLevel=FLUSH numRecordsToKeep=100 maxNumLogsToKeep=10 numVersionBuckets=65536
   [junit4]   2> 1439662 INFO  (qtp10816715-8098) [n:127.0.0.1:43623_solr c:testschemaapi s:shard1 r:core_node2 x:testschemaapi_shard1_replica1] o.a.s.c.SolrDeletionPolicy newest commit generation = 1
   [junit4]   2> 1439662 INFO  (qtp10816715-8098) [n:127.0.0.1:43623_solr c:testschemaapi s:shard1 r:core_node2 x:testschemaapi_shard1_replica1] o.a.s.s.SolrIndexSearcher Opening [Searcher@d5bc4[testschemaapi_shard1_replica1] main]
   [junit4]   2> 1439662 INFO  (qtp10816715-8098) [n:127.0.0.1:43623_solr c:testschemaapi s:shard1 r:core_node2 x:testschemaapi_shard1_replica1] o.a.s.c.c.ZkStateReader Load collection config from: [/collections/testschemaapi]
   [junit4]   2> 1439663 INFO  (qtp10816715-8098) [n:127.0.0.1:43623_solr c:testschemaapi s:shard1 r:core_node2 x:testschemaapi_shard1_replica1] o.a.s.c.c.ZkStateReader path=[/collections/testschemaapi] [configName]=[conf1] specified config exists in ZooKeeper
   [junit4]   2> 1439663 INFO  (qtp10816715-8098) [n:127.0.0.1:43623_solr c:testschemaapi s:shard1 r:core_node2 x:testschemaapi_shard1_replica1] o.a.s.r.ManagedResourceStorage Setting up ZooKeeper-based storage for the RestManager with znodeBase: /configs/conf1
   [junit4]   2> 1439663 INFO  (qtp7561503-8101) [n:127.0.0.1:40943_solr c:testschemaapi s:shard1 r:core_node1 x:testschemaapi_shard1_replica2] o.a.s.u.CommitTracker Hard AutoCommit: disabled
   [junit4]   2> 1439663 INFO  (qtp10816715-8098) [n:127.0.0.1:43623_solr c:testschemaapi s:shard1 r:core_node2 x:testschemaapi_shard1_replica1] o.a.s.r.ManagedResourceStorage Configured ZooKeeperStorageIO with znodeBase: /configs/conf1
   [junit4]   2> 1439663 INFO  (qtp7561503-8101) [n:127.0.0.1:40943_solr c:testschemaapi s:shard1 r:core_node1 x:testschemaapi_shard1_replica2] o.a.s.u.CommitTracker Soft AutoCommit: disabled
   [junit4]   2> 1439663 INFO  (qtp10816715-8098) [n:127.0.0.1:43623_solr c:testschemaapi s:shard1 r:core_node2 x:testschemaapi_shard1_replica1] o.a.s.r.RestManager Initializing RestManager with initArgs: {}
   [junit4]   2> 1439663 INFO  (qtp10816715-8098) [n:127.0.0.1:43623_solr c:testschemaapi s:shard1 r:core_node2 x:testschemaapi_shard1_replica1] o.a.s.r.ManagedResourceStorage Reading _rest_managed.json using ZooKeeperStorageIO:path=/configs/conf1
   [junit4]   2> 1439663 INFO  (qtp10816715-8098) [n:127.0.0.1:43623_solr c:testschemaapi s:shard1 r:core_node2 x:testschemaapi_shard1_replica1] o.a.s.r.ManagedResourceStorage No data found for znode /configs/conf1/_rest_managed.json
   [junit4]   2> 1439663 INFO  (qtp7561503-8101) [n:127.0.0.1:40943_solr c:testschemaapi s:shard1 r:core_node1 x:testschemaapi_shard1_replica2] o.a.s.c.SolrDeletionPolicy SolrDeletionPolicy.onInit: commits: num=1
   [junit4]   2> 	commit{dir=MockDirectoryWrapper(RAMDirectory@17a00f lockFactory=org.apache.lucene.store.SingleInstanceLockFactory@1dead0f),segFN=segments_1,generation=1}
   [junit4]   2> 1439663 INFO  (qtp7561503-8101) [n:127.0.0.1:40943_solr c:testschemaapi s:shard1 r:core_node1 x:testschemaapi_shard1_replica2] o.a.s.c.SolrDeletionPolicy newest commit generation = 1
   [junit4]   2> 1439663 INFO  (qtp10816715-8098) [n:127.0.0.1:43623_solr c:testschemaapi s:shard1 r:core_node2 x:testschemaapi_shard1_replica1] o.a.s.r.ManagedResourceStorage Loaded null at path _rest_managed.json using ZooKeeperStorageIO:path=/configs/conf1
   [junit4]   2> 1439663 INFO  (qtp10816715-8098) [n:127.0.0.1:43623_solr c:testschemaapi s:shard1 r:core_node2 x:testschemaapi_shard1_replica1] o.a.s.r.RestManager Initializing 0 registered ManagedResources
   [junit4]   2> 1439663 INFO  (qtp7561503-8101) [n:127.0.0.1:40943_solr c:testschemaapi s:shard1 r:core_node1 x:testschemaapi_shard1_replica2] o.a.s.s.SolrIndexSearcher Opening [Searcher@1fd076b[testschemaapi_shard1_replica2] main]
   [junit4]   2> 1439663 INFO  (qtp10816715-8098) [n:127.0.0.1:43623_solr c:testschemaapi s:shard1 r:core_node2 x:testschemaapi_shard1_replica1] o.a.s.s.ZkIndexSchemaReader Creating ZooKeeper watch for the managed schema at /configs/conf1/managed-schema
   [junit4]   2> 1439664 INFO  (qtp7561503-8101) [n:127.0.0.1:40943_solr c:testschemaapi s:shard1 r:core_node1 x:testschemaapi_shard1_replica2] o.a.s.c.c.ZkStateReader Load collection config from: [/collections/testschemaapi]
   [junit4]   2> 1439664 INFO  (qtp10816715-8098) [n:127.0.0.1:43623_solr c:testschemaapi s:shard1 r:core_node2 x:testschemaapi_shard1_replica1] o.a.s.c.ZkController Added new OnReconnect listener ZkIndexSchemaReader: /configs/conf1/managed-schema, uniqueCoreId: testschemaapi_shard1_replica1:1678120305686100
   [junit4]   2> 1439664 INFO  (qtp10816715-8098) [n:127.0.0.1:43623_solr c:testschemaapi s:shard1 r:core_node2 x:testschemaapi_shard1_replica1] o.a.s.h.ReplicationHandler Commits will be reserved for  10000
   [junit4]   2> 1439664 INFO  (qtp7561503-8101) [n:127.0.0.1:40943_solr c:testschemaapi s:shard1 r:core_node1 x:testschemaapi_shard1_replica2] o.a.s.c.c.ZkStateReader path=[/collections/testschemaapi] [configName]=[conf1] specified config exists in ZooKeeper
   [junit4]   2> 1439664 INFO  (searcherExecutor-3262-thread-1-processing-n:127.0.0.1:43623_solr x:testschemaapi_shard1_replica1 s:shard1 c:testschemaapi r:core_node2) [n:127.0.0.1:43623_solr c:testschemaapi s:shard1 r:core_node2 x:testschemaapi_shard1_replica1] o.a.s.c.SolrCore [testschemaapi_shard1_replica1] Registered new searcher Searcher@d5bc4[testschemaapi_shard1_replica1] main{ExitableDirectoryReader(UninvertingDirectoryReader())}
   [junit4]   2> 1439664 INFO  (qtp7561503-8101) [n:127.0.0.1:40943_solr c:testschemaapi s:shard1 r:core_node1 x:testschemaapi_shard1_replica2] o.a.s.r.ManagedResourceStorage Setting up ZooKeeper-based storage for the RestManager with znodeBase: /configs/conf1
   [junit4]   2> 1439664 INFO  (qtp10816715-8098) [n:127.0.0.1:43623_solr c:testschemaapi s:shard1 r:core_node2 x:testschemaapi_shard1_replica1] o.a.s.u.UpdateLog Looking up max value of version field to seed version buckets
   [junit4]   2> 1439664 INFO  (qtp10816715-8098) [n:127.0.0.1:43623_solr c:testschemaapi s:shard1 r:core_node2 x:testschemaapi_shard1_replica1] o.a.s.u.VersionInfo Refreshing highest value of _version_ for 65536 version buckets from index
   [junit4]   2> 1439664 INFO  (qtp7561503-8101) [n:127.0.0.1:40943_solr c:testschemaapi s:shard1 r:core_node1 x:testschemaapi_shard1_replica2] o.a.s.r.ManagedResourceStorage Configured ZooKeeperStorageIO with znodeBase: /configs/conf1
   [junit4]   2> 1439664 INFO  (qtp10816715-8098) [n:127.0.0.1:43623_solr c:testschemaapi s:shard1 r:core_node2 x:testschemaapi_shard1_replica1] o.a.s.u.VersionInfo No terms found for _version_, cannot seed version bucket highest value from index
   [junit4]   2> 1439664 INFO  (qtp7561503-8101) [n:127.0.0.1:40943_solr c:testschemaapi s:shard1 r:core_node1 x:testschemaapi_shard1_replica2] o.a.s.r.RestManager Initializing RestManager with initArgs: {}
   [junit4]   2> 1439664 INFO  (qtp10816715-8098) [n:127.0.0.1:43623_solr c:testschemaapi s:shard1 r:core_node2 x:testschemaapi_shard1_replica1] o.a.s.u.UpdateLog Could not find max version in index or recent updates, using new clock 1535345909147107328
   [junit4]   2> 1439664 INFO  (qtp7561503-8101) [n:127.0.0.1:40943_solr c:testschemaapi s:shard1 r:core_node1 x:testschemaapi_shard1_replica2] o.a.s.r.ManagedResourceStorage Reading _rest_managed.json using ZooKeeperStorageIO:path=/configs/conf1
   [junit4]   2> 1439665 INFO  (qtp7561503-8101) [n:127.0.0.1:40943_solr c:testschemaapi s:shard1 r:core_node1 x:testschemaapi_shard1_replica2] o.a.s.r.ManagedResourceStorage No data found for znode /configs/conf1/_rest_managed.json
   [junit4]   2> 1439665 INFO  (qtp7561503-8101) [n:127.0.0.1:40943_solr c:testschemaapi s:shard1 r:core_node1 x:testschemaapi_shard1_replica2] o.a.s.r.ManagedResourceStorage Loaded null at path _rest_managed.json using ZooKeeperStorageIO:path=/configs/conf1
   [junit4]   2> 1439665 INFO  (qtp7561503-8101) [n:127.0.0.1:40943_solr c:testschemaapi s:shard1 r:core_node1 x:testschemaapi_shard1_replica2] o.a.s.r.RestManager Initializing 0 registered ManagedResources
   [junit4]   2> 1439665 INFO  (qtp7561503-8101) [n:127.0.0.1:40943_solr c:testschemaapi s:shard1 r:core_node1 x:testschemaapi_shard1_replica2] o.a.s.s.ZkIndexSchemaReader Creating ZooKeeper watch for the managed schema at /configs/conf1/managed-schema
   [junit4]   2> 1439665 INFO  (qtp7561503-8101) [n:127.0.0.1:40943_solr c:testschemaapi s:shard1 r:core_node1 x:testschemaapi_shard1_replica2] o.a.s.c.ZkController Added new OnReconnect listener ZkIndexSchemaReader: /configs/conf1/managed-schema, uniqueCoreId: testschemaapi_shard1_replica2:1678120307572008
   [junit4]   2> 1439665 INFO  (qtp7561503-8101) [n:127.0.0.1:40943_solr c:testschemaapi s:shard1 r:core_node1 x:testschemaapi_shard1_replica2] o.a.s.h.ReplicationHandler Commits will be reserved for  10000
   [junit4]   2> 1439665 INFO  (searcherExecutor-3263-thread-1-processing-n:127.0.0.1:40943_solr x:testschemaapi_shard1_replica2 s:shard1 c:testschemaapi r:core_node1) [n:127.0.0.1:40943_solr c:testschemaapi s:shard1 r:core_node1 x:testschemaapi_shard1_replica2] o.a.s.c.SolrCore [testschemaapi_shard1_replica2] Registered new searcher Searcher@1fd076b[testschemaapi_shard1_replica2] main{ExitableDirectoryReader(UninvertingDirectoryReader())}
   [junit4]   2> 1439665 INFO  (qtp7561503-8101) [n:127.0.0.1:40943_solr c:testschemaapi s:shard1 r:core_node1 x:testschemaapi_shard1_replica2] o.a.s.u.UpdateLog Looking up max value of version field to seed version buckets
   [junit4]   2> 1439665 INFO  (qtp7561503-8101) [n:127.0.0.1:40943_solr c:testschemaapi s:shard1 r:core_node1 x:testschemaapi_shard1_replica2] o.a.s.u.VersionInfo Refreshing highest value of _version_ for 65536 version buckets from index
   [junit4]   2> 1439666 INFO  (qtp7561503-8101) [n:127.0.0.1:40943_solr c:testschemaapi s:shard1 r:core_node1 x:testschemaapi_shard1_replica2] o.a.s.u.VersionInfo No terms found for _version_, cannot seed version bucket highest value from index
   [junit4]   2> 1439666 INFO  (qtp7561503-8101) [n:127.0.0.1:40943_solr c:testschemaapi s:shard1 r:core_node1 x:testschemaapi_shard1_replica2] o.a.s.u.UpdateLog Could not find max version in index or recent updates, using new clock 1535345909149204480
   [junit4]   2> 1439667 INFO  (qtp10816715-8098) [n:127.0.0.1:43623_solr c:testschemaapi s:shard1 r:core_node2 x:testschemaapi_shard1_replica1] o.a.s.u.UpdateLog Took 2.0ms to seed version buckets with highest version 1535345909147107328
   [junit4]   2> 1439667 INFO  (qtp10816715-8098) [n:127.0.0.1:43623_solr c:testschemaapi s:shard1 r:core_node2 x:testschemaapi_shard1_replica1] o.a.s.c.ZkController watch zkdir /configs/conf1
   [junit4]   2> 1439667 INFO  (qtp10816715-8098) [n:127.0.0.1:43623_solr c:testschemaapi s:shard1 r:core_node2 x:testschemaapi_shard1_replica1] o.a.s.c.CoreContainer registering core: testschemaapi_shard1_replica1
   [junit4]   2> 1439667 INFO  (qtp10816715-8098) [n:127.0.0.1:43623_solr c:testschemaapi s:shard1 r:core_node2 x:testschemaapi_shard1_replica1] o.a.s.c.ZkController Register replica - core:testschemaapi_shard1_replica1 address:http://127.0.0.1:43623/solr collection:testschemaapi shard:shard1
   [junit4]   2> 1439668 INFO  (qtp10816715-8098) [n:127.0.0.1:43623_solr c:testschemaapi s:shard1 r:core_node2 x:testschemaapi_shard1_replica1] o.a.s.c.c.SolrZkClient makePath: /collections/testschemaapi/leader_elect/shard1/election
   [junit4]   2> 1439668 INFO  (qtp7561503-8101) [n:127.0.0.1:40943_solr c:testschemaapi s:shard1 r:core_node1 x:testschemaapi_shard1_replica2] o.a.s.u.UpdateLog Took 2.0ms to seed version buckets with highest version 1535345909149204480
   [junit4]   2> 1439668 INFO  (qtp7561503-8101) [n:127.0.0.1:40943_solr c:testschemaapi s:shard1 r:core_node1 x:testschemaapi_shard1_replica2] o.a.s.c.ZkController watch zkdir /configs/conf1
   [junit4]   2> 1439668 INFO  (qtp7561503-8101) [n:127.0.0.1:40943_solr c:testschemaapi s:shard1 r:core_node1 x:testschemaapi_shard1_replica2] o.a.s.c.CoreContainer registering core: testschemaapi_shard1_replica2
   [junit4]   2> 1439668 INFO  (qtp7561503-8101) [n:127.0.0.1:40943_solr c:testschemaapi s:shard1 r:core_node1 x:testschemaapi_shard1_replica2] o.a.s.c.ZkController Register replica - core:testschemaapi_shard1_replica2 address:http://127.0.0.1:40943/solr collection:testschemaapi shard:shard1
   [junit4]   2> 1439669 INFO  (qtp7561503-8101) [n:127.0.0.1:40943_solr c:testschemaapi s:shard1 r:core_node1 x:testschemaapi_shard1_replica2] o.a.s.c.c.SolrZkClient makePath: /collections/testschemaapi/leader_elect/shard1/election
   [junit4]   2> 1439669 INFO  (qtp10816715-8098) [n:127.0.0.1:43623_solr c:testschemaapi s:shard1 r:core_node2 x:testschemaapi_shard1_replica1] o.a.s.c.LeaderElector Joined leadership election with path: /collections/testschemaapi/leader_elect/shard1/election/95959119167225862-core_node2-n_0000000000
   [junit4]   2> 1439670 INFO  (qtp10816715-8098) [n:127.0.0.1:43623_solr c:testschemaapi s:shard1 r:core_node2 x:testschemaapi_shard1_replica1] o.a.s.c.ShardLeaderElectionContext Running the leader process for shard=shard1 and weAreReplacement=false and leaderVoteWait=10000
   [junit4]   2> 1439671 INFO  (qtp7561503-8101) [n:127.0.0.1:40943_solr c:testschemaapi s:shard1 r:core_node1 x:testschemaapi_shard1_replica2] o.a.s.c.LeaderElector Joined leadership election with path: /collections/testschemaapi/leader_elect/shard1/election/95959119167225861-core_node1-n_0000000001
   [junit4]   2> 1439671 INFO  (qtp10816715-8098) [n:127.0.0.1:43623_solr c:testschemaapi s:shard1 r:core_node2 x:testschemaapi_shard1_replica1] o.a.s.c.ShardLeaderElectionContext Enough replicas found to continue.
   [junit4]   2> 1439671 INFO  (qtp10816715-8098) [n:127.0.0.1:43623_solr c:testschemaapi s:shard1 r:core_node2 x:testschemaapi_shard1_replica1] o.a.s.c.ShardLeaderElectionContext I may be the new leader - try and sync
   [junit4]   2> 1439671 INFO  (qtp10816715-8098) [n:127.0.0.1:43623_solr c:testschemaapi s:shard1 r:core_node2 x:testschemaapi_shard1_replica1] o.a.s.c.SyncStrategy Sync replicas to http://127.0.0.1:43623/solr/testschemaapi_shard1_replica1/
   [junit4]   2> 1439671 INFO  (qtp10816715-8098) [n:127.0.0.1:43623_solr c:testschemaapi s:shard1 r:core_node2 x:testschemaapi_shard1_replica1] o.a.s.u.PeerSync PeerSync: core=testschemaapi_shard1_replica1 url=http://127.0.0.1:43623/solr START replicas=[http://127.0.0.1:40943/solr/testschemaapi_shard1_replica2/] nUpdates=100
   [junit4]   2> 1439671 INFO  (OverseerStateUpdate-95959119167225861-127.0.0.1:40943_solr-n_0000000000) [n:127.0.0.1:40943_solr    ] o.a.s.c.Overseer processMessage: queueSize: 1, message = {
   [junit4]   2>   "operation":"leader",
   [junit4]   2>   "shard":"shard1",
   [junit4]   2>   "collection":"testschemaapi"} current state version: 0
   [junit4]   2> 1439671 INFO  (qtp7561503-8101) [n:127.0.0.1:40943_solr c:testschemaapi s:shard1 r:core_node1 x:testschemaapi_shard1_replica2] o.a.s.c.LeaderElector Watching path /collections/testschemaapi/leader_elect/shard1/election/95959119167225862-core_node2-n_0000000000 to know if I could be the leader
   [junit4]   2> 1439671 INFO  (qtp10816715-8098) [n:127.0.0.1:43623_solr c:testschemaapi s:shard1 r:core_node2 x:testschemaapi_shard1_replica1] o.a.s.u.PeerSync PeerSync: core=testschemaapi_shard1_replica1 url=http://127.0.0.1:43623/solr DONE.  We have no versions.  sync failed.
   [junit4]   2> 1439671 INFO  (qtp10816715-8098) [n:127.0.0.1:43623_solr c:testschemaapi s:shard1 r:core_node2 x:testschemaapi_shard1_replica1] o.a.s.c.SyncStrategy Leader's attempt to sync with shard failed, moving to the next candidate
   [junit4]   2> 1439671 INFO  (qtp10816715-8098) [n:127.0.0.1:43623_solr c:testschemaapi s:shard1 r:core_node2 x:testschemaapi_shard1_replica1] o.a.s.c.ShardLeaderElectionContext We failed sync, but we have no versions - we can't sync in that case - we were active before, so become leader anyway
   [junit4]   2> 1439673 INFO  (qtp10816715-8098) [n:127.0.0.1:43623_solr c:testschemaapi s:shard1 r:core_node2 x:testschemaapi_shard1_replica1] o.a.s.c.c.SolrZkClient makePath: /collections/testschemaapi/leaders/shard1
   [junit4]   2> 1439674 INFO  (qtp7561503-8092) [n:127.0.0.1:40943_solr c:testschemaapi s:shard1 r:core_node1 x:testschemaapi_shard1_replica2] o.a.s.c.S.Request [testschemaapi_shard1_replica2]  webapp=/solr path=/get params={distrib=false&qt=/get&fingerprint=false&getVersions=100&wt=javabin&version=2} status=0 QTime=0
   [junit4]   2> 1439675 INFO  (qtp10816715-8098) [n:127.0.0.1:43623_solr c:testschemaapi s:shard1 r:core_node2 x:testschemaapi_shard1_replica1] o.a.s.c.ShardLeaderElectionContextBase Creating leader registration node /collections/testschemaapi/leaders/shard1/leader after winning as /collections/testschemaapi/leader_elect/shard1/election/95959119167225862-core_node2-n_0000000000
   [junit4]   2> 1439676 INFO  (qtp10816715-8098) [n:127.0.0.1:43623_solr c:testschemaapi s:shard1 r:core_node2 x:testschemaapi_shard1_replica1] o.a.s.c.ShardLeaderElectionContext I am the new leader: http://127.0.0.1:43623/solr/testschemaapi_shard1_replica1/ shard1
   [junit4]   2> 1439676 INFO  (OverseerStateUpdate-95959119167225861-127.0.0.1:40943_solr-n_0000000000) [n:127.0.0.1:40943_solr    ] o.a.s.c.Overseer processMessage: queueSize: 1, message = {
   [junit4]   2>   "operation":"leader",
   [junit4]   2>   "shard":"shard1",
   [junit4]   2>   "collection":"testschemaapi",
   [junit4]   2>   "base_url":"http://127.0.0.1:43623/solr",
   [junit4]   2>   "core":"testschemaapi_shard1_replica1",
   [junit4]   2>   "state":"active"} current state version: 0
   [junit4]   2> 1439778 INFO  (OverseerStateUpdate-95959119167225861-127.0.0.1:40943_solr-n_0000000000) [n:127.0.0.1:40943_solr    ] o.a.s.c.o.ZkStateWriter going to update_collection /collections/testschemaapi/state.json version: 1
   [junit4]   2> 1439778 INFO  (zkCallback-1582-thread-1-processing-n:127.0.0.1:40943_solr) [n:127.0.0.1:40943_solr    ] o.a.s.c.c.ZkStateReader A cluster state change: [WatchedEvent state:SyncConnected type:NodeDataChanged path:/collections/testschemaapi/state.json] for collection [testschemaapi] has occurred - updating... (live nodes size: [2])
   [junit4]   2> 1439779 INFO  (zkCallback-1583-thread-1-processing-n:127.0.0.1:43623_solr) [n:127.0.0.1:43623_solr    ] o.a.s.c.c.ZkStateReader A cluster state change: [WatchedEvent state:SyncConnected type:NodeDataChanged path:/collections/testschemaapi/state.json] for collection [testschemaapi] has occurred - updating... (live nodes size: [2])
   [junit4]   2> 1439779 INFO  (zkCallback-1582-thread-1-processing-n:127.0.0.1:40943_solr) [n:127.0.0.1:40943_solr    ] o.a.s.c.c.ZkStateReader Updating data for [testschemaapi] from [1] to [2]
   [junit4]   2> 1439779 INFO  (zkCallback-1583-thread-1-processing-n:127.0.0.1:43623_solr) [n:127.0.0.1:43623_solr    ] o.a.s.c.c.ZkStateReader Updating data for [testschemaapi] from [1] to [2]
   [junit4]   2> 1439827 INFO  (qtp10816715-8098) [n:127.0.0.1:43623_solr c:testschemaapi s:shard1 r:core_node2 x:testschemaapi_shard1_replica1] o.a.s.c.ZkController We are http://127.0.0.1:43623/solr/testschemaapi_shard1_replica1/ and leader is http://127.0.0.1:43623/solr/testschemaapi_shard1_replica1/
   [junit4]   2> 1439827 INFO  (qtp10816715-8098) [n:127.0.0.1:43623_solr c:testschemaapi s:shard1 r:core_node2 x:testschemaapi_shard1_replica1] o.a.s.c.ZkController No LogReplay needed for core=testschemaapi_shard1_replica1 baseURL=http://127.0.0.1:43623/solr
   [junit4]   2> 1439827 INFO  (qtp10816715-8098) [n:127.0.0.1:43623_solr c:testschemaapi s:shard1 r:core_node2 x:testschemaapi_shard1_replica1] o.a.s.c.ZkController I am the leader, no recovery necessary
   [junit4]   2> 1439827 INFO  (qtp10816715-8098) [n:127.0.0.1:43623_solr c:testschemaapi s:shard1 r:core_node2 x:testschemaapi_shard1_replica1] o.a.s.c.ZkController publishing state=active
   [junit4]   2> 1439828 INFO  (OverseerStateUpdate-95959119167225861-127.0.0.1:40943_solr-n_0000000000) [n:127.0.0.1:40943_solr    ] o.a.s.c.Overseer processMessage: queueSize: 1, message = {
   [junit4]   2>   "core":"testschemaapi_shard1_replica1",
   [junit4]   2>   "core_node_name":"core_node2",
   [junit4]   2>   "roles":null,
   [junit4]   2>   "base_url":"http://127.0.0.1:43623/solr",
   [junit4]   2>   "node_name":"127.0.0.1:43623_solr",
   [junit4]   2>   "numShards":"1",
   [junit4]   2>   "state":"active",
   [junit4]   2>   "shard":"shard1",
   [junit4]   2>   "collection":"testschemaapi",
   [junit4]   2>   "operation":"state"} current state version: 0
   [junit4]   2> 1439828 INFO  (OverseerStateUpdate-95959119167225861-127.0.0.1:40943_solr-n_0000000000) [n:127.0.0.1:40943_solr    ] o.a.s.c.o.ReplicaMutator Update state numShards=1 message={
   [junit4]   2>   "core":"testschemaapi_shard1_replica1",
   [junit4]   2>   "core_node_name":"core_node2",
   [junit4]  

[...truncated too long message...]

to reload core [testschemaapi_shard1_replica2]
   [junit4]   2> 	at org.apache.solr.core.CoreContainer.reload(CoreContainer.java:920)
   [junit4]   2> 	at org.apache.solr.core.SolrCore.lambda$getConfListener$6(SolrCore.java:2510)
   [junit4]   2> 	at org.apache.solr.cloud.ZkController$4.run(ZkController.java:2408)
   [junit4]   2> Caused by: org.apache.solr.common.SolrException: Could not load conf for core testschemaapi_shard1_replica2: Error attempting to access /configs/conf1/managed-schema
   [junit4]   2> 	at org.apache.solr.core.ConfigSetService.getConfig(ConfigSetService.java:86)
   [junit4]   2> 	at org.apache.solr.core.CoreContainer.reload(CoreContainer.java:912)
   [junit4]   2> 	... 2 more
   [junit4]   2> Caused by: org.apache.solr.common.SolrException: Error attempting to access /configs/conf1/managed-schema
   [junit4]   2> 	at org.apache.solr.schema.ManagedIndexSchemaFactory.create(ManagedIndexSchemaFactory.java:143)
   [junit4]   2> 	at org.apache.solr.schema.ManagedIndexSchemaFactory.create(ManagedIndexSchemaFactory.java:47)
   [junit4]   2> 	at org.apache.solr.schema.IndexSchemaFactory.buildIndexSchema(IndexSchemaFactory.java:75)
   [junit4]   2> 	at org.apache.solr.core.ConfigSetService.createIndexSchema(ConfigSetService.java:108)
   [junit4]   2> 	at org.apache.solr.core.ConfigSetService.getConfig(ConfigSetService.java:79)
   [junit4]   2> 	... 3 more
   [junit4]   2> Caused by: org.apache.zookeeper.KeeperException$SessionExpiredException: KeeperErrorCode = Session expired for /configs/conf1/managed-schema
   [junit4]   2> 	at org.apache.zookeeper.KeeperException.create(KeeperException.java:127)
   [junit4]   2> 	at org.apache.zookeeper.KeeperException.create(KeeperException.java:51)
   [junit4]   2> 	at org.apache.zookeeper.ZooKeeper.getData(ZooKeeper.java:1155)
   [junit4]   2> 	at org.apache.solr.common.cloud.SolrZkClient$7.execute(SolrZkClient.java:348)
   [junit4]   2> 	at org.apache.solr.common.cloud.SolrZkClient$7.execute(SolrZkClient.java:345)
   [junit4]   2> 	at org.apache.solr.common.cloud.ZkCmdExecutor.retryOperation(ZkCmdExecutor.java:60)
   [junit4]   2> 	at org.apache.solr.common.cloud.SolrZkClient.getData(SolrZkClient.java:345)
   [junit4]   2> 	at org.apache.solr.schema.ManagedIndexSchemaFactory.create(ManagedIndexSchemaFactory.java:128)
   [junit4]   2> 	... 7 more
   [junit4]   2> 1451352 INFO  (jetty-launcher-1572-thread-1) [    ] o.e.j.s.h.ContextHandler Stopped o.e.j.s.ServletContextHandler@170da71{/solr,null,UNAVAILABLE}
   [junit4]   2> 1451351 WARN  (Thread-2662) [n:127.0.0.1:43623_solr    ] o.a.s.c.ZkController listener throws error
   [junit4]   2> org.apache.solr.common.SolrException: Unable to reload core [testschemaapi_shard1_replica1]
   [junit4]   2> 	at org.apache.solr.core.CoreContainer.reload(CoreContainer.java:920)
   [junit4]   2> 	at org.apache.solr.core.SolrCore.lambda$getConfListener$6(SolrCore.java:2510)
   [junit4]   2> 	at org.apache.solr.cloud.ZkController$4.run(ZkController.java:2408)
   [junit4]   2> Caused by: org.apache.solr.common.SolrException: Could not load conf for core testschemaapi_shard1_replica1: Error attempting to access /configs/conf1/managed-schema
   [junit4]   2> 	at org.apache.solr.core.ConfigSetService.getConfig(ConfigSetService.java:86)
   [junit4]   2> 	at org.apache.solr.core.CoreContainer.reload(CoreContainer.java:912)
   [junit4]   2> 	... 2 more
   [junit4]   2> Caused by: org.apache.solr.common.SolrException: Error attempting to access /configs/conf1/managed-schema
   [junit4]   2> 	at org.apache.solr.schema.ManagedIndexSchemaFactory.create(ManagedIndexSchemaFactory.java:143)
   [junit4]   2> 	at org.apache.solr.schema.ManagedIndexSchemaFactory.create(ManagedIndexSchemaFactory.java:47)
   [junit4]   2> 	at org.apache.solr.schema.IndexSchemaFactory.buildIndexSchema(IndexSchemaFactory.java:75)
   [junit4]   2> 	at org.apache.solr.core.ConfigSetService.createIndexSchema(ConfigSetService.java:108)
   [junit4]   2> 	at org.apache.solr.core.ConfigSetService.getConfig(ConfigSetService.java:79)
   [junit4]   2> 	... 3 more
   [junit4]   2> Caused by: org.apache.zookeeper.KeeperException$SessionExpiredException: KeeperErrorCode = Session expired for /configs/conf1/managed-schema
   [junit4]   2> 	at org.apache.zookeeper.KeeperException.create(KeeperException.java:127)
   [junit4]   2> 	at org.apache.zookeeper.KeeperException.create(KeeperException.java:51)
   [junit4]   2> 	at org.apache.zookeeper.ZooKeeper.getData(ZooKeeper.java:1155)
   [junit4]   2> 	at org.apache.solr.common.cloud.SolrZkClient$7.execute(SolrZkClient.java:348)
   [junit4]   2> 	at org.apache.solr.common.cloud.SolrZkClient$7.execute(SolrZkClient.java:345)
   [junit4]   2> 	at org.apache.solr.common.cloud.ZkCmdExecutor.retryOperation(ZkCmdExecutor.java:60)
   [junit4]   2> 	at org.apache.solr.common.cloud.SolrZkClient.getData(SolrZkClient.java:345)
   [junit4]   2> 	at org.apache.solr.schema.ManagedIndexSchemaFactory.create(ManagedIndexSchemaFactory.java:128)
   [junit4]   2> 	... 7 more
   [junit4]   2> 1451353 INFO  (SUITE-TestManagedSchemaAPI-seed#[3AC9536D3434E164]-worker) [    ] o.a.s.c.ZkTestServer connecting to 127.0.0.1:36608 36608
   [junit4]   2> 1451371 INFO  (Thread-2626) [    ] o.a.s.c.ZkTestServer connecting to 127.0.0.1:36608 36608
   [junit4]   2> 1451372 WARN  (Thread-2626) [    ] o.a.s.c.ZkTestServer Watch limit violations: 
   [junit4]   2> Maximum concurrent create/delete watches above limit:
   [junit4]   2> 
   [junit4]   2> 	6	/solr/configs/conf1/managed-schema
   [junit4]   2> 	6	/solr/configs/conf1
   [junit4]   2> 	3	/solr/aliases.json
   [junit4]   2> 	3	/solr/clusterprops.json
   [junit4]   2> 	2	/solr/security.json
   [junit4]   2> 
   [junit4]   2> Maximum concurrent data watches above limit:
   [junit4]   2> 
   [junit4]   2> 	3	/solr/clusterstate.json
   [junit4]   2> 	2	/solr/collections/testschemaapi/state.json
   [junit4]   2> 
   [junit4]   2> Maximum concurrent children watches above limit:
   [junit4]   2> 
   [junit4]   2> 	3	/solr/live_nodes
   [junit4]   2> 	3	/solr/collections
   [junit4]   2> 
   [junit4]   2> 1451372 INFO  (SUITE-TestManagedSchemaAPI-seed#[3AC9536D3434E164]-worker) [    ] o.a.s.SolrTestCaseJ4 ###deleteCore
   [junit4]   2> NOTE: leaving temporary files on disk at: /home/jenkins/workspace/Lucene-Solr-6.x-Linux/solr/build/solr-core/test/J2/temp/solr.schema.TestManagedSchemaAPI_3AC9536D3434E164-001
   [junit4]   2> May 25, 2016 11:46:12 PM com.carrotsearch.randomizedtesting.ThreadLeakControl checkThreadLeaks
   [junit4]   2> WARNING: Will linger awaiting termination of 1 leaked thread(s).
   [junit4]   2> NOTE: test params are: codec=CheapBastard, sim=RandomSimilarity(queryNorm=true,coord=crazy): {}, locale=en-PH, timezone=Asia/Amman
   [junit4]   2> NOTE: Linux 4.4.0-21-generic i386/Oracle Corporation 1.8.0_92 (32-bit)/cpus=12,threads=1,free=35919624,total=369418240
   [junit4]   2> NOTE: All tests run in this JVM: [RegexBoostProcessorTest, HardAutoCommitTest, ShardSplitTest, DirectUpdateHandlerOptimizeTest, BasicDistributedZk2Test, TestCloudSchemaless, HdfsLockFactoryTest, TestFuzzyAnalyzedSuggestions, JavabinLoaderTest, HdfsRecoverLeaseTest, BadCopyFieldTest, TestFreeTextSuggestions, NoCacheHeaderTest, SearchHandlerTest, TestReversedWildcardFilterFactory, TestSchemaResource, MigrateRouteKeyTest, CleanupOldIndexTest, TestUseDocValuesAsStored2, TestHashQParserPlugin, TestCopyFieldCollectionResource, TestSolrConfigHandler, SliceStateTest, CoreAdminCreateDiscoverTest, TestSolrDeletionPolicy1, TestExclusionRuleCollectionAccess, SuggesterTest, TestStressReorder, FieldMutatingUpdateProcessorTest, TestCryptoKeys, QueryResultKeyTest, TestJettySolrRunner, TestAnalyzeInfixSuggestions, PluginInfoTest, RemoteQueryErrorTest, TestSolr4Spatial2, TestChildDocTransformer, UnloadDistributedZkTest, DistributedDebugComponentTest, HighlighterConfigTest, TestMiniSolrCloudClusterSSL, BaseCdcrDistributedZkTest, TestXIncludeConfig, TestSort, TestCloudInspectUtil, SolrCoreCheckLockOnStartupTest, TestGroupingSearch, TestRequestStatusCollectionAPI, TestRestManager, QueryParsingTest, DistributedSuggestComponentTest, TestMissingGroups, TestPHPSerializedResponseWriter, RequestLoggingTest, TestImplicitCoreProperties, CollectionsAPISolrJTest, TestDynamicFieldResource, FieldAnalysisRequestHandlerTest, TestJmxMonitoredMap, TestCSVResponseWriter, BlockJoinFacetRandomTest, TestExceedMaxTermLength, CursorMarkTest, OverriddenZkACLAndCredentialsProvidersTest, TestFieldTypeCollectionResource, StatsComponentTest, BadComponentTest, TestConfigSetsAPI, TestConfigSetProperties, TestCharFilters, TestAuthenticationFramework, TestManagedSchemaAPI]
   [junit4] Completed [253/599 (1!)] on J2 in 15.10s, 1 test, 1 error <<< FAILURES!

[...truncated 1131 lines...]
BUILD FAILED
/home/jenkins/workspace/Lucene-Solr-6.x-Linux/build.xml:740: The following error occurred while executing this line:
/home/jenkins/workspace/Lucene-Solr-6.x-Linux/build.xml:684: The following error occurred while executing this line:
/home/jenkins/workspace/Lucene-Solr-6.x-Linux/build.xml:59: The following error occurred while executing this line:
/home/jenkins/workspace/Lucene-Solr-6.x-Linux/solr/build.xml:233: The following error occurred while executing this line:
/home/jenkins/workspace/Lucene-Solr-6.x-Linux/solr/common-build.xml:531: The following error occurred while executing this line:
/home/jenkins/workspace/Lucene-Solr-6.x-Linux/lucene/common-build.xml:1427: The following error occurred while executing this line:
/home/jenkins/workspace/Lucene-Solr-6.x-Linux/lucene/common-build.xml:984: There were test failures: 599 suites (10 ignored), 2440 tests, 1 error, 115 ignored (71 assumptions) [seed: 3AC9536D3434E164]

Total time: 78 minutes 3 seconds
Build step 'Invoke Ant' marked build as failure
Archiving artifacts
[WARNINGS] Skipping publisher since build result is FAILURE
Recording test results
Email was triggered for: Failure - Any
Sending email for trigger: Failure - Any



Mime
View raw message