lucene-dev mailing list archives

Site index · List index
Message view « Date » · « Thread »
Top « Date » · « Thread »
From Policeman Jenkins Server <jenk...@thetaphi.de>
Subject [JENKINS] Lucene-Solr-6.x-Windows (32bit/jdk1.8.0_92) - Build # 149 - Failure!
Date Sun, 01 May 2016 21:05:54 GMT
Build: http://jenkins.thetaphi.de/job/Lucene-Solr-6.x-Windows/149/
Java: 32bit/jdk1.8.0_92 -client -XX:+UseSerialGC

2 tests failed.
FAILED:  junit.framework.TestSuite.org.apache.solr.schema.TestManagedSchemaAPI

Error Message:
ObjectTracker found 8 object(s) that were not released!!! [MDCAwareThreadPoolExecutor, MockDirectoryWrapper, MockDirectoryWrapper, MDCAwareThreadPoolExecutor, TransactionLog, TransactionLog, MockDirectoryWrapper, MockDirectoryWrapper]

Stack Trace:
java.lang.AssertionError: ObjectTracker found 8 object(s) that were not released!!! [MDCAwareThreadPoolExecutor, MockDirectoryWrapper, MockDirectoryWrapper, MDCAwareThreadPoolExecutor, TransactionLog, TransactionLog, MockDirectoryWrapper, MockDirectoryWrapper]
	at __randomizedtesting.SeedInfo.seed([64AB0DEEB58B15D4]:0)
	at org.junit.Assert.fail(Assert.java:93)
	at org.junit.Assert.assertTrue(Assert.java:43)
	at org.junit.Assert.assertNull(Assert.java:551)
	at org.apache.solr.SolrTestCaseJ4.afterClass(SolrTestCaseJ4.java:256)
	at sun.reflect.GeneratedMethodAccessor21.invoke(Unknown Source)
	at sun.reflect.DelegatingMethodAccessorImpl.invoke(DelegatingMethodAccessorImpl.java:43)
	at java.lang.reflect.Method.invoke(Method.java:498)
	at com.carrotsearch.randomizedtesting.RandomizedRunner.invoke(RandomizedRunner.java:1764)
	at com.carrotsearch.randomizedtesting.RandomizedRunner$7.evaluate(RandomizedRunner.java:834)
	at com.carrotsearch.randomizedtesting.rules.StatementAdapter.evaluate(StatementAdapter.java:36)
	at com.carrotsearch.randomizedtesting.rules.SystemPropertiesRestoreRule$1.evaluate(SystemPropertiesRestoreRule.java:57)
	at org.apache.lucene.util.AbstractBeforeAfterRule$1.evaluate(AbstractBeforeAfterRule.java:45)
	at com.carrotsearch.randomizedtesting.rules.StatementAdapter.evaluate(StatementAdapter.java:36)
	at org.apache.lucene.util.TestRuleStoreClassName$1.evaluate(TestRuleStoreClassName.java:41)
	at com.carrotsearch.randomizedtesting.rules.NoShadowingOrOverridesOnMethodsRule$1.evaluate(NoShadowingOrOverridesOnMethodsRule.java:40)
	at com.carrotsearch.randomizedtesting.rules.NoShadowingOrOverridesOnMethodsRule$1.evaluate(NoShadowingOrOverridesOnMethodsRule.java:40)
	at com.carrotsearch.randomizedtesting.rules.StatementAdapter.evaluate(StatementAdapter.java:36)
	at com.carrotsearch.randomizedtesting.rules.StatementAdapter.evaluate(StatementAdapter.java:36)
	at com.carrotsearch.randomizedtesting.rules.StatementAdapter.evaluate(StatementAdapter.java:36)
	at org.apache.lucene.util.TestRuleAssertionsRequired$1.evaluate(TestRuleAssertionsRequired.java:53)
	at org.apache.lucene.util.TestRuleMarkFailure$1.evaluate(TestRuleMarkFailure.java:47)
	at org.apache.lucene.util.TestRuleIgnoreAfterMaxFailures$1.evaluate(TestRuleIgnoreAfterMaxFailures.java:64)
	at org.apache.lucene.util.TestRuleIgnoreTestSuites$1.evaluate(TestRuleIgnoreTestSuites.java:54)
	at com.carrotsearch.randomizedtesting.rules.StatementAdapter.evaluate(StatementAdapter.java:36)
	at com.carrotsearch.randomizedtesting.ThreadLeakControl$StatementRunner.run(ThreadLeakControl.java:367)
	at java.lang.Thread.run(Thread.java:745)


FAILED:  junit.framework.TestSuite.org.apache.solr.schema.TestManagedSchemaAPI

Error Message:
Could not remove the following files (in the order of attempts):    C:\Users\jenkins\workspace\Lucene-Solr-6.x-Windows\solr\build\solr-core\test\J0\temp\solr.schema.TestManagedSchemaAPI_64AB0DEEB58B15D4-001\tempDir-001\node2\testschemaapi_shard1_replica1\data\tlog\tlog.0000000000000000000: java.nio.file.FileSystemException: C:\Users\jenkins\workspace\Lucene-Solr-6.x-Windows\solr\build\solr-core\test\J0\temp\solr.schema.TestManagedSchemaAPI_64AB0DEEB58B15D4-001\tempDir-001\node2\testschemaapi_shard1_replica1\data\tlog\tlog.0000000000000000000: The process cannot access the file because it is being used by another process.     C:\Users\jenkins\workspace\Lucene-Solr-6.x-Windows\solr\build\solr-core\test\J0\temp\solr.schema.TestManagedSchemaAPI_64AB0DEEB58B15D4-001\tempDir-001\node2\testschemaapi_shard1_replica1\data\tlog: java.nio.file.DirectoryNotEmptyException: C:\Users\jenkins\workspace\Lucene-Solr-6.x-Windows\solr\build\solr-core\test\J0\temp\solr.schema.TestManagedSchemaAPI_64AB0DEEB58B15D4-001\tempDir-001\node2\testschemaapi_shard1_replica1\data\tlog    C:\Users\jenkins\workspace\Lucene-Solr-6.x-Windows\solr\build\solr-core\test\J0\temp\solr.schema.TestManagedSchemaAPI_64AB0DEEB58B15D4-001\tempDir-001\node2\testschemaapi_shard1_replica1\data: java.nio.file.DirectoryNotEmptyException: C:\Users\jenkins\workspace\Lucene-Solr-6.x-Windows\solr\build\solr-core\test\J0\temp\solr.schema.TestManagedSchemaAPI_64AB0DEEB58B15D4-001\tempDir-001\node2\testschemaapi_shard1_replica1\data    C:\Users\jenkins\workspace\Lucene-Solr-6.x-Windows\solr\build\solr-core\test\J0\temp\solr.schema.TestManagedSchemaAPI_64AB0DEEB58B15D4-001\tempDir-001\node2\testschemaapi_shard1_replica1: java.nio.file.DirectoryNotEmptyException: C:\Users\jenkins\workspace\Lucene-Solr-6.x-Windows\solr\build\solr-core\test\J0\temp\solr.schema.TestManagedSchemaAPI_64AB0DEEB58B15D4-001\tempDir-001\node2\testschemaapi_shard1_replica1    C:\Users\jenkins\workspace\Lucene-Solr-6.x-Windows\solr\build\solr-core\test\J0\temp\solr.schema.TestManagedSchemaAPI_64AB0DEEB58B15D4-001\tempDir-001\node2: java.nio.file.DirectoryNotEmptyException: C:\Users\jenkins\workspace\Lucene-Solr-6.x-Windows\solr\build\solr-core\test\J0\temp\solr.schema.TestManagedSchemaAPI_64AB0DEEB58B15D4-001\tempDir-001\node2    C:\Users\jenkins\workspace\Lucene-Solr-6.x-Windows\solr\build\solr-core\test\J0\temp\solr.schema.TestManagedSchemaAPI_64AB0DEEB58B15D4-001\tempDir-001\node1\testschemaapi_shard1_replica2\data\tlog\tlog.0000000000000000001: java.nio.file.FileSystemException: C:\Users\jenkins\workspace\Lucene-Solr-6.x-Windows\solr\build\solr-core\test\J0\temp\solr.schema.TestManagedSchemaAPI_64AB0DEEB58B15D4-001\tempDir-001\node1\testschemaapi_shard1_replica2\data\tlog\tlog.0000000000000000001: The process cannot access the file because it is being used by another process.     C:\Users\jenkins\workspace\Lucene-Solr-6.x-Windows\solr\build\solr-core\test\J0\temp\solr.schema.TestManagedSchemaAPI_64AB0DEEB58B15D4-001\tempDir-001\node1\testschemaapi_shard1_replica2\data\tlog: java.nio.file.DirectoryNotEmptyException: C:\Users\jenkins\workspace\Lucene-Solr-6.x-Windows\solr\build\solr-core\test\J0\temp\solr.schema.TestManagedSchemaAPI_64AB0DEEB58B15D4-001\tempDir-001\node1\testschemaapi_shard1_replica2\data\tlog    C:\Users\jenkins\workspace\Lucene-Solr-6.x-Windows\solr\build\solr-core\test\J0\temp\solr.schema.TestManagedSchemaAPI_64AB0DEEB58B15D4-001\tempDir-001\node1\testschemaapi_shard1_replica2\data: java.nio.file.DirectoryNotEmptyException: C:\Users\jenkins\workspace\Lucene-Solr-6.x-Windows\solr\build\solr-core\test\J0\temp\solr.schema.TestManagedSchemaAPI_64AB0DEEB58B15D4-001\tempDir-001\node1\testschemaapi_shard1_replica2\data    C:\Users\jenkins\workspace\Lucene-Solr-6.x-Windows\solr\build\solr-core\test\J0\temp\solr.schema.TestManagedSchemaAPI_64AB0DEEB58B15D4-001\tempDir-001\node1\testschemaapi_shard1_replica2: java.nio.file.DirectoryNotEmptyException: C:\Users\jenkins\workspace\Lucene-Solr-6.x-Windows\solr\build\solr-core\test\J0\temp\solr.schema.TestManagedSchemaAPI_64AB0DEEB58B15D4-001\tempDir-001\node1\testschemaapi_shard1_replica2    C:\Users\jenkins\workspace\Lucene-Solr-6.x-Windows\solr\build\solr-core\test\J0\temp\solr.schema.TestManagedSchemaAPI_64AB0DEEB58B15D4-001\tempDir-001\node1: java.nio.file.DirectoryNotEmptyException: C:\Users\jenkins\workspace\Lucene-Solr-6.x-Windows\solr\build\solr-core\test\J0\temp\solr.schema.TestManagedSchemaAPI_64AB0DEEB58B15D4-001\tempDir-001\node1    C:\Users\jenkins\workspace\Lucene-Solr-6.x-Windows\solr\build\solr-core\test\J0\temp\solr.schema.TestManagedSchemaAPI_64AB0DEEB58B15D4-001\tempDir-001: java.nio.file.DirectoryNotEmptyException: C:\Users\jenkins\workspace\Lucene-Solr-6.x-Windows\solr\build\solr-core\test\J0\temp\solr.schema.TestManagedSchemaAPI_64AB0DEEB58B15D4-001\tempDir-001    C:\Users\jenkins\workspace\Lucene-Solr-6.x-Windows\solr\build\solr-core\test\J0\temp\solr.schema.TestManagedSchemaAPI_64AB0DEEB58B15D4-001: java.nio.file.DirectoryNotEmptyException: C:\Users\jenkins\workspace\Lucene-Solr-6.x-Windows\solr\build\solr-core\test\J0\temp\solr.schema.TestManagedSchemaAPI_64AB0DEEB58B15D4-001 

Stack Trace:
java.io.IOException: Could not remove the following files (in the order of attempts):
   C:\Users\jenkins\workspace\Lucene-Solr-6.x-Windows\solr\build\solr-core\test\J0\temp\solr.schema.TestManagedSchemaAPI_64AB0DEEB58B15D4-001\tempDir-001\node2\testschemaapi_shard1_replica1\data\tlog\tlog.0000000000000000000: java.nio.file.FileSystemException: C:\Users\jenkins\workspace\Lucene-Solr-6.x-Windows\solr\build\solr-core\test\J0\temp\solr.schema.TestManagedSchemaAPI_64AB0DEEB58B15D4-001\tempDir-001\node2\testschemaapi_shard1_replica1\data\tlog\tlog.0000000000000000000: The process cannot access the file because it is being used by another process.

   C:\Users\jenkins\workspace\Lucene-Solr-6.x-Windows\solr\build\solr-core\test\J0\temp\solr.schema.TestManagedSchemaAPI_64AB0DEEB58B15D4-001\tempDir-001\node2\testschemaapi_shard1_replica1\data\tlog: java.nio.file.DirectoryNotEmptyException: C:\Users\jenkins\workspace\Lucene-Solr-6.x-Windows\solr\build\solr-core\test\J0\temp\solr.schema.TestManagedSchemaAPI_64AB0DEEB58B15D4-001\tempDir-001\node2\testschemaapi_shard1_replica1\data\tlog
   C:\Users\jenkins\workspace\Lucene-Solr-6.x-Windows\solr\build\solr-core\test\J0\temp\solr.schema.TestManagedSchemaAPI_64AB0DEEB58B15D4-001\tempDir-001\node2\testschemaapi_shard1_replica1\data: java.nio.file.DirectoryNotEmptyException: C:\Users\jenkins\workspace\Lucene-Solr-6.x-Windows\solr\build\solr-core\test\J0\temp\solr.schema.TestManagedSchemaAPI_64AB0DEEB58B15D4-001\tempDir-001\node2\testschemaapi_shard1_replica1\data
   C:\Users\jenkins\workspace\Lucene-Solr-6.x-Windows\solr\build\solr-core\test\J0\temp\solr.schema.TestManagedSchemaAPI_64AB0DEEB58B15D4-001\tempDir-001\node2\testschemaapi_shard1_replica1: java.nio.file.DirectoryNotEmptyException: C:\Users\jenkins\workspace\Lucene-Solr-6.x-Windows\solr\build\solr-core\test\J0\temp\solr.schema.TestManagedSchemaAPI_64AB0DEEB58B15D4-001\tempDir-001\node2\testschemaapi_shard1_replica1
   C:\Users\jenkins\workspace\Lucene-Solr-6.x-Windows\solr\build\solr-core\test\J0\temp\solr.schema.TestManagedSchemaAPI_64AB0DEEB58B15D4-001\tempDir-001\node2: java.nio.file.DirectoryNotEmptyException: C:\Users\jenkins\workspace\Lucene-Solr-6.x-Windows\solr\build\solr-core\test\J0\temp\solr.schema.TestManagedSchemaAPI_64AB0DEEB58B15D4-001\tempDir-001\node2
   C:\Users\jenkins\workspace\Lucene-Solr-6.x-Windows\solr\build\solr-core\test\J0\temp\solr.schema.TestManagedSchemaAPI_64AB0DEEB58B15D4-001\tempDir-001\node1\testschemaapi_shard1_replica2\data\tlog\tlog.0000000000000000001: java.nio.file.FileSystemException: C:\Users\jenkins\workspace\Lucene-Solr-6.x-Windows\solr\build\solr-core\test\J0\temp\solr.schema.TestManagedSchemaAPI_64AB0DEEB58B15D4-001\tempDir-001\node1\testschemaapi_shard1_replica2\data\tlog\tlog.0000000000000000001: The process cannot access the file because it is being used by another process.

   C:\Users\jenkins\workspace\Lucene-Solr-6.x-Windows\solr\build\solr-core\test\J0\temp\solr.schema.TestManagedSchemaAPI_64AB0DEEB58B15D4-001\tempDir-001\node1\testschemaapi_shard1_replica2\data\tlog: java.nio.file.DirectoryNotEmptyException: C:\Users\jenkins\workspace\Lucene-Solr-6.x-Windows\solr\build\solr-core\test\J0\temp\solr.schema.TestManagedSchemaAPI_64AB0DEEB58B15D4-001\tempDir-001\node1\testschemaapi_shard1_replica2\data\tlog
   C:\Users\jenkins\workspace\Lucene-Solr-6.x-Windows\solr\build\solr-core\test\J0\temp\solr.schema.TestManagedSchemaAPI_64AB0DEEB58B15D4-001\tempDir-001\node1\testschemaapi_shard1_replica2\data: java.nio.file.DirectoryNotEmptyException: C:\Users\jenkins\workspace\Lucene-Solr-6.x-Windows\solr\build\solr-core\test\J0\temp\solr.schema.TestManagedSchemaAPI_64AB0DEEB58B15D4-001\tempDir-001\node1\testschemaapi_shard1_replica2\data
   C:\Users\jenkins\workspace\Lucene-Solr-6.x-Windows\solr\build\solr-core\test\J0\temp\solr.schema.TestManagedSchemaAPI_64AB0DEEB58B15D4-001\tempDir-001\node1\testschemaapi_shard1_replica2: java.nio.file.DirectoryNotEmptyException: C:\Users\jenkins\workspace\Lucene-Solr-6.x-Windows\solr\build\solr-core\test\J0\temp\solr.schema.TestManagedSchemaAPI_64AB0DEEB58B15D4-001\tempDir-001\node1\testschemaapi_shard1_replica2
   C:\Users\jenkins\workspace\Lucene-Solr-6.x-Windows\solr\build\solr-core\test\J0\temp\solr.schema.TestManagedSchemaAPI_64AB0DEEB58B15D4-001\tempDir-001\node1: java.nio.file.DirectoryNotEmptyException: C:\Users\jenkins\workspace\Lucene-Solr-6.x-Windows\solr\build\solr-core\test\J0\temp\solr.schema.TestManagedSchemaAPI_64AB0DEEB58B15D4-001\tempDir-001\node1
   C:\Users\jenkins\workspace\Lucene-Solr-6.x-Windows\solr\build\solr-core\test\J0\temp\solr.schema.TestManagedSchemaAPI_64AB0DEEB58B15D4-001\tempDir-001: java.nio.file.DirectoryNotEmptyException: C:\Users\jenkins\workspace\Lucene-Solr-6.x-Windows\solr\build\solr-core\test\J0\temp\solr.schema.TestManagedSchemaAPI_64AB0DEEB58B15D4-001\tempDir-001
   C:\Users\jenkins\workspace\Lucene-Solr-6.x-Windows\solr\build\solr-core\test\J0\temp\solr.schema.TestManagedSchemaAPI_64AB0DEEB58B15D4-001: java.nio.file.DirectoryNotEmptyException: C:\Users\jenkins\workspace\Lucene-Solr-6.x-Windows\solr\build\solr-core\test\J0\temp\solr.schema.TestManagedSchemaAPI_64AB0DEEB58B15D4-001

	at org.apache.lucene.util.IOUtils.rm(IOUtils.java:323)
	at org.apache.lucene.util.TestRuleTemporaryFilesCleanup.afterAlways(TestRuleTemporaryFilesCleanup.java:216)
	at com.carrotsearch.randomizedtesting.rules.TestRuleAdapter$1.afterAlways(TestRuleAdapter.java:31)
	at com.carrotsearch.randomizedtesting.rules.StatementAdapter.evaluate(StatementAdapter.java:43)
	at com.carrotsearch.randomizedtesting.rules.StatementAdapter.evaluate(StatementAdapter.java:36)
	at org.apache.lucene.util.TestRuleAssertionsRequired$1.evaluate(TestRuleAssertionsRequired.java:53)
	at org.apache.lucene.util.TestRuleMarkFailure$1.evaluate(TestRuleMarkFailure.java:47)
	at org.apache.lucene.util.TestRuleIgnoreAfterMaxFailures$1.evaluate(TestRuleIgnoreAfterMaxFailures.java:64)
	at org.apache.lucene.util.TestRuleIgnoreTestSuites$1.evaluate(TestRuleIgnoreTestSuites.java:54)
	at com.carrotsearch.randomizedtesting.rules.StatementAdapter.evaluate(StatementAdapter.java:36)
	at com.carrotsearch.randomizedtesting.ThreadLeakControl$StatementRunner.run(ThreadLeakControl.java:367)
	at java.lang.Thread.run(Thread.java:745)




Build Log:
[...truncated 11063 lines...]
   [junit4] Suite: org.apache.solr.schema.TestManagedSchemaAPI
   [junit4]   2> Creating dataDir: C:\Users\jenkins\workspace\Lucene-Solr-6.x-Windows\solr\build\solr-core\test\J0\temp\solr.schema.TestManagedSchemaAPI_64AB0DEEB58B15D4-001\init-core-data-001
   [junit4]   2> 724793 INFO  (SUITE-TestManagedSchemaAPI-seed#[64AB0DEEB58B15D4]-worker) [    ] o.a.s.SolrTestCaseJ4 Randomized ssl (false) and clientAuth (false)
   [junit4]   2> 724795 INFO  (SUITE-TestManagedSchemaAPI-seed#[64AB0DEEB58B15D4]-worker) [    ] o.a.s.c.ZkTestServer STARTING ZK TEST SERVER
   [junit4]   2> 724795 INFO  (Thread-2113) [    ] o.a.s.c.ZkTestServer client port:0.0.0.0/0.0.0.0:0
   [junit4]   2> 724797 INFO  (Thread-2113) [    ] o.a.s.c.ZkTestServer Starting server
   [junit4]   2> 724896 INFO  (SUITE-TestManagedSchemaAPI-seed#[64AB0DEEB58B15D4]-worker) [    ] o.a.s.c.ZkTestServer start zk server on port:60743
   [junit4]   2> 724896 INFO  (SUITE-TestManagedSchemaAPI-seed#[64AB0DEEB58B15D4]-worker) [    ] o.a.s.c.c.SolrZkClient Using default ZkCredentialsProvider
   [junit4]   2> 724899 INFO  (SUITE-TestManagedSchemaAPI-seed#[64AB0DEEB58B15D4]-worker) [    ] o.a.s.c.c.ConnectionManager Waiting for client to connect to ZooKeeper
   [junit4]   2> 724904 INFO  (zkCallback-793-thread-1) [    ] o.a.s.c.c.ConnectionManager Watcher org.apache.solr.common.cloud.ConnectionManager@c705ef name:ZooKeeperConnection Watcher:127.0.0.1:60743 got event WatchedEvent state:SyncConnected type:None path:null path:null type:None
   [junit4]   2> 724904 INFO  (SUITE-TestManagedSchemaAPI-seed#[64AB0DEEB58B15D4]-worker) [    ] o.a.s.c.c.ConnectionManager Client is connected to ZooKeeper
   [junit4]   2> 724906 INFO  (SUITE-TestManagedSchemaAPI-seed#[64AB0DEEB58B15D4]-worker) [    ] o.a.s.c.c.SolrZkClient Using default ZkACLProvider
   [junit4]   2> 724906 INFO  (SUITE-TestManagedSchemaAPI-seed#[64AB0DEEB58B15D4]-worker) [    ] o.a.s.c.c.SolrZkClient makePath: /solr/solr.xml
   [junit4]   2> 724921 INFO  (jetty-launcher-792-thread-1) [    ] o.e.j.s.Server jetty-9.3.8.v20160314
   [junit4]   2> 724923 INFO  (jetty-launcher-792-thread-2) [    ] o.e.j.s.Server jetty-9.3.8.v20160314
   [junit4]   2> 724925 INFO  (jetty-launcher-792-thread-1) [    ] o.e.j.s.h.ContextHandler Started o.e.j.s.ServletContextHandler@1112a9b{/solr,null,AVAILABLE}
   [junit4]   2> 724929 INFO  (jetty-launcher-792-thread-1) [    ] o.e.j.s.ServerConnector Started ServerConnector@ea1d94{HTTP/1.1,[http/1.1]}{127.0.0.1:60747}
   [junit4]   2> 724929 INFO  (jetty-launcher-792-thread-1) [    ] o.e.j.s.Server Started @729185ms
   [junit4]   2> 724929 INFO  (jetty-launcher-792-thread-1) [    ] o.a.s.c.s.e.JettySolrRunner Jetty properties: {hostContext=/solr, hostPort=60747}
   [junit4]   2> 724930 INFO  (jetty-launcher-792-thread-1) [    ] o.a.s.s.SolrDispatchFilter SolrDispatchFilter.init(): sun.misc.Launcher$AppClassLoader@1d16e93
   [junit4]   2> 724930 INFO  (jetty-launcher-792-thread-2) [    ] o.e.j.s.h.ContextHandler Started o.e.j.s.ServletContextHandler@e5291e{/solr,null,AVAILABLE}
   [junit4]   2> 724930 INFO  (jetty-launcher-792-thread-1) [    ] o.a.s.c.SolrResourceLoader new SolrResourceLoader for directory: 'C:\Users\jenkins\workspace\Lucene-Solr-6.x-Windows\solr\build\solr-core\test\J0\temp\solr.schema.TestManagedSchemaAPI_64AB0DEEB58B15D4-001\tempDir-001\node1'
   [junit4]   2> 724934 INFO  (jetty-launcher-792-thread-1) [    ] o.a.s.c.SolrResourceLoader JNDI not configured for solr (NoInitialContextEx)
   [junit4]   2> 724934 INFO  (jetty-launcher-792-thread-1) [    ] o.a.s.c.SolrResourceLoader solr home defaulted to 'solr/' (could not find system property or JNDI)
   [junit4]   2> 724935 INFO  (jetty-launcher-792-thread-2) [    ] o.e.j.s.ServerConnector Started ServerConnector@bffe31{HTTP/1.1,[http/1.1]}{127.0.0.1:60750}
   [junit4]   2> 724935 INFO  (jetty-launcher-792-thread-2) [    ] o.e.j.s.Server Started @729191ms
   [junit4]   2> 724935 INFO  (jetty-launcher-792-thread-2) [    ] o.a.s.c.s.e.JettySolrRunner Jetty properties: {hostContext=/solr, hostPort=60750}
   [junit4]   2> 724935 INFO  (jetty-launcher-792-thread-2) [    ] o.a.s.s.SolrDispatchFilter SolrDispatchFilter.init(): sun.misc.Launcher$AppClassLoader@1d16e93
   [junit4]   2> 724935 INFO  (jetty-launcher-792-thread-2) [    ] o.a.s.c.SolrResourceLoader new SolrResourceLoader for directory: 'C:\Users\jenkins\workspace\Lucene-Solr-6.x-Windows\solr\build\solr-core\test\J0\temp\solr.schema.TestManagedSchemaAPI_64AB0DEEB58B15D4-001\tempDir-001\node2'
   [junit4]   2> 724936 INFO  (jetty-launcher-792-thread-2) [    ] o.a.s.c.SolrResourceLoader JNDI not configured for solr (NoInitialContextEx)
   [junit4]   2> 724936 INFO  (jetty-launcher-792-thread-2) [    ] o.a.s.c.SolrResourceLoader solr home defaulted to 'solr/' (could not find system property or JNDI)
   [junit4]   2> 724937 INFO  (jetty-launcher-792-thread-2) [    ] o.a.s.c.c.SolrZkClient Using default ZkCredentialsProvider
   [junit4]   2> 724938 INFO  (jetty-launcher-792-thread-2) [    ] o.a.s.c.c.ConnectionManager Waiting for client to connect to ZooKeeper
   [junit4]   2> 724939 INFO  (jetty-launcher-792-thread-1) [    ] o.a.s.c.c.SolrZkClient Using default ZkCredentialsProvider
   [junit4]   2> 724942 INFO  (jetty-launcher-792-thread-1) [    ] o.a.s.c.c.ConnectionManager Waiting for client to connect to ZooKeeper
   [junit4]   2> 724944 INFO  (zkCallback-794-thread-1) [    ] o.a.s.c.c.ConnectionManager Watcher org.apache.solr.common.cloud.ConnectionManager@16d6620 name:ZooKeeperConnection Watcher:127.0.0.1:60743/solr got event WatchedEvent state:SyncConnected type:None path:null path:null type:None
   [junit4]   2> 724944 INFO  (jetty-launcher-792-thread-2) [    ] o.a.s.c.c.ConnectionManager Client is connected to ZooKeeper
   [junit4]   2> 724944 INFO  (jetty-launcher-792-thread-2) [    ] o.a.s.c.c.SolrZkClient Using default ZkACLProvider
   [junit4]   2> 724944 INFO  (jetty-launcher-792-thread-2) [    ] o.a.s.s.SolrDispatchFilter solr.xml found in ZooKeeper. Loading...
   [junit4]   2> 724945 INFO  (zkCallback-795-thread-1) [    ] o.a.s.c.c.ConnectionManager Watcher org.apache.solr.common.cloud.ConnectionManager@1aac85 name:ZooKeeperConnection Watcher:127.0.0.1:60743/solr got event WatchedEvent state:SyncConnected type:None path:null path:null type:None
   [junit4]   2> 724945 INFO  (jetty-launcher-792-thread-1) [    ] o.a.s.c.c.ConnectionManager Client is connected to ZooKeeper
   [junit4]   2> 724945 INFO  (jetty-launcher-792-thread-1) [    ] o.a.s.c.c.SolrZkClient Using default ZkACLProvider
   [junit4]   2> 724947 INFO  (jetty-launcher-792-thread-1) [    ] o.a.s.s.SolrDispatchFilter solr.xml found in ZooKeeper. Loading...
   [junit4]   2> 724959 WARN  (NIOServerCxn.Factory:0.0.0.0/0.0.0.0:0) [    ] o.a.z.s.NIOServerCnxn caught end of stream exception
   [junit4]   2> EndOfStreamException: Unable to read additional data from client sessionid 0x1546dfcaf1d0001, likely client has closed socket
   [junit4]   2> 	at org.apache.zookeeper.server.NIOServerCnxn.doIO(NIOServerCnxn.java:228)
   [junit4]   2> 	at org.apache.zookeeper.server.NIOServerCnxnFactory.run(NIOServerCnxnFactory.java:208)
   [junit4]   2> 	at java.lang.Thread.run(Thread.java:745)
   [junit4]   2> 724961 INFO  (jetty-launcher-792-thread-2) [    ] o.a.s.c.CorePropertiesLocator Config-defined core root directory: C:\Users\jenkins\workspace\Lucene-Solr-6.x-Windows\solr\build\solr-core\test\J0\temp\solr.schema.TestManagedSchemaAPI_64AB0DEEB58B15D4-001\tempDir-001\node2\.
   [junit4]   2> 724961 INFO  (jetty-launcher-792-thread-2) [    ] o.a.s.c.CoreContainer New CoreContainer 14326309
   [junit4]   2> 724962 INFO  (jetty-launcher-792-thread-2) [    ] o.a.s.c.CoreContainer Loading cores into CoreContainer [instanceDir=C:\Users\jenkins\workspace\Lucene-Solr-6.x-Windows\solr\build\solr-core\test\J0\temp\solr.schema.TestManagedSchemaAPI_64AB0DEEB58B15D4-001\tempDir-001\node2]
   [junit4]   2> 724962 WARN  (jetty-launcher-792-thread-2) [    ] o.a.s.c.CoreContainer Couldn't add files from C:\Users\jenkins\workspace\Lucene-Solr-6.x-Windows\solr\build\solr-core\test\J0\temp\solr.schema.TestManagedSchemaAPI_64AB0DEEB58B15D4-001\tempDir-001\node2\lib to classpath: C:\Users\jenkins\workspace\Lucene-Solr-6.x-Windows\solr\build\solr-core\test\J0\temp\solr.schema.TestManagedSchemaAPI_64AB0DEEB58B15D4-001\tempDir-001\node2\lib
   [junit4]   2> 724962 INFO  (jetty-launcher-792-thread-2) [    ] o.a.s.h.c.HttpShardHandlerFactory created with socketTimeout : 90000,urlScheme : ,connTimeout : 15000,maxConnectionsPerHost : 20,maxConnections : 10000,corePoolSize : 0,maximumPoolSize : 2147483647,maxThreadIdleTime : 5,sizeOfQueue : -1,fairnessPolicy : false,useRetries : false,
   [junit4]   2> 724963 INFO  (jetty-launcher-792-thread-1) [    ] o.a.s.c.CorePropertiesLocator Config-defined core root directory: C:\Users\jenkins\workspace\Lucene-Solr-6.x-Windows\solr\build\solr-core\test\J0\temp\solr.schema.TestManagedSchemaAPI_64AB0DEEB58B15D4-001\tempDir-001\node1\.
   [junit4]   2> 724963 INFO  (jetty-launcher-792-thread-1) [    ] o.a.s.c.CoreContainer New CoreContainer 17182690
   [junit4]   2> 724963 INFO  (jetty-launcher-792-thread-1) [    ] o.a.s.c.CoreContainer Loading cores into CoreContainer [instanceDir=C:\Users\jenkins\workspace\Lucene-Solr-6.x-Windows\solr\build\solr-core\test\J0\temp\solr.schema.TestManagedSchemaAPI_64AB0DEEB58B15D4-001\tempDir-001\node1]
   [junit4]   2> 724964 INFO  (jetty-launcher-792-thread-2) [    ] o.a.s.u.UpdateShardHandler Creating UpdateShardHandler HTTP client with params: socketTimeout=340000&connTimeout=45000&retry=true
   [junit4]   2> 724964 WARN  (jetty-launcher-792-thread-1) [    ] o.a.s.c.CoreContainer Couldn't add files from C:\Users\jenkins\workspace\Lucene-Solr-6.x-Windows\solr\build\solr-core\test\J0\temp\solr.schema.TestManagedSchemaAPI_64AB0DEEB58B15D4-001\tempDir-001\node1\lib to classpath: C:\Users\jenkins\workspace\Lucene-Solr-6.x-Windows\solr\build\solr-core\test\J0\temp\solr.schema.TestManagedSchemaAPI_64AB0DEEB58B15D4-001\tempDir-001\node1\lib
   [junit4]   2> 724964 INFO  (jetty-launcher-792-thread-1) [    ] o.a.s.h.c.HttpShardHandlerFactory created with socketTimeout : 90000,urlScheme : ,connTimeout : 15000,maxConnectionsPerHost : 20,maxConnections : 10000,corePoolSize : 0,maximumPoolSize : 2147483647,maxThreadIdleTime : 5,sizeOfQueue : -1,fairnessPolicy : false,useRetries : false,
   [junit4]   2> 724965 INFO  (jetty-launcher-792-thread-2) [    ] o.a.s.l.LogWatcher SLF4J impl is org.slf4j.impl.Log4jLoggerFactory
   [junit4]   2> 724965 INFO  (jetty-launcher-792-thread-2) [    ] o.a.s.l.LogWatcher Registering Log Listener [Log4j (org.slf4j.impl.Log4jLoggerFactory)]
   [junit4]   2> 724965 INFO  (jetty-launcher-792-thread-2) [    ] o.a.s.c.ZkContainer Zookeeper client=127.0.0.1:60743/solr
   [junit4]   2> 724965 INFO  (jetty-launcher-792-thread-2) [    ] o.a.s.c.ZkController zkHost includes chroot
   [junit4]   2> 724965 INFO  (jetty-launcher-792-thread-2) [    ] o.a.s.c.c.SolrZkClient Using default ZkCredentialsProvider
   [junit4]   2> 724965 INFO  (jetty-launcher-792-thread-1) [    ] o.a.s.u.UpdateShardHandler Creating UpdateShardHandler HTTP client with params: socketTimeout=340000&connTimeout=45000&retry=true
   [junit4]   2> 724966 INFO  (jetty-launcher-792-thread-2) [    ] o.a.s.c.c.ConnectionManager Waiting for client to connect to ZooKeeper
   [junit4]   2> 724966 INFO  (jetty-launcher-792-thread-1) [    ] o.a.s.l.LogWatcher SLF4J impl is org.slf4j.impl.Log4jLoggerFactory
   [junit4]   2> 724966 INFO  (jetty-launcher-792-thread-1) [    ] o.a.s.l.LogWatcher Registering Log Listener [Log4j (org.slf4j.impl.Log4jLoggerFactory)]
   [junit4]   2> 724966 INFO  (jetty-launcher-792-thread-1) [    ] o.a.s.c.ZkContainer Zookeeper client=127.0.0.1:60743/solr
   [junit4]   2> 724967 INFO  (jetty-launcher-792-thread-1) [    ] o.a.s.c.ZkController zkHost includes chroot
   [junit4]   2> 724967 INFO  (jetty-launcher-792-thread-1) [    ] o.a.s.c.c.SolrZkClient Using default ZkCredentialsProvider
   [junit4]   2> 724968 INFO  (jetty-launcher-792-thread-1) [    ] o.a.s.c.c.ConnectionManager Waiting for client to connect to ZooKeeper
   [junit4]   2> 724972 INFO  (zkCallback-798-thread-1) [    ] o.a.s.c.c.ConnectionManager Watcher org.apache.solr.common.cloud.ConnectionManager@19817be name:ZooKeeperConnection Watcher:127.0.0.1:60743 got event WatchedEvent state:SyncConnected type:None path:null path:null type:None
   [junit4]   2> 724972 INFO  (jetty-launcher-792-thread-2) [    ] o.a.s.c.c.ConnectionManager Client is connected to ZooKeeper
   [junit4]   2> 724972 INFO  (zkCallback-801-thread-1) [    ] o.a.s.c.c.ConnectionManager Watcher org.apache.solr.common.cloud.ConnectionManager@1211c63 name:ZooKeeperConnection Watcher:127.0.0.1:60743 got event WatchedEvent state:SyncConnected type:None path:null path:null type:None
   [junit4]   2> 724972 INFO  (jetty-launcher-792-thread-1) [    ] o.a.s.c.c.ConnectionManager Client is connected to ZooKeeper
   [junit4]   2> 724972 INFO  (jetty-launcher-792-thread-2) [    ] o.a.s.c.c.SolrZkClient Using default ZkACLProvider
   [junit4]   2> 724972 INFO  (jetty-launcher-792-thread-1) [    ] o.a.s.c.c.SolrZkClient Using default ZkACLProvider
   [junit4]   2> 724977 INFO  (jetty-launcher-792-thread-1) [n:127.0.0.1:60747_solr    ] o.a.s.c.ZkController Added new OnReconnect listener org.apache.solr.cloud.ZkController$$Lambda$58/14417430@1d8a1ca
   [junit4]   2> 724977 INFO  (jetty-launcher-792-thread-2) [n:127.0.0.1:60750_solr    ] o.a.s.c.ZkController Added new OnReconnect listener org.apache.solr.cloud.ZkController$$Lambda$58/14417430@6c4f2c
   [junit4]   2> 724979 INFO  (jetty-launcher-792-thread-2) [n:127.0.0.1:60750_solr    ] o.a.s.c.c.ConnectionManager Waiting for client to connect to ZooKeeper
   [junit4]   2> 724979 INFO  (jetty-launcher-792-thread-1) [n:127.0.0.1:60747_solr    ] o.a.s.c.c.ConnectionManager Waiting for client to connect to ZooKeeper
   [junit4]   2> 724983 INFO  (zkCallback-803-thread-1-processing-n:127.0.0.1:60750_solr) [n:127.0.0.1:60750_solr    ] o.a.s.c.c.ConnectionManager Watcher org.apache.solr.common.cloud.ConnectionManager@197ed38 name:ZooKeeperConnection Watcher:127.0.0.1:60743/solr got event WatchedEvent state:SyncConnected type:None path:null path:null type:None
   [junit4]   2> 724983 INFO  (zkCallback-802-thread-1-processing-n:127.0.0.1:60747_solr) [n:127.0.0.1:60747_solr    ] o.a.s.c.c.ConnectionManager Watcher org.apache.solr.common.cloud.ConnectionManager@10bafdf name:ZooKeeperConnection Watcher:127.0.0.1:60743/solr got event WatchedEvent state:SyncConnected type:None path:null path:null type:None
   [junit4]   2> 724983 INFO  (jetty-launcher-792-thread-2) [n:127.0.0.1:60750_solr    ] o.a.s.c.c.ConnectionManager Client is connected to ZooKeeper
   [junit4]   2> 724983 INFO  (jetty-launcher-792-thread-1) [n:127.0.0.1:60747_solr    ] o.a.s.c.c.ConnectionManager Client is connected to ZooKeeper
   [junit4]   2> 724986 INFO  (jetty-launcher-792-thread-2) [n:127.0.0.1:60750_solr    ] o.a.s.c.c.SolrZkClient makePath: /overseer/queue
   [junit4]   2> 724986 INFO  (jetty-launcher-792-thread-1) [n:127.0.0.1:60747_solr    ] o.a.s.c.c.SolrZkClient makePath: /overseer/queue
   [junit4]   2> 724991 INFO  (jetty-launcher-792-thread-2) [n:127.0.0.1:60750_solr    ] o.a.s.c.c.SolrZkClient makePath: /overseer/collection-queue-work
   [junit4]   2> 724992 INFO  (jetty-launcher-792-thread-1) [n:127.0.0.1:60747_solr    ] o.a.s.c.c.SolrZkClient makePath: /overseer/collection-queue-work
   [junit4]   2> 724997 INFO  (jetty-launcher-792-thread-2) [n:127.0.0.1:60750_solr    ] o.a.s.c.c.SolrZkClient makePath: /overseer/collection-map-running
   [junit4]   2> 724998 INFO  (jetty-launcher-792-thread-1) [n:127.0.0.1:60747_solr    ] o.a.s.c.c.SolrZkClient makePath: /overseer/collection-map-running
   [junit4]   2> 725003 INFO  (jetty-launcher-792-thread-2) [n:127.0.0.1:60750_solr    ] o.a.s.c.c.SolrZkClient makePath: /overseer/collection-map-completed
   [junit4]   2> 725005 INFO  (jetty-launcher-792-thread-1) [n:127.0.0.1:60747_solr    ] o.a.s.c.c.SolrZkClient makePath: /overseer/collection-map-completed
   [junit4]   2> 725008 INFO  (jetty-launcher-792-thread-2) [n:127.0.0.1:60750_solr    ] o.a.s.c.c.SolrZkClient makePath: /overseer/collection-map-failure
   [junit4]   2> 725009 INFO  (jetty-launcher-792-thread-1) [n:127.0.0.1:60747_solr    ] o.a.s.c.c.SolrZkClient makePath: /overseer/collection-map-failure
   [junit4]   2> 725011 INFO  (jetty-launcher-792-thread-2) [n:127.0.0.1:60750_solr    ] o.a.s.c.c.SolrZkClient makePath: /live_nodes
   [junit4]   2> 725015 INFO  (jetty-launcher-792-thread-1) [n:127.0.0.1:60747_solr    ] o.a.s.c.c.SolrZkClient makePath: /collections
   [junit4]   2> 725017 INFO  (jetty-launcher-792-thread-2) [n:127.0.0.1:60750_solr    ] o.a.s.c.c.SolrZkClient makePath: /collections
   [junit4]   2> 725020 INFO  (jetty-launcher-792-thread-2) [n:127.0.0.1:60750_solr    ] o.a.s.c.c.SolrZkClient makePath: /aliases.json
   [junit4]   2> 725020 INFO  (jetty-launcher-792-thread-1) [n:127.0.0.1:60747_solr    ] o.a.s.c.c.SolrZkClient makePath: /aliases.json
   [junit4]   2> 725022 INFO  (jetty-launcher-792-thread-2) [n:127.0.0.1:60750_solr    ] o.a.s.c.c.SolrZkClient makePath: /clusterstate.json
   [junit4]   2> 725023 INFO  (jetty-launcher-792-thread-1) [n:127.0.0.1:60747_solr    ] o.a.s.c.c.SolrZkClient makePath: /clusterstate.json
   [junit4]   2> 725026 INFO  (jetty-launcher-792-thread-1) [n:127.0.0.1:60747_solr    ] o.a.s.c.c.SolrZkClient makePath: /security.json
   [junit4]   2> 725026 INFO  (jetty-launcher-792-thread-2) [n:127.0.0.1:60750_solr    ] o.a.s.c.c.SolrZkClient makePath: /security.json
   [junit4]   2> 725028 INFO  (jetty-launcher-792-thread-2) [n:127.0.0.1:60750_solr    ] o.a.s.c.c.ZkStateReader Updating cluster state from ZooKeeper... 
   [junit4]   2> 725028 INFO  (jetty-launcher-792-thread-1) [n:127.0.0.1:60747_solr    ] o.a.s.c.c.ZkStateReader Updating cluster state from ZooKeeper... 
   [junit4]   2> 725030 INFO  (jetty-launcher-792-thread-2) [n:127.0.0.1:60750_solr    ] o.a.s.c.c.ZkStateReader Updated live nodes from ZooKeeper... (0) -> (0)
   [junit4]   2> 725031 INFO  (jetty-launcher-792-thread-1) [n:127.0.0.1:60747_solr    ] o.a.s.c.c.ZkStateReader Updated live nodes from ZooKeeper... (0) -> (0)
   [junit4]   2> 725033 INFO  (jetty-launcher-792-thread-2) [n:127.0.0.1:60750_solr    ] o.a.s.c.c.SolrZkClient makePath: /overseer_elect
   [junit4]   2> 725036 INFO  (jetty-launcher-792-thread-2) [n:127.0.0.1:60750_solr    ] o.a.s.c.c.SolrZkClient makePath: /overseer_elect/election
   [junit4]   2> 725036 INFO  (jetty-launcher-792-thread-1) [n:127.0.0.1:60747_solr    ] o.a.s.c.c.SolrZkClient makePath: /overseer_elect/election
   [junit4]   2> 725038 INFO  (jetty-launcher-792-thread-1) [n:127.0.0.1:60747_solr    ] o.a.s.c.Overseer Overseer (id=null) closing
   [junit4]   2> 725038 INFO  (jetty-launcher-792-thread-2) [n:127.0.0.1:60750_solr    ] o.a.s.c.Overseer Overseer (id=null) closing
   [junit4]   2> 725039 INFO  (jetty-launcher-792-thread-1) [n:127.0.0.1:60747_solr    ] o.a.s.c.LeaderElector Joined leadership election with path: /overseer_elect/election/95822424118722566-127.0.0.1:60747_solr-n_0000000000
   [junit4]   2> 725039 INFO  (jetty-launcher-792-thread-2) [n:127.0.0.1:60750_solr    ] o.a.s.c.LeaderElector Joined leadership election with path: /overseer_elect/election/95822424118722565-127.0.0.1:60750_solr-n_0000000001
   [junit4]   2> 725040 INFO  (jetty-launcher-792-thread-1) [n:127.0.0.1:60747_solr    ] o.a.s.c.OverseerElectionContext I am going to be the leader 127.0.0.1:60747_solr
   [junit4]   2> 725040 INFO  (jetty-launcher-792-thread-1) [n:127.0.0.1:60747_solr    ] o.a.s.c.c.SolrZkClient makePath: /overseer_elect/leader
   [junit4]   2> 725041 INFO  (jetty-launcher-792-thread-2) [n:127.0.0.1:60750_solr    ] o.a.s.c.LeaderElector Watching path /overseer_elect/election/95822424118722566-127.0.0.1:60747_solr-n_0000000000 to know if I could be the leader
   [junit4]   2> 725042 INFO  (jetty-launcher-792-thread-2) [n:127.0.0.1:60750_solr    ] o.a.s.c.ZkController Register node as live in ZooKeeper:/live_nodes/127.0.0.1:60750_solr
   [junit4]   2> 725043 INFO  (jetty-launcher-792-thread-2) [n:127.0.0.1:60750_solr    ] o.a.s.c.c.SolrZkClient makePath: /live_nodes/127.0.0.1:60750_solr
   [junit4]   2> 725043 INFO  (jetty-launcher-792-thread-1) [n:127.0.0.1:60747_solr    ] o.a.s.c.Overseer Overseer (id=95822424118722566-127.0.0.1:60747_solr-n_0000000000) starting
   [junit4]   2> 725045 INFO  (zkCallback-803-thread-1-processing-n:127.0.0.1:60750_solr) [n:127.0.0.1:60750_solr    ] o.a.s.c.c.ZkStateReader A live node change: [WatchedEvent state:SyncConnected type:NodeChildrenChanged path:/live_nodes], has occurred - updating... (live nodes size: [0])
   [junit4]   2> 725063 INFO  (zkCallback-802-thread-1-processing-n:127.0.0.1:60747_solr) [n:127.0.0.1:60747_solr    ] o.a.s.c.c.ZkStateReader A live node change: [WatchedEvent state:SyncConnected type:NodeChildrenChanged path:/live_nodes], has occurred - updating... (live nodes size: [0])
   [junit4]   2> 725090 INFO  (zkCallback-803-thread-1-processing-n:127.0.0.1:60750_solr) [n:127.0.0.1:60750_solr    ] o.a.s.c.c.ZkStateReader Updated live nodes from ZooKeeper... (0) -> (1)
   [junit4]   2> 725094 INFO  (zkCallback-802-thread-1-processing-n:127.0.0.1:60747_solr) [n:127.0.0.1:60747_solr    ] o.a.s.c.c.ZkStateReader Updated live nodes from ZooKeeper... (0) -> (1)
   [junit4]   2> 725095 INFO  (jetty-launcher-792-thread-1) [n:127.0.0.1:60747_solr    ] o.a.s.c.c.SolrZkClient makePath: /overseer/queue-work
   [junit4]   2> 725099 INFO  (jetty-launcher-792-thread-2) [n:127.0.0.1:60750_solr    ] o.a.s.c.CoreContainer Security conf doesn't exist. Skipping setup for authorization module.
   [junit4]   2> 725099 INFO  (jetty-launcher-792-thread-2) [n:127.0.0.1:60750_solr    ] o.a.s.c.CoreContainer No authentication plugin used.
   [junit4]   2> 725102 INFO  (jetty-launcher-792-thread-2) [n:127.0.0.1:60750_solr    ] o.a.s.c.CorePropertiesLocator Looking for core definitions underneath C:\Users\jenkins\workspace\Lucene-Solr-6.x-Windows\solr\build\solr-core\test\J0\temp\solr.schema.TestManagedSchemaAPI_64AB0DEEB58B15D4-001\tempDir-001\node2\.
   [junit4]   2> 725103 INFO  (jetty-launcher-792-thread-2) [n:127.0.0.1:60750_solr    ] o.a.s.c.CorePropertiesLocator Found 0 core definitions
   [junit4]   2> 725105 INFO  (jetty-launcher-792-thread-2) [n:127.0.0.1:60750_solr    ] o.a.s.s.SolrDispatchFilter user.dir=C:\Users\jenkins\workspace\Lucene-Solr-6.x-Windows\solr\build\solr-core\test\J0
   [junit4]   2> 725105 INFO  (jetty-launcher-792-thread-2) [n:127.0.0.1:60750_solr    ] o.a.s.s.SolrDispatchFilter SolrDispatchFilter.init() done
   [junit4]   2> 725120 INFO  (jetty-launcher-792-thread-1) [n:127.0.0.1:60747_solr    ] o.a.s.c.OverseerAutoReplicaFailoverThread Starting OverseerAutoReplicaFailoverThread autoReplicaFailoverWorkLoopDelay=10000 autoReplicaFailoverWaitAfterExpiration=30000 autoReplicaFailoverBadNodeExpiration=60000
   [junit4]   2> 725122 INFO  (jetty-launcher-792-thread-1) [n:127.0.0.1:60747_solr    ] o.a.s.c.ZkController Publish node=127.0.0.1:60747_solr as DOWN
   [junit4]   2> 725123 INFO  (OverseerCollectionConfigSetProcessor-95822424118722566-127.0.0.1:60747_solr-n_0000000000) [n:127.0.0.1:60747_solr    ] o.a.s.c.OverseerTaskProcessor Process current queue of overseer operations
   [junit4]   2> 725124 INFO  (OverseerStateUpdate-95822424118722566-127.0.0.1:60747_solr-n_0000000000) [n:127.0.0.1:60747_solr    ] o.a.s.c.Overseer Starting to work on the main queue
   [junit4]   2> 725127 INFO  (OverseerStateUpdate-95822424118722566-127.0.0.1:60747_solr-n_0000000000) [n:127.0.0.1:60747_solr    ] o.a.s.c.c.ZkStateReader Updated live nodes from ZooKeeper... (1) -> (1)
   [junit4]   2> 725129 INFO  (OverseerStateUpdate-95822424118722566-127.0.0.1:60747_solr-n_0000000000) [n:127.0.0.1:60747_solr    ] o.a.s.c.Overseer processMessage: queueSize: 1, message = {
   [junit4]   2>   "operation":"downnode",
   [junit4]   2>   "node_name":"127.0.0.1:60747_solr"} current state version: 0
   [junit4]   2> 725129 INFO  (OverseerStateUpdate-95822424118722566-127.0.0.1:60747_solr-n_0000000000) [n:127.0.0.1:60747_solr    ] o.a.s.c.o.NodeMutator DownNode state invoked for node: 127.0.0.1:60747_solr
   [junit4]   2> 726125 INFO  (jetty-launcher-792-thread-1) [n:127.0.0.1:60747_solr    ] o.a.s.c.ZkController Register node as live in ZooKeeper:/live_nodes/127.0.0.1:60747_solr
   [junit4]   2> 726126 INFO  (jetty-launcher-792-thread-1) [n:127.0.0.1:60747_solr    ] o.a.s.c.c.SolrZkClient makePath: /live_nodes/127.0.0.1:60747_solr
   [junit4]   2> 726127 INFO  (zkCallback-802-thread-1-processing-n:127.0.0.1:60747_solr) [n:127.0.0.1:60747_solr    ] o.a.s.c.c.ZkStateReader A live node change: [WatchedEvent state:SyncConnected type:NodeChildrenChanged path:/live_nodes], has occurred - updating... (live nodes size: [1])
   [junit4]   2> 726128 INFO  (zkCallback-803-thread-1-processing-n:127.0.0.1:60750_solr) [n:127.0.0.1:60750_solr    ] o.a.s.c.c.ZkStateReader A live node change: [WatchedEvent state:SyncConnected type:NodeChildrenChanged path:/live_nodes], has occurred - updating... (live nodes size: [1])
   [junit4]   2> 726131 INFO  (zkCallback-802-thread-1-processing-n:127.0.0.1:60747_solr) [n:127.0.0.1:60747_solr    ] o.a.s.c.c.ZkStateReader Updated live nodes from ZooKeeper... (1) -> (2)
   [junit4]   2> 726131 INFO  (zkCallback-803-thread-1-processing-n:127.0.0.1:60750_solr) [n:127.0.0.1:60750_solr    ] o.a.s.c.c.ZkStateReader Updated live nodes from ZooKeeper... (1) -> (2)
   [junit4]   2> 726165 INFO  (jetty-launcher-792-thread-1) [n:127.0.0.1:60747_solr    ] o.a.s.c.CoreContainer Security conf doesn't exist. Skipping setup for authorization module.
   [junit4]   2> 726165 INFO  (jetty-launcher-792-thread-1) [n:127.0.0.1:60747_solr    ] o.a.s.c.CoreContainer No authentication plugin used.
   [junit4]   2> 726166 INFO  (jetty-launcher-792-thread-1) [n:127.0.0.1:60747_solr    ] o.a.s.c.CorePropertiesLocator Looking for core definitions underneath C:\Users\jenkins\workspace\Lucene-Solr-6.x-Windows\solr\build\solr-core\test\J0\temp\solr.schema.TestManagedSchemaAPI_64AB0DEEB58B15D4-001\tempDir-001\node1\.
   [junit4]   2> 726167 INFO  (jetty-launcher-792-thread-1) [n:127.0.0.1:60747_solr    ] o.a.s.c.CorePropertiesLocator Found 0 core definitions
   [junit4]   2> 726168 INFO  (jetty-launcher-792-thread-1) [n:127.0.0.1:60747_solr    ] o.a.s.s.SolrDispatchFilter user.dir=C:\Users\jenkins\workspace\Lucene-Solr-6.x-Windows\solr\build\solr-core\test\J0
   [junit4]   2> 726169 INFO  (jetty-launcher-792-thread-1) [n:127.0.0.1:60747_solr    ] o.a.s.s.SolrDispatchFilter SolrDispatchFilter.init() done
   [junit4]   2> 726169 INFO  (SUITE-TestManagedSchemaAPI-seed#[64AB0DEEB58B15D4]-worker) [    ] o.a.s.c.c.SolrZkClient Using default ZkCredentialsProvider
   [junit4]   2> 726170 INFO  (SUITE-TestManagedSchemaAPI-seed#[64AB0DEEB58B15D4]-worker) [    ] o.a.s.c.c.ConnectionManager Waiting for client to connect to ZooKeeper
   [junit4]   2> 726173 INFO  (zkCallback-804-thread-1) [    ] o.a.s.c.c.ConnectionManager Watcher org.apache.solr.common.cloud.ConnectionManager@134a87 name:ZooKeeperConnection Watcher:127.0.0.1:60743 got event WatchedEvent state:SyncConnected type:None path:null path:null type:None
   [junit4]   2> 726173 INFO  (SUITE-TestManagedSchemaAPI-seed#[64AB0DEEB58B15D4]-worker) [    ] o.a.s.c.c.ConnectionManager Client is connected to ZooKeeper
   [junit4]   2> 726174 INFO  (SUITE-TestManagedSchemaAPI-seed#[64AB0DEEB58B15D4]-worker) [    ] o.a.s.c.c.SolrZkClient Using default ZkACLProvider
   [junit4]   2> 726179 INFO  (SUITE-TestManagedSchemaAPI-seed#[64AB0DEEB58B15D4]-worker) [    ] o.a.s.c.s.i.CloudSolrClient Final constructed zkHost string: 127.0.0.1:60743/solr
   [junit4]   2> 726180 INFO  (SUITE-TestManagedSchemaAPI-seed#[64AB0DEEB58B15D4]-worker) [    ] o.a.s.c.c.SolrZkClient Using default ZkCredentialsProvider
   [junit4]   2> 726181 INFO  (SUITE-TestManagedSchemaAPI-seed#[64AB0DEEB58B15D4]-worker) [    ] o.a.s.c.c.ConnectionManager Waiting for client to connect to ZooKeeper
   [junit4]   2> 726191 INFO  (zkCallback-806-thread-1) [    ] o.a.s.c.c.ConnectionManager Watcher org.apache.solr.common.cloud.ConnectionManager@cc8008 name:ZooKeeperConnection Watcher:127.0.0.1:60743/solr got event WatchedEvent state:SyncConnected type:None path:null path:null type:None
   [junit4]   2> 726191 INFO  (SUITE-TestManagedSchemaAPI-seed#[64AB0DEEB58B15D4]-worker) [    ] o.a.s.c.c.ConnectionManager Client is connected to ZooKeeper
   [junit4]   2> 726192 INFO  (SUITE-TestManagedSchemaAPI-seed#[64AB0DEEB58B15D4]-worker) [    ] o.a.s.c.c.SolrZkClient Using default ZkACLProvider
   [junit4]   2> 726192 INFO  (SUITE-TestManagedSchemaAPI-seed#[64AB0DEEB58B15D4]-worker) [    ] o.a.s.c.c.ZkStateReader Updating cluster state from ZooKeeper... 
   [junit4]   2> 726195 INFO  (SUITE-TestManagedSchemaAPI-seed#[64AB0DEEB58B15D4]-worker) [    ] o.a.s.c.c.ZkStateReader Updated live nodes from ZooKeeper... (0) -> (2)
   [junit4]   2> 726199 INFO  (SUITE-TestManagedSchemaAPI-seed#[64AB0DEEB58B15D4]-worker) [    ] o.a.s.c.c.SolrZkClient makePath: /configs/conf1/managed-schema
   [junit4]   2> 726211 INFO  (SUITE-TestManagedSchemaAPI-seed#[64AB0DEEB58B15D4]-worker) [    ] o.a.s.c.c.SolrZkClient makePath: /configs/conf1/solrconfig.xml
   [junit4]   2> 726243 INFO  (TEST-TestManagedSchemaAPI.test-seed#[64AB0DEEB58B15D4]) [    ] o.a.s.SolrTestCaseJ4 ###Starting test
   [junit4]   2> 726254 INFO  (qtp12513292-5440) [n:127.0.0.1:60750_solr    ] o.a.s.h.a.CollectionsHandler Invoked Collection Action :create with params replicationFactor=2&collection.configName=conf1&name=testschemaapi&action=CREATE&numShards=1&wt=javabin&version=2 and sendToOCPQueue=true
   [junit4]   2> 726261 INFO  (OverseerCollectionConfigSetProcessor-95822424118722566-127.0.0.1:60747_solr-n_0000000000) [n:127.0.0.1:60747_solr    ] o.a.s.c.OverseerTaskProcessor Overseer Collection Message Handler: Get the message id:/overseer/collection-queue-work/qn-0000000000 message:{
   [junit4]   2>   "name":"testschemaapi",
   [junit4]   2>   "fromApi":"true",
   [junit4]   2>   "replicationFactor":"2",
   [junit4]   2>   "collection.configName":"conf1",
   [junit4]   2>   "numShards":"1",
   [junit4]   2>   "stateFormat":"2",
   [junit4]   2>   "operation":"create"}
   [junit4]   2> 726263 INFO  (OverseerThreadFactory-2878-thread-1-processing-n:127.0.0.1:60747_solr) [n:127.0.0.1:60747_solr    ] o.a.s.c.OverseerCollectionMessageHandler OverseerCollectionMessageHandler.processMessage : create , {
   [junit4]   2>   "name":"testschemaapi",
   [junit4]   2>   "fromApi":"true",
   [junit4]   2>   "replicationFactor":"2",
   [junit4]   2>   "collection.configName":"conf1",
   [junit4]   2>   "numShards":"1",
   [junit4]   2>   "stateFormat":"2",
   [junit4]   2>   "operation":"create"}
   [junit4]   2> 726263 INFO  (OverseerThreadFactory-2878-thread-1-processing-n:127.0.0.1:60747_solr) [n:127.0.0.1:60747_solr    ] o.a.s.c.OverseerCollectionMessageHandler Create collection testschemaapi
   [junit4]   2> 726266 INFO  (OverseerThreadFactory-2878-thread-1-processing-n:127.0.0.1:60747_solr) [n:127.0.0.1:60747_solr    ] o.a.s.c.OverseerCollectionMessageHandler creating collections conf node /collections/testschemaapi 
   [junit4]   2> 726267 INFO  (OverseerThreadFactory-2878-thread-1-processing-n:127.0.0.1:60747_solr) [n:127.0.0.1:60747_solr    ] o.a.s.c.c.SolrZkClient makePath: /collections/testschemaapi
   [junit4]   2> 726273 INFO  (zkCallback-802-thread-1-processing-n:127.0.0.1:60747_solr) [n:127.0.0.1:60747_solr    ] o.a.s.c.c.ZkStateReader A collections change: [WatchedEvent state:SyncConnected type:NodeChildrenChanged path:/collections], has occurred - updating...
   [junit4]   2> 726273 INFO  (zkCallback-803-thread-1-processing-n:127.0.0.1:60750_solr) [n:127.0.0.1:60750_solr    ] o.a.s.c.c.ZkStateReader A collections change: [WatchedEvent state:SyncConnected type:NodeChildrenChanged path:/collections], has occurred - updating...
   [junit4]   2> 726274 INFO  (zkCallback-806-thread-1) [    ] o.a.s.c.c.ZkStateReader A collections change: [WatchedEvent state:SyncConnected type:NodeChildrenChanged path:/collections], has occurred - updating...
   [junit4]   2> 726282 INFO  (OverseerStateUpdate-95822424118722566-127.0.0.1:60747_solr-n_0000000000) [n:127.0.0.1:60747_solr    ] o.a.s.c.Overseer processMessage: queueSize: 1, message = {
   [junit4]   2>   "name":"testschemaapi",
   [junit4]   2>   "fromApi":"true",
   [junit4]   2>   "replicationFactor":"2",
   [junit4]   2>   "collection.configName":"conf1",
   [junit4]   2>   "numShards":"1",
   [junit4]   2>   "stateFormat":"2",
   [junit4]   2>   "operation":"create"} current state version: 0
   [junit4]   2> 726282 INFO  (OverseerStateUpdate-95822424118722566-127.0.0.1:60747_solr-n_0000000000) [n:127.0.0.1:60747_solr    ] o.a.s.c.o.ClusterStateMutator building a new cName: testschemaapi
   [junit4]   2> 726286 INFO  (OverseerStateUpdate-95822424118722566-127.0.0.1:60747_solr-n_0000000000) [n:127.0.0.1:60747_solr    ] o.a.s.c.o.ZkStateWriter going to create_collection /collections/testschemaapi/state.json
   [junit4]   2> 726383 INFO  (OverseerThreadFactory-2878-thread-1-processing-n:127.0.0.1:60747_solr) [n:127.0.0.1:60747_solr    ] o.a.s.c.OverseerCollectionMessageHandler Creating SolrCores for new collection testschemaapi, shardNames [shard1] , replicationFactor : 2
   [junit4]   2> 726384 INFO  (OverseerThreadFactory-2878-thread-1-processing-n:127.0.0.1:60747_solr) [n:127.0.0.1:60747_solr    ] o.a.s.c.OverseerCollectionMessageHandler Creating core testschemaapi_shard1_replica1 as part of shard shard1 of collection testschemaapi on 127.0.0.1:60750_solr
   [junit4]   2> 726385 INFO  (OverseerThreadFactory-2878-thread-1-processing-n:127.0.0.1:60747_solr) [n:127.0.0.1:60747_solr    ] o.a.s.c.OverseerCollectionMessageHandler Creating core testschemaapi_shard1_replica2 as part of shard shard1 of collection testschemaapi on 127.0.0.1:60747_solr
   [junit4]   2> 726394 INFO  (qtp12513292-5437) [n:127.0.0.1:60750_solr    ] o.a.s.h.a.CoreAdminOperation core create command qt=/admin/cores&collection.configName=conf1&name=testschemaapi_shard1_replica1&action=CREATE&numShards=1&collection=testschemaapi&shard=shard1&wt=javabin&version=2
   [junit4]   2> 726395 INFO  (qtp13561028-5426) [n:127.0.0.1:60747_solr    ] o.a.s.h.a.CoreAdminOperation core create command qt=/admin/cores&collection.configName=conf1&name=testschemaapi_shard1_replica2&action=CREATE&numShards=1&collection=testschemaapi&shard=shard1&wt=javabin&version=2
   [junit4]   2> 726396 INFO  (qtp12513292-5437) [n:127.0.0.1:60750_solr    ] o.a.s.c.CoreDescriptor Created CoreDescriptor: {name=testschemaapi_shard1_replica1, collection.configName=conf1, config=solrconfig.xml, transient=false, schema=schema.xml, loadOnStartup=true, configSetProperties=configsetprops.json, collection=testschemaapi, numShards=1, dataDir=data\, shard=shard1}
   [junit4]   2> 726397 INFO  (qtp13561028-5426) [n:127.0.0.1:60747_solr    ] o.a.s.c.CoreDescriptor Created CoreDescriptor: {name=testschemaapi_shard1_replica2, collection.configName=conf1, config=solrconfig.xml, transient=false, schema=schema.xml, loadOnStartup=true, configSetProperties=configsetprops.json, collection=testschemaapi, numShards=1, dataDir=data\, shard=shard1}
   [junit4]   2> 726403 INFO  (qtp12513292-5437) [n:127.0.0.1:60750_solr c:testschemaapi s:shard1  x:testschemaapi_shard1_replica1] o.a.s.c.ZkController publishing state=down
   [junit4]   2> 726403 INFO  (qtp13561028-5426) [n:127.0.0.1:60747_solr c:testschemaapi s:shard1  x:testschemaapi_shard1_replica2] o.a.s.c.ZkController publishing state=down
   [junit4]   2> 726405 INFO  (qtp13561028-5426) [n:127.0.0.1:60747_solr c:testschemaapi s:shard1  x:testschemaapi_shard1_replica2] o.a.s.c.ZkController Registering watch for collection testschemaapi
   [junit4]   2> 726405 INFO  (qtp12513292-5437) [n:127.0.0.1:60750_solr c:testschemaapi s:shard1  x:testschemaapi_shard1_replica1] o.a.s.c.ZkController Registering watch for collection testschemaapi
   [junit4]   2> 726406 INFO  (qtp13561028-5426) [n:127.0.0.1:60747_solr c:testschemaapi s:shard1  x:testschemaapi_shard1_replica2] o.a.s.c.c.ZkStateReader addZkWatch [testschemaapi]
   [junit4]   2> 726406 INFO  (qtp12513292-5437) [n:127.0.0.1:60750_solr c:testschemaapi s:shard1  x:testschemaapi_shard1_replica1] o.a.s.c.c.ZkStateReader addZkWatch [testschemaapi]
   [junit4]   2> 726406 INFO  (qtp12513292-5437) [n:127.0.0.1:60750_solr c:testschemaapi s:shard1  x:testschemaapi_shard1_replica1] o.a.s.c.c.ZkStateReader Add data for [testschemaapi] ver [0]
   [junit4]   2> 726406 INFO  (qtp12513292-5437) [n:127.0.0.1:60750_solr c:testschemaapi s:shard1  x:testschemaapi_shard1_replica1] o.a.s.c.ZkController look for our core node name
   [junit4]   2> 726407 INFO  (qtp13561028-5426) [n:127.0.0.1:60747_solr c:testschemaapi s:shard1  x:testschemaapi_shard1_replica2] o.a.s.c.c.ZkStateReader Add data for [testschemaapi] ver [0]
   [junit4]   2> 726407 INFO  (qtp13561028-5426) [n:127.0.0.1:60747_solr c:testschemaapi s:shard1  x:testschemaapi_shard1_replica2] o.a.s.c.ZkController look for our core node name
   [junit4]   2> 726408 INFO  (OverseerStateUpdate-95822424118722566-127.0.0.1:60747_solr-n_0000000000) [n:127.0.0.1:60747_solr    ] o.a.s.c.Overseer processMessage: queueSize: 2, message = {
   [junit4]   2>   "core":"testschemaapi_shard1_replica2",
   [junit4]   2>   "roles":null,
   [junit4]   2>   "base_url":"http://127.0.0.1:60747/solr",
   [junit4]   2>   "node_name":"127.0.0.1:60747_solr",
   [junit4]   2>   "numShards":"1",
   [junit4]   2>   "state":"down",
   [junit4]   2>   "shard":"shard1",
   [junit4]   2>   "collection":"testschemaapi",
   [junit4]   2>   "operation":"state"} current state version: 0
   [junit4]   2> 726409 INFO  (OverseerStateUpdate-95822424118722566-127.0.0.1:60747_solr-n_0000000000) [n:127.0.0.1:60747_solr    ] o.a.s.c.o.ReplicaMutator Update state numShards=1 message={
   [junit4]   2>   "core":"testschemaapi_shard1_replica2",
   [junit4]   2>   "roles":null,
   [junit4]   2>   "base_url":"http://127.0.0.1:60747/solr",
   [junit4]   2>   "node_name":"127.0.0.1:60747_solr",
   [junit4]   2>   "numShards":"1",
   [junit4]   2>   "state":"down",
   [junit4]   2>   "shard":"shard1",
   [junit4]   2>   "collection":"testschemaapi",
   [junit4]   2>   "operation":"state"}
   [junit4]   2> 726413 INFO  (OverseerStateUpdate-95822424118722566-127.0.0.1:60747_solr-n_0000000000) [n:127.0.0.1:60747_solr    ] o.a.s.c.Overseer processMessage: queueSize: 2, message = {
   [junit4]   2>   "core":"testschemaapi_shard1_replica1",
   [junit4]   2>   "roles":null,
   [junit4]   2>   "base_url":"http://127.0.0.1:60750/solr",
   [junit4]   2>   "node_name":"127.0.0.1:60750_solr",
   [junit4]   2>   "numShards":"1",
   [junit4]   2>   "state":"down",
   [junit4]   2>   "shard":"shard1",
   [junit4]   2>   "collection":"testschemaapi",
   [junit4]   2>   "operation":"state"} current state version: 0
   [junit4]   2> 726414 INFO  (OverseerStateUpdate-95822424118722566-127.0.0.1:60747_solr-n_0000000000) [n:127.0.0.1:60747_solr    ] o.a.s.c.o.ReplicaMutator Update state numShards=1 message={
   [junit4]   2>   "core":"testschemaapi_shard1_replica1",
   [junit4]   2>   "roles":null,
   [junit4]   2>   "base_url":"http://127.0.0.1:60750/solr",
   [junit4]   2>   "node_name":"127.0.0.1:60750_solr",
   [junit4]   2>   "numShards":"1",
   [junit4]   2>   "state":"down",
   [junit4]   2>   "shard":"shard1",
   [junit4]   2>   "collection":"testschemaapi",
   [junit4]   2>   "operation":"state"}
   [junit4]   2> 726520 INFO  (OverseerStateUpdate-95822424118722566-127.0.0.1:60747_solr-n_0000000000) [n:127.0.0.1:60747_solr    ] o.a.s.c.o.ZkStateWriter going to update_collection /collections/testschemaapi/state.json version: 0
   [junit4]   2> 726521 INFO  (zkCallback-802-thread-1-processing-n:127.0.0.1:60747_solr) [n:127.0.0.1:60747_solr    ] o.a.s.c.c.ZkStateReader A cluster state change: [WatchedEvent state:SyncConnected type:NodeDataChanged path:/collections/testschemaapi/state.json] for collection [testschemaapi] has occurred - updating... (live nodes size: [2])
   [junit4]   2> 726521 INFO  (zkCallback-803-thread-1-processing-n:127.0.0.1:60750_solr) [n:127.0.0.1:60750_solr    ] o.a.s.c.c.ZkStateReader A cluster state change: [WatchedEvent state:SyncConnected type:NodeDataChanged path:/collections/testschemaapi/state.json] for collection [testschemaapi] has occurred - updating... (live nodes size: [2])
   [junit4]   2> 726522 INFO  (zkCallback-802-thread-1-processing-n:127.0.0.1:60747_solr) [n:127.0.0.1:60747_solr    ] o.a.s.c.c.ZkStateReader Updating data for [testschemaapi] from [0] to [1]
   [junit4]   2> 726522 INFO  (zkCallback-803-thread-1-processing-n:127.0.0.1:60750_solr) [n:127.0.0.1:60750_solr    ] o.a.s.c.c.ZkStateReader Updating data for [testschemaapi] from [0] to [1]
   [junit4]   2> 727407 INFO  (qtp12513292-5437) [n:127.0.0.1:60750_solr c:testschemaapi s:shard1  x:testschemaapi_shard1_replica1] o.a.s.c.ZkController waiting to find shard id in clusterstate for testschemaapi_shard1_replica1
   [junit4]   2> 727407 INFO  (qtp12513292-5437) [n:127.0.0.1:60750_solr c:testschemaapi s:shard1  x:testschemaapi_shard1_replica1] o.a.s.c.ZkController Check for collection zkNode:testschemaapi
   [junit4]   2> 727408 INFO  (qtp13561028-5426) [n:127.0.0.1:60747_solr c:testschemaapi s:shard1  x:testschemaapi_shard1_replica2] o.a.s.c.ZkController waiting to find shard id in clusterstate for testschemaapi_shard1_replica2
   [junit4]   2> 727408 INFO  (qtp13561028-5426) [n:127.0.0.1:60747_solr c:testschemaapi s:shard1  x:testschemaapi_shard1_replica2] o.a.s.c.ZkController Check for collection zkNode:testschemaapi
   [junit4]   2> 727409 INFO  (qtp12513292-5437) [n:127.0.0.1:60750_solr c:testschemaapi s:shard1  x:testschemaapi_shard1_replica1] o.a.s.c.ZkController Collection zkNode exists
   [junit4]   2> 727409 INFO  (qtp12513292-5437) [n:127.0.0.1:60750_solr c:testschemaapi s:shard1  x:testschemaapi_shard1_replica1] o.a.s.c.c.ZkStateReader Load collection config from: [/collections/testschemaapi]
   [junit4]   2> 727411 INFO  (qtp13561028-5426) [n:127.0.0.1:60747_solr c:testschemaapi s:shard1  x:testschemaapi_shard1_replica2] o.a.s.c.ZkController Collection zkNode exists
   [junit4]   2> 727411 INFO  (qtp13561028-5426) [n:127.0.0.1:60747_solr c:testschemaapi s:shard1  x:testschemaapi_shard1_replica2] o.a.s.c.c.ZkStateReader Load collection config from: [/collections/testschemaapi]
   [junit4]   2> 727414 INFO  (qtp12513292-5437) [n:127.0.0.1:60750_solr c:testschemaapi s:shard1  x:testschemaapi_shard1_replica1] o.a.s.c.c.ZkStateReader path=[/collections/testschemaapi] [configName]=[conf1] specified config exists in ZooKeeper
   [junit4]   2> 727414 INFO  (qtp12513292-5437) [n:127.0.0.1:60750_solr c:testschemaapi s:shard1  x:testschemaapi_shard1_replica1] o.a.s.c.SolrResourceLoader new SolrResourceLoader for directory: 'C:\Users\jenkins\workspace\Lucene-Solr-6.x-Windows\solr\build\solr-core\test\J0\temp\solr.schema.TestManagedSchemaAPI_64AB0DEEB58B15D4-001\tempDir-001\node2\testschemaapi_shard1_replica1'
   [junit4]   2> 727414 INFO  (qtp12513292-5437) [n:127.0.0.1:60750_solr c:testschemaapi s:shard1  x:testschemaapi_shard1_replica1] o.a.s.c.SolrResourceLoader JNDI not configured for solr (NoInitialContextEx)
   [junit4]   2> 727414 INFO  (qtp12513292-5437) [n:127.0.0.1:60750_solr c:testschemaapi s:shard1  x:testschemaapi_shard1_replica1] o.a.s.c.SolrResourceLoader solr home defaulted to 'solr/' (could not find system property or JNDI)
   [junit4]   2> 727417 INFO  (qtp13561028-5426) [n:127.0.0.1:60747_solr c:testschemaapi s:shard1  x:testschemaapi_shard1_replica2] o.a.s.c.c.ZkStateReader path=[/collections/testschemaapi] [configName]=[conf1] specified config exists in ZooKeeper
   [junit4]   2> 727417 INFO  (qtp13561028-5426) [n:127.0.0.1:60747_solr c:testschemaapi s:shard1  x:testschemaapi_shard1_replica2] o.a.s.c.SolrResourceLoader new SolrResourceLoader for directory: 'C:\Users\jenkins\workspace\Lucene-Solr-6.x-Windows\solr\build\solr-core\test\J0\temp\solr.schema.TestManagedSchemaAPI_64AB0DEEB58B15D4-001\tempDir-001\node1\testschemaapi_shard1_replica2'
   [junit4]   2> 727418 INFO  (qtp13561028-5426) [n:127.0.0.1:60747_solr c:testschemaapi s:shard1  x:testschemaapi_shard1_replica2] o.a.s.c.SolrResourceLoader JNDI not configured for solr (NoInitialContextEx)
   [junit4]   2> 727418 INFO  (qtp13561028-5426) [n:127.0.0.1:60747_solr c:testschemaapi s:shard1  x:testschemaapi_shard1_replica2] o.a.s.c.SolrResourceLoader solr home defaulted to 'solr/' (could not find system property or JNDI)
   [junit4]   2> 727426 INFO  (qtp12513292-5437) [n:127.0.0.1:60750_solr c:testschemaapi s:shard1  x:testschemaapi_shard1_replica1] o.a.s.c.Config loaded config solrconfig.xml with version 0 
   [junit4]   2> 727442 INFO  (qtp12513292-5437) [n:127.0.0.1:60750_solr c:testschemaapi s:shard1  x:testschemaapi_shard1_replica1] o.a.s.c.SolrConfig current version of requestparams : -1
   [junit4]   2> 727453 INFO  (qtp12513292-5437) [n:127.0.0.1:60750_solr c:testschemaapi s:shard1  x:testschemaapi_shard1_replica1] o.a.s.c.SolrConfig Using Lucene MatchVersion: 6.1.0
   [junit4]   2> 727471 INFO  (qtp12513292-5437) [n:127.0.0.1:60750_solr c:testschemaapi s:shard1  x:testschemaapi_shard1_replica1] o.a.s.c.SolrConfig Loaded SolrConfig: solrconfig.xml
   [junit4]   2> 727472 INFO  (qtp13561028-5426) [n:127.0.0.1:60747_solr c:testschemaapi s:shard1  x:testschemaapi_shard1_replica2] o.a.s.c.Config loaded config solrconfig.xml with version 0 
   [junit4]   2> 727479 INFO  (qtp12513292-5437) [n:127.0.0.1:60750_solr c:testschemaapi s:shard1  x:testschemaapi_shard1_replica1] o.a.s.s.IndexSchema [testschemaapi_shard1_replica1] Schema name=minimal
   [junit4]   2> 727485 INFO  (qtp12513292-5437) [n:127.0.0.1:60750_solr c:testschemaapi s:shard1  x:testschemaapi_shard1_replica1] o.a.s.s.IndexSchema unique key field: id
   [junit4]   2> 727488 INFO  (qtp12513292-5437) [n:127.0.0.1:60750_solr c:testschemaapi s:shard1  x:testschemaapi_shard1_replica1] o.a.s.c.ConfigSetProperties Did not find ConfigSet properties, assuming default properties: Can't find resource 'configsetprops.json' in classpath or '/configs/conf1', cwd=C:\Users\jenkins\workspace\Lucene-Solr-6.x-Windows\solr\build\solr-core\test\J0
   [junit4]   2> 727488 INFO  (qtp12513292-5437) [n:127.0.0.1:60750_solr c:testschemaapi s:shard1  x:testschemaapi_shard1_replica1] o.a.s.c.CoreContainer Creating SolrCore 'testschemaapi_shard1_replica1' using configuration from collection testschemaapi
   [junit4]   2> 727488 INFO  (qtp12513292-5437) [n:127.0.0.1:60750_solr c:testschemaapi s:shard1 r:core_node2 x:testschemaapi_shard1_replica1] o.a.s.c.SolrCore org.apache.solr.core.MockDirectoryFactory
   [junit4]   2> 727489 INFO  (qtp12513292-5437) [n:127.0.0.1:60750_solr c:testschemaapi s:shard1 r:core_node2 x:testschemaapi_shard1_replica1] o.a.s.c.SolrCore [[testschemaapi_shard1_replica1] ] Opening new SolrCore at [C:\Users\jenkins\workspace\Lucene-Solr-6.x-Windows\solr\build\solr-core\test\J0\temp\solr.schema.TestManagedSchemaAPI_64AB0DEEB58B15D4-001\tempDir-001\node2\testschemaapi_shard1_replica1], dataDir=[C:\Users\jenkins\workspace\Lucene-Solr-6.x-Windows\solr\build\solr-core\test\J0\temp\solr.schema.TestManagedSchemaAPI_64AB0DEEB58B15D4-001\tempDir-001\node2\.\testschemaapi_shard1_replica1\data\]
   [junit4]   2> 727489 INFO  (qtp12513292-5437) [n:127.0.0.1:60750_solr c:testschemaapi s:shard1 r:core_node2 x:testschemaapi_shard1_replica1] o.a.s.c.SolrCore JMX monitoring not detected for core: testschemaapi_shard1_replica1
   [junit4]   2> 727490 INFO  (qtp13561028-5426) [n:127.0.0.1:60747_solr c:testschemaapi s:shard1  x:testschemaapi_shard1_replica2] o.a.s.c.SolrConfig current version of requestparams : -1
   [junit4]   2> 727490 INFO  (qtp12513292-5437) [n:127.0.0.1:60750_solr c:testschemaapi s:shard1 r:core_node2 x:testschemaapi_shard1_replica1] o.a.s.c.CachingDirectoryFactory return new directory for C:\Users\jenkins\workspace\Lucene-Solr-6.x-Windows\solr\build\solr-core\test\J0\temp\solr.schema.TestManagedSchemaAPI_64AB0DEEB58B15D4-001\tempDir-001\node2\.\testschemaapi_shard1_replica1\data\
   [junit4]   2> 727495 INFO  (qtp13561028-5426) [n:127.0.0.1:60747_solr c:testschemaapi s:shard1  x:testschemaapi_shard1_replica2] o.a.s.c.SolrConfig Using Lucene MatchVersion: 6.1.0
   [junit4]   2> 727509 INFO  (qtp12513292-5437) [n:127.0.0.1:60750_solr c:testschemaapi s:shard1 r:core_node2 x:testschemaapi_shard1_replica1] o.a.s.c.SolrCore New index directory detected: old=null new=C:\Users\jenkins\workspace\Lucene-Solr-6.x-Windows\solr\build\solr-core\test\J0\temp\solr.schema.TestManagedSchemaAPI_64AB0DEEB58B15D4-001\tempDir-001\node2\.\testschemaapi_shard1_replica1\data\index/
   [junit4]   2> 727509 WARN  (qtp12513292-5437) [n:127.0.0.1:60750_solr c:testschemaapi s:shard1 r:core_node2 x:testschemaapi_shard1_replica1] o.a.s.c.SolrCore [testschemaapi_shard1_replica1] Solr index directory 'C:\Users\jenkins\workspace\Lucene-Solr-6.x-Windows\solr\build\solr-core\test\J0\temp\solr.schema.TestManagedSchemaAPI_64AB0DEEB58B15D4-001\tempDir-001\node2\.\testschemaapi_shard1_replica1\data\index' doesn't exist. Creating new index...
   [junit4]   2> 727512 INFO  (qtp13561028-5426) [n:127.0.0.1:60747_solr c:testschemaapi s:shard1  x:testschemaapi_shard1_replica2] o.a.s.c.SolrConfig Loaded SolrConfig: solrconfig.xml
   [junit4]   2> 727519 INFO  (qtp12513292-5437) [n:127.0.0.1:60750_solr c:testschemaapi s:shard1 r:core_node2 x:testschemaapi_shard1_replica1] o.a.s.c.CachingDirectoryFactory return new directory for C:\Users\jenkins\workspace\Lucene-Solr-6.x-Windows\solr\build\solr-core\test\J0\temp\solr.schema.TestManagedSchemaAPI_64AB0DEEB58B15D4-001\tempDir-001\node2\.\testschemaapi_shard1_replica1\data\index
   [junit4]   2> 727521 INFO  (qtp13561028-5426) [n:127.0.0.1:60747_solr c:testschemaapi s:shard1  x:testschemaapi_shard1_replica2] o.a.s.s.IndexSchema [testschemaapi_shard1_replica2] Schema name=minimal
   [junit4]   2> 727525 INFO  (qtp13561028-5426) [n:127.0.0.1:60747_solr c:testschemaapi s:shard1  x:testschemaapi_shard1_replica2] o.a.s.s.IndexSchema unique key field: id
   [junit4]   2> 727527 INFO  (qtp13561028-5426) [n:127.0.0.1:60747_solr c:testschemaapi s:shard1  x:testschemaapi_shard1_replica2] o.a.s.c.ConfigSetProperties Did not find ConfigSet properties, assuming default properties: Can't find resource 'configsetprops.json' in classpath or '/configs/conf1', cwd=C:\Users\jenkins\workspace\Lucene-Solr-6.x-Windows\solr\build\solr-core\test\J0
   [junit4]   2> 727527 INFO  (qtp13561028-5426) [n:127.0.0.1:60747_solr c:testschemaapi s:shard1  x:testschemaapi_shard1_replica2] o.a.s.c.CoreContainer Creating SolrCore 'testschemaapi_shard1_replica2' using configuration from collection testschemaapi
   [junit4]   2> 727527 INFO  (qtp13561028-5426) [n:127.0.0.1:60747_solr c:testschemaapi s:shard1 r:core_node1 x:testschemaapi_shard1_replica2] o.a.s.c.SolrCore org.apache.solr.core.MockDirectoryFactory
   [junit4]   2> 727528 INFO  (qtp13561028-5426) [n:127.0.0.1:60747_solr c:testschemaapi s:shard1 r:core_node1 x:testschemaapi_shard1_replica2] o.a.s.c.SolrCore [[testschemaapi_shard1_replica2] ] Opening new SolrCore at [C:\Users\jenkins\workspace\Lucene-Solr-6.x-Windows\solr\build\solr-core\test\J0\temp\solr.schema.TestManagedSchemaAPI_64AB0DEEB58B15D4-001\tempDir-001\node1\testschemaapi_shard1_replica2], dataDir=[C:\Users\jenkins\workspace\Lucene-Solr-6.x-Windows\solr\build\solr-core\test\J0\temp\solr.schema.TestManagedSchemaAPI_64AB0DEEB58B15D4-001\tempDir-001\node1\.\testschemaapi_shard1_replica2\data\]
   [junit4]   2> 727528 INFO  (qtp13561028-5426) [n:127.0.0.1:60747_solr c:testschemaapi s:shard1 r:core_node1 x:testschemaapi_shard1_replica2] o.a.s.c.SolrCore JMX monitoring not detected for core: testschemaapi_shard1_replica2
   [junit4]   2> 727529 INFO  (qtp13561028-5426) [n:127.0.0.1:60747_solr c:testschemaapi s:shard1 r:core_node1 x:testschemaapi_shard1_replica2] o.a.s.c.CachingDirectoryFactory return new directory for C:\Users\jenkins\workspace\Lucene-Solr-6.x-Windows\solr\build\solr-core\test\J0\temp\solr.schema.TestManagedSchemaAPI_64AB0DEEB58B15D4-001\tempDir-001\node1\.\testschemaapi_shard1_replica2\data\
   [junit4]   2> 727530 INFO  (qtp13561028-5426) [n:127.0.0.1:60747_solr c:testschemaapi s:shard1 r:core_node1 x:testschemaapi_shard1_replica2] o.a.s.c.SolrCore New index directory detected: old=null new=C:\Users\jenkins\workspace\Lucene-Solr-6.x-Windows\solr\build\solr-core\test\J0\temp\solr.schema.TestManagedSchemaAPI_64AB0DEEB58B15D4-001\tempDir-001\node1\.\testschemaapi_shard1_replica2\data\index/
   [junit4]   2> 727530 WARN  (qtp13561028-5426) [n:127.0.0.1:60747_solr c:testschemaapi s:shard1 r:core_node1 x:testschemaapi_shard1_replica2] o.a.s.c.SolrCore [testschemaapi_shard1_replica2] Solr index directory 'C:\Users\jenkins\workspace\Lucene-Solr-6.x-Windows\solr\build\solr-core\test\J0\temp\solr.schema.TestManagedSchemaAPI_64AB0DEEB58B15D4-001\tempDir-001\node1\.\testschemaapi_shard1_replica2\data\index' doesn't exist. Creating new index...
   [junit4]   2> 727532 INFO  (qtp13561028-5426) [n:127.0.0.1:60747_solr c:testschemaapi s:shard1 r:core_node1 x:testschemaapi_shard1_replica2] o.a.s.c.CachingDirectoryFactory return new directory for C:\Users\jenkins\workspace\Lucene-Solr-6.x-Windows\solr\build\solr-core\test\J0\temp\solr.schema.TestManagedSchemaAPI_64AB0DEEB58B15D4-001\tempDir-001\node1\.\testschemaapi_shard1_replica2\data\index
   [junit4]   2> 727533 INFO  (qtp12513292-5437) [n:127.0.0.1:60750_solr c:testschemaapi s:shard1 r:core_node2 x:testschemaapi_shard1_replica1] o.a.s.c.SolrDeletionPolicy SolrDeletionPolicy.onCommit: commits: num=1
   [junit4]   2> 	commit{dir=MockDirectoryWrapper(RAMDirectory@149153b lockFactory=org.apache.lucene.store.SingleInstanceLockFactory@3d01f3),segFN=segments_1,generation=1}
   [junit4]   2> 727533 INFO  (qtp12513292-5437) [n:127.0.0.1:60750_solr c:testschemaapi s:shard1 r:core_node2 x:testschemaapi_shard1_replica1] o.a.s.c.SolrDeletionPolicy newest commit generation = 1
   [junit4]   2> 727536 INFO  (qtp12513292-5437) [n:127.0.0.1:60750_solr c:testschemaapi s:shard1 r:core_node2 x:testschemaapi_shard1_replica1] o.a.s.c.SolrCore no updateRequestProcessorChain defined as default, creating implicit default
   [junit4]   2> 727546 INFO  (qtp12513292-5437) [n:127.0.0.1:60750_solr c:testschemaapi s:shard1 r:core_node2 x:testschemaapi_shard1_replica1] o.a.s.h.l.XMLLoader xsltCacheLifetimeSeconds=60
   [junit4]   2> 727551 INFO  (qtp12513292-5437) [n:127.0.0.1:60750_solr c:testschemaapi s:shard1 r:core_node2 x:testschemaapi_shard1_replica1] o.a.s.h.l.XMLLoader xsltCacheLifetimeSeconds=60
   [junit4]   2> 727554 INFO  (qtp12513292-5437) [n:127.0.0.1:60750_solr c:testschemaapi s:shard1 r:core_node2 x:testschemaapi_shard1_replica1] o.a.s.h.l.XMLLoader xsltCacheLifetimeSeconds=60
   [junit4]   2> 727555 INFO  (qtp12513292-5437) [n:127.0.0.1:60750_solr c:testschemaapi s:shard1 r:core_node2 x:testschemaapi_shard1_replica1] o.a.s.h.l.XMLLoader xsltCacheLifetimeSeconds=60
   [junit4]   2> 727558 INFO  (qtp12513292-5437) [n:127.0.0.1:60750_solr c:testschemaapi s:shard1 r:core_node2 x:testschemaapi_shard1_replica1] o.a.s.c.RequestHandlers Registered paths: /admin/mbeans,/update/csv,/sql,/update/json/docs,/admin/luke,/export,/select,/admin/segments,/get,/admin/system,/replication,/admin/properties,/config,/stream,/schema,/admin/plugins,/admin/logging,/update/json,/admin/ping,/admin/threads,/update,/admin/file
   [junit4]   2> 727558 INFO  (qtp12513292-5437) [n:127.0.0.1:60750_solr c:testschemaapi s:shard1 r:core_node2 x:testschemaapi_shard1_replica1] o.a.s.c.SolrCore Using default statsCache cache: org.apache.solr.search.stats.LocalStatsCache
   [junit4]   2> 727559 INFO  (qtp12513292-5437) [n:127.0.0.1:60750_solr c:testschemaapi s:shard1 r:core_node2 x:testschemaapi_shard1_replica1] o.a.s.u.UpdateHandler Using UpdateLog implementation: org.apache.solr.update.UpdateLog
   [junit4]   2> 727559 INFO  (qtp12513292-5437) [n:127.0.0.1:60750_solr c:testschemaapi s:shard1 r:core_node2 x:testschemaapi_shard1_replica1] o.a.s.u.UpdateLog Initializing UpdateLog: dataDir=null defaultSyncLevel=FLUSH numRecordsToKeep=100 maxNumLogsToKeep=10 numVersionBuckets=65536
   [junit4]   2> 727562 INFO  (qtp12513292-5437) [n:127.0.0.1:60750_solr c:testschemaapi s:shard1 r:core_node2 x:testschemaapi_shard1_replica1] o.a.s.u.CommitTracker Hard AutoCommit: disabled
   [junit4]   2> 727563 INFO  (qtp12513292-5437) [n:127.0.0.1:60750_solr c:testschemaapi s:shard1 r:core_node2 x:testschemaapi_shard1_replica1] o.a.s.u.CommitTracker Soft AutoCommit: disabled
   [junit4]   2> 727563 INFO  (OldIndexDirectoryCleanupThreadForCore-testschemaapi_shard1_replica1) [n:127.0.0.1:60750_solr c:testschemaapi s:shard1 r:core_node2 x:testschemaapi_shard1_replica1] o.a.s.c.SolrCore Looking for old index directories to cleanup for core testschemaapi_shard1_replica1 in C:\Users\jenkins\workspace\Lucene-Solr-6.x-Windows\solr\build\solr-core\test\J0\temp\solr.schema.TestManagedSchemaAPI_64AB0DEEB58B15D4-001\tempDir-001\node2\.\testschemaapi_shard1_replica1\data\
   [junit4]   2> 727564 INFO  (qtp13561028-5426) [n:127.0.0.1:60747_solr c:testschemaapi s:shard1 r:core_node1 x:testschemaapi_shard1_replica2] o.a.s.c.SolrDeletionPolicy SolrDeletionPolicy.onCommit: commits: num=1
   [junit4]   2> 	commit{dir=MockDirectoryWrapper(RAMDirectory@1640f9a lockFactory=org.apache.lucene.store.SingleInstanceLockFactory@1cb5553),segFN=segments_1,generation=1}
   [junit4]   2> 727564 INFO  (qtp13561028-5426) [n:127.0.0.1:60747_solr c:testschemaapi s:shard1 r:core_node1 x:testschemaapi_shard1_replica2] o.a.s.c.SolrDeletionPolicy newest commit generation = 1
   [junit4]   2> 727567 INFO  (qtp13561028-5426) [n:127.0.0.1:60747_solr c:testschemaapi s:shard1 r:core_node1 x:testschemaapi_shard1_replica2] o.a.s.c.SolrCore no updateRequestProcessorChain defined as default, creating implicit default
   [junit4]   2> 727571 INFO  (qtp13561028-5426) [n:127.0.0.1:60747_solr c:testschemaapi s:shard1 r:core_node1 x:testschemaapi_shard1_replica2] o.a.s.h.l.XMLLoader xsltCacheLifetimeSeconds=60
   [junit4]   2> 727574 INFO  (qtp13561028-5426) [n:127.0.0.1:60747_solr c:testschemaapi s:shard1 r:core_node1 x:testschemaapi_shard1_replica2] o.a.s.h.l.XMLLoader xsltCacheLifetimeSeconds=60
   [junit4]   2> 727576 INFO  (qtp13561028-5426) [n:127.0.0.1:60747_solr c:testschemaapi s:shard1 r:core_node1 x:testschemaapi_shard1_replica2] o.a.s.h.l.XMLLoader xsltCacheLifetimeSeconds=60
   [junit4]   2> 727579 INFO  (qtp13561028-5426) [n:127.0.0.1:60747_solr c:testschemaapi s:shard1 r:core_node1 x:testschemaapi_shard1_replica2] o.a.s.h.l.XMLLoader xsltCacheLifetimeSeconds=60
   [junit4]   2> 727581 INFO  (qtp13561028-5426) [n:127.0.0.1:60747_solr c:testschemaapi s:shard1 r:core_node1 x:testschemaapi_shard1_replica2] o.a.s.c.RequestHandlers Registered paths: /admin/mbeans,/update/csv,/sql,/update/json/docs,/admin/luke,/export,/select,/admin/segments,/get,/admin/system,/replication,/admin/properties,/config,/stream,/schema,/admin/plugins,/admin/logging,/update/json,/admin/ping,/admin/threads,/update,/admin/file
   [junit4]   2> 727581 INFO  (qtp13561028-5426) [n:127.0.0.1:60747_solr c:testschemaapi s:shard1 r:core_node1 x:testschemaapi_shard1_replica2] o.a.s.c.SolrCore Using default statsCache cache: org.apache.solr.search.stats.LocalStatsCache
   [junit4]   2> 727583 INFO  (qtp13561028-5426) [n:127.0.0.1:60747_solr c:testschemaapi s:shard1 r:core_node1 x:testschemaapi_shard1_replica2] o.a.s.u.UpdateHandler Using UpdateLog implementation: org.apache.solr.update.UpdateLog
   [junit4]   2> 727583 INFO  (qtp13561028-5426) [n:127.0.0.1:60747_solr c:testschemaapi s:shard1 r:core_node1 x:testschemaapi_shard1_replica2] o.a.s.u.UpdateLog Initializing UpdateLog: dataDir=null defaultSyncLevel=FLUSH numRecordsToKeep=100 maxNumLogsToKeep=10 numVersionBuckets=65536
   [junit4]   2> 727585 INFO  (qtp13561028-5426) [n:127.0.0.1:60747_solr c:testschemaapi s:shard1 r:core_node1 x:testschemaapi_shard1_replica2] o.a.s.u.CommitTracker Hard AutoCommit: disabled
   [junit4]   2> 727585 INFO  (qtp13561028-5426) [n:127.0.0.1:60747_solr c:testschemaapi s:shard1 r:core_node1 x:testschemaapi_shard1_replica2] o.a.s.u.CommitTracker Soft AutoCommit: disabled
   [junit4]   2> 727587 INFO  (qtp12513292-5437) [n:127.0.0.1:60750_solr c:testschemaapi s:shard1 r:core_node2 x:testschemaapi_shard1_replica1] o.a.s.c.SolrDeletionPolicy SolrDeletionPolicy.onInit: commits: num=1
   [junit4]   2> 	commit{dir=MockDirectoryWrapper(RAMDirectory@149153b lockFactory=org.apache.lucene.store.SingleInstanceLockFactory@3d01f3),segFN=segments_1,generation=1}
   [junit4]   2> 727587 INFO  (qtp12513292-5437) [n:127.0.0.1:60750_solr c:testschemaapi s:shard1 r:core_node2 x:testschemaapi_shard1_replica1] o.a.s.c.SolrDeletionPolicy newest commit generation = 1
   [junit4]   2> 727587 INFO  (qtp12513292-5437) [n:127.0.0.1:60750_solr c:testschemaapi s:shard1 r:core_node2 x:testschemaapi_shard1_replica1] o.a.s.s.SolrIndexSearcher Opening [Searcher@a9c66c[testschemaapi_shard1_replica1] main]
   [junit4]   2> 727587 INFO  (qtp12513292-5437) [n:127.0.0.1:60750_solr c:testschemaapi s:shard1 r:core_node2 x:testschemaapi_shard1_replica1] o.a.s.c.c.ZkStateReader Load collection config from: [/collections/testschemaapi]
   [junit4]   2> 727590 INFO  (OldIndexDirectoryCleanupThreadForCore-testschemaapi_shard1_replica2) [n:127.0.0.1:60747_solr c:testschemaapi s:shard1 r:core_node1 x:testschemaapi_shard1_replica2] o.a.s.c.SolrCore Looking for old index directories to cleanup for core testschemaapi_shard1_replica2 in C:\Users\jenkins\workspace\Lucene-Solr-6.x-Windows\solr\build\solr-core\test\J0\temp\solr.schema.TestManagedSchemaAPI_64AB0DEEB58B15D4-001\tempDir-001\node1\.\testschemaapi_shard1_replica2\data\
   [junit4]   2> 727591 INFO  (qtp12513292-5437) [n:127.0.0.1:60750_solr c:testschemaapi s:shard1 r:core_node2 x:testschemaapi_shard1_replica1] o.a.s.c.c.ZkStateReader path=[/collections/testschemaapi] [configName]=[conf1] specified config exists in ZooKeeper
   [junit4]   2> 727591 INFO  (qtp12513292-5437) [n:127.0.0.1:60750_solr c:testschemaapi s:shard1 r:core_node2 x:testschemaapi_shard1_replica1] o.a.s.r.ManagedResourceStorage Setting up ZooKeeper-based storage for the RestManager with znodeBase: /configs/conf1
   [junit4]   2> 727592 INFO  (qtp12513292-5437) [n:127.0.0.1:60750_solr c:testschemaapi s:shard1 r:core_node2 x:testschemaapi_shard1_replica1] o.a.s.r.ManagedResourceStorage Configured ZooKeeperStorageIO with znodeBase: /configs/conf1
   [junit4]   2> 727592 INFO  (qtp12513292-5437) [n:127.0.0.1:60750_solr c:testschemaapi s:shard1 r:core_node2 x:testschemaapi_shard1_replica1] o.a.s.r.RestManager Initializing RestManager with initArgs: {}
   [junit4]   2> 727592 INFO  (qtp12513292-5437) [n:127.0.0.1:60750_solr c:testschemaapi s:shard1 r:core_node2 x:testschemaapi_shard1_replica1] o.a.s.r.ManagedResourceStorage Reading _rest_managed.json using ZooKeeperStorageIO:path=/configs/conf1
   [junit4]   2> 727593 INFO  (qtp12513292-5437) [n:127.0.0.1:60750_solr c:testschemaapi s:shard1 r:core_node2 x:testschemaapi_shard1_replica1] o.a.s.r.ManagedResourceStorage No data found for znode /configs/conf1/_rest_managed.json
   [junit4]   2> 727593 INFO  (qtp12513292-5437) [n:127.0.0.1:60750_solr c:testschemaapi s:shard1 r:core_node2 x:testschemaapi_shard1_replica1] o.a.s.r.ManagedResourceStorage Loaded null at path _rest_managed.json using ZooKeeperStorageIO:path=/configs/conf1
   [junit4]   2> 727593 INFO  (qtp12513292-5437) [n:127.0.0.1:60750_solr c:testschemaapi s:shard1 r:core_node2 x:testschemaapi_shard1_replica1] o.a.s.r.RestManager Initializing 0 registered ManagedResources
   [junit4]   2> 727593 INFO  (qtp12513292-5437) [n:127.0.0.1:60750_solr c:testschemaapi s:shard1 r:core_node2 x:testschemaapi_shard1_replica1] o.a.s.s.ZkIndexSchemaReader Creating ZooKeeper watch for the managed schema at /configs/conf1/managed-schema
   [junit4]   2> 727594 INFO  (qtp12513292-5437) [n:127.0.0.1:60750_solr c:testschemaapi s:shard1 r:core_node2 x:testschemaapi_shard1_replica1] o.a.s.c.ZkController Added new OnReconnect listener ZkIndexSchemaReader: /configs/conf1/managed-schema, uniqueCoreId: testschemaapi_shard1_replica1:14255543723580
   [junit4]   2> 727594 INFO  (qtp12513292-5437) [n:127.0.0.1:60750_solr c:testschemaapi s:shard1 r:core_node2 x:testschemaapi_shard1_replica1] o.a.s.h.ReplicationHandler Commits will be reserved for  10000
   [junit4]   2> 727594 INFO  (qtp12513292-5437) [n:127.0.0.1:60750_solr c:testschemaapi s:shard1 r:core_node2 x:testschemaapi_shard1_replica1] o.a.s.u.UpdateLog Looking up max value of version field to seed version buckets
   [junit4]   2> 727594 INFO  (qtp12513292-5437) [n:127.0.0.1:60750_solr c:testschemaapi s:shard1 r:core_node2 x:testschemaapi_shard1_replica1] o.a.s.u.VersionInfo Refreshing highest value of _version_ for 65536 version buckets from index
   [junit4]   2> 727595 INFO  (qtp12513292-5437) [n:127.0.0.1:60750_solr c:testschemaapi s:shard1 r:core_node2 x:testschemaapi_shard1_replica1] o.a.s.u.VersionInfo No terms found for _version_, cannot seed version bucket highest value from index
   [junit4]   2> 727595 INFO  (qtp12513292-5437) [n:127.0.0.1:60750_solr c:testschemaapi s:shard1 r:core_node2 x:testschemaapi_shard1_replica1] o.a.s.u.UpdateLog Could not find max version in index or recent updates, using new clock 1533158788828233728
   [junit4]   2> 727595 INFO  (searcherExecutor-2881-thread-1-processing-n:127.0.0.1:60750_solr x:testschemaapi_shard1_replica1 s:shard1 c:testschemaapi r:core_node2) [n:127.0.0.1:60750_solr c:testschemaapi s:shard1 r:core_node2 x:testschemaapi_shard1_replica1] o.a.s.c.SolrCore [testschemaapi_shard1_replica1] Registered new searcher Searcher@a9c66c[testschemaapi_shard1_replica1] main{ExitableDirectoryReader(UninvertingDirectoryReader())}
   [junit4]   2> 727597 INFO  (qtp13561028-5426) [n:127.0.0.1:60747_solr c:testschemaapi s:shard1 r:core_node1 x:testschemaapi_shard1_replica2] o.a.s.c.SolrDeletionPolicy SolrDeletionPolicy.onInit: commits: num=1
   [junit4]   2> 	commit{dir=MockDirectoryWrapper(RAMDirectory@1640f9a lockFactory=org.apache.lucene.store.SingleInstanceLockFactory@1cb5553),segFN=segments_1,generation=1}
   [junit4]   2> 727597 INFO  (qtp13561028-5426) [n:127.0.0.1:60747_solr c:testschemaapi s:shard1 r:core_node1 x:testschemaapi_shard1_replica2] o.a.s.c.SolrDeletionPolicy newest commit generation = 1
   [junit4]   2> 727597 INFO  (qtp13561028-5426) [n:127.0.0.1:60747_solr c:testschemaapi s:shard1 r:core_node1 x:testschemaapi_shard1_replica2] o.a.s.s.SolrIndexSearcher Opening [Searcher@1fe3a5[testschemaapi_shard1_replica2] main]
   [junit4]   2> 727597 INFO  (qtp12513292-5437) [n:127.0.0.1:60750_solr c:testschemaapi s:shard1 r:core_node2 x:testschemaapi_shard1_replica1] o.a.s.u.UpdateLog Took 3.0ms to seed version buckets with highest version 1533158788828233728
   [junit4]   2> 727598 INFO  (qtp13561028-5426) [n:127.0.0.1:60747_solr c:testschemaapi s:shard1 r:core_node1 x:testschemaapi_shard1_replica2] o.a.s.c.c.ZkStateReader Load collection config from: [/collections/testschemaapi]
   [junit4]   2> 727598 INFO  (qtp12513292-5437) [n:127.0.0.1:60750_solr c:testschemaapi s:shard1 r:core_node2 x:testschemaapi_shard1_replica1] o.a.s.c.ZkController watch zkdir /configs/conf1
   [junit4]   2> 727599 INFO  (qtp12513292-5437) [n:127.0.0.1:60750_solr c:testschemaapi s:shard1 r:core_node2 x:testschemaapi_shard1_replica1] o.a.s.c.CoreContainer registering core: testschemaapi_shard1_replica1
   [junit4]   2> 727599 INFO  (qtp12513292-5437) [n:127.0.0.1:60750_solr c:testschemaapi s:shard1 r:core_node2 x:testschemaapi_shard1_replica1] o.a.s.c.ZkController Register replica - core:testschemaapi_shard1_replica1 address:http://127.0.0.1:60750/solr collection:testschemaapi shard:shard1
   [junit4]   2> 727601 INFO  (qtp12513292-5437) [n:127.0.0.1:60750_solr c:testschemaapi s:shard1 r:core_node2 x:testschemaapi_shard1_replica1] o.a.s.c.c.SolrZkClient makePath: /collections/testschemaapi/leader_elect/shard1/election
   [junit4]   2> 727601 INFO  (qtp13561028-5426) [n:127.0.0.1:60747_solr c:testschemaapi s:shard1 r:core_node1 x:testschemaapi_shard1_replica2] o.a.s.c.c.ZkStateReader path=[/collections/testschemaapi] [configName]=[conf1] specified config exists in ZooKeeper
   [junit4]   2> 727601 INFO  (qtp13561028-5426) [n:127.0.0.1:60747_solr c:testschemaapi s:shard1 r:core_node1 x:testschemaapi_shard1_replica2] o.a.s.r.ManagedResourceStorage Setting up ZooKeeper-based storage for the RestManager with znodeBase: /configs/conf1
   [junit4]   2> 727601 INFO  (qtp13561028-5426) [n:127.0.0.1:60747_solr c:testschemaapi s:shard1 r:core_node1 x:testschemaapi_shard1_replica2] o.a.s.r.ManagedResourceStorage Configured ZooKeeperStorageIO with znodeBase: /configs/conf1
   [junit4]   2> 727601 INFO  (qtp13561028-5426) [n:127.0.0.1:60747_solr c:testschemaapi s:shard1 r:core_node1 x:testschemaapi_shard1_replica2] o.a.s.r.RestManager Initializing RestManager with initArgs: {}
   [junit4]   2> 727601 INFO  (qtp13561028-5426) [n:127.0.0.1:60747_solr c:testschemaapi s:shard1 r:core_node1 x:testschemaapi_shard1_replica2] o.a.s.r.ManagedResourceStorage Reading _rest_managed.json using ZooKeeperStorageIO:path=/configs/conf1
   [junit4]   2> 727602 INFO  (qtp13561028-5426) [n:127.0.0.1:60747_solr c:testschemaapi s:shard1 r:core_node1 x:testschemaapi_shard1_replica2] o.a.s.r.ManagedResourceStorage No data found for znode /configs/conf1/_rest_managed.json
   [junit4]   2> 727602 INFO  (qtp13561028-5426) [n:127.0.0.1:60747_solr c:testschemaapi s:shard1 r:core_node1 x:testschemaapi_shard1_replica2] o.a.s.r.ManagedResourceStorage Loaded null at path _rest_managed.json using ZooKeeperStorageIO:path=/configs/conf1
   [junit4]   2> 727602 INFO  (qtp13561028-5426) [n:127.0.0.1:60747_solr c:testschemaapi s:shard1 r:core_node1 x:testschemaapi_shard1_replica2] o.a.s.r.RestManager Initializing 0 registered ManagedResources
   [junit4]   2> 727602 INFO  (qtp13561028-5426) [n:127.0.0.1:60747_solr c:testschemaapi s:shard1 r:core_node1 x:testschemaapi_shard1_replica2] o.a.s.s.ZkIndexSchemaReader Creating ZooKeeper watch for the managed schema at /configs/conf1/managed-schema
   [junit4]   2> 727603 INFO  (qtp13561028-5426) [n:127.0.0.1:60747_solr c:testschemaapi s:shard1 r:core_node1 x:testschemaapi_shard1_replica2] o.a.s.c.ZkController Added new OnReconnect listener ZkIndexSchemaReader: /configs/conf1/managed-schema, uniqueCoreId: testschemaapi_shard1_replica2:14255582748837
   [junit4]   2> 727603 INFO  (qtp13561028-5426) [n:127.0.0.1:60747_solr c:testschemaapi s:shard1 r:core_node1 x:testschemaapi_shard1_replica2] o.a.s.h.ReplicationHandler Commits will be reserved for  10000
   [junit4]   2> 727603 INFO  (qtp13561028-5426) [n:127.0.0.1:60747_solr c:testschemaapi s:shard1 r:core_node1 x:testschemaapi_shard1_replica2] o.a.s.u.UpdateLog Looking up max value of version field to seed version buckets
   [junit4]   2> 727603 INFO  (qtp13561028-5426) [n:127.0.0.1:60747_solr c:testschemaapi s:shard1 r:core_node1 x:testschemaapi_shard1_replica2] o.a.s.u.VersionInfo Refreshing highest value of _version_ for 65536 version buckets from index
   [junit4]   2> 727603 INFO  (searcherExecutor-2882-thread-1-processing-n:127.0.0.1:60747_solr x:testschemaapi_shard1_replica2 s:shard1 c:testschemaapi r:core_node1) [n:127.0.0.1:60747_solr c:testschemaapi s:shard1 r:core_node1 x:testschemaapi_shard1_replica2] o.a.s.c.SolrCore [testschemaapi_shard1_replica2] Registered new searcher Searcher@1fe3a5[testschemaapi_shard1_replica2] main{ExitableDirectoryReader(UninvertingDirectoryReader())}
   [junit4]   2> 727603 INFO  (qtp13561028-5426) [n:127.0.0.1:60747_solr c:testschemaapi s:shard1 r:core_node1 x:testschemaapi_shard1_replica2] o.a.s.u.VersionInfo No terms found for _version_, cannot seed version bucket highest value from index
   [junit4]   2> 727603 INFO  (qtp13561028-5426) [n:127.0.0.1:60747_solr c:testschemaapi s:shard1 r:core_node1 x:testschemaapi_shard1_replica2] o.a.s.u.UpdateLog Could not find max version in index or recent updates, using new clock 1533158788836622336
   [junit4]   2> 727605 INFO  (qtp13561028-5426) [n:127.0.0.1:60747_solr c:testschemaapi s:shard1 r:core_node1 x:testschemaapi_shard1_replica2] o.a.s.u.UpdateLog Took 1.0ms to seed version buckets with highest version 1533158788836622336
   [junit4]   2> 727605 INFO  (qtp13561028-5426) [n:127.0.0.1:60747_solr c:testschemaapi s:shard1 r:core_node1 x:testschemaapi_shard1_replica2] o.a.s.c.ZkController watch zkdir /configs/conf1
   [junit4]   2> 727606 INFO  (qtp13561028-5426) [n:127.0.0.1:60747_solr c:testschemaapi s:shard1 r:core_node1 x:testschemaapi_shard1_replica2] o.a.s.c.CoreContainer registering core: testschemaapi_shard1_replica2
   [junit4]   2> 727606 INFO  (qtp13561028-5426) [n:127.0.0.1:60747_solr c:testschemaapi s:shard1 r:core_node1 x:testschemaapi_shard1_replica2] o.a.s.c.ZkController Register replica - core:testschemaapi_shard1_replica2 address:http://127.0.0.1:60747/solr collection:testschemaapi shard:shard1
   [junit4]   2> 727607 INFO  (qtp13561028-5426) [n:127.0.0.1:60747_solr c:testschemaapi s:shard1 r:core_node1 x:testschemaapi_shard1_replica2] o.a.s.c.LeaderElector Joined leadership election with path: /collections/testschemaapi/leader_elect/shard1/election/95822424118722566-core_node1-n_0000000000
   [junit4]   2> 727608 INFO  (qtp12513292-5437) [n:127.0.0.1:60750_solr c:testschemaapi s:shard1 r:core_node2 x:testschemaapi_shard1_replica1] o.a.s.c.LeaderElector Joined leadership election with path: /collections/testschemaapi/leader_elect/shard1/election/95822424118722565-core_node2-n_0000000001
   [junit4]   2> 727608 INFO  (qtp13561028-5426) [n:127.0.0.1:60747_solr c:testschemaapi s:shard1 r:core_node1 x:testschemaapi_shard1_replica2] o.a.s.c.ShardLeaderElectionContext Running the leader process for shard=shard1 and weAreReplacement=false and leaderVoteWait=10000
   [junit4]   2> 727610 INFO  (qtp12513292-5437) [n:127.0.0.1:60750_solr c:testschemaapi s:shard1 r:core_node2 x:testschemaapi_shard1_replica1] o.a.s.c.LeaderElector Watching path /collections/testschemaapi/leader_elect/shard1/election/95822424118722566-core_node1-n_0000000000 to know if I could be the leader
   [junit4]   2> 727613 INFO  (qtp13561028-5426) [n:127.0.0.1:60747_solr c:testschemaapi s:shard1 r:core_node1 x:test

[...truncated too long message...]

aramsTest, TestFilteredDocIdSet, MoreLikeThisHandlerTest, PreAnalyzedUpdateProcessorTest, TestUpdate, DistributedSpellCheckComponentTest, RankQueryTest, DocValuesTest, XmlUpdateRequestHandlerTest, TestXIncludeConfig, CloudExitableDirectoryReaderTest, CollectionStateFormat2Test, DataDrivenBlockJoinTest, CdcrReplicationDistributedZkTest, TestReplicationHandler, QueryEqualityTest, HdfsNNFailoverTest, TestPhraseSuggestions, HighlighterTest, TestRTimerTree, VersionInfoTest, TestTestInjection, TestAddFieldRealTimeGet, TestSolrCloudWithKerberosAlt, TestStandardQParsers, OverseerStatusTest, UUIDFieldTest, CircularListTest, QueryElevationComponentTest, DeleteShardTest, TestNonDefinedSimilarityFactory, PKIAuthenticationIntegrationTest, TestBlobHandler, TestSimpleQParserPlugin, TestBulkSchemaAPI, RecoveryAfterSoftCommitTest, PeerSyncTest, TestTrieFacet, TestIntervalFaceting, DirectSolrSpellCheckerTest, ZkControllerTest, PreAnalyzedFieldTest, ExitableDirectoryReaderTest, TestExceedMaxTermLength, SolrIndexConfigTest, TestReplicationHandlerBackup, TestAnalyzedSuggestions, TestIBSimilarityFactory, TestCoreContainer, JsonLoaderTest, TestCloudPivotFacet, TestPerFieldSimilarityWithDefaultOverride, BlockCacheTest, ConnectionManagerTest, TestDocumentBuilder, TestCollationFieldDocValues, TestCustomSort, CursorPagingTest, TestOverriddenPrefixQueryForCustomFieldType, FastVectorHighlighterTest, SystemInfoHandlerTest, TestRandomCollapseQParserPlugin, DateRangeFieldTest, TestImplicitCoreProperties, StatelessScriptUpdateProcessorFactoryTest, JavabinLoaderTest, TestSerializedLuceneMatchVersion, SecurityConfHandlerTest, TestCursorMarkWithoutUniqueKey, ZkStateWriterTest, DeleteLastCustomShardedReplicaTest, IndexBasedSpellCheckerTest, PingRequestHandlerTest, SimplePostToolTest, TestManagedResourceStorage, BadCopyFieldTest, ActionThrottleTest, SOLR749Test, HdfsLockFactoryTest, RequiredFieldsTest, StandardRequestHandlerTest, ShardRoutingTest, RecoveryZkTest, SolrRequestParserTest, ConcurrentDeleteAndCreateCollectionTest, DistributedQueryComponentOptimizationTest, SolrXmlInZkTest, EnumFieldTest, SharedFSAutoReplicaFailoverTest, TestRemoteStreaming, WrapperMergePolicyFactoryTest, BlobRepositoryCloudTest, TestManagedSchemaAPI]
   [junit4]   2> NOTE: reproduce with: ant test  -Dtestcase=TestManagedSchemaAPI -Dtests.seed=64AB0DEEB58B15D4 -Dtests.slow=true -Dtests.locale=hi -Dtests.timezone=America/Glace_Bay -Dtests.asserts=true -Dtests.file.encoding=US-ASCII
   [junit4] ERROR   0.00s J0 | TestManagedSchemaAPI (suite) <<<
   [junit4]    > Throwable #1: java.lang.AssertionError: ObjectTracker found 8 object(s) that were not released!!! [MDCAwareThreadPoolExecutor, MockDirectoryWrapper, MockDirectoryWrapper, MDCAwareThreadPoolExecutor, TransactionLog, TransactionLog, MockDirectoryWrapper, MockDirectoryWrapper]
   [junit4]    > 	at __randomizedtesting.SeedInfo.seed([64AB0DEEB58B15D4]:0)
   [junit4]    > 	at org.apache.solr.SolrTestCaseJ4.afterClass(SolrTestCaseJ4.java:256)
   [junit4]    > 	at java.lang.Thread.run(Thread.java:745)Throwable #2: java.io.IOException: Could not remove the following files (in the order of attempts):
   [junit4]    >    C:\Users\jenkins\workspace\Lucene-Solr-6.x-Windows\solr\build\solr-core\test\J0\temp\solr.schema.TestManagedSchemaAPI_64AB0DEEB58B15D4-001\tempDir-001\node2\testschemaapi_shard1_replica1\data\tlog\tlog.0000000000000000000: java.nio.file.FileSystemException: C:\Users\jenkins\workspace\Lucene-Solr-6.x-Windows\solr\build\solr-core\test\J0\temp\solr.schema.TestManagedSchemaAPI_64AB0DEEB58B15D4-001\tempDir-001\node2\testschemaapi_shard1_replica1\data\tlog\tlog.0000000000000000000: The process cannot access the file because it is being used by another process.
   [junit4]    >    C:\Users\jenkins\workspace\Lucene-Solr-6.x-Windows\solr\build\solr-core\test\J0\temp\solr.schema.TestManagedSchemaAPI_64AB0DEEB58B15D4-001\tempDir-001\node2\testschemaapi_shard1_replica1\data\tlog: java.nio.file.DirectoryNotEmptyException: C:\Users\jenkins\workspace\Lucene-Solr-6.x-Windows\solr\build\solr-core\test\J0\temp\solr.schema.TestManagedSchemaAPI_64AB0DEEB58B15D4-001\tempDir-001\node2\testschemaapi_shard1_replica1\data\tlog
   [junit4]    >    C:\Users\jenkins\workspace\Lucene-Solr-6.x-Windows\solr\build\solr-core\test\J0\temp\solr.schema.TestManagedSchemaAPI_64AB0DEEB58B15D4-001\tempDir-001\node2\testschemaapi_shard1_replica1\data: java.nio.file.DirectoryNotEmptyException: C:\Users\jenkins\workspace\Lucene-Solr-6.x-Windows\solr\build\solr-core\test\J0\temp\solr.schema.TestManagedSchemaAPI_64AB0DEEB58B15D4-001\tempDir-001\node2\testschemaapi_shard1_replica1\data
   [junit4]    >    C:\Users\jenkins\workspace\Lucene-Solr-6.x-Windows\solr\build\solr-core\test\J0\temp\solr.schema.TestManagedSchemaAPI_64AB0DEEB58B15D4-001\tempDir-001\node2\testschemaapi_shard1_replica1: java.nio.file.DirectoryNotEmptyException: C:\Users\jenkins\workspace\Lucene-Solr-6.x-Windows\solr\build\solr-core\test\J0\temp\solr.schema.TestManagedSchemaAPI_64AB0DEEB58B15D4-001\tempDir-001\node2\testschemaapi_shard1_replica1
   [junit4]    >    C:\Users\jenkins\workspace\Lucene-Solr-6.x-Windows\solr\build\solr-core\test\J0\temp\solr.schema.TestManagedSchemaAPI_64AB0DEEB58B15D4-001\tempDir-001\node2: java.nio.file.DirectoryNotEmptyException: C:\Users\jenkins\workspace\Lucene-Solr-6.x-Windows\solr\build\solr-core\test\J0\temp\solr.schema.TestManagedSchemaAPI_64AB0DEEB58B15D4-001\tempDir-001\node2
   [junit4]    >    C:\Users\jenkins\workspace\Lucene-Solr-6.x-Windows\solr\build\solr-core\test\J0\temp\solr.schema.TestManagedSchemaAPI_64AB0DEEB58B15D4-001\tempDir-001\node1\testschemaapi_shard1_replica2\data\tlog\tlog.0000000000000000001: java.nio.file.FileSystemException: C:\Users\jenkins\workspace\Lucene-Solr-6.x-Windows\solr\build\solr-core\test\J0\temp\solr.schema.TestManagedSchemaAPI_64AB0DEEB58B15D4-001\tempDir-001\node1\testschemaapi_shard1_replica2\data\tlog\tlog.0000000000000000001: The process cannot access the file because it is being used by another process.
   [junit4]    >    C:\Users\jenkins\workspace\Lucene-Solr-6.x-Windows\solr\build\solr-core\test\J0\temp\solr.schema.TestManagedSchemaAPI_64AB0DEEB58B15D4-001\tempDir-001\node1\testschemaapi_shard1_replica2\data\tlog: java.nio.file.DirectoryNotEmptyException: C:\Users\jenkins\workspace\Lucene-Solr-6.x-Windows\solr\build\solr-core\test\J0\temp\solr.schema.TestManagedSchemaAPI_64AB0DEEB58B15D4-001\tempDir-001\node1\testschemaapi_shard1_replica2\data\tlog
   [junit4]    >    C:\Users\jenkins\workspace\Lucene-Solr-6.x-Windows\solr\build\solr-core\test\J0\temp\solr.schema.TestManagedSchemaAPI_64AB0DEEB58B15D4-001\tempDir-001\node1\testschemaapi_shard1_replica2\data: java.nio.file.DirectoryNotEmptyException: C:\Users\jenkins\workspace\Lucene-Solr-6.x-Windows\solr\build\solr-core\test\J0\temp\solr.schema.TestManagedSchemaAPI_64AB0DEEB58B15D4-001\tempDir-001\node1\testschemaapi_shard1_replica2\data
   [junit4]    >    C:\Users\jenkins\workspace\Lucene-Solr-6.x-Windows\solr\build\solr-core\test\J0\temp\solr.schema.TestManagedSchemaAPI_64AB0DEEB58B15D4-001\tempDir-001\node1\testschemaapi_shard1_replica2: java.nio.file.DirectoryNotEmptyException: C:\Users\jenkins\workspace\Lucene-Solr-6.x-Windows\solr\build\solr-core\test\J0\temp\solr.schema.TestManagedSchemaAPI_64AB0DEEB58B15D4-001\tempDir-001\node1\testschemaapi_shard1_replica2
   [junit4]    >    C:\Users\jenkins\workspace\Lucene-Solr-6.x-Windows\solr\build\solr-core\test\J0\temp\solr.schema.TestManagedSchemaAPI_64AB0DEEB58B15D4-001\tempDir-001\node1: java.nio.file.DirectoryNotEmptyException: C:\Users\jenkins\workspace\Lucene-Solr-6.x-Windows\solr\build\solr-core\test\J0\temp\solr.schema.TestManagedSchemaAPI_64AB0DEEB58B15D4-001\tempDir-001\node1
   [junit4]    >    C:\Users\jenkins\workspace\Lucene-Solr-6.x-Windows\solr\build\solr-core\test\J0\temp\solr.schema.TestManagedSchemaAPI_64AB0DEEB58B15D4-001\tempDir-001: java.nio.file.DirectoryNotEmptyException: C:\Users\jenkins\workspace\Lucene-Solr-6.x-Windows\solr\build\solr-core\test\J0\temp\solr.schema.TestManagedSchemaAPI_64AB0DEEB58B15D4-001\tempDir-001
   [junit4]    >    C:\Users\jenkins\workspace\Lucene-Solr-6.x-Windows\solr\build\solr-core\test\J0\temp\solr.schema.TestManagedSchemaAPI_64AB0DEEB58B15D4-001: java.nio.file.DirectoryNotEmptyException: C:\Users\jenkins\workspace\Lucene-Solr-6.x-Windows\solr\build\solr-core\test\J0\temp\solr.schema.TestManagedSchemaAPI_64AB0DEEB58B15D4-001
   [junit4]    > 	at org.apache.lucene.util.IOUtils.rm(IOUtils.java:323)
   [junit4]    > 	at java.lang.Thread.run(Thread.java:745)
   [junit4] Completed [163/592 (1!)] on J0 in 14.16s, 1 test, 1 failure, 1 error <<< FAILURES!

[...truncated 1392 lines...]
BUILD FAILED
C:\Users\jenkins\workspace\Lucene-Solr-6.x-Windows\build.xml:740: The following error occurred while executing this line:
C:\Users\jenkins\workspace\Lucene-Solr-6.x-Windows\build.xml:684: The following error occurred while executing this line:
C:\Users\jenkins\workspace\Lucene-Solr-6.x-Windows\build.xml:59: The following error occurred while executing this line:
C:\Users\jenkins\workspace\Lucene-Solr-6.x-Windows\solr\build.xml:233: The following error occurred while executing this line:
C:\Users\jenkins\workspace\Lucene-Solr-6.x-Windows\solr\common-build.xml:529: The following error occurred while executing this line:
C:\Users\jenkins\workspace\Lucene-Solr-6.x-Windows\lucene\common-build.xml:1457: The following error occurred while executing this line:
C:\Users\jenkins\workspace\Lucene-Solr-6.x-Windows\lucene\common-build.xml:1014: There were test failures: 592 suites (10 ignored), 2399 tests, 2 suite-level errors, 124 ignored (80 assumptions) [seed: 64AB0DEEB58B15D4]

Total time: 79 minutes 44 seconds
Build step 'Invoke Ant' marked build as failure
Archiving artifacts
[WARNINGS] Skipping publisher since build result is FAILURE
Recording test results
Email was triggered for: Failure - Any
Sending email for trigger: Failure - Any



Mime
View raw message