lucene-dev mailing list archives

Site index · List index
Message view « Date » · « Thread »
Top « Date » · « Thread »
From Policeman Jenkins Server <jenk...@thetaphi.de>
Subject [JENKINS] Lucene-Solr-master-Linux (64bit/jdk1.8.0_92) - Build # 16859 - Still Failing!
Date Sun, 29 May 2016 14:32:37 GMT
Build: http://jenkins.thetaphi.de/job/Lucene-Solr-master-Linux/16859/
Java: 64bit/jdk1.8.0_92 -XX:-UseCompressedOops -XX:+UseConcMarkSweepGC

3 tests failed.
FAILED:  junit.framework.TestSuite.org.apache.solr.handler.TestReplicationHandler

Error Message:
ObjectTracker found 2 object(s) that were not released!!! [NRTCachingDirectory, NRTCachingDirectory]

Stack Trace:
java.lang.AssertionError: ObjectTracker found 2 object(s) that were not released!!! [NRTCachingDirectory, NRTCachingDirectory]
	at __randomizedtesting.SeedInfo.seed([41FEA0D4A33982F6]:0)
	at org.junit.Assert.fail(Assert.java:93)
	at org.junit.Assert.assertTrue(Assert.java:43)
	at org.junit.Assert.assertNull(Assert.java:551)
	at org.apache.solr.SolrTestCaseJ4.afterClass(SolrTestCaseJ4.java:255)
	at sun.reflect.GeneratedMethodAccessor19.invoke(Unknown Source)
	at sun.reflect.DelegatingMethodAccessorImpl.invoke(DelegatingMethodAccessorImpl.java:43)
	at java.lang.reflect.Method.invoke(Method.java:498)
	at com.carrotsearch.randomizedtesting.RandomizedRunner.invoke(RandomizedRunner.java:1764)
	at com.carrotsearch.randomizedtesting.RandomizedRunner$7.evaluate(RandomizedRunner.java:834)
	at com.carrotsearch.randomizedtesting.rules.StatementAdapter.evaluate(StatementAdapter.java:36)
	at com.carrotsearch.randomizedtesting.rules.SystemPropertiesRestoreRule$1.evaluate(SystemPropertiesRestoreRule.java:57)
	at org.apache.lucene.util.AbstractBeforeAfterRule$1.evaluate(AbstractBeforeAfterRule.java:45)
	at com.carrotsearch.randomizedtesting.rules.StatementAdapter.evaluate(StatementAdapter.java:36)
	at org.apache.lucene.util.TestRuleStoreClassName$1.evaluate(TestRuleStoreClassName.java:41)
	at com.carrotsearch.randomizedtesting.rules.NoShadowingOrOverridesOnMethodsRule$1.evaluate(NoShadowingOrOverridesOnMethodsRule.java:40)
	at com.carrotsearch.randomizedtesting.rules.NoShadowingOrOverridesOnMethodsRule$1.evaluate(NoShadowingOrOverridesOnMethodsRule.java:40)
	at com.carrotsearch.randomizedtesting.rules.StatementAdapter.evaluate(StatementAdapter.java:36)
	at com.carrotsearch.randomizedtesting.rules.StatementAdapter.evaluate(StatementAdapter.java:36)
	at com.carrotsearch.randomizedtesting.rules.StatementAdapter.evaluate(StatementAdapter.java:36)
	at org.apache.lucene.util.TestRuleAssertionsRequired$1.evaluate(TestRuleAssertionsRequired.java:53)
	at org.apache.lucene.util.TestRuleMarkFailure$1.evaluate(TestRuleMarkFailure.java:47)
	at org.apache.lucene.util.TestRuleIgnoreAfterMaxFailures$1.evaluate(TestRuleIgnoreAfterMaxFailures.java:64)
	at org.apache.lucene.util.TestRuleIgnoreTestSuites$1.evaluate(TestRuleIgnoreTestSuites.java:54)
	at com.carrotsearch.randomizedtesting.rules.StatementAdapter.evaluate(StatementAdapter.java:36)
	at com.carrotsearch.randomizedtesting.ThreadLeakControl$StatementRunner.run(ThreadLeakControl.java:367)
	at java.lang.Thread.run(Thread.java:745)


FAILED:  org.apache.solr.handler.TestReqParamsAPI.test

Error Message:
Could not get expected value  'CY val modified' for path 'response/params/y/c' full output: {   "responseHeader":{     "status":0,     "QTime":0},   "response":{     "znodeVersion":0,     "params":{"x":{         "a":"A val",         "b":"B val",         "":{"v":0}}}}},  from server:  http://127.0.0.1:46660/yel/j/collection1

Stack Trace:
java.lang.AssertionError: Could not get expected value  'CY val modified' for path 'response/params/y/c' full output: {
  "responseHeader":{
    "status":0,
    "QTime":0},
  "response":{
    "znodeVersion":0,
    "params":{"x":{
        "a":"A val",
        "b":"B val",
        "":{"v":0}}}}},  from server:  http://127.0.0.1:46660/yel/j/collection1
	at __randomizedtesting.SeedInfo.seed([41FEA0D4A33982F6:C9AA9F0E0DC5EF0E]:0)
	at org.junit.Assert.fail(Assert.java:93)
	at org.junit.Assert.assertTrue(Assert.java:43)
	at org.apache.solr.core.TestSolrConfigHandler.testForResponseElement(TestSolrConfigHandler.java:457)
	at org.apache.solr.handler.TestReqParamsAPI.testReqParams(TestReqParamsAPI.java:195)
	at org.apache.solr.handler.TestReqParamsAPI.test(TestReqParamsAPI.java:62)
	at sun.reflect.NativeMethodAccessorImpl.invoke0(Native Method)
	at sun.reflect.NativeMethodAccessorImpl.invoke(NativeMethodAccessorImpl.java:62)
	at sun.reflect.DelegatingMethodAccessorImpl.invoke(DelegatingMethodAccessorImpl.java:43)
	at java.lang.reflect.Method.invoke(Method.java:498)
	at com.carrotsearch.randomizedtesting.RandomizedRunner.invoke(RandomizedRunner.java:1764)
	at com.carrotsearch.randomizedtesting.RandomizedRunner$8.evaluate(RandomizedRunner.java:871)
	at com.carrotsearch.randomizedtesting.RandomizedRunner$9.evaluate(RandomizedRunner.java:907)
	at com.carrotsearch.randomizedtesting.RandomizedRunner$10.evaluate(RandomizedRunner.java:921)
	at org.apache.solr.BaseDistributedSearchTestCase$ShardsRepeatRule$ShardsFixedStatement.callStatement(BaseDistributedSearchTestCase.java:985)
	at org.apache.solr.BaseDistributedSearchTestCase$ShardsRepeatRule$ShardsStatement.evaluate(BaseDistributedSearchTestCase.java:960)
	at com.carrotsearch.randomizedtesting.rules.SystemPropertiesRestoreRule$1.evaluate(SystemPropertiesRestoreRule.java:57)
	at org.apache.lucene.util.TestRuleSetupTeardownChained$1.evaluate(TestRuleSetupTeardownChained.java:49)
	at org.apache.lucene.util.AbstractBeforeAfterRule$1.evaluate(AbstractBeforeAfterRule.java:45)
	at org.apache.lucene.util.TestRuleThreadAndTestName$1.evaluate(TestRuleThreadAndTestName.java:48)
	at org.apache.lucene.util.TestRuleIgnoreAfterMaxFailures$1.evaluate(TestRuleIgnoreAfterMaxFailures.java:64)
	at org.apache.lucene.util.TestRuleMarkFailure$1.evaluate(TestRuleMarkFailure.java:47)
	at com.carrotsearch.randomizedtesting.rules.StatementAdapter.evaluate(StatementAdapter.java:36)
	at com.carrotsearch.randomizedtesting.ThreadLeakControl$StatementRunner.run(ThreadLeakControl.java:367)
	at com.carrotsearch.randomizedtesting.ThreadLeakControl.forkTimeoutingTask(ThreadLeakControl.java:809)
	at com.carrotsearch.randomizedtesting.ThreadLeakControl$3.evaluate(ThreadLeakControl.java:460)
	at com.carrotsearch.randomizedtesting.RandomizedRunner.runSingleTest(RandomizedRunner.java:880)
	at com.carrotsearch.randomizedtesting.RandomizedRunner$5.evaluate(RandomizedRunner.java:781)
	at com.carrotsearch.randomizedtesting.RandomizedRunner$6.evaluate(RandomizedRunner.java:816)
	at com.carrotsearch.randomizedtesting.RandomizedRunner$7.evaluate(RandomizedRunner.java:827)
	at com.carrotsearch.randomizedtesting.rules.StatementAdapter.evaluate(StatementAdapter.java:36)
	at com.carrotsearch.randomizedtesting.rules.SystemPropertiesRestoreRule$1.evaluate(SystemPropertiesRestoreRule.java:57)
	at org.apache.lucene.util.AbstractBeforeAfterRule$1.evaluate(AbstractBeforeAfterRule.java:45)
	at com.carrotsearch.randomizedtesting.rules.StatementAdapter.evaluate(StatementAdapter.java:36)
	at org.apache.lucene.util.TestRuleStoreClassName$1.evaluate(TestRuleStoreClassName.java:41)
	at com.carrotsearch.randomizedtesting.rules.NoShadowingOrOverridesOnMethodsRule$1.evaluate(NoShadowingOrOverridesOnMethodsRule.java:40)
	at com.carrotsearch.randomizedtesting.rules.NoShadowingOrOverridesOnMethodsRule$1.evaluate(NoShadowingOrOverridesOnMethodsRule.java:40)
	at com.carrotsearch.randomizedtesting.rules.StatementAdapter.evaluate(StatementAdapter.java:36)
	at com.carrotsearch.randomizedtesting.rules.StatementAdapter.evaluate(StatementAdapter.java:36)
	at com.carrotsearch.randomizedtesting.rules.StatementAdapter.evaluate(StatementAdapter.java:36)
	at org.apache.lucene.util.TestRuleAssertionsRequired$1.evaluate(TestRuleAssertionsRequired.java:53)
	at org.apache.lucene.util.TestRuleMarkFailure$1.evaluate(TestRuleMarkFailure.java:47)
	at org.apache.lucene.util.TestRuleIgnoreAfterMaxFailures$1.evaluate(TestRuleIgnoreAfterMaxFailures.java:64)
	at org.apache.lucene.util.TestRuleIgnoreTestSuites$1.evaluate(TestRuleIgnoreTestSuites.java:54)
	at com.carrotsearch.randomizedtesting.rules.StatementAdapter.evaluate(StatementAdapter.java:36)
	at com.carrotsearch.randomizedtesting.ThreadLeakControl$StatementRunner.run(ThreadLeakControl.java:367)
	at java.lang.Thread.run(Thread.java:745)


FAILED:  org.apache.solr.util.SolrPluginUtilsTest.testInvokeSetters

Error Message:
argument type mismatch

Stack Trace:
java.lang.IllegalArgumentException: argument type mismatch
	at __randomizedtesting.SeedInfo.seed([41FEA0D4A33982F6:28E10BD4560FE05D]:0)
	at sun.reflect.NativeMethodAccessorImpl.invoke0(Native Method)
	at sun.reflect.NativeMethodAccessorImpl.invoke(NativeMethodAccessorImpl.java:62)
	at sun.reflect.DelegatingMethodAccessorImpl.invoke(DelegatingMethodAccessorImpl.java:43)
	at java.lang.reflect.Method.invoke(Method.java:498)
	at org.apache.solr.util.SolrPluginUtils.invokeSetters(SolrPluginUtils.java:1071)
	at org.apache.solr.util.SolrPluginUtilsTest.implTestInvokeSetters(SolrPluginUtilsTest.java:482)
	at org.apache.solr.util.SolrPluginUtilsTest.testInvokeSetters(SolrPluginUtilsTest.java:474)
	at sun.reflect.NativeMethodAccessorImpl.invoke0(Native Method)
	at sun.reflect.NativeMethodAccessorImpl.invoke(NativeMethodAccessorImpl.java:62)
	at sun.reflect.DelegatingMethodAccessorImpl.invoke(DelegatingMethodAccessorImpl.java:43)
	at java.lang.reflect.Method.invoke(Method.java:498)
	at com.carrotsearch.randomizedtesting.RandomizedRunner.invoke(RandomizedRunner.java:1764)
	at com.carrotsearch.randomizedtesting.RandomizedRunner$8.evaluate(RandomizedRunner.java:871)
	at com.carrotsearch.randomizedtesting.RandomizedRunner$9.evaluate(RandomizedRunner.java:907)
	at com.carrotsearch.randomizedtesting.RandomizedRunner$10.evaluate(RandomizedRunner.java:921)
	at com.carrotsearch.randomizedtesting.rules.SystemPropertiesRestoreRule$1.evaluate(SystemPropertiesRestoreRule.java:57)
	at org.apache.lucene.util.TestRuleSetupTeardownChained$1.evaluate(TestRuleSetupTeardownChained.java:49)
	at org.apache.lucene.util.AbstractBeforeAfterRule$1.evaluate(AbstractBeforeAfterRule.java:45)
	at org.apache.lucene.util.TestRuleThreadAndTestName$1.evaluate(TestRuleThreadAndTestName.java:48)
	at org.apache.lucene.util.TestRuleIgnoreAfterMaxFailures$1.evaluate(TestRuleIgnoreAfterMaxFailures.java:64)
	at org.apache.lucene.util.TestRuleMarkFailure$1.evaluate(TestRuleMarkFailure.java:47)
	at com.carrotsearch.randomizedtesting.rules.StatementAdapter.evaluate(StatementAdapter.java:36)
	at com.carrotsearch.randomizedtesting.ThreadLeakControl$StatementRunner.run(ThreadLeakControl.java:367)
	at com.carrotsearch.randomizedtesting.ThreadLeakControl.forkTimeoutingTask(ThreadLeakControl.java:809)
	at com.carrotsearch.randomizedtesting.ThreadLeakControl$3.evaluate(ThreadLeakControl.java:460)
	at com.carrotsearch.randomizedtesting.RandomizedRunner.runSingleTest(RandomizedRunner.java:880)
	at com.carrotsearch.randomizedtesting.RandomizedRunner$5.evaluate(RandomizedRunner.java:781)
	at com.carrotsearch.randomizedtesting.RandomizedRunner$6.evaluate(RandomizedRunner.java:816)
	at com.carrotsearch.randomizedtesting.RandomizedRunner$7.evaluate(RandomizedRunner.java:827)
	at com.carrotsearch.randomizedtesting.rules.StatementAdapter.evaluate(StatementAdapter.java:36)
	at com.carrotsearch.randomizedtesting.rules.SystemPropertiesRestoreRule$1.evaluate(SystemPropertiesRestoreRule.java:57)
	at org.apache.lucene.util.AbstractBeforeAfterRule$1.evaluate(AbstractBeforeAfterRule.java:45)
	at com.carrotsearch.randomizedtesting.rules.StatementAdapter.evaluate(StatementAdapter.java:36)
	at org.apache.lucene.util.TestRuleStoreClassName$1.evaluate(TestRuleStoreClassName.java:41)
	at com.carrotsearch.randomizedtesting.rules.NoShadowingOrOverridesOnMethodsRule$1.evaluate(NoShadowingOrOverridesOnMethodsRule.java:40)
	at com.carrotsearch.randomizedtesting.rules.NoShadowingOrOverridesOnMethodsRule$1.evaluate(NoShadowingOrOverridesOnMethodsRule.java:40)
	at com.carrotsearch.randomizedtesting.rules.StatementAdapter.evaluate(StatementAdapter.java:36)
	at com.carrotsearch.randomizedtesting.rules.StatementAdapter.evaluate(StatementAdapter.java:36)
	at com.carrotsearch.randomizedtesting.rules.StatementAdapter.evaluate(StatementAdapter.java:36)
	at org.apache.lucene.util.TestRuleAssertionsRequired$1.evaluate(TestRuleAssertionsRequired.java:53)
	at org.apache.lucene.util.TestRuleMarkFailure$1.evaluate(TestRuleMarkFailure.java:47)
	at org.apache.lucene.util.TestRuleIgnoreAfterMaxFailures$1.evaluate(TestRuleIgnoreAfterMaxFailures.java:64)
	at org.apache.lucene.util.TestRuleIgnoreTestSuites$1.evaluate(TestRuleIgnoreTestSuites.java:54)
	at com.carrotsearch.randomizedtesting.rules.StatementAdapter.evaluate(StatementAdapter.java:36)
	at com.carrotsearch.randomizedtesting.ThreadLeakControl$StatementRunner.run(ThreadLeakControl.java:367)
	at java.lang.Thread.run(Thread.java:745)




Build Log:
[...truncated 10761 lines...]
   [junit4] Suite: org.apache.solr.handler.TestReqParamsAPI
   [junit4]   2> Creating dataDir: /home/jenkins/workspace/Lucene-Solr-master-Linux/solr/build/solr-core/test/J0/temp/solr.handler.TestReqParamsAPI_41FEA0D4A33982F6-001/init-core-data-001
   [junit4]   2> 273641 INFO  (SUITE-TestReqParamsAPI-seed#[41FEA0D4A33982F6]-worker) [    ] o.a.s.SolrTestCaseJ4 Randomized ssl (false) and clientAuth (false)
   [junit4]   2> 273643 INFO  (SUITE-TestReqParamsAPI-seed#[41FEA0D4A33982F6]-worker) [    ] o.a.s.BaseDistributedSearchTestCase Setting hostContext system property: /yel/j
   [junit4]   2> 273647 INFO  (TEST-TestReqParamsAPI.test-seed#[41FEA0D4A33982F6]) [    ] o.a.s.c.ZkTestServer STARTING ZK TEST SERVER
   [junit4]   2> 273648 INFO  (Thread-384) [    ] o.a.s.c.ZkTestServer client port:0.0.0.0/0.0.0.0:0
   [junit4]   2> 273648 INFO  (Thread-384) [    ] o.a.s.c.ZkTestServer Starting server
   [junit4]   2> 273748 INFO  (TEST-TestReqParamsAPI.test-seed#[41FEA0D4A33982F6]) [    ] o.a.s.c.ZkTestServer start zk server on port:33328
   [junit4]   2> 273748 INFO  (TEST-TestReqParamsAPI.test-seed#[41FEA0D4A33982F6]) [    ] o.a.s.c.c.SolrZkClient Using default ZkCredentialsProvider
   [junit4]   2> 273748 INFO  (TEST-TestReqParamsAPI.test-seed#[41FEA0D4A33982F6]) [    ] o.a.s.c.c.ConnectionManager Waiting for client to connect to ZooKeeper
   [junit4]   2> 273750 INFO  (zkCallback-164-thread-1) [    ] o.a.s.c.c.ConnectionManager Watcher org.apache.solr.common.cloud.ConnectionManager@29d183e name:ZooKeeperConnection Watcher:127.0.0.1:33328 got event WatchedEvent state:SyncConnected type:None path:null path:null type:None
   [junit4]   2> 273750 INFO  (TEST-TestReqParamsAPI.test-seed#[41FEA0D4A33982F6]) [    ] o.a.s.c.c.ConnectionManager Client is connected to ZooKeeper
   [junit4]   2> 273750 INFO  (TEST-TestReqParamsAPI.test-seed#[41FEA0D4A33982F6]) [    ] o.a.s.c.c.SolrZkClient Using default ZkACLProvider
   [junit4]   2> 273750 INFO  (TEST-TestReqParamsAPI.test-seed#[41FEA0D4A33982F6]) [    ] o.a.s.c.c.SolrZkClient makePath: /solr
   [junit4]   2> 273752 INFO  (TEST-TestReqParamsAPI.test-seed#[41FEA0D4A33982F6]) [    ] o.a.s.c.c.SolrZkClient Using default ZkCredentialsProvider
   [junit4]   2> 273753 INFO  (TEST-TestReqParamsAPI.test-seed#[41FEA0D4A33982F6]) [    ] o.a.s.c.c.ConnectionManager Waiting for client to connect to ZooKeeper
   [junit4]   2> 273754 INFO  (zkCallback-165-thread-1) [    ] o.a.s.c.c.ConnectionManager Watcher org.apache.solr.common.cloud.ConnectionManager@30230093 name:ZooKeeperConnection Watcher:127.0.0.1:33328/solr got event WatchedEvent state:SyncConnected type:None path:null path:null type:None
   [junit4]   2> 273754 INFO  (TEST-TestReqParamsAPI.test-seed#[41FEA0D4A33982F6]) [    ] o.a.s.c.c.ConnectionManager Client is connected to ZooKeeper
   [junit4]   2> 273754 INFO  (TEST-TestReqParamsAPI.test-seed#[41FEA0D4A33982F6]) [    ] o.a.s.c.c.SolrZkClient Using default ZkACLProvider
   [junit4]   2> 273754 INFO  (TEST-TestReqParamsAPI.test-seed#[41FEA0D4A33982F6]) [    ] o.a.s.c.c.SolrZkClient makePath: /collections/collection1
   [junit4]   2> 273755 INFO  (TEST-TestReqParamsAPI.test-seed#[41FEA0D4A33982F6]) [    ] o.a.s.c.c.SolrZkClient makePath: /collections/collection1/shards
   [junit4]   2> 273755 INFO  (TEST-TestReqParamsAPI.test-seed#[41FEA0D4A33982F6]) [    ] o.a.s.c.c.SolrZkClient makePath: /collections/control_collection
   [junit4]   2> 273756 INFO  (TEST-TestReqParamsAPI.test-seed#[41FEA0D4A33982F6]) [    ] o.a.s.c.c.SolrZkClient makePath: /collections/control_collection/shards
   [junit4]   2> 273756 INFO  (TEST-TestReqParamsAPI.test-seed#[41FEA0D4A33982F6]) [    ] o.a.s.c.AbstractZkTestCase put /home/jenkins/workspace/Lucene-Solr-master-Linux/solr/core/src/test-files/solr/collection1/conf/solrconfig-tlog.xml to /configs/conf1/solrconfig.xml
   [junit4]   2> 273756 INFO  (TEST-TestReqParamsAPI.test-seed#[41FEA0D4A33982F6]) [    ] o.a.s.c.c.SolrZkClient makePath: /configs/conf1/solrconfig.xml
   [junit4]   2> 273757 INFO  (TEST-TestReqParamsAPI.test-seed#[41FEA0D4A33982F6]) [    ] o.a.s.c.AbstractZkTestCase put /home/jenkins/workspace/Lucene-Solr-master-Linux/solr/core/src/test-files/solr/collection1/conf/schema.xml to /configs/conf1/schema.xml
   [junit4]   2> 273757 INFO  (TEST-TestReqParamsAPI.test-seed#[41FEA0D4A33982F6]) [    ] o.a.s.c.c.SolrZkClient makePath: /configs/conf1/schema.xml
   [junit4]   2> 273758 INFO  (TEST-TestReqParamsAPI.test-seed#[41FEA0D4A33982F6]) [    ] o.a.s.c.AbstractZkTestCase put /home/jenkins/workspace/Lucene-Solr-master-Linux/solr/core/src/test-files/solr/collection1/conf/solrconfig.snippet.randomindexconfig.xml to /configs/conf1/solrconfig.snippet.randomindexconfig.xml
   [junit4]   2> 273758 INFO  (TEST-TestReqParamsAPI.test-seed#[41FEA0D4A33982F6]) [    ] o.a.s.c.c.SolrZkClient makePath: /configs/conf1/solrconfig.snippet.randomindexconfig.xml
   [junit4]   2> 273758 INFO  (TEST-TestReqParamsAPI.test-seed#[41FEA0D4A33982F6]) [    ] o.a.s.c.AbstractZkTestCase put /home/jenkins/workspace/Lucene-Solr-master-Linux/solr/core/src/test-files/solr/collection1/conf/stopwords.txt to /configs/conf1/stopwords.txt
   [junit4]   2> 273758 INFO  (TEST-TestReqParamsAPI.test-seed#[41FEA0D4A33982F6]) [    ] o.a.s.c.c.SolrZkClient makePath: /configs/conf1/stopwords.txt
   [junit4]   2> 273759 INFO  (TEST-TestReqParamsAPI.test-seed#[41FEA0D4A33982F6]) [    ] o.a.s.c.AbstractZkTestCase put /home/jenkins/workspace/Lucene-Solr-master-Linux/solr/core/src/test-files/solr/collection1/conf/protwords.txt to /configs/conf1/protwords.txt
   [junit4]   2> 273759 INFO  (TEST-TestReqParamsAPI.test-seed#[41FEA0D4A33982F6]) [    ] o.a.s.c.c.SolrZkClient makePath: /configs/conf1/protwords.txt
   [junit4]   2> 273776 INFO  (TEST-TestReqParamsAPI.test-seed#[41FEA0D4A33982F6]) [    ] o.a.s.c.AbstractZkTestCase put /home/jenkins/workspace/Lucene-Solr-master-Linux/solr/core/src/test-files/solr/collection1/conf/currency.xml to /configs/conf1/currency.xml
   [junit4]   2> 273776 INFO  (TEST-TestReqParamsAPI.test-seed#[41FEA0D4A33982F6]) [    ] o.a.s.c.c.SolrZkClient makePath: /configs/conf1/currency.xml
   [junit4]   2> 273777 INFO  (TEST-TestReqParamsAPI.test-seed#[41FEA0D4A33982F6]) [    ] o.a.s.c.AbstractZkTestCase put /home/jenkins/workspace/Lucene-Solr-master-Linux/solr/core/src/test-files/solr/collection1/conf/enumsConfig.xml to /configs/conf1/enumsConfig.xml
   [junit4]   2> 273777 INFO  (TEST-TestReqParamsAPI.test-seed#[41FEA0D4A33982F6]) [    ] o.a.s.c.c.SolrZkClient makePath: /configs/conf1/enumsConfig.xml
   [junit4]   2> 273777 INFO  (TEST-TestReqParamsAPI.test-seed#[41FEA0D4A33982F6]) [    ] o.a.s.c.AbstractZkTestCase put /home/jenkins/workspace/Lucene-Solr-master-Linux/solr/core/src/test-files/solr/collection1/conf/open-exchange-rates.json to /configs/conf1/open-exchange-rates.json
   [junit4]   2> 273777 INFO  (TEST-TestReqParamsAPI.test-seed#[41FEA0D4A33982F6]) [    ] o.a.s.c.c.SolrZkClient makePath: /configs/conf1/open-exchange-rates.json
   [junit4]   2> 273778 INFO  (TEST-TestReqParamsAPI.test-seed#[41FEA0D4A33982F6]) [    ] o.a.s.c.AbstractZkTestCase put /home/jenkins/workspace/Lucene-Solr-master-Linux/solr/core/src/test-files/solr/collection1/conf/mapping-ISOLatin1Accent.txt to /configs/conf1/mapping-ISOLatin1Accent.txt
   [junit4]   2> 273778 INFO  (TEST-TestReqParamsAPI.test-seed#[41FEA0D4A33982F6]) [    ] o.a.s.c.c.SolrZkClient makePath: /configs/conf1/mapping-ISOLatin1Accent.txt
   [junit4]   2> 273778 INFO  (TEST-TestReqParamsAPI.test-seed#[41FEA0D4A33982F6]) [    ] o.a.s.c.AbstractZkTestCase put /home/jenkins/workspace/Lucene-Solr-master-Linux/solr/core/src/test-files/solr/collection1/conf/old_synonyms.txt to /configs/conf1/old_synonyms.txt
   [junit4]   2> 273778 INFO  (TEST-TestReqParamsAPI.test-seed#[41FEA0D4A33982F6]) [    ] o.a.s.c.c.SolrZkClient makePath: /configs/conf1/old_synonyms.txt
   [junit4]   2> 273779 INFO  (TEST-TestReqParamsAPI.test-seed#[41FEA0D4A33982F6]) [    ] o.a.s.c.AbstractZkTestCase put /home/jenkins/workspace/Lucene-Solr-master-Linux/solr/core/src/test-files/solr/collection1/conf/synonyms.txt to /configs/conf1/synonyms.txt
   [junit4]   2> 273779 INFO  (TEST-TestReqParamsAPI.test-seed#[41FEA0D4A33982F6]) [    ] o.a.s.c.c.SolrZkClient makePath: /configs/conf1/synonyms.txt
   [junit4]   2> 273916 INFO  (TEST-TestReqParamsAPI.test-seed#[41FEA0D4A33982F6]) [    ] o.a.s.SolrTestCaseJ4 Writing core.properties file to /home/jenkins/workspace/Lucene-Solr-master-Linux/solr/build/solr-core/test/J0/temp/solr.handler.TestReqParamsAPI_41FEA0D4A33982F6-001/control-001/cores/collection1
   [junit4]   2> 273918 INFO  (TEST-TestReqParamsAPI.test-seed#[41FEA0D4A33982F6]) [    ] o.e.j.s.Server jetty-9.3.8.v20160314
   [junit4]   2> 273918 INFO  (TEST-TestReqParamsAPI.test-seed#[41FEA0D4A33982F6]) [    ] o.e.j.s.h.ContextHandler Started o.e.j.s.ServletContextHandler@2bbffa3f{/yel/j,null,AVAILABLE}
   [junit4]   2> 273919 INFO  (TEST-TestReqParamsAPI.test-seed#[41FEA0D4A33982F6]) [    ] o.e.j.s.ServerConnector Started ServerConnector@a86c83a{HTTP/1.1,[http/1.1]}{127.0.0.1:39822}
   [junit4]   2> 273919 INFO  (TEST-TestReqParamsAPI.test-seed#[41FEA0D4A33982F6]) [    ] o.e.j.s.Server Started @275606ms
   [junit4]   2> 273919 INFO  (TEST-TestReqParamsAPI.test-seed#[41FEA0D4A33982F6]) [    ] o.a.s.c.s.e.JettySolrRunner Jetty properties: {solr.data.dir=/home/jenkins/workspace/Lucene-Solr-master-Linux/solr/build/solr-core/test/J0/temp/solr.handler.TestReqParamsAPI_41FEA0D4A33982F6-001/tempDir-001/control/data, hostContext=/yel/j, hostPort=39822, coreRootDirectory=/home/jenkins/workspace/Lucene-Solr-master-Linux/solr/build/solr-core/test/J0/../../../../../../../../../home/jenkins/workspace/Lucene-Solr-master-Linux/solr/build/solr-core/test/J0/temp/solr.handler.TestReqParamsAPI_41FEA0D4A33982F6-001/control-001/cores}
   [junit4]   2> 273919 INFO  (TEST-TestReqParamsAPI.test-seed#[41FEA0D4A33982F6]) [    ] o.a.s.s.SolrDispatchFilter SolrDispatchFilter.init(): sun.misc.Launcher$AppClassLoader@73d16e93
   [junit4]   2> 273920 INFO  (TEST-TestReqParamsAPI.test-seed#[41FEA0D4A33982F6]) [    ] o.a.s.c.SolrResourceLoader new SolrResourceLoader for directory: '/home/jenkins/workspace/Lucene-Solr-master-Linux/solr/build/solr-core/test/J0/temp/solr.handler.TestReqParamsAPI_41FEA0D4A33982F6-001/control-001'
   [junit4]   2> 273920 INFO  (TEST-TestReqParamsAPI.test-seed#[41FEA0D4A33982F6]) [    ] o.a.s.c.SolrResourceLoader JNDI not configured for solr (NoInitialContextEx)
   [junit4]   2> 273920 INFO  (TEST-TestReqParamsAPI.test-seed#[41FEA0D4A33982F6]) [    ] o.a.s.c.SolrResourceLoader solr home defaulted to 'solr/' (could not find system property or JNDI)
   [junit4]   2> 273920 INFO  (TEST-TestReqParamsAPI.test-seed#[41FEA0D4A33982F6]) [    ] o.a.s.c.c.SolrZkClient Using default ZkCredentialsProvider
   [junit4]   2> 273920 INFO  (TEST-TestReqParamsAPI.test-seed#[41FEA0D4A33982F6]) [    ] o.a.s.c.c.ConnectionManager Waiting for client to connect to ZooKeeper
   [junit4]   2> 273921 INFO  (zkCallback-166-thread-1) [    ] o.a.s.c.c.ConnectionManager Watcher org.apache.solr.common.cloud.ConnectionManager@2e3f4e00 name:ZooKeeperConnection Watcher:127.0.0.1:33328/solr got event WatchedEvent state:SyncConnected type:None path:null path:null type:None
   [junit4]   2> 273921 INFO  (TEST-TestReqParamsAPI.test-seed#[41FEA0D4A33982F6]) [    ] o.a.s.c.c.ConnectionManager Client is connected to ZooKeeper
   [junit4]   2> 273921 INFO  (TEST-TestReqParamsAPI.test-seed#[41FEA0D4A33982F6]) [    ] o.a.s.c.c.SolrZkClient Using default ZkACLProvider
   [junit4]   2> 273922 INFO  (TEST-TestReqParamsAPI.test-seed#[41FEA0D4A33982F6]) [    ] o.a.s.s.SolrDispatchFilter Loading solr.xml from SolrHome (not found in ZooKeeper)
   [junit4]   2> 273922 INFO  (TEST-TestReqParamsAPI.test-seed#[41FEA0D4A33982F6]) [    ] o.a.s.c.SolrXmlConfig Loading container configuration from /home/jenkins/workspace/Lucene-Solr-master-Linux/solr/build/solr-core/test/J0/temp/solr.handler.TestReqParamsAPI_41FEA0D4A33982F6-001/control-001/solr.xml
   [junit4]   2> 273926 INFO  (TEST-TestReqParamsAPI.test-seed#[41FEA0D4A33982F6]) [    ] o.a.s.c.CorePropertiesLocator Config-defined core root directory: /home/jenkins/workspace/Lucene-Solr-master-Linux/solr/build/solr-core/test/J0/../../../../../../../../../home/jenkins/workspace/Lucene-Solr-master-Linux/solr/build/solr-core/test/J0/temp/solr.handler.TestReqParamsAPI_41FEA0D4A33982F6-001/control-001/cores
   [junit4]   2> 273926 INFO  (TEST-TestReqParamsAPI.test-seed#[41FEA0D4A33982F6]) [    ] o.a.s.c.CoreContainer New CoreContainer 1098279269
   [junit4]   2> 273926 INFO  (TEST-TestReqParamsAPI.test-seed#[41FEA0D4A33982F6]) [    ] o.a.s.c.CoreContainer Loading cores into CoreContainer [instanceDir=/home/jenkins/workspace/Lucene-Solr-master-Linux/solr/build/solr-core/test/J0/temp/solr.handler.TestReqParamsAPI_41FEA0D4A33982F6-001/control-001]
   [junit4]   2> 273926 WARN  (TEST-TestReqParamsAPI.test-seed#[41FEA0D4A33982F6]) [    ] o.a.s.c.CoreContainer Couldn't add files from /home/jenkins/workspace/Lucene-Solr-master-Linux/solr/build/solr-core/test/J0/temp/solr.handler.TestReqParamsAPI_41FEA0D4A33982F6-001/control-001/lib to classpath: /home/jenkins/workspace/Lucene-Solr-master-Linux/solr/build/solr-core/test/J0/temp/solr.handler.TestReqParamsAPI_41FEA0D4A33982F6-001/control-001/lib
   [junit4]   2> 273926 INFO  (TEST-TestReqParamsAPI.test-seed#[41FEA0D4A33982F6]) [    ] o.a.s.h.c.HttpShardHandlerFactory created with socketTimeout : 90000,urlScheme : ,connTimeout : 15000,maxConnectionsPerHost : 20,maxConnections : 10000,corePoolSize : 0,maximumPoolSize : 2147483647,maxThreadIdleTime : 5,sizeOfQueue : -1,fairnessPolicy : false,
   [junit4]   2> 273928 INFO  (TEST-TestReqParamsAPI.test-seed#[41FEA0D4A33982F6]) [    ] o.a.s.u.UpdateShardHandler Creating UpdateShardHandler HTTP client with params: 
   [junit4]   2> 273928 INFO  (TEST-TestReqParamsAPI.test-seed#[41FEA0D4A33982F6]) [    ] o.a.s.l.LogWatcher SLF4J impl is org.slf4j.impl.Log4jLoggerFactory
   [junit4]   2> 273929 INFO  (TEST-TestReqParamsAPI.test-seed#[41FEA0D4A33982F6]) [    ] o.a.s.l.LogWatcher Registering Log Listener [Log4j (org.slf4j.impl.Log4jLoggerFactory)]
   [junit4]   2> 273929 INFO  (TEST-TestReqParamsAPI.test-seed#[41FEA0D4A33982F6]) [    ] o.a.s.c.ZkContainer Zookeeper client=127.0.0.1:33328/solr
   [junit4]   2> 273929 INFO  (TEST-TestReqParamsAPI.test-seed#[41FEA0D4A33982F6]) [    ] o.a.s.c.ZkController zkHost includes chroot
   [junit4]   2> 273929 INFO  (TEST-TestReqParamsAPI.test-seed#[41FEA0D4A33982F6]) [    ] o.a.s.c.c.SolrZkClient Using default ZkCredentialsProvider
   [junit4]   2> 273929 INFO  (TEST-TestReqParamsAPI.test-seed#[41FEA0D4A33982F6]) [    ] o.a.s.c.c.ConnectionManager Waiting for client to connect to ZooKeeper
   [junit4]   2> 273930 INFO  (zkCallback-169-thread-1) [    ] o.a.s.c.c.ConnectionManager Watcher org.apache.solr.common.cloud.ConnectionManager@7acfeab7 name:ZooKeeperConnection Watcher:127.0.0.1:33328 got event WatchedEvent state:SyncConnected type:None path:null path:null type:None
   [junit4]   2> 273930 INFO  (TEST-TestReqParamsAPI.test-seed#[41FEA0D4A33982F6]) [    ] o.a.s.c.c.ConnectionManager Client is connected to ZooKeeper
   [junit4]   2> 273931 INFO  (TEST-TestReqParamsAPI.test-seed#[41FEA0D4A33982F6]) [    ] o.a.s.c.c.SolrZkClient Using default ZkACLProvider
   [junit4]   2> 273931 INFO  (TEST-TestReqParamsAPI.test-seed#[41FEA0D4A33982F6]) [n:127.0.0.1:39822_yel%2Fj    ] o.a.s.c.ZkController Added new OnReconnect listener org.apache.solr.cloud.ZkController$$Lambda$80/1522658972@7d58775c
   [junit4]   2> 273932 INFO  (TEST-TestReqParamsAPI.test-seed#[41FEA0D4A33982F6]) [n:127.0.0.1:39822_yel%2Fj    ] o.a.s.c.c.ConnectionManager Waiting for client to connect to ZooKeeper
   [junit4]   2> 273933 INFO  (zkCallback-170-thread-1-processing-n:127.0.0.1:39822_yel%2Fj) [n:127.0.0.1:39822_yel%2Fj    ] o.a.s.c.c.ConnectionManager Watcher org.apache.solr.common.cloud.ConnectionManager@31a80bc4 name:ZooKeeperConnection Watcher:127.0.0.1:33328/solr got event WatchedEvent state:SyncConnected type:None path:null path:null type:None
   [junit4]   2> 273933 INFO  (TEST-TestReqParamsAPI.test-seed#[41FEA0D4A33982F6]) [n:127.0.0.1:39822_yel%2Fj    ] o.a.s.c.c.ConnectionManager Client is connected to ZooKeeper
   [junit4]   2> 273934 INFO  (TEST-TestReqParamsAPI.test-seed#[41FEA0D4A33982F6]) [n:127.0.0.1:39822_yel%2Fj    ] o.a.s.c.c.SolrZkClient makePath: /overseer/queue
   [junit4]   2> 273934 INFO  (TEST-TestReqParamsAPI.test-seed#[41FEA0D4A33982F6]) [n:127.0.0.1:39822_yel%2Fj    ] o.a.s.c.c.SolrZkClient makePath: /overseer/collection-queue-work
   [junit4]   2> 273935 INFO  (TEST-TestReqParamsAPI.test-seed#[41FEA0D4A33982F6]) [n:127.0.0.1:39822_yel%2Fj    ] o.a.s.c.c.SolrZkClient makePath: /overseer/collection-map-running
   [junit4]   2> 273941 INFO  (TEST-TestReqParamsAPI.test-seed#[41FEA0D4A33982F6]) [n:127.0.0.1:39822_yel%2Fj    ] o.a.s.c.c.SolrZkClient makePath: /overseer/collection-map-completed
   [junit4]   2> 273941 INFO  (TEST-TestReqParamsAPI.test-seed#[41FEA0D4A33982F6]) [n:127.0.0.1:39822_yel%2Fj    ] o.a.s.c.c.SolrZkClient makePath: /overseer/collection-map-failure
   [junit4]   2> 273942 INFO  (TEST-TestReqParamsAPI.test-seed#[41FEA0D4A33982F6]) [n:127.0.0.1:39822_yel%2Fj    ] o.a.s.c.c.SolrZkClient makePath: /live_nodes
   [junit4]   2> 273942 INFO  (TEST-TestReqParamsAPI.test-seed#[41FEA0D4A33982F6]) [n:127.0.0.1:39822_yel%2Fj    ] o.a.s.c.c.SolrZkClient makePath: /aliases.json
   [junit4]   2> 273943 INFO  (TEST-TestReqParamsAPI.test-seed#[41FEA0D4A33982F6]) [n:127.0.0.1:39822_yel%2Fj    ] o.a.s.c.c.SolrZkClient makePath: /clusterstate.json
   [junit4]   2> 273944 INFO  (TEST-TestReqParamsAPI.test-seed#[41FEA0D4A33982F6]) [n:127.0.0.1:39822_yel%2Fj    ] o.a.s.c.c.SolrZkClient makePath: /security.json
   [junit4]   2> 273944 INFO  (TEST-TestReqParamsAPI.test-seed#[41FEA0D4A33982F6]) [n:127.0.0.1:39822_yel%2Fj    ] o.a.s.c.c.ZkStateReader Updating cluster state from ZooKeeper... 
   [junit4]   2> 273945 INFO  (TEST-TestReqParamsAPI.test-seed#[41FEA0D4A33982F6]) [n:127.0.0.1:39822_yel%2Fj    ] o.a.s.c.c.ZkStateReader Loaded empty cluster properties
   [junit4]   2> 273945 INFO  (TEST-TestReqParamsAPI.test-seed#[41FEA0D4A33982F6]) [n:127.0.0.1:39822_yel%2Fj    ] o.a.s.c.c.ZkStateReader Updated live nodes from ZooKeeper... (0) -> (0)
   [junit4]   2> 273945 INFO  (TEST-TestReqParamsAPI.test-seed#[41FEA0D4A33982F6]) [n:127.0.0.1:39822_yel%2Fj    ] o.a.s.c.c.SolrZkClient makePath: /overseer_elect
   [junit4]   2> 273946 INFO  (TEST-TestReqParamsAPI.test-seed#[41FEA0D4A33982F6]) [n:127.0.0.1:39822_yel%2Fj    ] o.a.s.c.c.SolrZkClient makePath: /overseer_elect/election
   [junit4]   2> 273946 INFO  (TEST-TestReqParamsAPI.test-seed#[41FEA0D4A33982F6]) [n:127.0.0.1:39822_yel%2Fj    ] o.a.s.c.Overseer Overseer (id=null) closing
   [junit4]   2> 273946 INFO  (TEST-TestReqParamsAPI.test-seed#[41FEA0D4A33982F6]) [n:127.0.0.1:39822_yel%2Fj    ] o.a.s.c.LeaderElector Joined leadership election with path: /overseer_elect/election/95979474789859332-127.0.0.1:39822_yel%2Fj-n_0000000000
   [junit4]   2> 273947 INFO  (TEST-TestReqParamsAPI.test-seed#[41FEA0D4A33982F6]) [n:127.0.0.1:39822_yel%2Fj    ] o.a.s.c.OverseerElectionContext I am going to be the leader 127.0.0.1:39822_yel%2Fj
   [junit4]   2> 273947 INFO  (TEST-TestReqParamsAPI.test-seed#[41FEA0D4A33982F6]) [n:127.0.0.1:39822_yel%2Fj    ] o.a.s.c.c.SolrZkClient makePath: /overseer_elect/leader
   [junit4]   2> 273947 INFO  (TEST-TestReqParamsAPI.test-seed#[41FEA0D4A33982F6]) [n:127.0.0.1:39822_yel%2Fj    ] o.a.s.c.Overseer Overseer (id=95979474789859332-127.0.0.1:39822_yel%2Fj-n_0000000000) starting
   [junit4]   2> 273948 INFO  (TEST-TestReqParamsAPI.test-seed#[41FEA0D4A33982F6]) [n:127.0.0.1:39822_yel%2Fj    ] o.a.s.c.c.SolrZkClient makePath: /overseer/queue-work
   [junit4]   2> 273950 INFO  (TEST-TestReqParamsAPI.test-seed#[41FEA0D4A33982F6]) [n:127.0.0.1:39822_yel%2Fj    ] o.a.s.c.OverseerAutoReplicaFailoverThread Starting OverseerAutoReplicaFailoverThread autoReplicaFailoverWorkLoopDelay=10000 autoReplicaFailoverWaitAfterExpiration=30000 autoReplicaFailoverBadNodeExpiration=60000
   [junit4]   2> 273950 INFO  (OverseerCollectionConfigSetProcessor-95979474789859332-127.0.0.1:39822_yel%2Fj-n_0000000000) [n:127.0.0.1:39822_yel%2Fj    ] o.a.s.c.OverseerTaskProcessor Process current queue of overseer operations
   [junit4]   2> 273950 INFO  (TEST-TestReqParamsAPI.test-seed#[41FEA0D4A33982F6]) [n:127.0.0.1:39822_yel%2Fj    ] o.a.s.c.ZkController Register node as live in ZooKeeper:/live_nodes/127.0.0.1:39822_yel%2Fj
   [junit4]   2> 273950 INFO  (OverseerStateUpdate-95979474789859332-127.0.0.1:39822_yel%2Fj-n_0000000000) [n:127.0.0.1:39822_yel%2Fj    ] o.a.s.c.Overseer Starting to work on the main queue
   [junit4]   2> 273950 INFO  (TEST-TestReqParamsAPI.test-seed#[41FEA0D4A33982F6]) [n:127.0.0.1:39822_yel%2Fj    ] o.a.s.c.c.SolrZkClient makePath: /live_nodes/127.0.0.1:39822_yel%2Fj
   [junit4]   2> 273952 INFO  (zkCallback-170-thread-1-processing-n:127.0.0.1:39822_yel%2Fj) [n:127.0.0.1:39822_yel%2Fj    ] o.a.s.c.c.ZkStateReader A live node change: [WatchedEvent state:SyncConnected type:NodeChildrenChanged path:/live_nodes], has occurred - updating... (live nodes size: [0])
   [junit4]   2> 273952 INFO  (OverseerStateUpdate-95979474789859332-127.0.0.1:39822_yel%2Fj-n_0000000000) [n:127.0.0.1:39822_yel%2Fj    ] o.a.s.c.c.ZkStateReader Updated live nodes from ZooKeeper... (0) -> (1)
   [junit4]   2> 273953 INFO  (zkCallback-170-thread-1-processing-n:127.0.0.1:39822_yel%2Fj) [n:127.0.0.1:39822_yel%2Fj    ] o.a.s.c.c.ZkStateReader Updated live nodes from ZooKeeper... (1) -> (1)
   [junit4]   2> 273966 INFO  (TEST-TestReqParamsAPI.test-seed#[41FEA0D4A33982F6]) [n:127.0.0.1:39822_yel%2Fj    ] o.a.s.c.CoreContainer Security conf doesn't exist. Skipping setup for authorization module.
   [junit4]   2> 273966 INFO  (TEST-TestReqParamsAPI.test-seed#[41FEA0D4A33982F6]) [n:127.0.0.1:39822_yel%2Fj    ] o.a.s.c.CoreContainer No authentication plugin used.
   [junit4]   2> 273966 INFO  (TEST-TestReqParamsAPI.test-seed#[41FEA0D4A33982F6]) [n:127.0.0.1:39822_yel%2Fj    ] o.a.s.c.CorePropertiesLocator Looking for core definitions underneath /home/jenkins/workspace/Lucene-Solr-master-Linux/solr/build/solr-core/test/J0/../../../../../../../../../home/jenkins/workspace/Lucene-Solr-master-Linux/solr/build/solr-core/test/J0/temp/solr.handler.TestReqParamsAPI_41FEA0D4A33982F6-001/control-001/cores
   [junit4]   2> 273967 INFO  (TEST-TestReqParamsAPI.test-seed#[41FEA0D4A33982F6]) [n:127.0.0.1:39822_yel%2Fj    ] o.a.s.c.CoreDescriptor Created CoreDescriptor: {name=collection1, config=solrconfig.xml, transient=false, schema=schema.xml, loadOnStartup=true, configSetProperties=configsetprops.json, collection=control_collection, coreNodeName=, dataDir=data/, shard=}
   [junit4]   2> 273967 INFO  (TEST-TestReqParamsAPI.test-seed#[41FEA0D4A33982F6]) [n:127.0.0.1:39822_yel%2Fj    ] o.a.s.c.CorePropertiesLocator Found core collection1 in /home/jenkins/workspace/Lucene-Solr-master-Linux/solr/build/solr-core/test/J0/../../../../../../../../../home/jenkins/workspace/Lucene-Solr-master-Linux/solr/build/solr-core/test/J0/temp/solr.handler.TestReqParamsAPI_41FEA0D4A33982F6-001/control-001/cores/collection1
   [junit4]   2> 273967 INFO  (TEST-TestReqParamsAPI.test-seed#[41FEA0D4A33982F6]) [n:127.0.0.1:39822_yel%2Fj    ] o.a.s.c.CorePropertiesLocator Found 1 core definitions
   [junit4]   2> 273967 INFO  (coreLoadExecutor-546-thread-1-processing-n:127.0.0.1:39822_yel%2Fj) [n:127.0.0.1:39822_yel%2Fj c:control_collection   x:collection1] o.a.s.c.ZkController publishing state=down
   [junit4]   2> 273967 INFO  (TEST-TestReqParamsAPI.test-seed#[41FEA0D4A33982F6]) [n:127.0.0.1:39822_yel%2Fj    ] o.a.s.s.SolrDispatchFilter user.dir=/home/jenkins/workspace/Lucene-Solr-master-Linux/solr/build/solr-core/test/J0
   [junit4]   2> 273967 INFO  (coreLoadExecutor-546-thread-1-processing-n:127.0.0.1:39822_yel%2Fj) [n:127.0.0.1:39822_yel%2Fj c:control_collection   x:collection1] o.a.s.c.ZkController numShards not found on descriptor - reading it from system property
   [junit4]   2> 273967 INFO  (TEST-TestReqParamsAPI.test-seed#[41FEA0D4A33982F6]) [n:127.0.0.1:39822_yel%2Fj    ] o.a.s.s.SolrDispatchFilter SolrDispatchFilter.init() done
   [junit4]   2> 273968 INFO  (coreLoadExecutor-546-thread-1-processing-n:127.0.0.1:39822_yel%2Fj) [n:127.0.0.1:39822_yel%2Fj c:control_collection   x:collection1] o.a.s.c.ZkController Collection control_collection not visible yet, but flagging it so a watch is registered when it becomes visible
   [junit4]   2> 273968 INFO  (OverseerStateUpdate-95979474789859332-127.0.0.1:39822_yel%2Fj-n_0000000000) [n:127.0.0.1:39822_yel%2Fj    ] o.a.s.c.Overseer processMessage: queueSize: 1, message = {
   [junit4]   2>   "core":"collection1",
   [junit4]   2>   "roles":null,
   [junit4]   2>   "base_url":"http://127.0.0.1:39822/yel/j",
   [junit4]   2>   "node_name":"127.0.0.1:39822_yel%2Fj",
   [junit4]   2>   "numShards":"1",
   [junit4]   2>   "state":"down",
   [junit4]   2>   "shard":null,
   [junit4]   2>   "collection":"control_collection",
   [junit4]   2>   "operation":"state"} current state version: 0
   [junit4]   2> 273968 INFO  (OverseerStateUpdate-95979474789859332-127.0.0.1:39822_yel%2Fj-n_0000000000) [n:127.0.0.1:39822_yel%2Fj    ] o.a.s.c.o.ReplicaMutator Update state numShards=1 message={
   [junit4]   2>   "core":"collection1",
   [junit4]   2>   "roles":null,
   [junit4]   2>   "base_url":"http://127.0.0.1:39822/yel/j",
   [junit4]   2>   "node_name":"127.0.0.1:39822_yel%2Fj",
   [junit4]   2>   "numShards":"1",
   [junit4]   2>   "state":"down",
   [junit4]   2>   "shard":null,
   [junit4]   2>   "collection":"control_collection",
   [junit4]   2>   "operation":"state"}
   [junit4]   2> 273968 INFO  (coreLoadExecutor-546-thread-1-processing-n:127.0.0.1:39822_yel%2Fj) [n:127.0.0.1:39822_yel%2Fj c:control_collection   x:collection1] o.a.s.c.c.ZkStateReader Deleting data for [control_collection]
   [junit4]   2> 273968 INFO  (OverseerStateUpdate-95979474789859332-127.0.0.1:39822_yel%2Fj-n_0000000000) [n:127.0.0.1:39822_yel%2Fj    ] o.a.s.c.o.ClusterStateMutator building a new cName: control_collection
   [junit4]   2> 273969 INFO  (OverseerStateUpdate-95979474789859332-127.0.0.1:39822_yel%2Fj-n_0000000000) [n:127.0.0.1:39822_yel%2Fj    ] o.a.s.c.o.ReplicaMutator Assigning new node to shard shard=shard1
   [junit4]   2> 273969 INFO  (coreLoadExecutor-546-thread-1-processing-n:127.0.0.1:39822_yel%2Fj) [n:127.0.0.1:39822_yel%2Fj c:control_collection   x:collection1] o.a.s.c.ZkController look for our core node name
   [junit4]   2> 273969 INFO  (zkCallback-170-thread-1-processing-n:127.0.0.1:39822_yel%2Fj) [n:127.0.0.1:39822_yel%2Fj    ] o.a.s.c.c.ZkStateReader A cluster state change: [WatchedEvent state:SyncConnected type:NodeDataChanged path:/clusterstate.json], has occurred - updating... (live nodes size: [1])
   [junit4]   2> 274969 INFO  (coreLoadExecutor-546-thread-1-processing-n:127.0.0.1:39822_yel%2Fj) [n:127.0.0.1:39822_yel%2Fj c:control_collection   x:collection1] o.a.s.c.ZkController waiting to find shard id in clusterstate for collection1
   [junit4]   2> 274969 INFO  (coreLoadExecutor-546-thread-1-processing-n:127.0.0.1:39822_yel%2Fj) [n:127.0.0.1:39822_yel%2Fj c:control_collection   x:collection1] o.a.s.c.ZkController Check for collection zkNode:control_collection
   [junit4]   2> 274969 INFO  (coreLoadExecutor-546-thread-1-processing-n:127.0.0.1:39822_yel%2Fj) [n:127.0.0.1:39822_yel%2Fj c:control_collection   x:collection1] o.a.s.c.ZkController Collection zkNode exists
   [junit4]   2> 274969 INFO  (coreLoadExecutor-546-thread-1-processing-n:127.0.0.1:39822_yel%2Fj) [n:127.0.0.1:39822_yel%2Fj c:control_collection   x:collection1] o.a.s.c.c.ZkStateReader Load collection config from: [/collections/control_collection]
   [junit4]   2> 274969 INFO  (coreLoadExecutor-546-thread-1-processing-n:127.0.0.1:39822_yel%2Fj) [n:127.0.0.1:39822_yel%2Fj c:control_collection   x:collection1] o.a.s.c.c.ZkStateReader path=[/collections/control_collection] [configName]=[conf1] specified config exists in ZooKeeper
   [junit4]   2> 274969 INFO  (coreLoadExecutor-546-thread-1-processing-n:127.0.0.1:39822_yel%2Fj) [n:127.0.0.1:39822_yel%2Fj c:control_collection   x:collection1] o.a.s.c.SolrResourceLoader new SolrResourceLoader for directory: '/home/jenkins/workspace/Lucene-Solr-master-Linux/solr/build/solr-core/test/J0/temp/solr.handler.TestReqParamsAPI_41FEA0D4A33982F6-001/control-001/cores/collection1'
   [junit4]   2> 274970 INFO  (coreLoadExecutor-546-thread-1-processing-n:127.0.0.1:39822_yel%2Fj) [n:127.0.0.1:39822_yel%2Fj c:control_collection   x:collection1] o.a.s.c.SolrResourceLoader JNDI not configured for solr (NoInitialContextEx)
   [junit4]   2> 274970 INFO  (coreLoadExecutor-546-thread-1-processing-n:127.0.0.1:39822_yel%2Fj) [n:127.0.0.1:39822_yel%2Fj c:control_collection   x:collection1] o.a.s.c.SolrResourceLoader solr home defaulted to 'solr/' (could not find system property or JNDI)
   [junit4]   2> 274970 INFO  (coreLoadExecutor-546-thread-1-processing-n:127.0.0.1:39822_yel%2Fj) [n:127.0.0.1:39822_yel%2Fj c:control_collection   x:collection1] o.a.s.c.Config loaded config solrconfig.xml with version 0 
   [junit4]   2> 274974 INFO  (coreLoadExecutor-546-thread-1-processing-n:127.0.0.1:39822_yel%2Fj) [n:127.0.0.1:39822_yel%2Fj c:control_collection   x:collection1] o.a.s.c.SolrConfig current version of requestparams : -1
   [junit4]   2> 274978 INFO  (coreLoadExecutor-546-thread-1-processing-n:127.0.0.1:39822_yel%2Fj) [n:127.0.0.1:39822_yel%2Fj c:control_collection   x:collection1] o.a.s.c.SolrConfig Using Lucene MatchVersion: 7.0.0
   [junit4]   2> 274985 INFO  (coreLoadExecutor-546-thread-1-processing-n:127.0.0.1:39822_yel%2Fj) [n:127.0.0.1:39822_yel%2Fj c:control_collection   x:collection1] o.a.s.c.SolrConfig Loaded SolrConfig: solrconfig.xml
   [junit4]   2> 274988 INFO  (coreLoadExecutor-546-thread-1-processing-n:127.0.0.1:39822_yel%2Fj) [n:127.0.0.1:39822_yel%2Fj c:control_collection   x:collection1] o.a.s.s.IndexSchema [collection1] Schema name=test
   [junit4]   2> 275059 INFO  (coreLoadExecutor-546-thread-1-processing-n:127.0.0.1:39822_yel%2Fj) [n:127.0.0.1:39822_yel%2Fj c:control_collection   x:collection1] o.a.s.s.OpenExchangeRatesOrgProvider Initialized with rates=open-exchange-rates.json, refreshInterval=1440.
   [junit4]   2> 275063 INFO  (coreLoadExecutor-546-thread-1-processing-n:127.0.0.1:39822_yel%2Fj) [n:127.0.0.1:39822_yel%2Fj c:control_collection   x:collection1] o.a.s.s.IndexSchema default search field in schema is text
   [junit4]   2> 275064 INFO  (coreLoadExecutor-546-thread-1-processing-n:127.0.0.1:39822_yel%2Fj) [n:127.0.0.1:39822_yel%2Fj c:control_collection   x:collection1] o.a.s.s.IndexSchema unique key field: id
   [junit4]   2> 275073 INFO  (coreLoadExecutor-546-thread-1-processing-n:127.0.0.1:39822_yel%2Fj) [n:127.0.0.1:39822_yel%2Fj c:control_collection   x:collection1] o.a.s.s.FileExchangeRateProvider Reloading exchange rates from file currency.xml
   [junit4]   2> 275074 INFO  (coreLoadExecutor-546-thread-1-processing-n:127.0.0.1:39822_yel%2Fj) [n:127.0.0.1:39822_yel%2Fj c:control_collection   x:collection1] o.a.s.s.FileExchangeRateProvider Reloading exchange rates from file currency.xml
   [junit4]   2> 275076 INFO  (coreLoadExecutor-546-thread-1-processing-n:127.0.0.1:39822_yel%2Fj) [n:127.0.0.1:39822_yel%2Fj c:control_collection   x:collection1] o.a.s.s.OpenExchangeRatesOrgProvider Reloading exchange rates from open-exchange-rates.json
   [junit4]   2> 275077 INFO  (coreLoadExecutor-546-thread-1-processing-n:127.0.0.1:39822_yel%2Fj) [n:127.0.0.1:39822_yel%2Fj c:control_collection   x:collection1] o.a.s.s.OpenExchangeRatesOrgProvider Reloading exchange rates from open-exchange-rates.json
   [junit4]   2> 275077 INFO  (coreLoadExecutor-546-thread-1-processing-n:127.0.0.1:39822_yel%2Fj) [n:127.0.0.1:39822_yel%2Fj c:control_collection   x:collection1] o.a.s.c.ConfigSetProperties Did not find ConfigSet properties, assuming default properties: Can't find resource 'configsetprops.json' in classpath or '/configs/conf1', cwd=/home/jenkins/workspace/Lucene-Solr-master-Linux/solr/build/solr-core/test/J0
   [junit4]   2> 275078 INFO  (coreLoadExecutor-546-thread-1-processing-n:127.0.0.1:39822_yel%2Fj) [n:127.0.0.1:39822_yel%2Fj c:control_collection   x:collection1] o.a.s.c.CoreContainer Creating SolrCore 'collection1' using configuration from collection control_collection
   [junit4]   2> 275078 INFO  (coreLoadExecutor-546-thread-1-processing-n:127.0.0.1:39822_yel%2Fj) [n:127.0.0.1:39822_yel%2Fj c:control_collection s:shard1 r:core_node1 x:collection1] o.a.s.c.SolrCore org.apache.solr.core.MockDirectoryFactory
   [junit4]   2> 275078 INFO  (coreLoadExecutor-546-thread-1-processing-n:127.0.0.1:39822_yel%2Fj) [n:127.0.0.1:39822_yel%2Fj c:control_collection s:shard1 r:core_node1 x:collection1] o.a.s.c.SolrCore [[collection1] ] Opening new SolrCore at [/home/jenkins/workspace/Lucene-Solr-master-Linux/solr/build/solr-core/test/J0/temp/solr.handler.TestReqParamsAPI_41FEA0D4A33982F6-001/control-001/cores/collection1], dataDir=[/home/jenkins/workspace/Lucene-Solr-master-Linux/solr/build/solr-core/test/J0/../../../../../../../../../home/jenkins/workspace/Lucene-Solr-master-Linux/solr/build/solr-core/test/J0/temp/solr.handler.TestReqParamsAPI_41FEA0D4A33982F6-001/control-001/cores/collection1/data/]
   [junit4]   2> 275078 INFO  (coreLoadExecutor-546-thread-1-processing-n:127.0.0.1:39822_yel%2Fj) [n:127.0.0.1:39822_yel%2Fj c:control_collection s:shard1 r:core_node1 x:collection1] o.a.s.c.JmxMonitoredMap JMX monitoring is enabled. Adding Solr mbeans to JMX Server: com.sun.jmx.mbeanserver.JmxMBeanServer@2e57cfa8
   [junit4]   2> 275078 INFO  (coreLoadExecutor-546-thread-1-processing-n:127.0.0.1:39822_yel%2Fj) [n:127.0.0.1:39822_yel%2Fj c:control_collection s:shard1 r:core_node1 x:collection1] o.a.s.c.CachingDirectoryFactory return new directory for /home/jenkins/workspace/Lucene-Solr-master-Linux/solr/build/solr-core/test/J0/../../../../../../../../../home/jenkins/workspace/Lucene-Solr-master-Linux/solr/build/solr-core/test/J0/temp/solr.handler.TestReqParamsAPI_41FEA0D4A33982F6-001/control-001/cores/collection1/data
   [junit4]   2> 275078 INFO  (coreLoadExecutor-546-thread-1-processing-n:127.0.0.1:39822_yel%2Fj) [n:127.0.0.1:39822_yel%2Fj c:control_collection s:shard1 r:core_node1 x:collection1] o.a.s.c.SolrCore New index directory detected: old=null new=/home/jenkins/workspace/Lucene-Solr-master-Linux/solr/build/solr-core/test/J0/../../../../../../../../../home/jenkins/workspace/Lucene-Solr-master-Linux/solr/build/solr-core/test/J0/temp/solr.handler.TestReqParamsAPI_41FEA0D4A33982F6-001/control-001/cores/collection1/data/index/
   [junit4]   2> 275079 WARN  (coreLoadExecutor-546-thread-1-processing-n:127.0.0.1:39822_yel%2Fj) [n:127.0.0.1:39822_yel%2Fj c:control_collection s:shard1 r:core_node1 x:collection1] o.a.s.c.SolrCore [collection1] Solr index directory '/home/jenkins/workspace/Lucene-Solr-master-Linux/solr/build/solr-core/test/J0/../../../../../../../../../home/jenkins/workspace/Lucene-Solr-master-Linux/solr/build/solr-core/test/J0/temp/solr.handler.TestReqParamsAPI_41FEA0D4A33982F6-001/control-001/cores/collection1/data/index' doesn't exist. Creating new index...
   [junit4]   2> 275079 INFO  (coreLoadExecutor-546-thread-1-processing-n:127.0.0.1:39822_yel%2Fj) [n:127.0.0.1:39822_yel%2Fj c:control_collection s:shard1 r:core_node1 x:collection1] o.a.s.c.CachingDirectoryFactory return new directory for /home/jenkins/workspace/Lucene-Solr-master-Linux/solr/build/solr-core/test/J0/../../../../../../../../../home/jenkins/workspace/Lucene-Solr-master-Linux/solr/build/solr-core/test/J0/temp/solr.handler.TestReqParamsAPI_41FEA0D4A33982F6-001/control-001/cores/collection1/data/index
   [junit4]   2> 275079 INFO  (coreLoadExecutor-546-thread-1-processing-n:127.0.0.1:39822_yel%2Fj) [n:127.0.0.1:39822_yel%2Fj c:control_collection s:shard1 r:core_node1 x:collection1] o.a.s.u.RandomMergePolicy RandomMergePolicy wrapping class org.apache.lucene.index.TieredMergePolicy: [TieredMergePolicy: maxMergeAtOnce=19, maxMergeAtOnceExplicit=36, maxMergedSegmentMB=68.392578125, floorSegmentMB=1.095703125, forceMergeDeletesPctAllowed=6.471769866310119, segmentsPerTier=30.0, maxCFSSegmentSizeMB=8.796093022207999E12, noCFSRatio=0.46940320899447263
   [junit4]   2> 275080 INFO  (coreLoadExecutor-546-thread-1-processing-n:127.0.0.1:39822_yel%2Fj) [n:127.0.0.1:39822_yel%2Fj c:control_collection s:shard1 r:core_node1 x:collection1] o.a.s.c.SolrDeletionPolicy SolrDeletionPolicy.onCommit: commits: num=1
   [junit4]   2> 	commit{dir=MockDirectoryWrapper(RAMDirectory@298be531 lockFactory=org.apache.lucene.store.SingleInstanceLockFactory@7414f2eb),segFN=segments_1,generation=1}
   [junit4]   2> 275080 INFO  (coreLoadExecutor-546-thread-1-processing-n:127.0.0.1:39822_yel%2Fj) [n:127.0.0.1:39822_yel%2Fj c:control_collection s:shard1 r:core_node1 x:collection1] o.a.s.c.SolrDeletionPolicy newest commit generation = 1
   [junit4]   2> 275080 INFO  (OldIndexDirectoryCleanupThreadForCore-collection1) [n:127.0.0.1:39822_yel%2Fj c:control_collection s:shard1 r:core_node1 x:collection1] o.a.s.c.SolrCore Looking for old index directories to cleanup for core collection1 in /home/jenkins/workspace/Lucene-Solr-master-Linux/solr/build/solr-core/test/J0/../../../../../../../../../home/jenkins/workspace/Lucene-Solr-master-Linux/solr/build/solr-core/test/J0/temp/solr.handler.TestReqParamsAPI_41FEA0D4A33982F6-001/control-001/cores/collection1/data/
   [junit4]   2> 275080 WARN  (OldIndexDirectoryCleanupThreadForCore-collection1) [n:127.0.0.1:39822_yel%2Fj c:control_collection s:shard1 r:core_node1 x:collection1] o.a.s.c.DirectoryFactory /home/jenkins/workspace/Lucene-Solr-master-Linux/solr/build/solr-core/test/J0/../../../../../../../../../home/jenkins/workspace/Lucene-Solr-master-Linux/solr/build/solr-core/test/J0/temp/solr.handler.TestReqParamsAPI_41FEA0D4A33982F6-001/control-001/cores/collection1/data/ does not point to a valid data directory; skipping clean-up of old index directories.
   [junit4]   2> 275084 INFO  (coreLoadExecutor-546-thread-1-processing-n:127.0.0.1:39822_yel%2Fj) [n:127.0.0.1:39822_yel%2Fj c:control_collection s:shard1 r:core_node1 x:collection1] o.a.s.u.p.UpdateRequestProcessorChain creating updateRequestProcessorChain "nodistrib"
   [junit4]   2> 275084 INFO  (coreLoadExecutor-546-thread-1-processing-n:127.0.0.1:39822_yel%2Fj) [n:127.0.0.1:39822_yel%2Fj c:control_collection s:shard1 r:core_node1 x:collection1] o.a.s.u.p.UpdateRequestProcessorChain creating updateRequestProcessorChain "dedupe"
   [junit4]   2> 275084 INFO  (coreLoadExecutor-546-thread-1-processing-n:127.0.0.1:39822_yel%2Fj) [n:127.0.0.1:39822_yel%2Fj c:control_collection s:shard1 r:core_node1 x:collection1] o.a.s.u.p.UpdateRequestProcessorChain inserting DistributedUpdateProcessorFactory into updateRequestProcessorChain "dedupe"
   [junit4]   2> 275084 INFO  (coreLoadExecutor-546-thread-1-processing-n:127.0.0.1:39822_yel%2Fj) [n:127.0.0.1:39822_yel%2Fj c:control_collection s:shard1 r:core_node1 x:collection1] o.a.s.u.p.UpdateRequestProcessorChain creating updateRequestProcessorChain "stored_sig"
   [junit4]   2> 275084 INFO  (coreLoadExecutor-546-thread-1-processing-n:127.0.0.1:39822_yel%2Fj) [n:127.0.0.1:39822_yel%2Fj c:control_collection s:shard1 r:core_node1 x:collection1] o.a.s.u.p.UpdateRequestProcessorChain inserting DistributedUpdateProcessorFactory into updateRequestProcessorChain "stored_sig"
   [junit4]   2> 275084 INFO  (coreLoadExecutor-546-thread-1-processing-n:127.0.0.1:39822_yel%2Fj) [n:127.0.0.1:39822_yel%2Fj c:control_collection s:shard1 r:core_node1 x:collection1] o.a.s.u.p.UpdateRequestProcessorChain creating updateRequestProcessorChain "distrib-dup-test-chain-explicit"
   [junit4]   2> 275084 INFO  (coreLoadExecutor-546-thread-1-processing-n:127.0.0.1:39822_yel%2Fj) [n:127.0.0.1:39822_yel%2Fj c:control_collection s:shard1 r:core_node1 x:collection1] o.a.s.u.p.UpdateRequestProcessorChain creating updateRequestProcessorChain "distrib-dup-test-chain-implicit"
   [junit4]   2> 275084 INFO  (coreLoadExecutor-546-thread-1-processing-n:127.0.0.1:39822_yel%2Fj) [n:127.0.0.1:39822_yel%2Fj c:control_collection s:shard1 r:core_node1 x:collection1] o.a.s.u.p.UpdateRequestProcessorChain inserting DistributedUpdateProcessorFactory into updateRequestProcessorChain "distrib-dup-test-chain-implicit"
   [junit4]   2> 275084 INFO  (coreLoadExecutor-546-thread-1-processing-n:127.0.0.1:39822_yel%2Fj) [n:127.0.0.1:39822_yel%2Fj c:control_collection s:shard1 r:core_node1 x:collection1] o.a.s.c.SolrCore no updateRequestProcessorChain defined as default, creating implicit default
   [junit4]   2> 275084 WARN  (coreLoadExecutor-546-thread-1-processing-n:127.0.0.1:39822_yel%2Fj) [n:127.0.0.1:39822_yel%2Fj c:control_collection s:shard1 r:core_node1 x:collection1] o.a.s.c.RequestHandlers INVALID paramSet a in requestHandler {type = requestHandler,name = /dump,class = DumpRequestHandler,args = {defaults={a=A,b=B}}}
   [junit4]   2> 275086 INFO  (coreLoadExecutor-546-thread-1-processing-n:127.0.0.1:39822_yel%2Fj) [n:127.0.0.1:39822_yel%2Fj c:control_collection s:shard1 r:core_node1 x:collection1] o.a.s.h.l.XMLLoader xsltCacheLifetimeSeconds=60
   [junit4]   2> 275086 INFO  (coreLoadExecutor-546-thread-1-processing-n:127.0.0.1:39822_yel%2Fj) [n:127.0.0.1:39822_yel%2Fj c:control_collection s:shard1 r:core_node1 x:collection1] o.a.s.h.l.XMLLoader xsltCacheLifetimeSeconds=60
   [junit4]   2> 275087 INFO  (coreLoadExecutor-546-thread-1-processing-n:127.0.0.1:39822_yel%2Fj) [n:127.0.0.1:39822_yel%2Fj c:control_collection s:shard1 r:core_node1 x:collection1] o.a.s.h.l.XMLLoader xsltCacheLifetimeSeconds=60
   [junit4]   2> 275088 INFO  (coreLoadExecutor-546-thread-1-processing-n:127.0.0.1:39822_yel%2Fj) [n:127.0.0.1:39822_yel%2Fj c:control_collection s:shard1 r:core_node1 x:collection1] o.a.s.h.l.XMLLoader xsltCacheLifetimeSeconds=60
   [junit4]   2> 275090 INFO  (coreLoadExecutor-546-thread-1-processing-n:127.0.0.1:39822_yel%2Fj) [n:127.0.0.1:39822_yel%2Fj c:control_collection s:shard1 r:core_node1 x:collection1] o.a.s.c.RequestHandlers Registered paths: /admin/mbeans,standard,/update/json/docs,/admin/luke,/export,/get,/admin/properties,/update/json,/admin/threads,/dump,/update/csv,/sql,/graph,/admin/segments,/admin/system,/replication,/config,/stream,/schema,/admin/plugins,/admin/logging,/admin/ping,/update,/admin/file
   [junit4]   2> 275090 INFO  (coreLoadExecutor-546-thread-1-processing-n:127.0.0.1:39822_yel%2Fj) [n:127.0.0.1:39822_yel%2Fj c:control_collection s:shard1 r:core_node1 x:collection1] o.a.s.c.SolrCore Using default statsCache cache: org.apache.solr.search.stats.LocalStatsCache
   [junit4]   2> 275091 INFO  (coreLoadExecutor-546-thread-1-processing-n:127.0.0.1:39822_yel%2Fj) [n:127.0.0.1:39822_yel%2Fj c:control_collection s:shard1 r:core_node1 x:collection1] o.a.s.u.UpdateHandler Using UpdateLog implementation: org.apache.solr.update.UpdateLog
   [junit4]   2> 275091 INFO  (coreLoadExecutor-546-thread-1-processing-n:127.0.0.1:39822_yel%2Fj) [n:127.0.0.1:39822_yel%2Fj c:control_collection s:shard1 r:core_node1 x:collection1] o.a.s.u.UpdateLog Initializing UpdateLog: dataDir= defaultSyncLevel=FLUSH numRecordsToKeep=100 maxNumLogsToKeep=10 numVersionBuckets=65536
   [junit4]   2> 275092 INFO  (coreLoadExecutor-546-thread-1-processing-n:127.0.0.1:39822_yel%2Fj) [n:127.0.0.1:39822_yel%2Fj c:control_collection s:shard1 r:core_node1 x:collection1] o.a.s.u.CommitTracker Hard AutoCommit: disabled
   [junit4]   2> 275092 INFO  (coreLoadExecutor-546-thread-1-processing-n:127.0.0.1:39822_yel%2Fj) [n:127.0.0.1:39822_yel%2Fj c:control_collection s:shard1 r:core_node1 x:collection1] o.a.s.u.CommitTracker Soft AutoCommit: disabled
   [junit4]   2> 275093 INFO  (coreLoadExecutor-546-thread-1-processing-n:127.0.0.1:39822_yel%2Fj) [n:127.0.0.1:39822_yel%2Fj c:control_collection s:shard1 r:core_node1 x:collection1] o.a.s.u.RandomMergePolicy RandomMergePolicy wrapping class org.apache.lucene.index.AlcoholicMergePolicy: [AlcoholicMergePolicy: minMergeSize=0, mergeFactor=10, maxMergeSize=1907650255, maxMergeSizeForForcedMerge=9223372036854775807, calibrateSizeByDeletes=true, maxMergeDocs=2147483647, maxCFSSegmentSizeMB=8.796093022207999E12, noCFSRatio=0.1]
   [junit4]   2> 275093 INFO  (coreLoadExecutor-546-thread-1-processing-n:127.0.0.1:39822_yel%2Fj) [n:127.0.0.1:39822_yel%2Fj c:control_collection s:shard1 r:core_node1 x:collection1] o.a.s.c.SolrDeletionPolicy SolrDeletionPolicy.onInit: commits: num=1
   [junit4]   2> 	commit{dir=MockDirectoryWrapper(RAMDirectory@298be531 lockFactory=org.apache.lucene.store.SingleInstanceLockFactory@7414f2eb),segFN=segments_1,generation=1}
   [junit4]   2> 275093 INFO  (coreLoadExecutor-546-thread-1-processing-n:127.0.0.1:39822_yel%2Fj) [n:127.0.0.1:39822_yel%2Fj c:control_collection s:shard1 r:core_node1 x:collection1] o.a.s.c.SolrDeletionPolicy newest commit generation = 1
   [junit4]   2> 275093 INFO  (coreLoadExecutor-546-thread-1-processing-n:127.0.0.1:39822_yel%2Fj) [n:127.0.0.1:39822_yel%2Fj c:control_collection s:shard1 r:core_node1 x:collection1] o.a.s.s.SolrIndexSearcher Opening [Searcher@6a31ad84[collection1] main]
   [junit4]   2> 275093 INFO  (coreLoadExecutor-546-thread-1-processing-n:127.0.0.1:39822_yel%2Fj) [n:127.0.0.1:39822_yel%2Fj c:control_collection s:shard1 r:core_node1 x:collection1] o.a.s.c.c.ZkStateReader Load collection config from: [/collections/control_collection]
   [junit4]   2> 275094 INFO  (coreLoadExecutor-546-thread-1-processing-n:127.0.0.1:39822_yel%2Fj) [n:127.0.0.1:39822_yel%2Fj c:control_collection s:shard1 r:core_node1 x:collection1] o.a.s.c.c.ZkStateReader path=[/collections/control_collection] [configName]=[conf1] specified config exists in ZooKeeper
   [junit4]   2> 275094 INFO  (coreLoadExecutor-546-thread-1-processing-n:127.0.0.1:39822_yel%2Fj) [n:127.0.0.1:39822_yel%2Fj c:control_collection s:shard1 r:core_node1 x:collection1] o.a.s.r.ManagedResourceStorage Setting up ZooKeeper-based storage for the RestManager with znodeBase: /configs/conf1
   [junit4]   2> 275094 INFO  (coreLoadExecutor-546-thread-1-processing-n:127.0.0.1:39822_yel%2Fj) [n:127.0.0.1:39822_yel%2Fj c:control_collection s:shard1 r:core_node1 x:collection1] o.a.s.r.ManagedResourceStorage Configured ZooKeeperStorageIO with znodeBase: /configs/conf1
   [junit4]   2> 275094 INFO  (coreLoadExecutor-546-thread-1-processing-n:127.0.0.1:39822_yel%2Fj) [n:127.0.0.1:39822_yel%2Fj c:control_collection s:shard1 r:core_node1 x:collection1] o.a.s.r.RestManager Initializing RestManager with initArgs: {}
   [junit4]   2> 275094 INFO  (coreLoadExecutor-546-thread-1-processing-n:127.0.0.1:39822_yel%2Fj) [n:127.0.0.1:39822_yel%2Fj c:control_collection s:shard1 r:core_node1 x:collection1] o.a.s.r.ManagedResourceStorage Reading _rest_managed.json using ZooKeeperStorageIO:path=/configs/conf1
   [junit4]   2> 275094 INFO  (coreLoadExecutor-546-thread-1-processing-n:127.0.0.1:39822_yel%2Fj) [n:127.0.0.1:39822_yel%2Fj c:control_collection s:shard1 r:core_node1 x:collection1] o.a.s.r.ManagedResourceStorage No data found for znode /configs/conf1/_rest_managed.json
   [junit4]   2> 275094 INFO  (coreLoadExecutor-546-thread-1-processing-n:127.0.0.1:39822_yel%2Fj) [n:127.0.0.1:39822_yel%2Fj c:control_collection s:shard1 r:core_node1 x:collection1] o.a.s.r.ManagedResourceStorage Loaded null at path _rest_managed.json using ZooKeeperStorageIO:path=/configs/conf1
   [junit4]   2> 275094 INFO  (coreLoadExecutor-546-thread-1-processing-n:127.0.0.1:39822_yel%2Fj) [n:127.0.0.1:39822_yel%2Fj c:control_collection s:shard1 r:core_node1 x:collection1] o.a.s.r.RestManager Initializing 0 registered ManagedResources
   [junit4]   2> 275094 INFO  (coreLoadExecutor-546-thread-1-processing-n:127.0.0.1:39822_yel%2Fj) [n:127.0.0.1:39822_yel%2Fj c:control_collection s:shard1 r:core_node1 x:collection1] o.a.s.h.ReplicationHandler Commits will be reserved for  10000
   [junit4]   2> 275095 INFO  (searcherExecutor-547-thread-1-processing-n:127.0.0.1:39822_yel%2Fj x:collection1 s:shard1 c:control_collection r:core_node1) [n:127.0.0.1:39822_yel%2Fj c:control_collection s:shard1 r:core_node1 x:collection1] o.a.s.c.SolrCore [collection1] Registered new searcher Searcher@6a31ad84[collection1] main{ExitableDirectoryReader(UninvertingDirectoryReader())}
   [junit4]   2> 275095 INFO  (coreLoadExecutor-546-thread-1-processing-n:127.0.0.1:39822_yel%2Fj) [n:127.0.0.1:39822_yel%2Fj c:control_collection s:shard1 r:core_node1 x:collection1] o.a.s.u.UpdateLog Looking up max value of version field to seed version buckets
   [junit4]   2> 275096 INFO  (coreLoadExecutor-546-thread-1-processing-n:127.0.0.1:39822_yel%2Fj) [n:127.0.0.1:39822_yel%2Fj c:control_collection s:shard1 r:core_node1 x:collection1] o.a.s.u.VersionInfo Refreshing highest value of _version_ for 65536 version buckets from index
   [junit4]   2> 275096 INFO  (coreLoadExecutor-546-thread-1-processing-n:127.0.0.1:39822_yel%2Fj) [n:127.0.0.1:39822_yel%2Fj c:control_collection s:shard1 r:core_node1 x:collection1] o.a.s.u.VersionInfo No terms found for _version_, cannot seed version bucket highest value from index
   [junit4]   2> 275096 INFO  (coreLoadExecutor-546-thread-1-processing-n:127.0.0.1:39822_yel%2Fj) [n:127.0.0.1:39822_yel%2Fj c:control_collection s:shard1 r:core_node1 x:collection1] o.a.s.u.UpdateLog Could not find max version in index or recent updates, using new clock 1535671598139310080
   [junit4]   2> 275097 INFO  (coreLoadExecutor-546-thread-1-processing-n:127.0.0.1:39822_yel%2Fj) [n:127.0.0.1:39822_yel%2Fj c:control_collection s:shard1 r:core_node1 x:collection1] o.a.s.u.UpdateLog Took 1.0ms to seed version buckets with highest version 1535671598139310080
   [junit4]   2> 275097 INFO  (coreLoadExecutor-546-thread-1-processing-n:127.0.0.1:39822_yel%2Fj) [n:127.0.0.1:39822_yel%2Fj c:control_collection s:shard1 r:core_node1 x:collection1] o.a.s.c.ZkController watch zkdir /configs/conf1
   [junit4]   2> 275098 INFO  (coreLoadExecutor-546-thread-1-processing-n:127.0.0.1:39822_yel%2Fj) [n:127.0.0.1:39822_yel%2Fj c:control_collection s:shard1 r:core_node1 x:collection1] o.a.s.c.CoreContainer registering core: collection1
   [junit4]   2> 275098 INFO  (coreZkRegister-540-thread-1-processing-n:127.0.0.1:39822_yel%2Fj x:collection1 s:shard1 c:control_collection r:core_node1) [n:127.0.0.1:39822_yel%2Fj c:control_collection s:shard1 r:core_node1 x:collection1] o.a.s.c.ZkController Register replica - core:collection1 address:http://127.0.0.1:39822/yel/j collection:control_collection shard:shard1
   [junit4]   2> 275099 INFO  (coreZkRegister-540-thread-1-processing-n:127.0.0.1:39822_yel%2Fj x:collection1 s:shard1 c:control_collection r:core_node1) [n:127.0.0.1:39822_yel%2Fj c:control_collection s:shard1 r:core_node1 x:collection1] o.a.s.c.c.SolrZkClient makePath: /collections/control_collection/leader_elect/shard1/election
   [junit4]   2> 275100 INFO  (coreZkRegister-540-thread-1-processing-n:127.0.0.1:39822_yel%2Fj x:collection1 s:shard1 c:control_collection r:core_node1) [n:127.0.0.1:39822_yel%2Fj c:control_collection s:shard1 r:core_node1 x:collection1] o.a.s.c.LeaderElector Joined leadership election with path: /collections/control_collection/leader_elect/shard1/election/95979474789859332-core_node1-n_0000000000
   [junit4]   2> 275100 INFO  (coreZkRegister-540-thread-1-processing-n:127.0.0.1:39822_yel%2Fj x:collection1 s:shard1 c:control_collection r:core_node1) [n:127.0.0.1:39822_yel%2Fj c:control_collection s:shard1 r:core_node1 x:collection1] o.a.s.c.ShardLeaderElectionContext Running the leader process for shard=shard1 and weAreReplacement=false and leaderVoteWait=10000
   [junit4]   2> 275101 INFO  (coreZkRegister-540-thread-1-processing-n:127.0.0.1:39822_yel%2Fj x:collection1 s:shard1 c:control_collection r:core_node1) [n:127.0.0.1:39822_yel%2Fj c:control_collection s:shard1 r:core_node1 x:collection1] o.a.s.c.ShardLeaderElectionContext Enough replicas found to continue.
   [junit4]   2> 275101 INFO  (coreZkRegister-540-thread-1-processing-n:127.0.0.1:39822_yel%2Fj x:collection1 s:shard1 c:control_collection r:core_node1) [n:127.0.0.1:39822_yel%2Fj c:control_collection s:shard1 r:core_node1 x:collection1] o.a.s.c.ShardLeaderElectionContext I may be the new leader - try and sync
   [junit4]   2> 275101 INFO  (coreZkRegister-540-thread-1-processing-n:127.0.0.1:39822_yel%2Fj x:collection1 s:shard1 c:control_collection r:core_node1) [n:127.0.0.1:39822_yel%2Fj c:control_collection s:shard1 r:core_node1 x:collection1] o.a.s.c.SyncStrategy Sync replicas to http://127.0.0.1:39822/yel/j/collection1/
   [junit4]   2> 275101 INFO  (coreZkRegister-540-thread-1-processing-n:127.0.0.1:39822_yel%2Fj x:collection1 s:shard1 c:control_collection r:core_node1) [n:127.0.0.1:39822_yel%2Fj c:control_collection s:shard1 r:core_node1 x:collection1] o.a.s.c.SyncStrategy Sync Success - now sync replicas to me
   [junit4]   2> 275101 INFO  (OverseerStateUpdate-95979474789859332-127.0.0.1:39822_yel%2Fj-n_0000000000) [n:127.0.0.1:39822_yel%2Fj    ] o.a.s.c.Overseer processMessage: queueSize: 1, message = {
   [junit4]   2>   "operation":"leader",
   [junit4]   2>   "shard":"shard1",
   [junit4]   2>   "collection":"control_collection"} current state version: 1
   [junit4]   2> 275101 INFO  (coreZkRegister-540-thread-1-processing-n:127.0.0.1:39822_yel%2Fj x:collection1 s:shard1 c:control_collection r:core_node1) [n:127.0.0.1:39822_yel%2Fj c:control_collection s:shard1 r:core_node1 x:collection1] o.a.s.c.SyncStrategy http://127.0.0.1:39822/yel/j/collection1/ has no replicas
   [junit4]   2> 275103 INFO  (coreZkRegister-540-thread-1-processing-n:127.0.0.1:39822_yel%2Fj x:collection1 s:shard1 c:control_collection r:core_node1) [n:127.0.0.1:39822_yel%2Fj c:control_collection s:shard1 r:core_node1 x:collection1] o.a.s.c.c.SolrZkClient makePath: /collections/control_collection/leaders/shard1
   [junit4]   2> 275105 INFO  (coreZkRegister-540-thread-1-processing-n:127.0.0.1:39822_yel%2Fj x:collection1 s:shard1 c:control_collection r:core_node1) [n:127.0.0.1:39822_yel%2Fj c:control_collection s:shard1 r:core_node1 x:collection1] o.a.s.c.ShardLeaderElectionContextBase Creating leader registration node /collections/control_collection/leaders/shard1/leader after winning as /collections/control_collection/leader_elect/shard1/election/95979474789859332-core_node1-n_0000000000
   [junit4]   2> 275106 INFO  (coreZkRegister-540-thread-1-processing-n:127.0.0.1:39822_yel%2Fj x:collection1 s:shard1 c:control_collection r:core_node1) [n:127.0.0.1:39822_yel%2Fj c:control_collection s:shard1 r:core_node1 x:collection1] o.a.s.c.ShardLeaderElectionContext I am the new leader: http://127.0.0.1:39822/yel/j/collection1/ shard1
   [junit4]   2> 275107 INFO  (OverseerStateUpdate-95979474789859332-127.0.0.1:39822_yel%2Fj-n_0000000000) [n:127.0.0.1:39822_yel%2Fj    ] o.a.s.c.Overseer processMessage: queueSize: 1, message = {
   [junit4]   2>   "operation":"leader",
   [junit4]   2>   "shard":"shard1",
   [junit4]   2>   "collection":"control_collection",
   [junit4]   2>   "base_url":"http://127.0.0.1:39822/yel/j",
   [junit4]   2>   "core":"collection1",
   [junit4]   2>   "state":"active"} current state version: 1
   [junit4]   2> 275208 INFO  (zkCallback-170-thread-1-processing-n:127.0.0.1:39822_yel%2Fj) [n:127.0.0.1:39822_yel%2Fj    ] o.a.s.c.c.ZkStateReader A cluster state change: [WatchedEvent state:SyncConnected type:NodeDataChanged path:/clusterstate.json], has occurred - updating... (live nodes size: [1])
   [junit4]   2> 275257 INFO  (coreZkRegister-540-thread-1-processing-n:127.0.0.1:39822_yel%2Fj x:collection1 s:shard1 c:control_collection r:core_node1) [n:127.0.0.1:39822_yel%2Fj c:control_collection s:shard1 r:core_node1 x:collection1] o.a.s.c.ZkController We are http://127.0.0.1:39822/yel/j/collection1/ and leader is http://127.0.0.1:39822/yel/j/collection1/
   [junit4]   2> 275257 INFO  (coreZkRegister-540-thread-1-processing-n:127.0.0.1:39822_yel%2Fj x:collection1 s:shard1 c:control_collection r:core_node1) [n:127.0.0.1:39822_yel%2Fj c:control_collection s:shard1 r:core_node1 x:collection1] o.a.s.c.ZkController No LogReplay needed for core=collection1 baseURL=http://127.0.0.1:39822/yel/j
   [junit4]   2> 275257 INFO  (coreZkRegister-540-thread-1-processing-n:127.0.0.1:39822_yel%2Fj x:collection1 s:shard1 c:control_collection r:core_node1) [n:127.0.0.1:39822_yel%2Fj c:control_collection s:shard1 r:core_node1 x:collection1] o.a.s.c.ZkController I am the leader, no recovery necessary
   [junit4]   2> 275258 INFO  (coreZkRegister-540-thread-1-processing-n:127.0.0.1:39822_yel%2Fj x:collection1 s:shard1 c:control_collection r:core_node1) [n:127.0.0.1:39822_yel%2Fj c:control_collection s:shard1 r:core_node1 x:collection1] o.a.s.c.ZkController publishing state=active
   [junit4]   2> 275258 INFO  (coreZkRegister-540-thread-1-processing-n:127.0.0.1:39822_yel%2Fj x:collection1 s:shard1 c:control_collection r:core_node1) [n:127.0.0.1:39822_yel%2Fj c:control_collection s:shard1 r:core_node1 x:collection1] o.a.s.c.ZkController numShards not found on descriptor - reading it from system property
   [junit4]   2> 275261 INFO  (OverseerStateUpdate-95979474789859332-127.0.0.1:39822_yel%2Fj-n_0000000000) [n:127.0.0.1:39822_yel%2Fj    ] o.a.s.c.Overseer processMessage: queueSize: 1, message = {
   [junit4]   2>   "core":"collection1",
   [junit4]   2>   "core_node_name":"core_node1",
   [junit4]   2>   "roles":null,
   [junit4]   2>   "base_url":"http://127.0.0.1:39822/yel/j",
   [junit4]   2>   "node_name":"127.0.0.1:39822_yel%2Fj",
   [junit4]   2>   "numShards":"1",
   [junit4]   2>   "state":"active",
   [junit4]   2>   "shard":"shard1",
   [junit4]   2>   "collection":"control_collection",
   [junit4]   2>   "operation":"state"} current state version: 2
   [junit4]   2> 275261 INFO  (OverseerStateUpdate-95979474789859332-127.0.0.1:39822_yel%2Fj-n_0000000000) [n:127.0.0.1:39822_yel%2Fj    ] o.a.s.c.o.ReplicaMutator Update state numShards=1 message={
   [junit4]   2>   "core":"collection1",
   [junit4]   2>   "core_node_name":"core_node1",
   [junit4]   2>   "roles":null,
   [junit4]   2>   "base_url":"http://127.0.0.1:39822/yel/j",
   [junit4]   2>   "node_name":"127.0.0.1:39822_yel%2Fj",
   [junit4]   2>   "numShards":"1",
   [junit4]   2>   "state":"active",
   [junit4]   2>   "shard":"shard1",
   [junit4]   2>   "collection":"control_collection",
   [junit4]   2>   "operation":"state"}
   [junit4]   2> 275362 INFO  (zkCallback-170-thread-1-processing-n:127.0.0.1:39822_yel%2Fj) [n:127.0.0.1:39822_yel%2Fj    ] o.a.s.c.c.ZkStateReader A cluster state change: [WatchedEvent state:SyncConnected type:NodeDataChanged path:/clusterstate.json], has occurred - updating... (live nodes size: [1])
   [junit4]   2> 275469 INFO  (TEST-TestReqParamsAPI.test-seed#[41FEA0D4A33982F6]) [    ] o.a.s.c.s.i.CloudSolrClient Final constructed zkHost string: 127.0.0.1:33328/solr
   [junit4]   2> 275469 INFO  (TEST-TestReqParamsAPI.test-seed#[41FEA0D4A33982F6]) [    ] o.a.s.c.c.SolrZkClient Using default ZkCredentialsProvider
   [junit4]   2> 275470 INFO  (TEST-TestReqParamsAPI.test-seed#[41FEA0D4A33982F6]) [    ] o.a.s.c.c.ConnectionManager Waiting for client to connect to ZooKeeper
   [junit4]   2> 275471 INFO  (zkCallback-174-thread-1) [    ] o.a.s.c.c.ConnectionManager Watcher org.apache.solr.common.cloud.ConnectionManager@455b6b2c name:ZooKeeperConnection Watcher:127.0.0.1:33328/solr got event WatchedEvent state:SyncConnected type:None path:null path:null type:None
   [junit4]   2> 275471 INFO  (TEST-TestReqParamsAPI.test-seed#[41FEA0D4A33982F6]) [    ] o.a.s.c.c.ConnectionManager Client is connected to ZooKeeper
   [junit4]   2> 275471 INFO  (TEST-TestReqParamsAPI.test-seed#[41FEA0D4A33982F6]) [    ] o.a.s.c.c.SolrZkClient Using default ZkACLProvider
   [junit4]   2> 275471 INFO  (TEST-TestReqParamsAPI.test-seed#[41FEA0D4A33982F6]) [    ] o.a.s.c.c.ZkStateReader Updating cluster state from ZooKeeper... 
   [junit4]   2> 275472 INFO  (TEST-TestReqParamsAPI.test-seed#[41FEA0D4A33982F6]) [    ] o.a.s.c.c.ZkStateReader Loaded empty cluster properties
   [junit4]   2> 275472 INFO  (TEST-TestReqParamsAPI.test-seed#[41FEA0D4A33982F6]) [    ] o.a.s.c.c.ZkStateReader Updated live nodes from ZooKeeper... (0) -> (1)
   [junit4]   2> 275473 INFO  (TEST-TestReqParamsAPI.test-seed#[41FEA0D4A33982F6]) [    ] o.a.s.c.ChaosMonkey monkey: init - expire sessions:false cause connection loss:false
   [junit4]   2> 275473 INFO  (TEST-TestReqParamsAPI.test-seed#[41FEA0D4A33982F6]) [    ] o.a.s.c.AbstractFullDistribZkTestBase Creating collection1 with stateFormat=2
   [junit4]   2> 275473 INFO  (TEST-TestReqParamsAPI.test-seed#[41FEA0D4A33982F6]) [    ] o.a.s.c.c.SolrZkClient Using default ZkCredentialsProvider
   [junit4]   2> 275473 INFO  (TEST-TestReqParamsAPI.test-seed#[41FEA0D4A33982F6]) [    ] o.a.s.c.c.ConnectionManager Waiting for client to connect to ZooKeeper
   [junit4]   2> 275474 INFO  (zkCallback-175-thread-1) [    ] o.a.s.c.c.ConnectionManager Watcher org.apache.solr.common.cloud.ConnectionManager@50af5472 name:ZooKeeperConnection Watcher:127.0.0.1:33328/solr got event WatchedEvent state:SyncConnected type:None path:null path:null type:None
   [junit4]   2> 275474 INFO  (TEST-TestReqParamsAPI.test-seed#[41FEA0D4A33982F6]) [    ] o.a.s.c.c.ConnectionManager Client is connected to ZooKeeper
   [junit4]   2> 275475 INFO  (TEST-TestReqParamsAPI.test-seed#[41FEA0D4A33982F6]) [    ] o.a.s.c.c.SolrZkClient Using default ZkACLProvider
   [junit4]   2> 275476 INFO  (OverseerStateUpdate-95979474789859332-127.0.0.1:39822_yel%2Fj-n_0000000000) [n:127.0.0.1:39822_yel%2Fj    ] o.a.s.c.Overseer processMessage: queueSize: 1, message = {
   [junit4]   2>   "operation":"create",
   [junit4]   2>   "name":"collection1",
   [junit4]   2>   "numShards":"2",
   [junit4]   2>   "stateFormat":"2"} current state version: 3
   [junit4]   2> 275477 INFO  (OverseerStateUpdate-95979474789859332-127.0.0.1:39822_yel%2Fj-n_0000000000) [n:127.0.0.1:39822_yel%2Fj    ] o.a.s.c.o.ClusterStateMutator building a new cName: collection1
   [junit4]   2> 275528 INFO  (TEST-TestReqParamsAPI.test-seed#[41FEA0D4A33982F6]) [    ] o.a.s.SolrTestCaseJ4 Writing core.properties file to /home/jenkins/workspace/Lucene-Solr-master-Linux/solr/build/solr-core/test/J0/temp/solr.handler.TestReqParamsAPI_41FEA0D4A33982F6-001/shard-1-001/cores/collection1
   [junit4]   2> 275529 INFO  (TEST-TestReqParamsAPI.test-seed#[41FEA0D4A33982F6]) [    ] o.a.s.c.AbstractFullDistribZkTestBase create jetty 1 in directory /home/jenkins/workspace/Lucene-Solr-master-Linux/solr/build/solr-core/test/J0/temp/solr.handler.TestReqParamsAPI_41FEA0D4A33982F6-001/shard-1-001
   [junit4]   2> 275529 INFO  (TEST-TestReqParamsAPI.test-seed#[41FEA0D4A33982F6]) [    ] o.e.j.s.Server jetty-9.3.8.v20160314
   [junit4]   2> 275544 INFO  (TEST-TestReqParamsAPI.test-seed#[41FEA0D4A33982F6]) [    ] o.e.j.s.h.ContextHandler Started o.e.j.s.ServletContextHandler@4b6ba607{/yel/j,null,AVAILABLE}
   [junit4]   2> 275544 INFO  (TEST-TestReqParamsAPI.test-seed#[41FEA0D4A33982F6]) [    ] o.e.j.s.ServerConnector Started ServerConnector@3fc98949{HTTP/1.1,[http/1.1]}{127.0.0.1:38084}
   [junit4]   2> 275544 INFO  (TEST-TestReqParamsAPI.test-seed#[41FEA0D4A33982F6]) [    ] o.e.j.s.Server Started @277231ms
   [junit4]   2> 275544 INFO  (TEST-TestReqParamsAPI.test-seed#[41FEA0D4A33982F6]) [    ] o.a.s.c.s.e.JettySolrRunner Jetty properties: {solr.data.dir=/home/jenkins/workspace/Lucene-Solr-master-Linux/solr/build/solr-core/test/J0/temp/solr.handler.TestReqParamsAPI_41FEA0D4A33982F6-001/tempDir-001/jetty1, solrconfig=solrconfig.xml, hostContext=/yel/j, hostPort=38084, coreRootDirectory=/home/jenkins/workspace/Lucene-Solr-master-Linux/solr/build/solr-core/test/J0/../../../../../../../../../home/jenkins/workspace/Lucene-Solr-master-Linux/solr/build/solr-core/test/J0/temp/solr.handler.TestReqParamsAPI_41FEA0D4A33982F6-001/shard-1-001/cores}
   [junit4]   2> 275544 INFO  (TEST-TestReqParamsAPI.test-seed#[41FEA0D4A33982F6]) [    ] o.a.s.s.SolrDispatchFilter SolrDispatchFilter.init(): sun.misc.Launcher$AppClassLoader@73d16e93
   [junit4]   2> 275545 INFO  (TEST-TestReqParamsAPI.test-seed#[41FEA0D4A33982F6]) [    ] o.a.s.c.SolrResourceLoader new SolrResourceLoader for directory: '/home/jenkins/workspace/Lucene-Solr-master-Linux/solr/build/solr-core/test/J0/temp/solr.handler.TestReqParamsAPI_41FEA0D4A33982F6-001/shard-1-001'
   [junit4]   2> 275545 INFO  (TEST-TestReqParamsAPI.test-seed#[41FEA0D4A33982F6]) [    ] o.a.s.c.SolrResourceLoader JNDI not configured for solr (NoInitialContextEx)
   [junit4]   2> 275545 INFO  (TEST-TestReqParamsAPI.test-seed#[41FEA0D4A33982F6]) [    ] o.a.s.c.SolrResourceLoader solr home defaulted to 'solr/' (could not find system property or JNDI)
   [junit4]   2> 275545 INFO  (TEST-TestReqParamsAPI.test-seed#[41FEA0D4A33982F6]) [    ] o.a.s.c.c.SolrZkClient Using default ZkCredentialsProvider
   [junit4]   2> 275545 INFO  (TEST-TestReqParamsAPI.test-seed#[41FEA0D4A33982F6]) [    ] o.a.s.c.c.ConnectionManager Waiting for client to connect to ZooKeeper
   [junit4]   2> 275552 INFO  (zkCallback-176-thread-1) [    ] o.a.s.c.c.ConnectionManager Watcher org.apache.solr.common.cloud.ConnectionManager@330d0314 name:ZooKeeperConnection Watcher:127.0.0.1:33328/solr got event WatchedEvent state:SyncConnected type:None path:null path:null type:None
   [junit4]   2> 275552 INFO  (TEST-TestReqParamsAPI.test-seed#[41FEA0D4A33982F6]) [    ] o.a.s.c.c.ConnectionManager Client is connected to ZooKeeper
   [junit4]   2> 275552 INFO  (TEST-TestReqParamsAPI.test-seed#[41FEA0D4A33982F6]) [    ] o.a.s.c.c.SolrZkClient Using default ZkACLProvider
   [junit4]   2> 275556 INFO  (TEST-TestReqParamsAPI.test-seed#[41FEA0D4A33982F6]) [    ] o.a.s.s.SolrDispatchFilter Loading solr.xml from SolrHome (not found in ZooKeeper)
   [junit4]   2> 275556 INFO  (TEST-TestReqParamsAPI.test-seed#[41FEA0D4A33982F6]) [    ] o.a.s.c.SolrXmlConfig Loading container configuration from /home/jenkins/workspace/Lucene-Solr-master-Linux/solr/build/solr-core/test/J0/temp/solr.handler.TestReqParamsAPI_41FEA0D4A33982F6-001/shard-1-001/solr.xml
   [junit4]   2> 275561 INFO  (TEST-TestReqParamsAPI.test-seed#[41FEA0D4A33982F6]) [    ] o.a.s.c.CorePropertiesLocator Config-defined core root directory: /home/jenkins/workspace/Lucene-Solr-master-Linux/solr/build/solr-core/test/J0/../../../../../../../../../home/jenkins/workspace/Lucene-Solr-master-Linux/solr/build/solr-core/test/J0/temp/solr.handler.TestReqParamsAPI_41FEA0D4A33982F6-001/shard-1-001/cores
   [junit4]   2> 275561 INFO  (TEST-TestReqParamsAPI.test-seed#[41FEA0D4A33982F6]) [    ] o.a.s.c.CoreContainer New CoreContainer 2037199356
   [junit4]   2> 275561 INFO  (TEST-TestReqParamsAPI.test-seed#[41FEA0D4A33982F6]) [    ] o.a.s.c.CoreContainer Loading cores into CoreContainer [instanceDir=/home/jenkins/workspace/Lucene-Solr-master-Linux/solr/build/solr-core/test/J0/temp/solr.handler.TestReqParamsAPI_41FEA0D4A33982F6-001/shard-1-001]
   [junit4]   2> 275562 WARN  (TEST-TestReqParamsAPI.test-seed#[41FEA0D4A33982F6]) [    ] o.a.s.c.CoreContainer Couldn't add files from /home/jenkins/workspace/Lucene-Solr-master-Linux/solr/build/solr-core/test/J0/temp/solr.handler.TestReqParamsAPI_41FEA0D4A33982F6-001/shard-1-001/lib to classpath: /home/jenkins/workspace/Lucene-Solr-master-Linux/solr/build/solr-core/test/J0/temp/solr.handler.TestReqParamsAPI_41FEA0D4A33982F6-001/shard-1-001/lib
   [junit4]   2> 275562 INFO  (TEST-TestReqParamsAPI.test-seed#[41FEA0D4A33982F6]) [    ] o.a.s.h.c.HttpShardHandlerFactory created with socketTimeout : 90000,urlScheme : ,connTimeout : 15000,maxConnectionsPerHost : 20,maxConnections : 10000,corePoolSize : 0,maximumPoolSize : 2147483647,maxThreadIdleTime : 5,sizeOfQueue : -1,fairnessPolicy : false,
   [junit4]   2> 275564 INFO  (TEST-TestReqParamsAPI.test-seed#[41FEA0D4A33982F6]) [    ] o.a.s.u.UpdateShardHandler Creating UpdateShardHandler HTTP client with params: 
   [junit4]   2> 275565 INFO  (TEST-TestReqParamsAPI.test-seed#[41FEA0D4A33982F6]) [    ] o.a.s.l.LogWatcher SLF4J impl is org.slf4j.impl.Log4jLoggerFactory
   [junit4]   2> 275565 INFO  (TEST-TestReqParamsAPI.test-seed#[41FEA0D4A33982F6]) [    ] o.a.s.l.LogWatcher Registering Log Listener [Log4j (org.slf4j.impl.Log4jLoggerFactory)]
   [junit4]   2> 275565 INFO  (TEST-TestReqParamsAPI.test-seed#[41FEA0D4A33982F6]) [    ] o.a.s.c.ZkContainer Zookeeper client=127.0.0.1:33328/solr
   [junit4]   2> 275565 INFO  (TEST-TestReqParamsAPI.test-seed#[41FEA0D4A33982F6]) [    ] o.a.s.c.ZkController zkHost includes chroot
   [junit4]   2> 275565 INFO  (TEST-TestReqParamsAPI.test-seed#[41FEA0D4A33982F6]) [    ] o.a.s.c.c.SolrZkClient Using default ZkCredentialsProvider
   [junit4]   2> 275565 INFO  (TEST-TestReqParamsAPI.test-seed#[41FEA0D4A33982F6]) [    ] o.a.s.c.c.ConnectionManager Waiting for client to connect to ZooKeeper
   [junit4]   2> 275567 INFO  (zkCallback-179-thread-1) [    ] o.a.s.c.c.ConnectionManager Watcher org.apache.solr.common.cloud.ConnectionManager@272145f4 name:ZooKeeperConnection Watcher:127.0.0.1:33328 got event WatchedEvent state:SyncConnected type:None path:null path:null type:None
   [junit4]   2> 275567 INFO  (TEST-TestReqParamsAPI.test-seed#[41FEA0D4A33982F6]) [    ] o.a.s.c.c.ConnectionManager Client is connected to ZooKeeper
   [junit4]   2> 275567 INFO  (TEST-TestReqParamsAPI.test-seed#[41FEA0D4A33982F6]) [    ] o.a.s.c.c.SolrZkClient Using default ZkACLProvider
   [junit4]   2> 275568 INFO  (TEST-TestReqParamsAPI.test-seed#[41FEA0D4A33982F6]) [n:127.0.0.1:38084_yel%2Fj    ] o.a.s.c.ZkController Added new OnReconnect listener org.apache.solr.cloud.ZkController$$Lambda$80/1522658972@146936da
   [junit4]   2> 275568 INFO  (TEST-TestReqParamsAPI.test-seed#[41FEA0D4A33982F6]) [n:127.0.0.1:38084_yel%2Fj    ] o.a.s.c.c.ConnectionManager Waiting for client to connect to ZooKeeper
   [junit4]   2> 275569 INFO  (zkCallback-180-thread-1-processing-n:127.0.0.1:38084_yel%2Fj) [n:127.0.0.1:38084_yel%2Fj    ] o.a.s.c.c.ConnectionManager Watcher org.apache.solr.common.cloud.ConnectionManager@7df2a1ff name:ZooKeeperConnection Watcher:127.0.0.1:33328/solr got event WatchedEvent state:SyncConnected type:None path:null path:null type:None
   [junit4]   2> 275569 INFO  (TEST-TestReqParamsAPI.test-seed#[41FEA0D4A33982F6]) [n:127.0.0.1:38084_yel%2Fj    ] o.a.s.c.c.ConnectionManager Client is connected to ZooKeeper
   [junit4]   2> 275573 INFO  (TEST-TestReqParamsAPI.test-seed#[41FEA0D4A33982F6]) [n:127.0.0.1:38084_yel%2Fj    ] o.a.s.c.c.ZkStateReader Updating cluster state from ZooKeeper... 
   [junit4]   2> 275573 INFO  (TEST-TestReqParamsAPI.test-seed#[41FEA0D4A33982F6]) [n:127.0.0.1:38084_yel%2Fj    ] o.a.s.c.c.ZkStateReader Loaded empty cluster properties
   [junit4]   2> 275573 INFO  (TEST-TestReqParamsAPI.test-seed#[41FEA0D4A33982F6]) [n:127.0.0.1:38084_yel%2Fj    ] o.a.s.c.c.ZkStateReader Updated live nodes from ZooKeeper... (0) -> (1)
   [junit4]   2> 275574 INFO  (TEST-TestReqParamsAPI.test-seed#[41FEA0D4A33982F6]) [n:127.0.0.1:38084_yel%2Fj    ] o.a.s.c.Overseer Overseer (id=null) closing
   [junit4]   2> 275575 INFO  (TEST-TestReqParamsAPI.test-seed#[41FEA0D4A33982F6]) [n:127.0.0.1:38084_yel%2Fj    ] o.a.s.c.LeaderElector Joined leadership election with path: /overseer_elect/election/95979474789859337-127.0.0.1:38084_yel%2Fj-n_0000000001
   [junit4]   2> 275575 INFO  (TEST-TestReqParamsAPI.test-seed#[41FEA0D4A33982F6]) [n:127.0.0.1:38084_yel%2Fj    ] o.a.s.c.LeaderElector Watching path /overseer_elect/election/95979474789859332-127.0.0.1:39822_yel%2Fj-n_0000000000 to know if I could be the leader
   [junit4]   2> 275575 INFO  (TEST-TestReqParamsAPI.test-seed#[41FEA0D4A33982F6]) [n:127.0.0.1:38084_yel%2Fj    ] o.a.s.c.ZkController Publish node=127.0.0.1:38084_yel%2Fj as DOWN
   [junit4]   2> 275577 INFO  (OverseerStateUpdate-95979474789859332-127.0.0.1:39822_yel%2Fj-n_0000000000) [n:127.0.0.1:39822_yel%2Fj    ] o.a.s.c.o.ZkStateWriter going to create_collection /collections/collection1/state.json
   [junit4]   2> 275579 INFO  (OverseerStateUpdate-95979474789859332-127.0.0.1:39822_yel%2Fj-n_0000000000) [n:127.0.0.1:39822_yel%2Fj    ] o.a.s.c.Overseer processMessage: queueSize: 1, message = {
   [junit4]   2>   "operation":"downnode",
   [junit4]   2>   "node_name":"127.0.0.1:38084_yel%2Fj"} current state version: 3
   [junit4]   2> 275579 INFO  (OverseerStateUpdate-95979474789859332-127.0.0.1:39822_yel%2Fj-n_0000000000) [n:127.0.0.1:39822_yel%2Fj    ] o.a.s.c.o.NodeMutator DownNode state invoked for node: 127.0.0.1:38084_yel%2Fj
   [junit4]   2> 275580 INFO  (zkCallback-170-thread-1-processing-n:127.0.0.1:39822_yel%2Fj) [n:127.0.0.1:39822_yel%2Fj    ] o.a.s.c.c.ZkStateReader A cluster state change: [WatchedEvent state:SyncConnected type:NodeDataChanged path:/clusterstate.json], has occurred - updating... (live nodes size: [1])
   [junit4]   2> 275580 INFO  (zkCallback-174-thread-1) [    ] o.a.s.c.c.ZkStateReader A cluster state change: [WatchedEvent state:SyncConnected type:NodeDataChanged path:/clusterstate.json], has occurred - updating... (live nodes size: [1])
   [junit4]   2> 275580 INFO  (zkCallback-180-thread-1-processing-n:127.0.0.1:38084_yel%2Fj) [n:127.0.0.1:38084_yel%2Fj    ] o.a.s.c.c.ZkStateReader A cluster state change: [WatchedEvent state:SyncConnected type:NodeDataChanged path:/clusterstate.json], has occurred - updating... (live nodes size: [1])
   [junit4]   2> 275682 INFO  (OverseerStateUpdate-95979474789859332-127.0.0.1:39822_yel%2Fj-n_0000000000) [n:127.0.0.1:39822_yel%2Fj    ] o.a.s.c.o.ZkStateWriter going to update_collection /collections/collection1/state.json version: 0
   [junit4]   2> 276576 INFO  (TEST-TestReqParamsAPI.test-seed#[41FEA0D4A33982F6]) [n:127.0.0.1:38084_yel%2Fj    ] o.a.s.c.ZkController Register node as live in ZooKeeper:/live_nodes/127.0.0.1:38084_yel%2Fj
   [junit4]   2> 276577 INFO  (TEST-TestReqParamsAPI.test-seed#[41FEA0D4A33982F6]) [n:127.0.0.1:38084_yel%2Fj    ] o.a.s.c.c.SolrZkClient makePath: /live_nodes/127.0.0.1:38084_yel%2Fj
   [junit4]   2> 276577 INFO  (zkCallback-170-thread-1-processing-n:127.0.0.1:39822_yel%2Fj) [n:127.0.0.1:39822_yel%2Fj    ] o.a.s.c.c.ZkStateReader A live node change: [WatchedEvent state:SyncConnected type:NodeChildrenChanged path:/live_nodes], has occurred - updating... (live nodes size: [1])
   [junit4]   2> 276577 INFO  (zkCallback-174-thread-1) [    ] o.a.s.c.c.ZkStateReader A live node change: [WatchedEvent state:SyncConnected type:NodeChildrenChanged path:/live_nodes], has occurred - updating... (live nodes size: [1])
   [junit4]   2> 276577 INFO  (zkCallback-180-thread-1-processing-n:127.0.0.1:38084_yel%2Fj) [n:127.0.0.1:38084_yel%2Fj    ] o.a.s.c.c.ZkStateReader A live node change: [WatchedEvent state:SyncConnected type:NodeChildrenChanged path:/live_nodes], has occurred - updating... (live nodes size: [1])
   [junit4]   2> 276577 INFO  (zkCallback-170-thread-1-processing-n:127.0.0.1:39822_yel%2Fj) [n:127.0.0.1:39822_yel%2Fj    ] o.a.s.c.c.ZkStateReader Updated live nodes from ZooKeeper... (1) -> (2)
   [junit4]   2> 276578 INFO  (zkCallback-180-thread-1-processing-n:127.0.0.1:38084_yel%2Fj) [n:127.0.0.1:38084_yel%2Fj    ] o.a.s.c.c.ZkStateReader Updated live nodes from ZooKeeper... (1) -> (2)
   [junit4]   2> 276578 INFO  (zkCallback-174-thread-1) [    ] o.a.s.c.c.ZkStateReader Updated live nodes from ZooKeeper... (1) -> (2)
   [junit4]   2> 276598 INFO  (TEST-TestReqParamsAPI.test-seed#[41FEA0D4A33982F6]) [n:127.0.0.1:38084_yel%2Fj    ] o.a.s.c.CoreContainer Security conf doesn't exist. Skipping setup for authorization module.
   [junit4]   2> 276598 INFO  (TEST-TestReqParamsAPI.test-seed#[41FEA0D4A33982F6]) [n:127.0.0.1:38084_yel%2Fj    ] o.a.s.c.CoreContainer No authentication plugin used.
   [junit4]   2> 276599 INFO  (TEST-TestReqParamsAPI.test-seed#[41FEA0D4A33982F6]) [n:127.0.0.1:38084_yel%2Fj    ] o.a.s.c.CorePropertiesLocator Looking for core definitions underneath /home/jenkins/workspace/Lucene-Solr-master-Linux/solr/build/solr-core/test/J0/../../../../../../../../../home/jenkins/workspace/Lucene-Solr-master-Linux/solr/build/solr-core/test/J0/temp/solr.handler.TestReqParamsAPI_41FEA0D4A33982F6-001/shard-1-001/cores
   [junit4]   2> 276599 INFO  (TEST-TestReqParamsAPI.test-seed#[41FEA0D4A33982F6]) [n:127.0.0.1:38084_yel%2Fj    ] o.a.s.c.CoreDescriptor Created CoreDescriptor: {name=collection1, config=solrconfig.xml, transient=false, schema=schema.xml, loadOnStartup=true, configSetProperties=configsetprops.json, collection=collection1, coreNodeName=, dataDir=data/, shard=}
   [junit4]   2> 276599 INFO  (TEST-TestReqParamsAPI.test-seed#[41FEA0D4A33982F6]) [n:127.0.0.1:38084_yel%2Fj    ] o.a.s.c.CorePropertiesLocator Found core collection1 in /home/jenkins/workspace/Lucene-Solr-master-Linux/solr

[...truncated too long message...]

s.c.SolrCore [collection1] Registered new searcher Searcher@1ddfa050[collection1] main{ExitableDirectoryReader(UninvertingDirectoryReader(Uninverting(_0(7.0.0):c3)))}
   [junit4]   2> 1218464 INFO  (TEST-SolrPluginUtilsTest.testDocListConversion-seed#[41FEA0D4A33982F6]) [    ] o.a.s.u.p.LogUpdateProcessorFactory [collection1]  webapp=null path=null params={}{commit=} 0 13
   [junit4]   2> 1218465 INFO  (TEST-SolrPluginUtilsTest.testDocListConversion-seed#[41FEA0D4A33982F6]) [    ] o.a.s.SolrTestCaseJ4 ###Ending testDocListConversion
   [junit4]   2> 1218468 INFO  (TEST-SolrPluginUtilsTest.testParseFieldBoosts-seed#[41FEA0D4A33982F6]) [    ] o.a.s.SolrTestCaseJ4 ###Starting testParseFieldBoosts
   [junit4]   2> 1218468 INFO  (TEST-SolrPluginUtilsTest.testParseFieldBoosts-seed#[41FEA0D4A33982F6]) [    ] o.a.s.SolrTestCaseJ4 ###Ending testParseFieldBoosts
   [junit4]   2> 1218469 INFO  (SUITE-SolrPluginUtilsTest-seed#[41FEA0D4A33982F6]-worker) [    ] o.a.s.SolrTestCaseJ4 ###deleteCore
   [junit4]   2> 1218469 INFO  (SUITE-SolrPluginUtilsTest-seed#[41FEA0D4A33982F6]-worker) [    ] o.a.s.c.CoreContainer Shutting down CoreContainer instance=430007361
   [junit4]   2> 1218469 INFO  (coreCloseExecutor-4292-thread-1) [    x:collection1] o.a.s.c.SolrCore [collection1]  CLOSING SolrCore org.apache.solr.core.SolrCore@8d94d19
   [junit4]   2> 1218469 INFO  (coreCloseExecutor-4292-thread-1) [    x:collection1] o.a.s.u.DirectUpdateHandler2 closing DirectUpdateHandler2{commits=1,autocommits=0,soft autocommits=0,optimizes=0,rollbacks=0,expungeDeletes=0,docsPending=0,adds=0,deletesById=0,deletesByQuery=0,errors=0,cumulative_adds=3,cumulative_deletesById=0,cumulative_deletesByQuery=0,cumulative_errors=0,transaction_logs_total_size=251,transaction_logs_total_number=1}
   [junit4]   2> 1218469 INFO  (coreCloseExecutor-4292-thread-1) [    x:collection1] o.a.s.u.SolrCoreState Closing SolrCoreState
   [junit4]   2> 1218469 INFO  (coreCloseExecutor-4292-thread-1) [    x:collection1] o.a.s.u.DefaultSolrCoreState SolrCoreState ref count has reached 0 - closing IndexWriter
   [junit4]   2> 1218469 INFO  (coreCloseExecutor-4292-thread-1) [    x:collection1] o.a.s.u.DefaultSolrCoreState closing IndexWriter with IndexWriterCloser
   [junit4]   2> 1218470 INFO  (coreCloseExecutor-4292-thread-1) [    x:collection1] o.a.s.c.SolrCore [collection1] Closing main searcher on request.
   [junit4]   2> 1218476 INFO  (coreCloseExecutor-4292-thread-1) [    x:collection1] o.a.s.c.CachingDirectoryFactory Closing MockDirectoryFactory - 2 directories currently being tracked
   [junit4]   2> 1218476 INFO  (coreCloseExecutor-4292-thread-1) [    x:collection1] o.a.s.c.CachingDirectoryFactory looking to close /home/jenkins/workspace/Lucene-Solr-master-Linux/solr/build/solr-core/test/J1/temp/solr.util.SolrPluginUtilsTest_41FEA0D4A33982F6-001/init-core-data-001/index [CachedDir<<refCount=0;path=/home/jenkins/workspace/Lucene-Solr-master-Linux/solr/build/solr-core/test/J1/temp/solr.util.SolrPluginUtilsTest_41FEA0D4A33982F6-001/init-core-data-001/index;done=false>>]
   [junit4]   2> 1218476 INFO  (coreCloseExecutor-4292-thread-1) [    x:collection1] o.a.s.c.CachingDirectoryFactory Closing directory, CoreContainer#isShutdown=true
   [junit4]   2> 1218476 INFO  (coreCloseExecutor-4292-thread-1) [    x:collection1] o.a.s.c.CachingDirectoryFactory Closing directory: /home/jenkins/workspace/Lucene-Solr-master-Linux/solr/build/solr-core/test/J1/temp/solr.util.SolrPluginUtilsTest_41FEA0D4A33982F6-001/init-core-data-001/index
   [junit4]   2> 1218476 INFO  (coreCloseExecutor-4292-thread-1) [    x:collection1] o.a.s.c.CachingDirectoryFactory looking to close /home/jenkins/workspace/Lucene-Solr-master-Linux/solr/build/solr-core/test/J1/temp/solr.util.SolrPluginUtilsTest_41FEA0D4A33982F6-001/init-core-data-001 [CachedDir<<refCount=0;path=/home/jenkins/workspace/Lucene-Solr-master-Linux/solr/build/solr-core/test/J1/temp/solr.util.SolrPluginUtilsTest_41FEA0D4A33982F6-001/init-core-data-001;done=false>>]
   [junit4]   2> 1218476 INFO  (coreCloseExecutor-4292-thread-1) [    x:collection1] o.a.s.c.CachingDirectoryFactory Closing directory, CoreContainer#isShutdown=true
   [junit4]   2> 1218476 INFO  (coreCloseExecutor-4292-thread-1) [    x:collection1] o.a.s.c.CachingDirectoryFactory Closing directory: /home/jenkins/workspace/Lucene-Solr-master-Linux/solr/build/solr-core/test/J1/temp/solr.util.SolrPluginUtilsTest_41FEA0D4A33982F6-001/init-core-data-001
   [junit4]   2> NOTE: leaving temporary files on disk at: /home/jenkins/workspace/Lucene-Solr-master-Linux/solr/build/solr-core/test/J1/temp/solr.util.SolrPluginUtilsTest_41FEA0D4A33982F6-001
   [junit4]   2> NOTE: test params are: codec=Asserting(Lucene62): {val_dynamic=FSTOrd50, range_facet_l_dv=FSTOrd50, _version_=PostingsFormat(name=LuceneVarGapFixedInterval), multiDefault=FST50, val_i=FSTOrd50, intDefault=PostingsFormat(name=LuceneVarGapFixedInterval), dynamic_val=FSTOrd50, id=FSTOrd50, range_facet_i_dv=PostingsFormat(name=LuceneVarGapFixedInterval), range_facet_l=PostingsFormat(name=LuceneVarGapFixedInterval), timestamp=PostingsFormat(name=LuceneVarGapFixedInterval)}, docValues:{range_facet_l_dv=DocValuesFormat(name=Lucene54), range_facet_i_dv=DocValuesFormat(name=SimpleText), timestamp=DocValuesFormat(name=SimpleText)}, maxPointsInLeafNode=1530, maxMBSortInHeap=7.685944907745051, sim=RandomSimilarity(queryNorm=false,coord=yes): {}, locale=es-AR, timezone=Asia/Irkutsk
   [junit4]   2> NOTE: Linux 4.4.0-21-generic amd64/Oracle Corporation 1.8.0_92 (64-bit)/cpus=12,threads=1,free=259304728,total=515899392
   [junit4]   2> NOTE: All tests run in this JVM: [TestDFRSimilarityFactory, TestSolrCLIRunExample, TestFieldTypeResource, DirectSolrSpellCheckerTest, ZkControllerTest, TestSolrQueryParserDefaultOperatorResource, SortByFunctionTest, IgnoreCommitOptimizeUpdateProcessorFactoryTest, DistributedMLTComponentTest, TestBinaryResponseWriter, BigEndianAscendingWordSerializerTest, OpenCloseCoreStressTest, TestSolrCoreProperties, DistributedQueueTest, VersionInfoTest, CSVRequestHandlerTest, PKIAuthenticationIntegrationTest, TestFieldCache, DistribCursorPagingTest, MBeansHandlerTest, SpellCheckCollatorTest, DistributedFacetPivotLargeTest, TestNonDefinedSimilarityFactory, DistanceUnitsTest, TestDocumentBuilder, HdfsChaosMonkeyNothingIsSafeTest, DistributedTermsComponentTest, UniqFieldsUpdateProcessorFactoryTest, ShardRoutingCustomTest, TestFiltering, SolrIndexSplitterTest, DistributedIntervalFacetingTest, LeaderInitiatedRecoveryOnShardRestartTest, TestCloudDeleteByQuery, AsyncMigrateRouteKeyTest, TestFieldCollectionResource, MinimalSchemaTest, ZkSolrClientTest, ChaosMonkeySafeLeaderTest, TestSystemIdResolver, TestSolrDeletionPolicy2, SolrInfoMBeanTest, SpellCheckComponentTest, TestSurroundQueryParser, TestCursorMarkWithoutUniqueKey, HttpPartitionTest, TestDefaultStatsCache, TestEmbeddedSolrServerConstructors, TestQuerySenderNoQuery, SimpleMLTQParserTest, CustomCollectionTest, TestSlowCompositeReaderWrapper, TestUpdate, TestComplexPhraseQParserPlugin, TestAddFieldRealTimeGet, TestConfigSetImmutable, LoggingHandlerTest, DOMUtilTest, TestCoreContainer, NotRequiredUniqueKeyTest, TestFieldCacheWithThreads, OpenExchangeRatesOrgProviderTest, MultiTermTest, DistanceFunctionTest, CachingDirectoryFactoryTest, HdfsDirectoryTest, SoftAutoCommitTest, TestLeaderInitiatedRecoveryThread, TestCollectionAPI, TestCodecSupport, SpatialHeatmapFacetsTest, TestCloudManagedSchema, SolrIndexConfigTest, DistributedQueryComponentOptimizationTest, DocumentBuilderTest, IndexBasedSpellCheckerTest, TestTrieFacet, TestFieldCacheSort, AnalysisErrorHandlingTest, TestNumericTerms64, RulesTest, TimeZoneUtilsTest, SolrXmlInZkTest, TestSolrXml, TestRuleBasedAuthorizationPlugin, DocValuesTest, TestShardHandlerFactory, HighlighterTest, HdfsNNFailoverTest, TestWordDelimiterFilterFactory, MergeStrategyTest, ConjunctionSolrSpellCheckerTest, BJQParserTest, TestExactStatsCache, TestQueryUtils, TestQueryTypes, TestSubQueryTransformer, RecoveryZkTest, LeaderElectionTest, ZkCLITest, AutoCommitTest, TestHashPartitioner, TermVectorComponentDistributedTest, TestRealTimeGet, TestStressVersions, QueryElevationComponentTest, ConvertedLegacyTest, BasicFunctionalityTest, DirectUpdateHandlerTest, ShowFileRequestHandlerTest, CurrencyFieldXmlFileTest, AnalysisAfterCoreReloadTest, SignatureUpdateProcessorFactoryTest, TestFoldingMultitermQuery, SuggesterWFSTTest, FieldMutatingUpdateProcessorTest, QueryEqualityTest, DocValuesMultiTest, PrimitiveFieldTypeTest, TestOmitPositions, TermVectorComponentTest, TestSolrQueryParser, SolrPluginUtilsTest]
   [junit4] Completed [375/611 (3!)] on J1 in 0.66s, 9 tests, 1 error <<< FAILURES!

[...truncated 766 lines...]
BUILD FAILED
/home/jenkins/workspace/Lucene-Solr-master-Linux/build.xml:740: The following error occurred while executing this line:
/home/jenkins/workspace/Lucene-Solr-master-Linux/build.xml:684: The following error occurred while executing this line:
/home/jenkins/workspace/Lucene-Solr-master-Linux/build.xml:59: The following error occurred while executing this line:
/home/jenkins/workspace/Lucene-Solr-master-Linux/solr/build.xml:233: The following error occurred while executing this line:
/home/jenkins/workspace/Lucene-Solr-master-Linux/solr/common-build.xml:531: The following error occurred while executing this line:
/home/jenkins/workspace/Lucene-Solr-master-Linux/lucene/common-build.xml:1427: The following error occurred while executing this line:
/home/jenkins/workspace/Lucene-Solr-master-Linux/lucene/common-build.xml:984: There were test failures: 611 suites (10 ignored), 2558 tests, 1 suite-level error, 1 error, 1 failure, 116 ignored (72 assumptions) [seed: 41FEA0D4A33982F6]

Total time: 56 minutes 35 seconds
Build step 'Invoke Ant' marked build as failure
Archiving artifacts
[WARNINGS] Skipping publisher since build result is FAILURE
Recording test results
Email was triggered for: Failure - Any
Sending email for trigger: Failure - Any



Mime
View raw message