lucene-dev mailing list archives

Site index · List index
Message view « Date » · « Thread »
Top « Date » · « Thread »
From Apache Jenkins Server <jenk...@builds.apache.org>
Subject [JENKINS] Lucene-Solr-Tests-6.x - Build # 219 - Failure
Date Sat, 21 May 2016 22:58:20 GMT
Build: https://builds.apache.org/job/Lucene-Solr-Tests-6.x/219/

1 tests failed.
FAILED:  org.apache.solr.handler.TestReqParamsAPI.test

Error Message:
Could not get expected value  'CY val' for path 'response/params/y/c' full output: {   "responseHeader":{     "status":0,     "QTime":0},   "response":{     "znodeVersion":0,     "params":{"x":{         "a":"A val",         "b":"B val",         "":{"v":0}}}}},  from server:  http://127.0.0.1:41630/collection1

Stack Trace:
java.lang.AssertionError: Could not get expected value  'CY val' for path 'response/params/y/c' full output: {
  "responseHeader":{
    "status":0,
    "QTime":0},
  "response":{
    "znodeVersion":0,
    "params":{"x":{
        "a":"A val",
        "b":"B val",
        "":{"v":0}}}}},  from server:  http://127.0.0.1:41630/collection1
	at __randomizedtesting.SeedInfo.seed([74A81CCE89B35964:FCFC2314274F349C]:0)
	at org.junit.Assert.fail(Assert.java:93)
	at org.junit.Assert.assertTrue(Assert.java:43)
	at org.apache.solr.core.TestSolrConfigHandler.testForResponseElement(TestSolrConfigHandler.java:457)
	at org.apache.solr.handler.TestReqParamsAPI.testReqParams(TestReqParamsAPI.java:160)
	at org.apache.solr.handler.TestReqParamsAPI.test(TestReqParamsAPI.java:62)
	at sun.reflect.NativeMethodAccessorImpl.invoke0(Native Method)
	at sun.reflect.NativeMethodAccessorImpl.invoke(NativeMethodAccessorImpl.java:62)
	at sun.reflect.DelegatingMethodAccessorImpl.invoke(DelegatingMethodAccessorImpl.java:43)
	at java.lang.reflect.Method.invoke(Method.java:498)
	at com.carrotsearch.randomizedtesting.RandomizedRunner.invoke(RandomizedRunner.java:1764)
	at com.carrotsearch.randomizedtesting.RandomizedRunner$8.evaluate(RandomizedRunner.java:871)
	at com.carrotsearch.randomizedtesting.RandomizedRunner$9.evaluate(RandomizedRunner.java:907)
	at com.carrotsearch.randomizedtesting.RandomizedRunner$10.evaluate(RandomizedRunner.java:921)
	at org.apache.solr.BaseDistributedSearchTestCase$ShardsRepeatRule$ShardsFixedStatement.callStatement(BaseDistributedSearchTestCase.java:992)
	at org.apache.solr.BaseDistributedSearchTestCase$ShardsRepeatRule$ShardsStatement.evaluate(BaseDistributedSearchTestCase.java:967)
	at com.carrotsearch.randomizedtesting.rules.SystemPropertiesRestoreRule$1.evaluate(SystemPropertiesRestoreRule.java:57)
	at org.apache.lucene.util.TestRuleSetupTeardownChained$1.evaluate(TestRuleSetupTeardownChained.java:49)
	at org.apache.lucene.util.AbstractBeforeAfterRule$1.evaluate(AbstractBeforeAfterRule.java:45)
	at org.apache.lucene.util.TestRuleThreadAndTestName$1.evaluate(TestRuleThreadAndTestName.java:48)
	at org.apache.lucene.util.TestRuleIgnoreAfterMaxFailures$1.evaluate(TestRuleIgnoreAfterMaxFailures.java:64)
	at org.apache.lucene.util.TestRuleMarkFailure$1.evaluate(TestRuleMarkFailure.java:47)
	at com.carrotsearch.randomizedtesting.rules.StatementAdapter.evaluate(StatementAdapter.java:36)
	at com.carrotsearch.randomizedtesting.ThreadLeakControl$StatementRunner.run(ThreadLeakControl.java:367)
	at com.carrotsearch.randomizedtesting.ThreadLeakControl.forkTimeoutingTask(ThreadLeakControl.java:809)
	at com.carrotsearch.randomizedtesting.ThreadLeakControl$3.evaluate(ThreadLeakControl.java:460)
	at com.carrotsearch.randomizedtesting.RandomizedRunner.runSingleTest(RandomizedRunner.java:880)
	at com.carrotsearch.randomizedtesting.RandomizedRunner$5.evaluate(RandomizedRunner.java:781)
	at com.carrotsearch.randomizedtesting.RandomizedRunner$6.evaluate(RandomizedRunner.java:816)
	at com.carrotsearch.randomizedtesting.RandomizedRunner$7.evaluate(RandomizedRunner.java:827)
	at com.carrotsearch.randomizedtesting.rules.StatementAdapter.evaluate(StatementAdapter.java:36)
	at com.carrotsearch.randomizedtesting.rules.SystemPropertiesRestoreRule$1.evaluate(SystemPropertiesRestoreRule.java:57)
	at org.apache.lucene.util.AbstractBeforeAfterRule$1.evaluate(AbstractBeforeAfterRule.java:45)
	at com.carrotsearch.randomizedtesting.rules.StatementAdapter.evaluate(StatementAdapter.java:36)
	at org.apache.lucene.util.TestRuleStoreClassName$1.evaluate(TestRuleStoreClassName.java:41)
	at com.carrotsearch.randomizedtesting.rules.NoShadowingOrOverridesOnMethodsRule$1.evaluate(NoShadowingOrOverridesOnMethodsRule.java:40)
	at com.carrotsearch.randomizedtesting.rules.NoShadowingOrOverridesOnMethodsRule$1.evaluate(NoShadowingOrOverridesOnMethodsRule.java:40)
	at com.carrotsearch.randomizedtesting.rules.StatementAdapter.evaluate(StatementAdapter.java:36)
	at com.carrotsearch.randomizedtesting.rules.StatementAdapter.evaluate(StatementAdapter.java:36)
	at com.carrotsearch.randomizedtesting.rules.StatementAdapter.evaluate(StatementAdapter.java:36)
	at org.apache.lucene.util.TestRuleAssertionsRequired$1.evaluate(TestRuleAssertionsRequired.java:53)
	at org.apache.lucene.util.TestRuleMarkFailure$1.evaluate(TestRuleMarkFailure.java:47)
	at org.apache.lucene.util.TestRuleIgnoreAfterMaxFailures$1.evaluate(TestRuleIgnoreAfterMaxFailures.java:64)
	at org.apache.lucene.util.TestRuleIgnoreTestSuites$1.evaluate(TestRuleIgnoreTestSuites.java:54)
	at com.carrotsearch.randomizedtesting.rules.StatementAdapter.evaluate(StatementAdapter.java:36)
	at com.carrotsearch.randomizedtesting.ThreadLeakControl$StatementRunner.run(ThreadLeakControl.java:367)
	at java.lang.Thread.run(Thread.java:745)




Build Log:
[...truncated 11228 lines...]
   [junit4] Suite: org.apache.solr.handler.TestReqParamsAPI
   [junit4]   2> Creating dataDir: /x1/jenkins/jenkins-slave/workspace/Lucene-Solr-Tests-6.x/solr/build/solr-core/test/J2/temp/solr.handler.TestReqParamsAPI_74A81CCE89B35964-001/init-core-data-001
   [junit4]   2> 771611 INFO  (SUITE-TestReqParamsAPI-seed#[74A81CCE89B35964]-worker) [    ] o.a.s.SolrTestCaseJ4 Randomized ssl (false) and clientAuth (false)
   [junit4]   2> 771612 INFO  (SUITE-TestReqParamsAPI-seed#[74A81CCE89B35964]-worker) [    ] o.a.s.BaseDistributedSearchTestCase Setting hostContext system property: /
   [junit4]   2> 771614 INFO  (TEST-TestReqParamsAPI.test-seed#[74A81CCE89B35964]) [    ] o.a.s.c.ZkTestServer STARTING ZK TEST SERVER
   [junit4]   2> 771618 INFO  (Thread-5029) [    ] o.a.s.c.ZkTestServer client port:0.0.0.0/0.0.0.0:0
   [junit4]   2> 771618 INFO  (Thread-5029) [    ] o.a.s.c.ZkTestServer Starting server
   [junit4]   2> 771718 INFO  (TEST-TestReqParamsAPI.test-seed#[74A81CCE89B35964]) [    ] o.a.s.c.ZkTestServer start zk server on port:36346
   [junit4]   2> 771718 INFO  (TEST-TestReqParamsAPI.test-seed#[74A81CCE89B35964]) [    ] o.a.s.c.c.SolrZkClient Using default ZkCredentialsProvider
   [junit4]   2> 771719 INFO  (TEST-TestReqParamsAPI.test-seed#[74A81CCE89B35964]) [    ] o.a.s.c.c.ConnectionManager Waiting for client to connect to ZooKeeper
   [junit4]   2> 771720 INFO  (zkCallback-1449-thread-1) [    ] o.a.s.c.c.ConnectionManager Watcher org.apache.solr.common.cloud.ConnectionManager@53b56873 name:ZooKeeperConnection Watcher:127.0.0.1:36346 got event WatchedEvent state:SyncConnected type:None path:null path:null type:None
   [junit4]   2> 771720 INFO  (TEST-TestReqParamsAPI.test-seed#[74A81CCE89B35964]) [    ] o.a.s.c.c.ConnectionManager Client is connected to ZooKeeper
   [junit4]   2> 771721 INFO  (TEST-TestReqParamsAPI.test-seed#[74A81CCE89B35964]) [    ] o.a.s.c.c.SolrZkClient Using default ZkACLProvider
   [junit4]   2> 771721 INFO  (TEST-TestReqParamsAPI.test-seed#[74A81CCE89B35964]) [    ] o.a.s.c.c.SolrZkClient makePath: /solr
   [junit4]   2> 771722 INFO  (TEST-TestReqParamsAPI.test-seed#[74A81CCE89B35964]) [    ] o.a.s.c.c.SolrZkClient Using default ZkCredentialsProvider
   [junit4]   2> 771722 INFO  (TEST-TestReqParamsAPI.test-seed#[74A81CCE89B35964]) [    ] o.a.s.c.c.ConnectionManager Waiting for client to connect to ZooKeeper
   [junit4]   2> 771723 INFO  (zkCallback-1450-thread-1) [    ] o.a.s.c.c.ConnectionManager Watcher org.apache.solr.common.cloud.ConnectionManager@71beac71 name:ZooKeeperConnection Watcher:127.0.0.1:36346/solr got event WatchedEvent state:SyncConnected type:None path:null path:null type:None
   [junit4]   2> 771723 INFO  (TEST-TestReqParamsAPI.test-seed#[74A81CCE89B35964]) [    ] o.a.s.c.c.ConnectionManager Client is connected to ZooKeeper
   [junit4]   2> 771724 INFO  (TEST-TestReqParamsAPI.test-seed#[74A81CCE89B35964]) [    ] o.a.s.c.c.SolrZkClient Using default ZkACLProvider
   [junit4]   2> 771724 INFO  (TEST-TestReqParamsAPI.test-seed#[74A81CCE89B35964]) [    ] o.a.s.c.c.SolrZkClient makePath: /collections/collection1
   [junit4]   2> 771725 INFO  (TEST-TestReqParamsAPI.test-seed#[74A81CCE89B35964]) [    ] o.a.s.c.c.SolrZkClient makePath: /collections/collection1/shards
   [junit4]   2> 771725 INFO  (TEST-TestReqParamsAPI.test-seed#[74A81CCE89B35964]) [    ] o.a.s.c.c.SolrZkClient makePath: /collections/control_collection
   [junit4]   2> 771726 INFO  (TEST-TestReqParamsAPI.test-seed#[74A81CCE89B35964]) [    ] o.a.s.c.c.SolrZkClient makePath: /collections/control_collection/shards
   [junit4]   2> 771727 INFO  (TEST-TestReqParamsAPI.test-seed#[74A81CCE89B35964]) [    ] o.a.s.c.AbstractZkTestCase put /x1/jenkins/jenkins-slave/workspace/Lucene-Solr-Tests-6.x/solr/core/src/test-files/solr/collection1/conf/solrconfig-tlog.xml to /configs/conf1/solrconfig.xml
   [junit4]   2> 771727 INFO  (TEST-TestReqParamsAPI.test-seed#[74A81CCE89B35964]) [    ] o.a.s.c.c.SolrZkClient makePath: /configs/conf1/solrconfig.xml
   [junit4]   2> 771728 INFO  (TEST-TestReqParamsAPI.test-seed#[74A81CCE89B35964]) [    ] o.a.s.c.AbstractZkTestCase put /x1/jenkins/jenkins-slave/workspace/Lucene-Solr-Tests-6.x/solr/core/src/test-files/solr/collection1/conf/schema.xml to /configs/conf1/schema.xml
   [junit4]   2> 771728 INFO  (TEST-TestReqParamsAPI.test-seed#[74A81CCE89B35964]) [    ] o.a.s.c.c.SolrZkClient makePath: /configs/conf1/schema.xml
   [junit4]   2> 771729 INFO  (TEST-TestReqParamsAPI.test-seed#[74A81CCE89B35964]) [    ] o.a.s.c.AbstractZkTestCase put /x1/jenkins/jenkins-slave/workspace/Lucene-Solr-Tests-6.x/solr/core/src/test-files/solr/collection1/conf/solrconfig.snippet.randomindexconfig.xml to /configs/conf1/solrconfig.snippet.randomindexconfig.xml
   [junit4]   2> 771729 INFO  (TEST-TestReqParamsAPI.test-seed#[74A81CCE89B35964]) [    ] o.a.s.c.c.SolrZkClient makePath: /configs/conf1/solrconfig.snippet.randomindexconfig.xml
   [junit4]   2> 771730 INFO  (TEST-TestReqParamsAPI.test-seed#[74A81CCE89B35964]) [    ] o.a.s.c.AbstractZkTestCase put /x1/jenkins/jenkins-slave/workspace/Lucene-Solr-Tests-6.x/solr/core/src/test-files/solr/collection1/conf/stopwords.txt to /configs/conf1/stopwords.txt
   [junit4]   2> 771730 INFO  (TEST-TestReqParamsAPI.test-seed#[74A81CCE89B35964]) [    ] o.a.s.c.c.SolrZkClient makePath: /configs/conf1/stopwords.txt
   [junit4]   2> 771731 INFO  (TEST-TestReqParamsAPI.test-seed#[74A81CCE89B35964]) [    ] o.a.s.c.AbstractZkTestCase put /x1/jenkins/jenkins-slave/workspace/Lucene-Solr-Tests-6.x/solr/core/src/test-files/solr/collection1/conf/protwords.txt to /configs/conf1/protwords.txt
   [junit4]   2> 771731 INFO  (TEST-TestReqParamsAPI.test-seed#[74A81CCE89B35964]) [    ] o.a.s.c.c.SolrZkClient makePath: /configs/conf1/protwords.txt
   [junit4]   2> 771732 INFO  (TEST-TestReqParamsAPI.test-seed#[74A81CCE89B35964]) [    ] o.a.s.c.AbstractZkTestCase put /x1/jenkins/jenkins-slave/workspace/Lucene-Solr-Tests-6.x/solr/core/src/test-files/solr/collection1/conf/currency.xml to /configs/conf1/currency.xml
   [junit4]   2> 771732 INFO  (TEST-TestReqParamsAPI.test-seed#[74A81CCE89B35964]) [    ] o.a.s.c.c.SolrZkClient makePath: /configs/conf1/currency.xml
   [junit4]   2> 771733 INFO  (TEST-TestReqParamsAPI.test-seed#[74A81CCE89B35964]) [    ] o.a.s.c.AbstractZkTestCase put /x1/jenkins/jenkins-slave/workspace/Lucene-Solr-Tests-6.x/solr/core/src/test-files/solr/collection1/conf/enumsConfig.xml to /configs/conf1/enumsConfig.xml
   [junit4]   2> 771733 INFO  (TEST-TestReqParamsAPI.test-seed#[74A81CCE89B35964]) [    ] o.a.s.c.c.SolrZkClient makePath: /configs/conf1/enumsConfig.xml
   [junit4]   2> 771733 INFO  (TEST-TestReqParamsAPI.test-seed#[74A81CCE89B35964]) [    ] o.a.s.c.AbstractZkTestCase put /x1/jenkins/jenkins-slave/workspace/Lucene-Solr-Tests-6.x/solr/core/src/test-files/solr/collection1/conf/open-exchange-rates.json to /configs/conf1/open-exchange-rates.json
   [junit4]   2> 771734 INFO  (TEST-TestReqParamsAPI.test-seed#[74A81CCE89B35964]) [    ] o.a.s.c.c.SolrZkClient makePath: /configs/conf1/open-exchange-rates.json
   [junit4]   2> 771734 INFO  (TEST-TestReqParamsAPI.test-seed#[74A81CCE89B35964]) [    ] o.a.s.c.AbstractZkTestCase put /x1/jenkins/jenkins-slave/workspace/Lucene-Solr-Tests-6.x/solr/core/src/test-files/solr/collection1/conf/mapping-ISOLatin1Accent.txt to /configs/conf1/mapping-ISOLatin1Accent.txt
   [junit4]   2> 771734 INFO  (TEST-TestReqParamsAPI.test-seed#[74A81CCE89B35964]) [    ] o.a.s.c.c.SolrZkClient makePath: /configs/conf1/mapping-ISOLatin1Accent.txt
   [junit4]   2> 771735 INFO  (TEST-TestReqParamsAPI.test-seed#[74A81CCE89B35964]) [    ] o.a.s.c.AbstractZkTestCase put /x1/jenkins/jenkins-slave/workspace/Lucene-Solr-Tests-6.x/solr/core/src/test-files/solr/collection1/conf/old_synonyms.txt to /configs/conf1/old_synonyms.txt
   [junit4]   2> 771735 INFO  (TEST-TestReqParamsAPI.test-seed#[74A81CCE89B35964]) [    ] o.a.s.c.c.SolrZkClient makePath: /configs/conf1/old_synonyms.txt
   [junit4]   2> 771736 INFO  (TEST-TestReqParamsAPI.test-seed#[74A81CCE89B35964]) [    ] o.a.s.c.AbstractZkTestCase put /x1/jenkins/jenkins-slave/workspace/Lucene-Solr-Tests-6.x/solr/core/src/test-files/solr/collection1/conf/synonyms.txt to /configs/conf1/synonyms.txt
   [junit4]   2> 771736 INFO  (TEST-TestReqParamsAPI.test-seed#[74A81CCE89B35964]) [    ] o.a.s.c.c.SolrZkClient makePath: /configs/conf1/synonyms.txt
   [junit4]   2> 771823 INFO  (TEST-TestReqParamsAPI.test-seed#[74A81CCE89B35964]) [    ] o.a.s.SolrTestCaseJ4 Writing core.properties file to /x1/jenkins/jenkins-slave/workspace/Lucene-Solr-Tests-6.x/solr/build/solr-core/test/J2/temp/solr.handler.TestReqParamsAPI_74A81CCE89B35964-001/control-001/cores/collection1
   [junit4]   2> 771825 INFO  (TEST-TestReqParamsAPI.test-seed#[74A81CCE89B35964]) [    ] o.e.j.s.Server jetty-9.3.8.v20160314
   [junit4]   2> 771826 INFO  (TEST-TestReqParamsAPI.test-seed#[74A81CCE89B35964]) [    ] o.e.j.s.h.ContextHandler Started o.e.j.s.ServletContextHandler@543ecff1{/,null,AVAILABLE}
   [junit4]   2> 771826 INFO  (TEST-TestReqParamsAPI.test-seed#[74A81CCE89B35964]) [    ] o.e.j.s.ServerConnector Started ServerConnector@7f760c51{HTTP/1.1,[http/1.1]}{127.0.0.1:40963}
   [junit4]   2> 771827 INFO  (TEST-TestReqParamsAPI.test-seed#[74A81CCE89B35964]) [    ] o.e.j.s.Server Started @774021ms
   [junit4]   2> 771827 INFO  (TEST-TestReqParamsAPI.test-seed#[74A81CCE89B35964]) [    ] o.a.s.c.s.e.JettySolrRunner Jetty properties: {solr.data.dir=/x1/jenkins/jenkins-slave/workspace/Lucene-Solr-Tests-6.x/solr/build/solr-core/test/J2/temp/solr.handler.TestReqParamsAPI_74A81CCE89B35964-001/tempDir-001/control/data, hostContext=/, hostPort=40963, coreRootDirectory=/x1/jenkins/jenkins-slave/workspace/Lucene-Solr-Tests-6.x/solr/build/solr-core/test/J2/temp/solr.handler.TestReqParamsAPI_74A81CCE89B35964-001/control-001/cores}
   [junit4]   2> 771827 INFO  (TEST-TestReqParamsAPI.test-seed#[74A81CCE89B35964]) [    ] o.a.s.s.SolrDispatchFilter SolrDispatchFilter.init(): sun.misc.Launcher$AppClassLoader@73d16e93
   [junit4]   2> 771827 INFO  (TEST-TestReqParamsAPI.test-seed#[74A81CCE89B35964]) [    ] o.a.s.c.SolrResourceLoader new SolrResourceLoader for directory: '/x1/jenkins/jenkins-slave/workspace/Lucene-Solr-Tests-6.x/solr/build/solr-core/test/J2/temp/solr.handler.TestReqParamsAPI_74A81CCE89B35964-001/control-001'
   [junit4]   2> 771827 INFO  (TEST-TestReqParamsAPI.test-seed#[74A81CCE89B35964]) [    ] o.a.s.c.SolrResourceLoader JNDI not configured for solr (NoInitialContextEx)
   [junit4]   2> 771827 INFO  (TEST-TestReqParamsAPI.test-seed#[74A81CCE89B35964]) [    ] o.a.s.c.SolrResourceLoader solr home defaulted to 'solr/' (could not find system property or JNDI)
   [junit4]   2> 771827 INFO  (TEST-TestReqParamsAPI.test-seed#[74A81CCE89B35964]) [    ] o.a.s.c.c.SolrZkClient Using default ZkCredentialsProvider
   [junit4]   2> 771828 INFO  (TEST-TestReqParamsAPI.test-seed#[74A81CCE89B35964]) [    ] o.a.s.c.c.ConnectionManager Waiting for client to connect to ZooKeeper
   [junit4]   2> 771828 INFO  (zkCallback-1451-thread-1) [    ] o.a.s.c.c.ConnectionManager Watcher org.apache.solr.common.cloud.ConnectionManager@4641485 name:ZooKeeperConnection Watcher:127.0.0.1:36346/solr got event WatchedEvent state:SyncConnected type:None path:null path:null type:None
   [junit4]   2> 771828 INFO  (TEST-TestReqParamsAPI.test-seed#[74A81CCE89B35964]) [    ] o.a.s.c.c.ConnectionManager Client is connected to ZooKeeper
   [junit4]   2> 771829 INFO  (TEST-TestReqParamsAPI.test-seed#[74A81CCE89B35964]) [    ] o.a.s.c.c.SolrZkClient Using default ZkACLProvider
   [junit4]   2> 771829 INFO  (TEST-TestReqParamsAPI.test-seed#[74A81CCE89B35964]) [    ] o.a.s.s.SolrDispatchFilter Loading solr.xml from SolrHome (not found in ZooKeeper)
   [junit4]   2> 771829 INFO  (TEST-TestReqParamsAPI.test-seed#[74A81CCE89B35964]) [    ] o.a.s.c.SolrXmlConfig Loading container configuration from /x1/jenkins/jenkins-slave/workspace/Lucene-Solr-Tests-6.x/solr/build/solr-core/test/J2/temp/solr.handler.TestReqParamsAPI_74A81CCE89B35964-001/control-001/solr.xml
   [junit4]   2> 771832 INFO  (TEST-TestReqParamsAPI.test-seed#[74A81CCE89B35964]) [    ] o.a.s.c.CorePropertiesLocator Config-defined core root directory: /x1/jenkins/jenkins-slave/workspace/Lucene-Solr-Tests-6.x/solr/build/solr-core/test/J2/temp/solr.handler.TestReqParamsAPI_74A81CCE89B35964-001/control-001/cores
   [junit4]   2> 771832 INFO  (TEST-TestReqParamsAPI.test-seed#[74A81CCE89B35964]) [    ] o.a.s.c.CoreContainer New CoreContainer 1654667307
   [junit4]   2> 771832 INFO  (TEST-TestReqParamsAPI.test-seed#[74A81CCE89B35964]) [    ] o.a.s.c.CoreContainer Loading cores into CoreContainer [instanceDir=/x1/jenkins/jenkins-slave/workspace/Lucene-Solr-Tests-6.x/solr/build/solr-core/test/J2/temp/solr.handler.TestReqParamsAPI_74A81CCE89B35964-001/control-001]
   [junit4]   2> 771833 WARN  (TEST-TestReqParamsAPI.test-seed#[74A81CCE89B35964]) [    ] o.a.s.c.CoreContainer Couldn't add files from /x1/jenkins/jenkins-slave/workspace/Lucene-Solr-Tests-6.x/solr/build/solr-core/test/J2/temp/solr.handler.TestReqParamsAPI_74A81CCE89B35964-001/control-001/lib to classpath: /x1/jenkins/jenkins-slave/workspace/Lucene-Solr-Tests-6.x/solr/build/solr-core/test/J2/temp/solr.handler.TestReqParamsAPI_74A81CCE89B35964-001/control-001/lib
   [junit4]   2> 771833 INFO  (TEST-TestReqParamsAPI.test-seed#[74A81CCE89B35964]) [    ] o.a.s.h.c.HttpShardHandlerFactory created with socketTimeout : 90000,urlScheme : ,connTimeout : 15000,maxConnectionsPerHost : 20,maxConnections : 10000,corePoolSize : 0,maximumPoolSize : 2147483647,maxThreadIdleTime : 5,sizeOfQueue : -1,fairnessPolicy : false,useRetries : false,
   [junit4]   2> 771833 INFO  (TEST-TestReqParamsAPI.test-seed#[74A81CCE89B35964]) [    ] o.a.s.u.UpdateShardHandler Creating UpdateShardHandler HTTP client with params: socketTimeout=340000&connTimeout=45000&retry=true
   [junit4]   2> 771834 INFO  (TEST-TestReqParamsAPI.test-seed#[74A81CCE89B35964]) [    ] o.a.s.l.LogWatcher SLF4J impl is org.slf4j.impl.Log4jLoggerFactory
   [junit4]   2> 771834 INFO  (TEST-TestReqParamsAPI.test-seed#[74A81CCE89B35964]) [    ] o.a.s.l.LogWatcher Registering Log Listener [Log4j (org.slf4j.impl.Log4jLoggerFactory)]
   [junit4]   2> 771834 INFO  (TEST-TestReqParamsAPI.test-seed#[74A81CCE89B35964]) [    ] o.a.s.c.ZkContainer Zookeeper client=127.0.0.1:36346/solr
   [junit4]   2> 771834 INFO  (TEST-TestReqParamsAPI.test-seed#[74A81CCE89B35964]) [    ] o.a.s.c.ZkController zkHost includes chroot
   [junit4]   2> 771834 INFO  (TEST-TestReqParamsAPI.test-seed#[74A81CCE89B35964]) [    ] o.a.s.c.c.SolrZkClient Using default ZkCredentialsProvider
   [junit4]   2> 771834 INFO  (TEST-TestReqParamsAPI.test-seed#[74A81CCE89B35964]) [    ] o.a.s.c.c.ConnectionManager Waiting for client to connect to ZooKeeper
   [junit4]   2> 771835 INFO  (zkCallback-1454-thread-1) [    ] o.a.s.c.c.ConnectionManager Watcher org.apache.solr.common.cloud.ConnectionManager@4e60a687 name:ZooKeeperConnection Watcher:127.0.0.1:36346 got event WatchedEvent state:SyncConnected type:None path:null path:null type:None
   [junit4]   2> 771835 INFO  (TEST-TestReqParamsAPI.test-seed#[74A81CCE89B35964]) [    ] o.a.s.c.c.ConnectionManager Client is connected to ZooKeeper
   [junit4]   2> 771836 INFO  (TEST-TestReqParamsAPI.test-seed#[74A81CCE89B35964]) [    ] o.a.s.c.c.SolrZkClient Using default ZkACLProvider
   [junit4]   2> 771836 INFO  (TEST-TestReqParamsAPI.test-seed#[74A81CCE89B35964]) [n:127.0.0.1:40963_    ] o.a.s.c.ZkController Added new OnReconnect listener org.apache.solr.cloud.ZkController$$Lambda$58/1210067039@35b66e4b
   [junit4]   2> 771836 INFO  (TEST-TestReqParamsAPI.test-seed#[74A81CCE89B35964]) [n:127.0.0.1:40963_    ] o.a.s.c.c.ConnectionManager Waiting for client to connect to ZooKeeper
   [junit4]   2> 771837 INFO  (zkCallback-1455-thread-1-processing-n:127.0.0.1:40963_) [n:127.0.0.1:40963_    ] o.a.s.c.c.ConnectionManager Watcher org.apache.solr.common.cloud.ConnectionManager@34ba331f name:ZooKeeperConnection Watcher:127.0.0.1:36346/solr got event WatchedEvent state:SyncConnected type:None path:null path:null type:None
   [junit4]   2> 771837 INFO  (TEST-TestReqParamsAPI.test-seed#[74A81CCE89B35964]) [n:127.0.0.1:40963_    ] o.a.s.c.c.ConnectionManager Client is connected to ZooKeeper
   [junit4]   2> 771838 INFO  (TEST-TestReqParamsAPI.test-seed#[74A81CCE89B35964]) [n:127.0.0.1:40963_    ] o.a.s.c.c.SolrZkClient makePath: /overseer/queue
   [junit4]   2> 771839 INFO  (TEST-TestReqParamsAPI.test-seed#[74A81CCE89B35964]) [n:127.0.0.1:40963_    ] o.a.s.c.c.SolrZkClient makePath: /overseer/collection-queue-work
   [junit4]   2> 771843 INFO  (TEST-TestReqParamsAPI.test-seed#[74A81CCE89B35964]) [n:127.0.0.1:40963_    ] o.a.s.c.c.SolrZkClient makePath: /overseer/collection-map-running
   [junit4]   2> 771844 INFO  (TEST-TestReqParamsAPI.test-seed#[74A81CCE89B35964]) [n:127.0.0.1:40963_    ] o.a.s.c.c.SolrZkClient makePath: /overseer/collection-map-completed
   [junit4]   2> 771845 INFO  (TEST-TestReqParamsAPI.test-seed#[74A81CCE89B35964]) [n:127.0.0.1:40963_    ] o.a.s.c.c.SolrZkClient makePath: /overseer/collection-map-failure
   [junit4]   2> 771846 INFO  (TEST-TestReqParamsAPI.test-seed#[74A81CCE89B35964]) [n:127.0.0.1:40963_    ] o.a.s.c.c.SolrZkClient makePath: /live_nodes
   [junit4]   2> 771846 INFO  (TEST-TestReqParamsAPI.test-seed#[74A81CCE89B35964]) [n:127.0.0.1:40963_    ] o.a.s.c.c.SolrZkClient makePath: /aliases.json
   [junit4]   2> 771847 INFO  (TEST-TestReqParamsAPI.test-seed#[74A81CCE89B35964]) [n:127.0.0.1:40963_    ] o.a.s.c.c.SolrZkClient makePath: /clusterstate.json
   [junit4]   2> 771847 INFO  (TEST-TestReqParamsAPI.test-seed#[74A81CCE89B35964]) [n:127.0.0.1:40963_    ] o.a.s.c.c.SolrZkClient makePath: /security.json
   [junit4]   2> 771848 INFO  (TEST-TestReqParamsAPI.test-seed#[74A81CCE89B35964]) [n:127.0.0.1:40963_    ] o.a.s.c.c.ZkStateReader Updating cluster state from ZooKeeper... 
   [junit4]   2> 771848 INFO  (TEST-TestReqParamsAPI.test-seed#[74A81CCE89B35964]) [n:127.0.0.1:40963_    ] o.a.s.c.c.ZkStateReader Loaded empty cluster properties
   [junit4]   2> 771848 INFO  (TEST-TestReqParamsAPI.test-seed#[74A81CCE89B35964]) [n:127.0.0.1:40963_    ] o.a.s.c.c.ZkStateReader Updated live nodes from ZooKeeper... (0) -> (0)
   [junit4]   2> 771849 INFO  (TEST-TestReqParamsAPI.test-seed#[74A81CCE89B35964]) [n:127.0.0.1:40963_    ] o.a.s.c.c.SolrZkClient makePath: /overseer_elect
   [junit4]   2> 771850 INFO  (TEST-TestReqParamsAPI.test-seed#[74A81CCE89B35964]) [n:127.0.0.1:40963_    ] o.a.s.c.c.SolrZkClient makePath: /overseer_elect/election
   [junit4]   2> 771850 INFO  (TEST-TestReqParamsAPI.test-seed#[74A81CCE89B35964]) [n:127.0.0.1:40963_    ] o.a.s.c.Overseer Overseer (id=null) closing
   [junit4]   2> 771851 INFO  (TEST-TestReqParamsAPI.test-seed#[74A81CCE89B35964]) [n:127.0.0.1:40963_    ] o.a.s.c.LeaderElector Joined leadership election with path: /overseer_elect/election/95936194174517252-127.0.0.1:40963_-n_0000000000
   [junit4]   2> 771851 INFO  (TEST-TestReqParamsAPI.test-seed#[74A81CCE89B35964]) [n:127.0.0.1:40963_    ] o.a.s.c.OverseerElectionContext I am going to be the leader 127.0.0.1:40963_
   [junit4]   2> 771851 INFO  (TEST-TestReqParamsAPI.test-seed#[74A81CCE89B35964]) [n:127.0.0.1:40963_    ] o.a.s.c.c.SolrZkClient makePath: /overseer_elect/leader
   [junit4]   2> 771851 INFO  (TEST-TestReqParamsAPI.test-seed#[74A81CCE89B35964]) [n:127.0.0.1:40963_    ] o.a.s.c.Overseer Overseer (id=95936194174517252-127.0.0.1:40963_-n_0000000000) starting
   [junit4]   2> 771852 INFO  (TEST-TestReqParamsAPI.test-seed#[74A81CCE89B35964]) [n:127.0.0.1:40963_    ] o.a.s.c.c.SolrZkClient makePath: /overseer/queue-work
   [junit4]   2> 771854 INFO  (TEST-TestReqParamsAPI.test-seed#[74A81CCE89B35964]) [n:127.0.0.1:40963_    ] o.a.s.c.OverseerAutoReplicaFailoverThread Starting OverseerAutoReplicaFailoverThread autoReplicaFailoverWorkLoopDelay=10000 autoReplicaFailoverWaitAfterExpiration=30000 autoReplicaFailoverBadNodeExpiration=60000
   [junit4]   2> 771855 INFO  (OverseerStateUpdate-95936194174517252-127.0.0.1:40963_-n_0000000000) [n:127.0.0.1:40963_    ] o.a.s.c.Overseer Starting to work on the main queue
   [junit4]   2> 771859 INFO  (TEST-TestReqParamsAPI.test-seed#[74A81CCE89B35964]) [n:127.0.0.1:40963_    ] o.a.s.c.ZkController Register node as live in ZooKeeper:/live_nodes/127.0.0.1:40963_
   [junit4]   2> 771859 INFO  (TEST-TestReqParamsAPI.test-seed#[74A81CCE89B35964]) [n:127.0.0.1:40963_    ] o.a.s.c.c.SolrZkClient makePath: /live_nodes/127.0.0.1:40963_
   [junit4]   2> 771860 INFO  (OverseerStateUpdate-95936194174517252-127.0.0.1:40963_-n_0000000000) [n:127.0.0.1:40963_    ] o.a.s.c.c.ZkStateReader Updated live nodes from ZooKeeper... (0) -> (0)
   [junit4]   2> 771860 INFO  (zkCallback-1455-thread-1-processing-n:127.0.0.1:40963_) [n:127.0.0.1:40963_    ] o.a.s.c.c.ZkStateReader A live node change: [WatchedEvent state:SyncConnected type:NodeChildrenChanged path:/live_nodes], has occurred - updating... (live nodes size: [0])
   [junit4]   2> 771866 INFO  (zkCallback-1455-thread-1-processing-n:127.0.0.1:40963_) [n:127.0.0.1:40963_    ] o.a.s.c.c.ZkStateReader Updated live nodes from ZooKeeper... (0) -> (1)
   [junit4]   2> 771866 INFO  (OverseerCollectionConfigSetProcessor-95936194174517252-127.0.0.1:40963_-n_0000000000) [n:127.0.0.1:40963_    ] o.a.s.c.OverseerTaskProcessor Process current queue of overseer operations
   [junit4]   2> 771874 INFO  (TEST-TestReqParamsAPI.test-seed#[74A81CCE89B35964]) [n:127.0.0.1:40963_    ] o.a.s.c.CoreContainer Security conf doesn't exist. Skipping setup for authorization module.
   [junit4]   2> 771874 INFO  (TEST-TestReqParamsAPI.test-seed#[74A81CCE89B35964]) [n:127.0.0.1:40963_    ] o.a.s.c.CoreContainer No authentication plugin used.
   [junit4]   2> 771874 INFO  (TEST-TestReqParamsAPI.test-seed#[74A81CCE89B35964]) [n:127.0.0.1:40963_    ] o.a.s.c.CorePropertiesLocator Looking for core definitions underneath /x1/jenkins/jenkins-slave/workspace/Lucene-Solr-Tests-6.x/solr/build/solr-core/test/J2/temp/solr.handler.TestReqParamsAPI_74A81CCE89B35964-001/control-001/cores
   [junit4]   2> 771875 INFO  (TEST-TestReqParamsAPI.test-seed#[74A81CCE89B35964]) [n:127.0.0.1:40963_    ] o.a.s.c.CoreDescriptor Created CoreDescriptor: {name=collection1, config=solrconfig.xml, transient=false, schema=schema.xml, loadOnStartup=true, configSetProperties=configsetprops.json, collection=control_collection, coreNodeName=, dataDir=data/, shard=}
   [junit4]   2> 771875 INFO  (TEST-TestReqParamsAPI.test-seed#[74A81CCE89B35964]) [n:127.0.0.1:40963_    ] o.a.s.c.CorePropertiesLocator Found core collection1 in /x1/jenkins/jenkins-slave/workspace/Lucene-Solr-Tests-6.x/solr/build/solr-core/test/J2/temp/solr.handler.TestReqParamsAPI_74A81CCE89B35964-001/control-001/cores/collection1
   [junit4]   2> 771875 INFO  (TEST-TestReqParamsAPI.test-seed#[74A81CCE89B35964]) [n:127.0.0.1:40963_    ] o.a.s.c.CorePropertiesLocator Found 1 core definitions
   [junit4]   2> 771876 INFO  (coreLoadExecutor-3598-thread-1-processing-n:127.0.0.1:40963_) [n:127.0.0.1:40963_ c:control_collection   x:collection1] o.a.s.c.ZkController publishing state=down
   [junit4]   2> 771876 INFO  (coreLoadExecutor-3598-thread-1-processing-n:127.0.0.1:40963_) [n:127.0.0.1:40963_ c:control_collection   x:collection1] o.a.s.c.ZkController numShards not found on descriptor - reading it from system property
   [junit4]   2> 771876 INFO  (TEST-TestReqParamsAPI.test-seed#[74A81CCE89B35964]) [n:127.0.0.1:40963_    ] o.a.s.s.SolrDispatchFilter user.dir=/x1/jenkins/jenkins-slave/workspace/Lucene-Solr-Tests-6.x/solr/build/solr-core/test/J2
   [junit4]   2> 771876 INFO  (TEST-TestReqParamsAPI.test-seed#[74A81CCE89B35964]) [n:127.0.0.1:40963_    ] o.a.s.s.SolrDispatchFilter SolrDispatchFilter.init() done
   [junit4]   2> 771877 INFO  (OverseerStateUpdate-95936194174517252-127.0.0.1:40963_-n_0000000000) [n:127.0.0.1:40963_    ] o.a.s.c.Overseer processMessage: queueSize: 1, message = {
   [junit4]   2>   "core":"collection1",
   [junit4]   2>   "roles":null,
   [junit4]   2>   "base_url":"http://127.0.0.1:40963",
   [junit4]   2>   "node_name":"127.0.0.1:40963_",
   [junit4]   2>   "numShards":"1",
   [junit4]   2>   "state":"down",
   [junit4]   2>   "shard":null,
   [junit4]   2>   "collection":"control_collection",
   [junit4]   2>   "operation":"state"} current state version: 0
   [junit4]   2> 771877 INFO  (coreLoadExecutor-3598-thread-1-processing-n:127.0.0.1:40963_) [n:127.0.0.1:40963_ c:control_collection   x:collection1] o.a.s.c.ZkController Collection control_collection not visible yet, but flagging it so a watch is registered when it becomes visible
   [junit4]   2> 771877 INFO  (OverseerStateUpdate-95936194174517252-127.0.0.1:40963_-n_0000000000) [n:127.0.0.1:40963_    ] o.a.s.c.o.ReplicaMutator Update state numShards=1 message={
   [junit4]   2>   "core":"collection1",
   [junit4]   2>   "roles":null,
   [junit4]   2>   "base_url":"http://127.0.0.1:40963",
   [junit4]   2>   "node_name":"127.0.0.1:40963_",
   [junit4]   2>   "numShards":"1",
   [junit4]   2>   "state":"down",
   [junit4]   2>   "shard":null,
   [junit4]   2>   "collection":"control_collection",
   [junit4]   2>   "operation":"state"}
   [junit4]   2> 771877 INFO  (OverseerStateUpdate-95936194174517252-127.0.0.1:40963_-n_0000000000) [n:127.0.0.1:40963_    ] o.a.s.c.o.ClusterStateMutator building a new cName: control_collection
   [junit4]   2> 771877 INFO  (coreLoadExecutor-3598-thread-1-processing-n:127.0.0.1:40963_) [n:127.0.0.1:40963_ c:control_collection   x:collection1] o.a.s.c.c.ZkStateReader Deleting data for [control_collection]
   [junit4]   2> 771877 INFO  (OverseerStateUpdate-95936194174517252-127.0.0.1:40963_-n_0000000000) [n:127.0.0.1:40963_    ] o.a.s.c.o.ReplicaMutator Assigning new node to shard shard=shard1
   [junit4]   2> 771878 INFO  (coreLoadExecutor-3598-thread-1-processing-n:127.0.0.1:40963_) [n:127.0.0.1:40963_ c:control_collection   x:collection1] o.a.s.c.ZkController look for our core node name
   [junit4]   2> 771878 INFO  (zkCallback-1455-thread-1-processing-n:127.0.0.1:40963_) [n:127.0.0.1:40963_    ] o.a.s.c.c.ZkStateReader A cluster state change: [WatchedEvent state:SyncConnected type:NodeDataChanged path:/clusterstate.json], has occurred - updating... (live nodes size: [1])
   [junit4]   2> 772878 INFO  (coreLoadExecutor-3598-thread-1-processing-n:127.0.0.1:40963_) [n:127.0.0.1:40963_ c:control_collection   x:collection1] o.a.s.c.ZkController waiting to find shard id in clusterstate for collection1
   [junit4]   2> 772878 INFO  (coreLoadExecutor-3598-thread-1-processing-n:127.0.0.1:40963_) [n:127.0.0.1:40963_ c:control_collection   x:collection1] o.a.s.c.ZkController Check for collection zkNode:control_collection
   [junit4]   2> 772879 INFO  (coreLoadExecutor-3598-thread-1-processing-n:127.0.0.1:40963_) [n:127.0.0.1:40963_ c:control_collection   x:collection1] o.a.s.c.ZkController Collection zkNode exists
   [junit4]   2> 772879 INFO  (coreLoadExecutor-3598-thread-1-processing-n:127.0.0.1:40963_) [n:127.0.0.1:40963_ c:control_collection   x:collection1] o.a.s.c.c.ZkStateReader Load collection config from: [/collections/control_collection]
   [junit4]   2> 772879 INFO  (coreLoadExecutor-3598-thread-1-processing-n:127.0.0.1:40963_) [n:127.0.0.1:40963_ c:control_collection   x:collection1] o.a.s.c.c.ZkStateReader path=[/collections/control_collection] [configName]=[conf1] specified config exists in ZooKeeper
   [junit4]   2> 772879 INFO  (coreLoadExecutor-3598-thread-1-processing-n:127.0.0.1:40963_) [n:127.0.0.1:40963_ c:control_collection   x:collection1] o.a.s.c.SolrResourceLoader new SolrResourceLoader for directory: '/x1/jenkins/jenkins-slave/workspace/Lucene-Solr-Tests-6.x/solr/build/solr-core/test/J2/temp/solr.handler.TestReqParamsAPI_74A81CCE89B35964-001/control-001/cores/collection1'
   [junit4]   2> 772879 INFO  (coreLoadExecutor-3598-thread-1-processing-n:127.0.0.1:40963_) [n:127.0.0.1:40963_ c:control_collection   x:collection1] o.a.s.c.SolrResourceLoader JNDI not configured for solr (NoInitialContextEx)
   [junit4]   2> 772879 INFO  (coreLoadExecutor-3598-thread-1-processing-n:127.0.0.1:40963_) [n:127.0.0.1:40963_ c:control_collection   x:collection1] o.a.s.c.SolrResourceLoader solr home defaulted to 'solr/' (could not find system property or JNDI)
   [junit4]   2> 772880 INFO  (coreLoadExecutor-3598-thread-1-processing-n:127.0.0.1:40963_) [n:127.0.0.1:40963_ c:control_collection   x:collection1] o.a.s.c.Config loaded config solrconfig.xml with version 0 
   [junit4]   2> 772883 INFO  (coreLoadExecutor-3598-thread-1-processing-n:127.0.0.1:40963_) [n:127.0.0.1:40963_ c:control_collection   x:collection1] o.a.s.c.SolrConfig current version of requestparams : -1
   [junit4]   2> 772885 WARN  (coreLoadExecutor-3598-thread-1-processing-n:127.0.0.1:40963_) [n:127.0.0.1:40963_ c:control_collection   x:collection1] o.a.s.c.Config Beginning with Solr 5.5, <mergePolicy> is deprecated, use <mergePolicyFactory> instead.
   [junit4]   2> 772886 INFO  (coreLoadExecutor-3598-thread-1-processing-n:127.0.0.1:40963_) [n:127.0.0.1:40963_ c:control_collection   x:collection1] o.a.s.c.SolrConfig Using Lucene MatchVersion: 6.1.0
   [junit4]   2> 772892 INFO  (coreLoadExecutor-3598-thread-1-processing-n:127.0.0.1:40963_) [n:127.0.0.1:40963_ c:control_collection   x:collection1] o.a.s.c.SolrConfig Loaded SolrConfig: solrconfig.xml
   [junit4]   2> 772896 INFO  (coreLoadExecutor-3598-thread-1-processing-n:127.0.0.1:40963_) [n:127.0.0.1:40963_ c:control_collection   x:collection1] o.a.s.s.IndexSchema [collection1] Schema name=test
   [junit4]   2> 772959 INFO  (coreLoadExecutor-3598-thread-1-processing-n:127.0.0.1:40963_) [n:127.0.0.1:40963_ c:control_collection   x:collection1] o.a.s.s.OpenExchangeRatesOrgProvider Initialized with rates=open-exchange-rates.json, refreshInterval=1440.
   [junit4]   2> 772963 INFO  (coreLoadExecutor-3598-thread-1-processing-n:127.0.0.1:40963_) [n:127.0.0.1:40963_ c:control_collection   x:collection1] o.a.s.s.IndexSchema default search field in schema is text
   [junit4]   2> 772964 INFO  (coreLoadExecutor-3598-thread-1-processing-n:127.0.0.1:40963_) [n:127.0.0.1:40963_ c:control_collection   x:collection1] o.a.s.s.IndexSchema unique key field: id
   [junit4]   2> 772968 INFO  (coreLoadExecutor-3598-thread-1-processing-n:127.0.0.1:40963_) [n:127.0.0.1:40963_ c:control_collection   x:collection1] o.a.s.s.FileExchangeRateProvider Reloading exchange rates from file currency.xml
   [junit4]   2> 772970 INFO  (coreLoadExecutor-3598-thread-1-processing-n:127.0.0.1:40963_) [n:127.0.0.1:40963_ c:control_collection   x:collection1] o.a.s.s.FileExchangeRateProvider Reloading exchange rates from file currency.xml
   [junit4]   2> 772971 INFO  (coreLoadExecutor-3598-thread-1-processing-n:127.0.0.1:40963_) [n:127.0.0.1:40963_ c:control_collection   x:collection1] o.a.s.s.OpenExchangeRatesOrgProvider Reloading exchange rates from open-exchange-rates.json
   [junit4]   2> 772971 INFO  (coreLoadExecutor-3598-thread-1-processing-n:127.0.0.1:40963_) [n:127.0.0.1:40963_ c:control_collection   x:collection1] o.a.s.s.OpenExchangeRatesOrgProvider Reloading exchange rates from open-exchange-rates.json
   [junit4]   2> 772972 INFO  (coreLoadExecutor-3598-thread-1-processing-n:127.0.0.1:40963_) [n:127.0.0.1:40963_ c:control_collection   x:collection1] o.a.s.c.ConfigSetProperties Did not find ConfigSet properties, assuming default properties: Can't find resource 'configsetprops.json' in classpath or '/configs/conf1', cwd=/x1/jenkins/jenkins-slave/workspace/Lucene-Solr-Tests-6.x/solr/build/solr-core/test/J2
   [junit4]   2> 772972 INFO  (coreLoadExecutor-3598-thread-1-processing-n:127.0.0.1:40963_) [n:127.0.0.1:40963_ c:control_collection   x:collection1] o.a.s.c.CoreContainer Creating SolrCore 'collection1' using configuration from collection control_collection
   [junit4]   2> 772972 INFO  (coreLoadExecutor-3598-thread-1-processing-n:127.0.0.1:40963_) [n:127.0.0.1:40963_ c:control_collection s:shard1 r:core_node1 x:collection1] o.a.s.c.SolrCore org.apache.solr.core.MockDirectoryFactory
   [junit4]   2> 772972 INFO  (coreLoadExecutor-3598-thread-1-processing-n:127.0.0.1:40963_) [n:127.0.0.1:40963_ c:control_collection s:shard1 r:core_node1 x:collection1] o.a.s.c.SolrCore [[collection1] ] Opening new SolrCore at [/x1/jenkins/jenkins-slave/workspace/Lucene-Solr-Tests-6.x/solr/build/solr-core/test/J2/temp/solr.handler.TestReqParamsAPI_74A81CCE89B35964-001/control-001/cores/collection1], dataDir=[/x1/jenkins/jenkins-slave/workspace/Lucene-Solr-Tests-6.x/solr/build/solr-core/test/J2/temp/solr.handler.TestReqParamsAPI_74A81CCE89B35964-001/control-001/cores/collection1/data/]
   [junit4]   2> 772972 INFO  (coreLoadExecutor-3598-thread-1-processing-n:127.0.0.1:40963_) [n:127.0.0.1:40963_ c:control_collection s:shard1 r:core_node1 x:collection1] o.a.s.c.JmxMonitoredMap JMX monitoring is enabled. Adding Solr mbeans to JMX Server: com.sun.jmx.mbeanserver.JmxMBeanServer@2eeb80dd
   [junit4]   2> 772973 INFO  (coreLoadExecutor-3598-thread-1-processing-n:127.0.0.1:40963_) [n:127.0.0.1:40963_ c:control_collection s:shard1 r:core_node1 x:collection1] o.a.s.c.CachingDirectoryFactory return new directory for /x1/jenkins/jenkins-slave/workspace/Lucene-Solr-Tests-6.x/solr/build/solr-core/test/J2/temp/solr.handler.TestReqParamsAPI_74A81CCE89B35964-001/control-001/cores/collection1/data
   [junit4]   2> 772973 INFO  (coreLoadExecutor-3598-thread-1-processing-n:127.0.0.1:40963_) [n:127.0.0.1:40963_ c:control_collection s:shard1 r:core_node1 x:collection1] o.a.s.c.SolrCore New index directory detected: old=null new=/x1/jenkins/jenkins-slave/workspace/Lucene-Solr-Tests-6.x/solr/build/solr-core/test/J2/temp/solr.handler.TestReqParamsAPI_74A81CCE89B35964-001/control-001/cores/collection1/data/index/
   [junit4]   2> 772973 WARN  (coreLoadExecutor-3598-thread-1-processing-n:127.0.0.1:40963_) [n:127.0.0.1:40963_ c:control_collection s:shard1 r:core_node1 x:collection1] o.a.s.c.SolrCore [collection1] Solr index directory '/x1/jenkins/jenkins-slave/workspace/Lucene-Solr-Tests-6.x/solr/build/solr-core/test/J2/temp/solr.handler.TestReqParamsAPI_74A81CCE89B35964-001/control-001/cores/collection1/data/index' doesn't exist. Creating new index...
   [junit4]   2> 772973 INFO  (coreLoadExecutor-3598-thread-1-processing-n:127.0.0.1:40963_) [n:127.0.0.1:40963_ c:control_collection s:shard1 r:core_node1 x:collection1] o.a.s.c.CachingDirectoryFactory return new directory for /x1/jenkins/jenkins-slave/workspace/Lucene-Solr-Tests-6.x/solr/build/solr-core/test/J2/temp/solr.handler.TestReqParamsAPI_74A81CCE89B35964-001/control-001/cores/collection1/data/index
   [junit4]   2> 772973 INFO  (coreLoadExecutor-3598-thread-1-processing-n:127.0.0.1:40963_) [n:127.0.0.1:40963_ c:control_collection s:shard1 r:core_node1 x:collection1] o.a.s.u.RandomMergePolicy RandomMergePolicy wrapping class org.apache.lucene.index.LogDocMergePolicy: [LogDocMergePolicy: minMergeSize=1000, mergeFactor=10, maxMergeSize=9223372036854775807, maxMergeSizeForForcedMerge=9223372036854775807, calibrateSizeByDeletes=false, maxMergeDocs=2147483647, maxCFSSegmentSizeMB=8.796093022207999E12, noCFSRatio=0.0]
   [junit4]   2> 772973 INFO  (coreLoadExecutor-3598-thread-1-processing-n:127.0.0.1:40963_) [n:127.0.0.1:40963_ c:control_collection s:shard1 r:core_node1 x:collection1] o.a.s.c.SolrDeletionPolicy SolrDeletionPolicy.onCommit: commits: num=1
   [junit4]   2> 	commit{dir=MockDirectoryWrapper(NRTCachingDirectory(RAMDirectory@6f4a3a34 lockFactory=org.apache.lucene.store.SingleInstanceLockFactory@3e5bc40b; maxCacheMB=0.5517578125 maxMergeSizeMB=0.923828125)),segFN=segments_1,generation=1}
   [junit4]   2> 772974 INFO  (coreLoadExecutor-3598-thread-1-processing-n:127.0.0.1:40963_) [n:127.0.0.1:40963_ c:control_collection s:shard1 r:core_node1 x:collection1] o.a.s.c.SolrDeletionPolicy newest commit generation = 1
   [junit4]   2> 772976 INFO  (OldIndexDirectoryCleanupThreadForCore-collection1) [n:127.0.0.1:40963_ c:control_collection s:shard1 r:core_node1 x:collection1] o.a.s.c.SolrCore Looking for old index directories to cleanup for core collection1 in /x1/jenkins/jenkins-slave/workspace/Lucene-Solr-Tests-6.x/solr/build/solr-core/test/J2/temp/solr.handler.TestReqParamsAPI_74A81CCE89B35964-001/control-001/cores/collection1/data/
   [junit4]   2> 772977 WARN  (OldIndexDirectoryCleanupThreadForCore-collection1) [n:127.0.0.1:40963_ c:control_collection s:shard1 r:core_node1 x:collection1] o.a.s.c.DirectoryFactory /x1/jenkins/jenkins-slave/workspace/Lucene-Solr-Tests-6.x/solr/build/solr-core/test/J2/temp/solr.handler.TestReqParamsAPI_74A81CCE89B35964-001/control-001/cores/collection1/data/ does not point to a valid data directory; skipping clean-up of old index directories.
   [junit4]   2> 772979 INFO  (coreLoadExecutor-3598-thread-1-processing-n:127.0.0.1:40963_) [n:127.0.0.1:40963_ c:control_collection s:shard1 r:core_node1 x:collection1] o.a.s.u.p.UpdateRequestProcessorChain creating updateRequestProcessorChain "nodistrib"
   [junit4]   2> 772979 INFO  (coreLoadExecutor-3598-thread-1-processing-n:127.0.0.1:40963_) [n:127.0.0.1:40963_ c:control_collection s:shard1 r:core_node1 x:collection1] o.a.s.u.p.UpdateRequestProcessorChain creating updateRequestProcessorChain "dedupe"
   [junit4]   2> 772979 INFO  (coreLoadExecutor-3598-thread-1-processing-n:127.0.0.1:40963_) [n:127.0.0.1:40963_ c:control_collection s:shard1 r:core_node1 x:collection1] o.a.s.u.p.UpdateRequestProcessorChain inserting DistributedUpdateProcessorFactory into updateRequestProcessorChain "dedupe"
   [junit4]   2> 772979 INFO  (coreLoadExecutor-3598-thread-1-processing-n:127.0.0.1:40963_) [n:127.0.0.1:40963_ c:control_collection s:shard1 r:core_node1 x:collection1] o.a.s.u.p.UpdateRequestProcessorChain creating updateRequestProcessorChain "stored_sig"
   [junit4]   2> 772979 INFO  (coreLoadExecutor-3598-thread-1-processing-n:127.0.0.1:40963_) [n:127.0.0.1:40963_ c:control_collection s:shard1 r:core_node1 x:collection1] o.a.s.u.p.UpdateRequestProcessorChain inserting DistributedUpdateProcessorFactory into updateRequestProcessorChain "stored_sig"
   [junit4]   2> 772979 INFO  (coreLoadExecutor-3598-thread-1-processing-n:127.0.0.1:40963_) [n:127.0.0.1:40963_ c:control_collection s:shard1 r:core_node1 x:collection1] o.a.s.u.p.UpdateRequestProcessorChain creating updateRequestProcessorChain "distrib-dup-test-chain-explicit"
   [junit4]   2> 772979 INFO  (coreLoadExecutor-3598-thread-1-processing-n:127.0.0.1:40963_) [n:127.0.0.1:40963_ c:control_collection s:shard1 r:core_node1 x:collection1] o.a.s.u.p.UpdateRequestProcessorChain creating updateRequestProcessorChain "distrib-dup-test-chain-implicit"
   [junit4]   2> 772979 INFO  (coreLoadExecutor-3598-thread-1-processing-n:127.0.0.1:40963_) [n:127.0.0.1:40963_ c:control_collection s:shard1 r:core_node1 x:collection1] o.a.s.u.p.UpdateRequestProcessorChain inserting DistributedUpdateProcessorFactory into updateRequestProcessorChain "distrib-dup-test-chain-implicit"
   [junit4]   2> 772979 INFO  (coreLoadExecutor-3598-thread-1-processing-n:127.0.0.1:40963_) [n:127.0.0.1:40963_ c:control_collection s:shard1 r:core_node1 x:collection1] o.a.s.c.SolrCore no updateRequestProcessorChain defined as default, creating implicit default
   [junit4]   2> 772979 WARN  (coreLoadExecutor-3598-thread-1-processing-n:127.0.0.1:40963_) [n:127.0.0.1:40963_ c:control_collection s:shard1 r:core_node1 x:collection1] o.a.s.c.RequestHandlers INVALID paramSet a in requestHandler {type = requestHandler,name = /dump,class = DumpRequestHandler,args = {defaults={a=A,b=B}}}
   [junit4]   2> 772980 INFO  (coreLoadExecutor-3598-thread-1-processing-n:127.0.0.1:40963_) [n:127.0.0.1:40963_ c:control_collection s:shard1 r:core_node1 x:collection1] o.a.s.h.l.XMLLoader xsltCacheLifetimeSeconds=60
   [junit4]   2> 772981 INFO  (coreLoadExecutor-3598-thread-1-processing-n:127.0.0.1:40963_) [n:127.0.0.1:40963_ c:control_collection s:shard1 r:core_node1 x:collection1] o.a.s.h.l.XMLLoader xsltCacheLifetimeSeconds=60
   [junit4]   2> 772981 INFO  (coreLoadExecutor-3598-thread-1-processing-n:127.0.0.1:40963_) [n:127.0.0.1:40963_ c:control_collection s:shard1 r:core_node1 x:collection1] o.a.s.h.l.XMLLoader xsltCacheLifetimeSeconds=60
   [junit4]   2> 772982 INFO  (coreLoadExecutor-3598-thread-1-processing-n:127.0.0.1:40963_) [n:127.0.0.1:40963_ c:control_collection s:shard1 r:core_node1 x:collection1] o.a.s.h.l.XMLLoader xsltCacheLifetimeSeconds=60
   [junit4]   2> 772984 INFO  (coreLoadExecutor-3598-thread-1-processing-n:127.0.0.1:40963_) [n:127.0.0.1:40963_ c:control_collection s:shard1 r:core_node1 x:collection1] o.a.s.c.RequestHandlers Registered paths: /admin/mbeans,standard,/update/json/docs,/admin/luke,/export,/get,/admin/properties,/update/json,/admin/threads,/dump,/update/csv,/sql,/graph,/admin/segments,/admin/system,/replication,/config,/stream,/schema,/admin/plugins,/admin/logging,/admin/ping,/update,/admin/file
   [junit4]   2> 772984 INFO  (coreLoadExecutor-3598-thread-1-processing-n:127.0.0.1:40963_) [n:127.0.0.1:40963_ c:control_collection s:shard1 r:core_node1 x:collection1] o.a.s.c.SolrCore Using default statsCache cache: org.apache.solr.search.stats.LocalStatsCache
   [junit4]   2> 772984 INFO  (coreLoadExecutor-3598-thread-1-processing-n:127.0.0.1:40963_) [n:127.0.0.1:40963_ c:control_collection s:shard1 r:core_node1 x:collection1] o.a.s.u.UpdateHandler Using UpdateLog implementation: org.apache.solr.update.UpdateLog
   [junit4]   2> 772985 INFO  (coreLoadExecutor-3598-thread-1-processing-n:127.0.0.1:40963_) [n:127.0.0.1:40963_ c:control_collection s:shard1 r:core_node1 x:collection1] o.a.s.u.UpdateLog Initializing UpdateLog: dataDir= defaultSyncLevel=FLUSH numRecordsToKeep=100 maxNumLogsToKeep=10 numVersionBuckets=65536
   [junit4]   2> 772985 INFO  (coreLoadExecutor-3598-thread-1-processing-n:127.0.0.1:40963_) [n:127.0.0.1:40963_ c:control_collection s:shard1 r:core_node1 x:collection1] o.a.s.u.CommitTracker Hard AutoCommit: disabled
   [junit4]   2> 772985 INFO  (coreLoadExecutor-3598-thread-1-processing-n:127.0.0.1:40963_) [n:127.0.0.1:40963_ c:control_collection s:shard1 r:core_node1 x:collection1] o.a.s.u.CommitTracker Soft AutoCommit: disabled
   [junit4]   2> 772985 INFO  (coreLoadExecutor-3598-thread-1-processing-n:127.0.0.1:40963_) [n:127.0.0.1:40963_ c:control_collection s:shard1 r:core_node1 x:collection1] o.a.s.u.RandomMergePolicy RandomMergePolicy wrapping class org.apache.lucene.index.TieredMergePolicy: [TieredMergePolicy: maxMergeAtOnce=43, maxMergeAtOnceExplicit=12, maxMergedSegmentMB=21.4521484375, floorSegmentMB=1.5771484375, forceMergeDeletesPctAllowed=1.7166698829043947, segmentsPerTier=27.0, maxCFSSegmentSizeMB=8.796093022207999E12, noCFSRatio=1.0
   [junit4]   2> 772985 INFO  (coreLoadExecutor-3598-thread-1-processing-n:127.0.0.1:40963_) [n:127.0.0.1:40963_ c:control_collection s:shard1 r:core_node1 x:collection1] o.a.s.c.SolrDeletionPolicy SolrDeletionPolicy.onInit: commits: num=1
   [junit4]   2> 	commit{dir=MockDirectoryWrapper(NRTCachingDirectory(RAMDirectory@6f4a3a34 lockFactory=org.apache.lucene.store.SingleInstanceLockFactory@3e5bc40b; maxCacheMB=0.5517578125 maxMergeSizeMB=0.923828125)),segFN=segments_1,generation=1}
   [junit4]   2> 772985 INFO  (coreLoadExecutor-3598-thread-1-processing-n:127.0.0.1:40963_) [n:127.0.0.1:40963_ c:control_collection s:shard1 r:core_node1 x:collection1] o.a.s.c.SolrDeletionPolicy newest commit generation = 1
   [junit4]   2> 772986 INFO  (coreLoadExecutor-3598-thread-1-processing-n:127.0.0.1:40963_) [n:127.0.0.1:40963_ c:control_collection s:shard1 r:core_node1 x:collection1] o.a.s.s.SolrIndexSearcher Opening [Searcher@36adc6d1[collection1] main]
   [junit4]   2> 772986 INFO  (coreLoadExecutor-3598-thread-1-processing-n:127.0.0.1:40963_) [n:127.0.0.1:40963_ c:control_collection s:shard1 r:core_node1 x:collection1] o.a.s.c.c.ZkStateReader Load collection config from: [/collections/control_collection]
   [junit4]   2> 772986 INFO  (coreLoadExecutor-3598-thread-1-processing-n:127.0.0.1:40963_) [n:127.0.0.1:40963_ c:control_collection s:shard1 r:core_node1 x:collection1] o.a.s.c.c.ZkStateReader path=[/collections/control_collection] [configName]=[conf1] specified config exists in ZooKeeper
   [junit4]   2> 772986 INFO  (coreLoadExecutor-3598-thread-1-processing-n:127.0.0.1:40963_) [n:127.0.0.1:40963_ c:control_collection s:shard1 r:core_node1 x:collection1] o.a.s.r.ManagedResourceStorage Setting up ZooKeeper-based storage for the RestManager with znodeBase: /configs/conf1
   [junit4]   2> 772986 INFO  (coreLoadExecutor-3598-thread-1-processing-n:127.0.0.1:40963_) [n:127.0.0.1:40963_ c:control_collection s:shard1 r:core_node1 x:collection1] o.a.s.r.ManagedResourceStorage Configured ZooKeeperStorageIO with znodeBase: /configs/conf1
   [junit4]   2> 772986 INFO  (coreLoadExecutor-3598-thread-1-processing-n:127.0.0.1:40963_) [n:127.0.0.1:40963_ c:control_collection s:shard1 r:core_node1 x:collection1] o.a.s.r.RestManager Initializing RestManager with initArgs: {}
   [junit4]   2> 772986 INFO  (coreLoadExecutor-3598-thread-1-processing-n:127.0.0.1:40963_) [n:127.0.0.1:40963_ c:control_collection s:shard1 r:core_node1 x:collection1] o.a.s.r.ManagedResourceStorage Reading _rest_managed.json using ZooKeeperStorageIO:path=/configs/conf1
   [junit4]   2> 772987 INFO  (coreLoadExecutor-3598-thread-1-processing-n:127.0.0.1:40963_) [n:127.0.0.1:40963_ c:control_collection s:shard1 r:core_node1 x:collection1] o.a.s.r.ManagedResourceStorage No data found for znode /configs/conf1/_rest_managed.json
   [junit4]   2> 772987 INFO  (coreLoadExecutor-3598-thread-1-processing-n:127.0.0.1:40963_) [n:127.0.0.1:40963_ c:control_collection s:shard1 r:core_node1 x:collection1] o.a.s.r.ManagedResourceStorage Loaded null at path _rest_managed.json using ZooKeeperStorageIO:path=/configs/conf1
   [junit4]   2> 772987 INFO  (coreLoadExecutor-3598-thread-1-processing-n:127.0.0.1:40963_) [n:127.0.0.1:40963_ c:control_collection s:shard1 r:core_node1 x:collection1] o.a.s.r.RestManager Initializing 0 registered ManagedResources
   [junit4]   2> 772987 INFO  (coreLoadExecutor-3598-thread-1-processing-n:127.0.0.1:40963_) [n:127.0.0.1:40963_ c:control_collection s:shard1 r:core_node1 x:collection1] o.a.s.h.ReplicationHandler Commits will be reserved for  10000
   [junit4]   2> 772987 INFO  (searcherExecutor-3599-thread-1-processing-n:127.0.0.1:40963_ x:collection1 s:shard1 c:control_collection r:core_node1) [n:127.0.0.1:40963_ c:control_collection s:shard1 r:core_node1 x:collection1] o.a.s.c.SolrCore [collection1] Registered new searcher Searcher@36adc6d1[collection1] main{ExitableDirectoryReader(UninvertingDirectoryReader())}
   [junit4]   2> 772987 INFO  (coreLoadExecutor-3598-thread-1-processing-n:127.0.0.1:40963_) [n:127.0.0.1:40963_ c:control_collection s:shard1 r:core_node1 x:collection1] o.a.s.u.UpdateLog Looking up max value of version field to seed version buckets
   [junit4]   2> 772987 INFO  (coreLoadExecutor-3598-thread-1-processing-n:127.0.0.1:40963_) [n:127.0.0.1:40963_ c:control_collection s:shard1 r:core_node1 x:collection1] o.a.s.u.VersionInfo Refreshing highest value of _version_ for 65536 version buckets from index
   [junit4]   2> 772987 INFO  (coreLoadExecutor-3598-thread-1-processing-n:127.0.0.1:40963_) [n:127.0.0.1:40963_ c:control_collection s:shard1 r:core_node1 x:collection1] o.a.s.u.VersionInfo No terms found for _version_, cannot seed version bucket highest value from index
   [junit4]   2> 772987 INFO  (coreLoadExecutor-3598-thread-1-processing-n:127.0.0.1:40963_) [n:127.0.0.1:40963_ c:control_collection s:shard1 r:core_node1 x:collection1] o.a.s.u.UpdateLog Could not find max version in index or recent updates, using new clock 1534979108226727936
   [junit4]   2> 772989 INFO  (coreLoadExecutor-3598-thread-1-processing-n:127.0.0.1:40963_) [n:127.0.0.1:40963_ c:control_collection s:shard1 r:core_node1 x:collection1] o.a.s.u.UpdateLog Took 1.0ms to seed version buckets with highest version 1534979108226727936
   [junit4]   2> 772989 INFO  (coreLoadExecutor-3598-thread-1-processing-n:127.0.0.1:40963_) [n:127.0.0.1:40963_ c:control_collection s:shard1 r:core_node1 x:collection1] o.a.s.c.ZkController watch zkdir /configs/conf1
   [junit4]   2> 772989 INFO  (coreLoadExecutor-3598-thread-1-processing-n:127.0.0.1:40963_) [n:127.0.0.1:40963_ c:control_collection s:shard1 r:core_node1 x:collection1] o.a.s.c.CoreContainer registering core: collection1
   [junit4]   2> 772990 INFO  (coreZkRegister-3592-thread-1-processing-n:127.0.0.1:40963_ x:collection1 s:shard1 c:control_collection r:core_node1) [n:127.0.0.1:40963_ c:control_collection s:shard1 r:core_node1 x:collection1] o.a.s.c.ZkController Register replica - core:collection1 address:http://127.0.0.1:40963 collection:control_collection shard:shard1
   [junit4]   2> 772990 INFO  (coreZkRegister-3592-thread-1-processing-n:127.0.0.1:40963_ x:collection1 s:shard1 c:control_collection r:core_node1) [n:127.0.0.1:40963_ c:control_collection s:shard1 r:core_node1 x:collection1] o.a.s.c.c.SolrZkClient makePath: /collections/control_collection/leader_elect/shard1/election
   [junit4]   2> 772991 INFO  (coreZkRegister-3592-thread-1-processing-n:127.0.0.1:40963_ x:collection1 s:shard1 c:control_collection r:core_node1) [n:127.0.0.1:40963_ c:control_collection s:shard1 r:core_node1 x:collection1] o.a.s.c.LeaderElector Joined leadership election with path: /collections/control_collection/leader_elect/shard1/election/95936194174517252-core_node1-n_0000000000
   [junit4]   2> 772992 INFO  (coreZkRegister-3592-thread-1-processing-n:127.0.0.1:40963_ x:collection1 s:shard1 c:control_collection r:core_node1) [n:127.0.0.1:40963_ c:control_collection s:shard1 r:core_node1 x:collection1] o.a.s.c.ShardLeaderElectionContext Running the leader process for shard=shard1 and weAreReplacement=false and leaderVoteWait=10000
   [junit4]   2> 772992 INFO  (coreZkRegister-3592-thread-1-processing-n:127.0.0.1:40963_ x:collection1 s:shard1 c:control_collection r:core_node1) [n:127.0.0.1:40963_ c:control_collection s:shard1 r:core_node1 x:collection1] o.a.s.c.ShardLeaderElectionContext Enough replicas found to continue.
   [junit4]   2> 772992 INFO  (coreZkRegister-3592-thread-1-processing-n:127.0.0.1:40963_ x:collection1 s:shard1 c:control_collection r:core_node1) [n:127.0.0.1:40963_ c:control_collection s:shard1 r:core_node1 x:collection1] o.a.s.c.ShardLeaderElectionContext I may be the new leader - try and sync
   [junit4]   2> 772992 INFO  (coreZkRegister-3592-thread-1-processing-n:127.0.0.1:40963_ x:collection1 s:shard1 c:control_collection r:core_node1) [n:127.0.0.1:40963_ c:control_collection s:shard1 r:core_node1 x:collection1] o.a.s.c.SyncStrategy Sync replicas to http://127.0.0.1:40963/collection1/
   [junit4]   2> 772992 INFO  (OverseerStateUpdate-95936194174517252-127.0.0.1:40963_-n_0000000000) [n:127.0.0.1:40963_    ] o.a.s.c.Overseer processMessage: queueSize: 1, message = {
   [junit4]   2>   "operation":"leader",
   [junit4]   2>   "shard":"shard1",
   [junit4]   2>   "collection":"control_collection"} current state version: 1
   [junit4]   2> 772992 INFO  (coreZkRegister-3592-thread-1-processing-n:127.0.0.1:40963_ x:collection1 s:shard1 c:control_collection r:core_node1) [n:127.0.0.1:40963_ c:control_collection s:shard1 r:core_node1 x:collection1] o.a.s.c.SyncStrategy Sync Success - now sync replicas to me
   [junit4]   2> 772993 INFO  (coreZkRegister-3592-thread-1-processing-n:127.0.0.1:40963_ x:collection1 s:shard1 c:control_collection r:core_node1) [n:127.0.0.1:40963_ c:control_collection s:shard1 r:core_node1 x:collection1] o.a.s.c.SyncStrategy http://127.0.0.1:40963/collection1/ has no replicas
   [junit4]   2> 772993 INFO  (coreZkRegister-3592-thread-1-processing-n:127.0.0.1:40963_ x:collection1 s:shard1 c:control_collection r:core_node1) [n:127.0.0.1:40963_ c:control_collection s:shard1 r:core_node1 x:collection1] o.a.s.c.c.SolrZkClient makePath: /collections/control_collection/leaders/shard1
   [junit4]   2> 772994 INFO  (coreZkRegister-3592-thread-1-processing-n:127.0.0.1:40963_ x:collection1 s:shard1 c:control_collection r:core_node1) [n:127.0.0.1:40963_ c:control_collection s:shard1 r:core_node1 x:collection1] o.a.s.c.ShardLeaderElectionContextBase Creating leader registration node /collections/control_collection/leaders/shard1/leader after winning as /collections/control_collection/leader_elect/shard1/election/95936194174517252-core_node1-n_0000000000
   [junit4]   2> 772995 INFO  (coreZkRegister-3592-thread-1-processing-n:127.0.0.1:40963_ x:collection1 s:shard1 c:control_collection r:core_node1) [n:127.0.0.1:40963_ c:control_collection s:shard1 r:core_node1 x:collection1] o.a.s.c.ShardLeaderElectionContext I am the new leader: http://127.0.0.1:40963/collection1/ shard1
   [junit4]   2> 772995 INFO  (OverseerStateUpdate-95936194174517252-127.0.0.1:40963_-n_0000000000) [n:127.0.0.1:40963_    ] o.a.s.c.Overseer processMessage: queueSize: 1, message = {
   [junit4]   2>   "operation":"leader",
   [junit4]   2>   "shard":"shard1",
   [junit4]   2>   "collection":"control_collection",
   [junit4]   2>   "base_url":"http://127.0.0.1:40963",
   [junit4]   2>   "core":"collection1",
   [junit4]   2>   "state":"active"} current state version: 1
   [junit4]   2> 773097 INFO  (zkCallback-1455-thread-1-processing-n:127.0.0.1:40963_) [n:127.0.0.1:40963_    ] o.a.s.c.c.ZkStateReader A cluster state change: [WatchedEvent state:SyncConnected type:NodeDataChanged path:/clusterstate.json], has occurred - updating... (live nodes size: [1])
   [junit4]   2> 773146 INFO  (coreZkRegister-3592-thread-1-processing-n:127.0.0.1:40963_ x:collection1 s:shard1 c:control_collection r:core_node1) [n:127.0.0.1:40963_ c:control_collection s:shard1 r:core_node1 x:collection1] o.a.s.c.ZkController We are http://127.0.0.1:40963/collection1/ and leader is http://127.0.0.1:40963/collection1/
   [junit4]   2> 773146 INFO  (coreZkRegister-3592-thread-1-processing-n:127.0.0.1:40963_ x:collection1 s:shard1 c:control_collection r:core_node1) [n:127.0.0.1:40963_ c:control_collection s:shard1 r:core_node1 x:collection1] o.a.s.c.ZkController No LogReplay needed for core=collection1 baseURL=http://127.0.0.1:40963
   [junit4]   2> 773146 INFO  (coreZkRegister-3592-thread-1-processing-n:127.0.0.1:40963_ x:collection1 s:shard1 c:control_collection r:core_node1) [n:127.0.0.1:40963_ c:control_collection s:shard1 r:core_node1 x:collection1] o.a.s.c.ZkController I am the leader, no recovery necessary
   [junit4]   2> 773146 INFO  (coreZkRegister-3592-thread-1-processing-n:127.0.0.1:40963_ x:collection1 s:shard1 c:control_collection r:core_node1) [n:127.0.0.1:40963_ c:control_collection s:shard1 r:core_node1 x:collection1] o.a.s.c.ZkController publishing state=active
   [junit4]   2> 773146 INFO  (coreZkRegister-3592-thread-1-processing-n:127.0.0.1:40963_ x:collection1 s:shard1 c:control_collection r:core_node1) [n:127.0.0.1:40963_ c:control_collection s:shard1 r:core_node1 x:collection1] o.a.s.c.ZkController numShards not found on descriptor - reading it from system property
   [junit4]   2> 773147 INFO  (OverseerStateUpdate-95936194174517252-127.0.0.1:40963_-n_0000000000) [n:127.0.0.1:40963_    ] o.a.s.c.Overseer processMessage: queueSize: 1, message = {
   [junit4]   2>   "core":"collection1",
   [junit4]   2>   "core_node_name":"core_node1",
   [junit4]   2>   "roles":null,
   [junit4]   2>   "base_url":"http://127.0.0.1:40963",
   [junit4]   2>   "node_name":"127.0.0.1:40963_",
   [junit4]   2>   "numShards":"1",
   [junit4]   2>   "state":"active",
   [junit4]   2>   "shard":"shard1",
   [junit4]   2>   "collection":"control_collection",
   [junit4]   2>   "operation":"state"} current state version: 2
   [junit4]   2> 773147 INFO  (OverseerStateUpdate-95936194174517252-127.0.0.1:40963_-n_0000000000) [n:127.0.0.1:40963_    ] o.a.s.c.o.ReplicaMutator Update state numShards=1 message={
   [junit4]   2>   "core":"collection1",
   [junit4]   2>   "core_node_name":"core_node1",
   [junit4]   2>   "roles":null,
   [junit4]   2>   "base_url":"http://127.0.0.1:40963",
   [junit4]   2>   "node_name":"127.0.0.1:40963_",
   [junit4]   2>   "numShards":"1",
   [junit4]   2>   "state":"active",
   [junit4]   2>   "shard":"shard1",
   [junit4]   2>   "collection":"control_collection",
   [junit4]   2>   "operation":"state"}
   [junit4]   2> 773249 INFO  (zkCallback-1455-thread-1-processing-n:127.0.0.1:40963_) [n:127.0.0.1:40963_    ] o.a.s.c.c.ZkStateReader A cluster state change: [WatchedEvent state:SyncConnected type:NodeDataChanged path:/clusterstate.json], has occurred - updating... (live nodes size: [1])
   [junit4]   2> 773377 INFO  (TEST-TestReqParamsAPI.test-seed#[74A81CCE89B35964]) [    ] o.a.s.c.s.i.CloudSolrClient Final constructed zkHost string: 127.0.0.1:36346/solr
   [junit4]   2> 773378 INFO  (TEST-TestReqParamsAPI.test-seed#[74A81CCE89B35964]) [    ] o.a.s.c.c.SolrZkClient Using default ZkCredentialsProvider
   [junit4]   2> 773378 INFO  (TEST-TestReqParamsAPI.test-seed#[74A81CCE89B35964]) [    ] o.a.s.c.c.ConnectionManager Waiting for client to connect to ZooKeeper
   [junit4]   2> 773379 INFO  (zkCallback-1459-thread-1) [    ] o.a.s.c.c.ConnectionManager Watcher org.apache.solr.common.cloud.ConnectionManager@6c9e8fe1 name:ZooKeeperConnection Watcher:127.0.0.1:36346/solr got event WatchedEvent state:SyncConnected type:None path:null path:null type:None
   [junit4]   2> 773379 INFO  (TEST-TestReqParamsAPI.test-seed#[74A81CCE89B35964]) [    ] o.a.s.c.c.ConnectionManager Client is connected to ZooKeeper
   [junit4]   2> 773379 INFO  (TEST-TestReqParamsAPI.test-seed#[74A81CCE89B35964]) [    ] o.a.s.c.c.SolrZkClient Using default ZkACLProvider
   [junit4]   2> 773379 INFO  (TEST-TestReqParamsAPI.test-seed#[74A81CCE89B35964]) [    ] o.a.s.c.c.ZkStateReader Updating cluster state from ZooKeeper... 
   [junit4]   2> 773380 INFO  (TEST-TestReqParamsAPI.test-seed#[74A81CCE89B35964]) [    ] o.a.s.c.c.ZkStateReader Loaded empty cluster properties
   [junit4]   2> 773380 INFO  (TEST-TestReqParamsAPI.test-seed#[74A81CCE89B35964]) [    ] o.a.s.c.c.ZkStateReader Updated live nodes from ZooKeeper... (0) -> (1)
   [junit4]   2> 773381 INFO  (TEST-TestReqParamsAPI.test-seed#[74A81CCE89B35964]) [    ] o.a.s.c.ChaosMonkey monkey: init - expire sessions:false cause connection loss:false
   [junit4]   2> 773439 INFO  (TEST-TestReqParamsAPI.test-seed#[74A81CCE89B35964]) [    ] o.a.s.SolrTestCaseJ4 Writing core.properties file to /x1/jenkins/jenkins-slave/workspace/Lucene-Solr-Tests-6.x/solr/build/solr-core/test/J2/temp/solr.handler.TestReqParamsAPI_74A81CCE89B35964-001/shard-1-001/cores/collection1
   [junit4]   2> 773439 INFO  (TEST-TestReqParamsAPI.test-seed#[74A81CCE89B35964]) [    ] o.a.s.c.AbstractFullDistribZkTestBase create jetty 1 in directory /x1/jenkins/jenkins-slave/workspace/Lucene-Solr-Tests-6.x/solr/build/solr-core/test/J2/temp/solr.handler.TestReqParamsAPI_74A81CCE89B35964-001/shard-1-001
   [junit4]   2> 773439 INFO  (TEST-TestReqParamsAPI.test-seed#[74A81CCE89B35964]) [    ] o.e.j.s.Server jetty-9.3.8.v20160314
   [junit4]   2> 773440 INFO  (TEST-TestReqParamsAPI.test-seed#[74A81CCE89B35964]) [    ] o.e.j.s.h.ContextHandler Started o.e.j.s.ServletContextHandler@f769537{/,null,AVAILABLE}
   [junit4]   2> 773441 INFO  (TEST-TestReqParamsAPI.test-seed#[74A81CCE89B35964]) [    ] o.e.j.s.ServerConnector Started ServerConnector@cc5602f{HTTP/1.1,[http/1.1]}{127.0.0.1:47964}
   [junit4]   2> 773441 INFO  (TEST-TestReqParamsAPI.test-seed#[74A81CCE89B35964]) [    ] o.e.j.s.Server Started @775636ms
   [junit4]   2> 773442 INFO  (TEST-TestReqParamsAPI.test-seed#[74A81CCE89B35964]) [    ] o.a.s.c.s.e.JettySolrRunner Jetty properties: {solr.data.dir=/x1/jenkins/jenkins-slave/workspace/Lucene-Solr-Tests-6.x/solr/build/solr-core/test/J2/temp/solr.handler.TestReqParamsAPI_74A81CCE89B35964-001/tempDir-001/jetty1, solrconfig=solrconfig.xml, hostContext=/, hostPort=47964, coreRootDirectory=/x1/jenkins/jenkins-slave/workspace/Lucene-Solr-Tests-6.x/solr/build/solr-core/test/J2/temp/solr.handler.TestReqParamsAPI_74A81CCE89B35964-001/shard-1-001/cores}
   [junit4]   2> 773442 INFO  (TEST-TestReqParamsAPI.test-seed#[74A81CCE89B35964]) [    ] o.a.s.s.SolrDispatchFilter SolrDispatchFilter.init(): sun.misc.Launcher$AppClassLoader@73d16e93
   [junit4]   2> 773442 INFO  (TEST-TestReqParamsAPI.test-seed#[74A81CCE89B35964]) [    ] o.a.s.c.SolrResourceLoader new SolrResourceLoader for directory: '/x1/jenkins/jenkins-slave/workspace/Lucene-Solr-Tests-6.x/solr/build/solr-core/test/J2/temp/solr.handler.TestReqParamsAPI_74A81CCE89B35964-001/shard-1-001'
   [junit4]   2> 773442 INFO  (TEST-TestReqParamsAPI.test-seed#[74A81CCE89B35964]) [    ] o.a.s.c.SolrResourceLoader JNDI not configured for solr (NoInitialContextEx)
   [junit4]   2> 773442 INFO  (TEST-TestReqParamsAPI.test-seed#[74A81CCE89B35964]) [    ] o.a.s.c.SolrResourceLoader solr home defaulted to 'solr/' (could not find system property or JNDI)
   [junit4]   2> 773442 INFO  (TEST-TestReqParamsAPI.test-seed#[74A81CCE89B35964]) [    ] o.a.s.c.c.SolrZkClient Using default ZkCredentialsProvider
   [junit4]   2> 773443 INFO  (TEST-TestReqParamsAPI.test-seed#[74A81CCE89B35964]) [    ] o.a.s.c.c.ConnectionManager Waiting for client to connect to ZooKeeper
   [junit4]   2> 773443 INFO  (zkCallback-1460-thread-1) [    ] o.a.s.c.c.ConnectionManager Watcher org.apache.solr.common.cloud.ConnectionManager@14cc96bc name:ZooKeeperConnection Watcher:127.0.0.1:36346/solr got event WatchedEvent state:SyncConnected type:None path:null path:null type:None
   [junit4]   2> 773443 INFO  (TEST-TestReqParamsAPI.test-seed#[74A81CCE89B35964]) [    ] o.a.s.c.c.ConnectionManager Client is connected to ZooKeeper
   [junit4]   2> 773443 INFO  (TEST-TestReqParamsAPI.test-seed#[74A81CCE89B35964]) [    ] o.a.s.c.c.SolrZkClient Using default ZkACLProvider
   [junit4]   2> 773444 INFO  (TEST-TestReqParamsAPI.test-seed#[74A81CCE89B35964]) [    ] o.a.s.s.SolrDispatchFilter Loading solr.xml from SolrHome (not found in ZooKeeper)
   [junit4]   2> 773444 INFO  (TEST-TestReqParamsAPI.test-seed#[74A81CCE89B35964]) [    ] o.a.s.c.SolrXmlConfig Loading container configuration from /x1/jenkins/jenkins-slave/workspace/Lucene-Solr-Tests-6.x/solr/build/solr-core/test/J2/temp/solr.handler.TestReqParamsAPI_74A81CCE89B35964-001/shard-1-001/solr.xml
   [junit4]   2> 773447 INFO  (TEST-TestReqParamsAPI.test-seed#[74A81CCE89B35964]) [    ] o.a.s.c.CorePropertiesLocator Config-defined core root directory: /x1/jenkins/jenkins-slave/workspace/Lucene-Solr-Tests-6.x/solr/build/solr-core/test/J2/temp/solr.handler.TestReqParamsAPI_74A81CCE89B35964-001/shard-1-001/cores
   [junit4]   2> 773447 INFO  (TEST-TestReqParamsAPI.test-seed#[74A81CCE89B35964]) [    ] o.a.s.c.CoreContainer New CoreContainer 178594951
   [junit4]   2> 773447 INFO  (TEST-TestReqParamsAPI.test-seed#[74A81CCE89B35964]) [    ] o.a.s.c.CoreContainer Loading cores into CoreContainer [instanceDir=/x1/jenkins/jenkins-slave/workspace/Lucene-Solr-Tests-6.x/solr/build/solr-core/test/J2/temp/solr.handler.TestReqParamsAPI_74A81CCE89B35964-001/shard-1-001]
   [junit4]   2> 773447 WARN  (TEST-TestReqParamsAPI.test-seed#[74A81CCE89B35964]) [    ] o.a.s.c.CoreContainer Couldn't add files from /x1/jenkins/jenkins-slave/workspace/Lucene-Solr-Tests-6.x/solr/build/solr-core/test/J2/temp/solr.handler.TestReqParamsAPI_74A81CCE89B35964-001/shard-1-001/lib to classpath: /x1/jenkins/jenkins-slave/workspace/Lucene-Solr-Tests-6.x/solr/build/solr-core/test/J2/temp/solr.handler.TestReqParamsAPI_74A81CCE89B35964-001/shard-1-001/lib
   [junit4]   2> 773448 INFO  (TEST-TestReqParamsAPI.test-seed#[74A81CCE89B35964]) [    ] o.a.s.h.c.HttpShardHandlerFactory created with socketTimeout : 90000,urlScheme : ,connTimeout : 15000,maxConnectionsPerHost : 20,maxConnections : 10000,corePoolSize : 0,maximumPoolSize : 2147483647,maxThreadIdleTime : 5,sizeOfQueue : -1,fairnessPolicy : false,useRetries : false,
   [junit4]   2> 773448 INFO  (TEST-TestReqParamsAPI.test-seed#[74A81CCE89B35964]) [    ] o.a.s.u.UpdateShardHandler Creating UpdateShardHandler HTTP client with params: socketTimeout=340000&connTimeout=45000&retry=true
   [junit4]   2> 773449 INFO  (TEST-TestReqParamsAPI.test-seed#[74A81CCE89B35964]) [    ] o.a.s.l.LogWatcher SLF4J impl is org.slf4j.impl.Log4jLoggerFactory
   [junit4]   2> 773449 INFO  (TEST-TestReqParamsAPI.test-seed#[74A81CCE89B35964]) [    ] o.a.s.l.LogWatcher Registering Log Listener [Log4j (org.slf4j.impl.Log4jLoggerFactory)]
   [junit4]   2> 773449 INFO  (TEST-TestReqParamsAPI.test-seed#[74A81CCE89B35964]) [    ] o.a.s.c.ZkContainer Zookeeper client=127.0.0.1:36346/solr
   [junit4]   2> 773449 INFO  (TEST-TestReqParamsAPI.test-seed#[74A81CCE89B35964]) [    ] o.a.s.c.ZkController zkHost includes chroot
   [junit4]   2> 773449 INFO  (TEST-TestReqParamsAPI.test-seed#[74A81CCE89B35964]) [    ] o.a.s.c.c.SolrZkClient Using default ZkCredentialsProvider
   [junit4]   2> 773454 INFO  (TEST-TestReqParamsAPI.test-seed#[74A81CCE89B35964]) [    ] o.a.s.c.c.ConnectionManager Waiting for client to connect to ZooKeeper
   [junit4]   2> 773454 INFO  (zkCallback-1463-thread-1) [    ] o.a.s.c.c.ConnectionManager Watcher org.apache.solr.common.cloud.ConnectionManager@572b1fa5 name:ZooKeeperConnection Watcher:127.0.0.1:36346 got event WatchedEvent state:SyncConnected type:None path:null path:null type:None
   [junit4]   2> 773455 INFO  (TEST-TestReqParamsAPI.test-seed#[74A81CCE89B35964]) [    ] o.a.s.c.c.ConnectionManager Client is connected to ZooKeeper
   [junit4]   2> 773461 INFO  (TEST-TestReqParamsAPI.test-seed#[74A81CCE89B35964]) [    ] o.a.s.c.c.SolrZkClient Using default ZkACLProvider
   [junit4]   2> 773462 INFO  (TEST-TestReqParamsAPI.test-seed#[74A81CCE89B35964]) [n:127.0.0.1:47964_    ] o.a.s.c.ZkController Added new OnReconnect listener org.apache.solr.cloud.ZkController$$Lambda$58/1210067039@335a09b0
   [junit4]   2> 773463 INFO  (TEST-TestReqParamsAPI.test-seed#[74A81CCE89B35964]) [n:127.0.0.1:47964_    ] o.a.s.c.c.ConnectionManager Waiting for client to connect to ZooKeeper
   [junit4]   2> 773463 INFO  (zkCallback-1464-thread-1-processing-n:127.0.0.1:47964_) [n:127.0.0.1:47964_    ] o.a.s.c.c.ConnectionManager Watcher org.apache.solr.common.cloud.ConnectionManager@62ee5ddd name:ZooKeeperConnection Watcher:127.0.0.1:36346/solr got event WatchedEvent state:SyncConnected type:None path:null path:null type:None
   [junit4]   2> 773463 INFO  (TEST-TestReqParamsAPI.test-seed#[74A81CCE89B35964]) [n:127.0.0.1:47964_    ] o.a.s.c.c.ConnectionManager Client is connected to ZooKeeper
   [junit4]   2> 773466 INFO  (TEST-TestReqParamsAPI.test-seed#[74A81CCE89B35964]) [n:127.0.0.1:47964_    ] o.a.s.c.c.ZkStateReader Updating cluster state from ZooKeeper... 
   [junit4]   2> 773466 INFO  (TEST-TestReqParamsAPI.test-seed#[74A81CCE89B35964]) [n:127.0.0.1:47964_    ] o.a.s.c.c.ZkStateReader Loaded empty cluster properties
   [junit4]   2> 773466 INFO  (TEST-TestReqParamsAPI.test-seed#[74A81CCE89B35964]) [n:127.0.0.1:47964_    ] o.a.s.c.c.ZkStateReader Updated live nodes from ZooKeeper... (0) -> (1)
   [junit4]   2> 773468 INFO  (TEST-TestReqParamsAPI.test-seed#[74A81CCE89B35964]) [n:127.0.0.1:47964_    ] o.a.s.c.Overseer Overseer (id=null) closing
   [junit4]   2> 773468 INFO  (TEST-TestReqParamsAPI.test-seed#[74A81CCE89B35964]) [n:127.0.0.1:47964_    ] o.a.s.c.LeaderElector Joined leadership election with path: /overseer_elect/election/95936194174517256-127.0.0.1:47964_-n_0000000001
   [junit4]   2> 773468 INFO  (TEST-TestReqParamsAPI.test-seed#[74A81CCE89B35964]) [n:127.0.0.1:47964_    ] o.a.s.c.LeaderElector Watching path /overseer_elect/election/95936194174517252-127.0.0.1:40963_-n_0000000000 to know if I could be the leader
   [junit4]   2> 773468 INFO  (TEST-TestReqParamsAPI.test-seed#[74A81CCE89B35964]) [n:127.0.0.1:47964_    ] o.a.s.c.ZkController Publish node=127.0.0.1:47964_ as DOWN
   [junit4]   2> 773469 INFO  (OverseerStateUpdate-95936194174517252-127.0.0.1:40963_-n_0000000000) [n:127.0.0.1:40963_    ] o.a.s.c.Overseer processMessage: queueSize: 1, message = {
   [junit4]   2>   "operation":"downnode",
   [junit4]   2>   "node_name":"127.0.0.1:47964_"} current state version: 3
   [junit4]   2> 773469 INFO  (OverseerStateUpdate-95936194174517252-127.0.0.1:40963_-n_0000000000) [n:127.0.0.1:40963_    ] o.a.s.c.o.NodeMutator DownNode state invoked for node: 127.0.0.1:47964_
   [junit4]   2> 773571 INFO  (zkCallback-1459-thread-1) [    ] o.a.s.c.c.ZkStateReader A cluster state change: [WatchedEvent state:SyncConnected type:NodeDataChanged path:/clusterstate.json], has occurred - updating... (live nodes size: [1])
   [junit4]   2> 773571 INFO  (zkCallback-1455-thread-1-processing-n:127.0.0.1:40963_) [n:127.0.0.1:40963_    ] o.a.s.c.c.ZkStateReader A cluster state change: [WatchedEvent state:SyncConnected type:NodeDataChanged path:/clusterstate.json], has occurred - updating... (live nodes size: [1])
   [junit4]   2> 773571 INFO  (zkCallback-1464-thread-1-processing-n:127.0.0.1:47964_) [n:127.0.0.1:47964_    ] o.a.s.c.c.ZkStateReader A cluster state change: [WatchedEvent state:SyncConnected type:NodeDataChanged path:/clusterstate.json], has occurred - updating... (live nodes size: [1])
   [junit4]   2> 774469 INFO  (TEST-TestReqParamsAPI.test-seed#[74A81CCE89B35964]) [n:127.0.0.1:47964_    ] o.a.s.c.ZkController Register node as live in ZooKeeper:/live_nodes/127.0.0.1:47964_
   [junit4]   2> 774470 INFO  (TEST-TestReqParamsAPI.test-seed#[74A81CCE89B35964]) [n:127.0.0.1:47964_    ] o.a.s.c.c.SolrZkClient makePath: /live_nodes/127.0.0.1:47964_
   [junit4]   2> 774471 INFO  (zkCallback-1459-thread-1) [    ] o.a.s.c.c.ZkStateReader A live node change: [WatchedEvent state:SyncConnected type:NodeChildrenChanged path:/live_nodes], has occurred - updating... (live nodes size: [1])
   [junit4]   2> 774471 INFO  (zkCallback-1464-thread-1-processing-n:127.0.0.1:47964_) [n:127.0.0.1:47964_    ] o.a.s.c.c.ZkStateReader A live node change: [WatchedEvent state:SyncConnected type:NodeChildrenChanged path:/live_nodes], has occurred - updating... (live nodes size: [1])
   [junit4]   2> 774471 INFO  (zkCallback-1455-thread-1-processing-n:127.0.0.1:40963_) [n:127.0.0.1:40963_    ] o.a.s.c.c.ZkStateReader A live node change: [WatchedEvent state:SyncConnected type:NodeChildrenChanged path:/live_nodes], has occurred - updating... (live nodes size: [1])
   [junit4]   2> 774471 INFO  (zkCallback-1464-thread-1-processing-n:127.0.0.1:47964_) [n:127.0.0.1:47964_    ] o.a.s.c.c.ZkStateReader Updated live nodes from ZooKeeper... (1) -> (2)
   [junit4]   2> 774471 INFO  (zkCallback-1459-thread-1) [    ] o.a.s.c.c.ZkStateReader Updated live nodes from ZooKeeper... (1) -> (2)
   [junit4]   2> 774471 INFO  (zkCallback-1455-thread-1-processing-n:127.0.0.1:40963_) [n:127.0.0.1:40963_    ] o.a.s.c.c.ZkStateReader Updated live nodes from ZooKeeper... (1) -> (2)
   [junit4]   2> 774478 INFO  (TEST-TestReqParamsAPI.test-seed#[74A81CCE89B35964]) [n:127.0.0.1:47964_    ] o.a.s.c.CoreContainer Security conf doesn't exist. Skipping setup for authorization module.
   [junit4]   2> 774478 INFO  (TEST-TestReqParamsAPI.test-seed#[74A81CCE89B35964]) [n:127.0.0.1:47964_    ] o.a.s.c.CoreContainer No authentication plugin used.
   [junit4]   2> 774479 INFO  (TEST-TestReqParamsAPI.test-seed#[74A81CCE89B35964]) [n:127.0.0.1:47964_    ] o.a.s.c.CorePropertiesLocator Looking for core definitions underneath /x1/jenkins/jenkins-slave/workspace/Lucene-Solr-Tests-6.x/solr/build/solr-core/test/J2/temp/solr.handler.TestReqParamsAPI_74A81CCE89B35964-001/shard-1-001/cores
   [junit4]   2> 774479 INFO  (TEST-TestReqParamsAPI.test-seed#[74A81CCE89B35964]) [n:127.0.0.1:47964_    ] o.a.s.c.CoreDescriptor Created CoreDescriptor: {name=collection1, config=solrconfig.xml, transient=false, schema=schema.xml, loadOnStartup=true, configSetProperties=configsetprops.json, collection=collection1, coreNodeName=, dataDir=data/, shard=}
   [junit4]   2> 774479 INFO  (TEST-TestReqParamsAPI.test-seed#[74A81CCE89B35964]) [n:127.0.0.1:47964_    ] o.a.s.c.CorePropertiesLocator Found core collection1 in /x1/jenkins/jenkins-slave/workspace/Lucene-Solr-Tests-6.x/solr/build/solr-core/test/J2/temp/solr.handler.TestReqParamsAPI_74A81CCE89B35964-001/shard-1-001/cores/collection1
   [junit4]   2> 774479 INFO  (TEST-TestReqParamsAPI.test-seed#[74A81CCE89B35964]) [n:127.0.0.1:47964_    ] o.a.s.c.CorePropertiesLocator Found 1 core definitions
   [junit4]   2> 774480 INFO  (coreLoadExecutor-3609-thread-1-processing-n:127.0.0.1:47964_) [n:127.0.0.1:47964_ c:collection1   x:collection1] o.a.s.c.ZkController publishing state=down
   [junit4]   2> 774480 INFO  (coreLoadExecutor-3609-thread-1-processing-n:127.0.0.1:47964_) [n:127.0.0.1:47964_ c:collection1   x:collection1] o.a.s.c.ZkController numShards not found on descriptor - reading it from system property
   [junit4]   2> 774480 INFO  (TEST-TestReqParamsAPI.test-seed#[74A81CCE89B35964]) [n:127.0.0.1:47964_    ] o.a.s.s.SolrDispatchFilter user.dir=/x1/jenkins/jenkins-slave/workspace/Lucene-Solr-Tests-6.x/solr/build/solr-core/test/J2
   [junit4]   2> 774480 INFO  (TEST-TestReqParamsAPI.test-seed#[74A81CCE89B35964]) [n:127.0.0.1:47964_    ] o.a.s.s.SolrDispatchFilter SolrDispatchFilter.init() done
   [junit4]   2> 774480 INFO  (coreLoadExecutor-3609-thread-1-processing-n:127.0.0.1:47964_) [n:127.0.0.1:47964_ c:collection1   x:collection1] o.a.s.c.ZkController Collection collection1 not visible yet, but flagging it so a watch is registered when it becomes visible
   [junit4]   2> 774481 INFO  (OverseerStateUpdate-95936194174517252-127.0.0.1:40963_-n_0000000000) [n:127.0.0.1:40963_    ] o.a.s.c.Overseer processMessage: queueSize: 1, message = {
   [junit4]   2>   "core":"collection1",
   [junit4]   2>   "roles":null,
   [junit4]   2>   "base_url":"http://127.0.0.1:47964",
   [junit4]   2>   "node_name":"127.0.0.1:47964_",
   [junit4]   2>   "numShards":"2",
   [junit4]   2>   "state":"down",
   [junit4]   2>   "shard":null,
   [junit4]   2>   "collection":"collection1",
   [junit4]   2>   "operation":"state"} current state version: 4
   [junit4]   2> 774481 INFO  (OverseerStateUpdate-95936194174517252-127.0.0.1:40963_-n_0000000000) [n:127.0.0.1:40963_    ] o.a.s.c.o.ReplicaMutator Update state numShards=2 message={
   [junit4]   2>   "core":"collection1",
   [junit4]   2>   "roles":null,
   [junit4]   2>   "base_url":"http://127.0.0.1:47964",
   [junit4]   2>   "node_name":"127.0.0.1:47964_",
   [junit4]   2>   "numShards":"2",
   [junit4]   2>   "state":"down",
   [junit4]   2>   "shard":null,
   [junit4]   2>   "collection":"collection1",
   [junit4]   2>   "operation":"state"}
   [junit4]   2> 774481 INFO  (OverseerStateUpdate-95936194174517252-127.0.0.1:40963_-n_0000000000) [n:127.0.0.1:40963_    ] o.a.s.c.o.ClusterStateMutator building a new cName: collection1
   [junit4]   2> 774481 INFO  (OverseerStateUpdate-95936194174517252-127.0.0.1:40963_-n_0000000000) [n:127.0.0.1:40963_    ] o.a.s.c.o.ReplicaMutator Assigning new node to shard shard=shard2
   [junit4]   2> 774481 INFO  (coreLoadExecutor-3609-thread-1-processing-n:127.0.0.1:47964_) [n:127.0.0.1:47964_ c:collection1   x:collection1] o.a.s.c.c.ZkStateReader Deleting data for [collection1]
   [junit4]   2> 774481 INFO  (coreLoadExecutor-3609-thread-1-processing-n:127.0.0.1:47964_) [n:127.0.0.1:47964_ c:collection1   x:collection1] o.a.s.c.ZkController look for our core node name
   [junit4]   2> 774582 INFO  (zkCallback-1464-thread-1-processing-n:127.0.0.1:47964_) [n:127.0.0.1:47964_    ] o.a.s.c.c.ZkStateReader A cluster state change: [WatchedEvent state:SyncConnected type:NodeDataChanged path:/clusterstate.json], has occurred - updating... (live nodes size: [2])
   [junit4]   2> 774582 INFO  (zkCallback-1459-thread-1) [    ] o.a.s.c.c.ZkStateReader A cluster state change: [WatchedEvent state:SyncConnected type:NodeDataChanged path:/clusterstate.json], has occurred - updating... (live nodes size: [2])
   [junit4]   2> 774582 INFO  (zkCallback-1455-thread-1-processing-n:127.0.0.1:40963_) [n:127.0.0.1:40963_    ] o.a.s.c.c.ZkStateReader A cluster state change: [WatchedEvent state:SyncConnected type:NodeDataChanged path:/clusterstate.json], has occurred - updating... (live nodes size: [2])
   [junit4]   2> 775482 INFO  (coreLoadExecutor-3609-thread-1-processing-n:127.0.0.1:47964_) [n:127.0.0.1:47964_ c:collection1   x:collection1] o.a.s.c.ZkController waiting to find shard id in clusterstate for collection1
   [junit4]   2> 775482 INFO  (coreLoadExecutor-3609-thread-1-processing-n:127.0.0.1:47964_) [n:127.0.0.1:47964_ c:collection1   x:collection1] o.a.s.c.ZkController Check for collection zkNode:collection1
   [junit4]   2> 775482 INFO  (coreLoadExecutor-3609-thread-1-processing-n:127.0.0.1:47964_) [n:127.0.0.1:47964_ c:collection1   x:collection1] o.a.s.c.ZkController Collection zkNode exists
   [junit4]   2> 775482 INFO  (coreLoadExecutor-3609-thread-1-processing-n:127.0.0.1:47964_) [n:127.0.0.1:47964_ c:collection1   x:collection1] o.a.s.c.c.ZkStateReader Load collection config from: [/collections/collection1]
   [junit4]   2> 775483 INFO  (coreLoadExecutor-3609-thread-1-processing-n:127.0.0.1:47964_) [n:127.0.0.1:47964_ c:collection1   x:collection1] o.a.s.c.c.ZkStateReader path=[/collections/collection1] [configName]=[conf1] specified config exists in ZooKeeper
   [junit4]   2> 775483 INFO  (coreLoadExecutor-3609-thread-1-processing-n:127.0.0.1:47964_) [n:127.0.0.1:47964_ c:collection1   x:collection1] o.a.s.c.SolrResourceLoader new SolrResourceLoader for directory: '/x1/jenkins/jenkins-slave/workspace/Lucene-Solr-Tests-6.x/solr/build/solr-core/test/J2/temp/solr.handler.TestReqParamsAPI_74A81CCE89B35964-001/shard-1-001/cores/collection1'
   [junit4]   2> 775483 INFO  (coreLoadExecutor-3609-thread-1-processing-n:127.0.0.1:47964_) [n:127.0.0.1:47964_ c:collection1   x:collection1] o.a.s.c.SolrResourceLoader JNDI not configured for solr (NoInitialContextEx)
   [junit4]   2> 775483 INFO  (coreLoadExecutor-3609-thread-1-processing-n:127.0.0.1:47964_) [n:127.0.0.1:47964_ c:collection1   x:collection1] o.a.s.c.SolrResourceLoader solr home defaulted to 'solr/' (could not find system property or JNDI)
   [junit4]   2> 775484 INFO  (coreLoadExecutor-3609-thread-1-processing-n:127.0.0.1:47964_) [n:127.0.0.1:47964_ c:collection1   x:collection1] o.a.s.c.Config loaded config solrconfig.xml with version 0 
   [junit4]   2> 775497 INFO  (coreLoadExecutor-3609-thread-1-processing-n:127.0.0.1:47964_) [n:127.0.0.1:47964_ c:collection1   x:collection1] o.a.s.c.SolrConfig current version of requestparams : -1
   [junit4]   2> 775500 WARN  (coreLoadExecutor-3609-thread-1-processing-n:127.0.0.1:47964_) [n:127.0.0.1:47964_ c:collection1   x:collection1] o.a.s.c.Config Beginning with Solr 5.5, <mergePolicy> is deprecated, use <mergePolicyFactory> instead.
   [junit4]   2> 775500 INFO  (coreLoadExecutor-3609-thread-1-processing-n:127.0.0.1:47964_) [n:127.0.0.1:47964_ c:collection1   x:collection1] o.a.s.c.SolrConfig Using Lucene MatchVersion: 6.1.0
   [junit4]   2> 775506 INFO  (coreLoadExecutor-3609-thread-1-processing-n:127.0.0.1:47964_) [n:127.0.0.1:47964_ c:collection1   x:collection1] o.a.s.c.SolrConfig Loaded SolrConfig: solrconfig.xml
   [junit4]   2> 775510 INFO  (coreLoadExecutor-3609-thread-1-processing-n:127.0.0.1:47964_) [n:127.0.0.1:47964_ c:collection1   x:collection1] o.a.s.s.IndexSchema [collection1] Schema name=test
   [junit4]   2> 775574 INFO  (coreLoadExecutor-3609-thread-1-processing-n:127.0.0.1:47964_) [n:127.0.0.1:47964_ c:collection1   x:collection1] o.a.s.s.OpenExchangeRatesOrgProvider Initialized with rates=open-exchange-rates.json, refreshInterval=1440.
   [junit4]   2> 775578 INFO  (coreLoadExecutor-3609-thread-1-processing-n:127.0.0.1:47964_) [n:127.0.0.1:47964_ c:collection1   x:collection1] o.a.s.s.IndexSchema default search field in schema is text
   [junit4]   2> 775579 INFO  (coreLoadExecutor-3609-thread-1-processing-n:127.0.0.1:47964_) [n:127.0.0.1:47964_ c:collection1   x:collection1] o.a.s.s.IndexSchema unique key field: id
   [junit4]   2> 775583 INFO  (coreLoadExecutor-3609-thread-1-processing-n:127.0.0.1:47964_) [n:127.0.0.1:47964_ c:collection1   x:collection1] o.a.s.s.FileExchangeRateProvider Reloading exchange rates from file currency.xml
   [junit4]   2> 775584 INFO  (coreLoadExecutor-3609-thread-1-processing-n:127.0.0.1:47964_) [n:127.0.0.1:47964_ c:collection1   x:collection1] o.a.s.s.FileExchangeRateProvider Reloading exchange rates from file currency.xml
   [junit4]   2> 775585 INFO  (coreLoadExecutor-3609-thread-1-processing-n:127.0.0.1:47964_) [n:127.0.0.1:47964_ c:collection1   x:collection1] o.a.s.s.OpenExchangeRatesOrgProvider Reloading exchange rates from open-exchange-rates.json
   [junit4]   2> 775586 INFO  (coreLoadExecutor-3609-thread-1-processing-n:127.0.0.1:47964_) [n:127.0.0.1:47964_ c:collection1   x:collection1] o.a.s.s.OpenExchangeRatesOrgProvider Reloading exchange rates from open-exchange-rates.json
   [junit4]   2> 775586 INFO  (coreLoadExecutor-3609-thread-1-processing-n:127.0.0.1:47964_) [n:127.0.0.1:47964_ c:collection1   x:collection1] o.a.s.c.ConfigSetProperties Did not find ConfigSet properties, assuming default properties: Can't find resource 'configsetprops.json' in classpath or '/configs/conf1', cwd=/x1/jenkins/jenkins-slave/workspace/Lucene-Solr-Tests-6.x/solr/build/solr-core/test/J2
   [junit4]   2> 775586 INFO  (coreLoadExecutor-3609-thread-1-processing-n:127.0.0.1:47964_) [n:127.0.0.1:47964_ c:collection1   x:collection1] o.a.s.c.CoreContainer Creating SolrCore 'collection1' using configuration from collection collection1
   [junit4]   2> 775587 INFO  (coreLoadExecutor-3609-thread-1-processing-n:127.0.0.1:47964_) [n:127.0.0.1:47964_ c:collection1 s:shard2 r:core_node1 x:collection1] o.a.s.c.SolrCore org.apache.solr.core.MockDirectoryFactory
   [junit4]   2> 775587 INFO  (coreLoadExecutor-3609-thread-1-processing-n:127.0.0.1:47964_) [n:127.0.0.1:47964_ c:collection1 s:shard2 r:core_node1 x:collection1] o.a.s.c.SolrCore [[collection1] ] Opening new SolrCore at [/x1/jenkins/jenkins-slave/workspace/Lucene-Solr-Tests-6.x/solr/build/solr-core/test/J2/temp/solr.handler.TestReqParamsAPI_74A81CCE89B35964-001/shard-1-001/cores/collection1], dataDir=[/x1/jenkins/jenkins-slave/workspace/Lucene-Solr-Tests-6.x/solr/build/solr-core/test/J2/temp/solr.handler.TestReqParamsAPI_74A81CCE89B35964-001/shard-1-001/cores/collection1/data/]
   [junit4]   2> 775587 INFO  (coreLoadExecutor-3609-thread-1-processing-n:127.0.0.1:47964_) [n:127.0.0.1:47964_ c:collection1 s:shard2 r:core_node1 x:collection1] o.a.s.c.JmxMonitoredMap JMX monitoring is enabled. Adding Solr mbeans to JMX Server: com.sun.jmx.mbeanserver.JmxMBeanServer@2eeb80dd
   [junit4]   2> 775587 INFO  (coreLoadExecutor-3609-thread-1-processing-n:127.0.0.1:47964_) [n:127.0.0.1:47964_ c:collection1 s:shard2 r:core_node1 x:collection1] o.a.s.c.CachingDirectoryFactory return new directory for /x1/jenkins/jenkins-slave/workspace/Lucene-Solr-Tests-6.x/solr/build/solr-core/test/J2/temp/solr.handler.TestReqParamsAPI_74A81CCE89B35964-001/shard-1-001/cores/collection1/data
   [junit4]   2> 775587 INFO  (coreLoadExecutor-3609-thread-1-processing-n:127.0.0.1:47964_) [n:127.0.0.1:47964_ c:collection1 s:shard2 r:core_node1 x:collection1] o.a.s.c.SolrCore New index directory detected: old=null new=/x1/jenkins/jenkins-slave/workspace/Lucene-Solr-Tests-6.x/solr/build/solr-core/test/J2/temp/solr.handler.TestReqParamsAPI_74A81CCE89B35964-001/shard-1-001/cores/collection1/data/index/
   [junit4]   2> 775587 WARN  (coreLoadExecutor-3609-thread-1-processing-n:127.0.0.1:47964_) [n:127.0.0.1:47964_ c:collection1 s:shard2 r:core_node1 x:collection1] o.a.s.c.SolrCore [collection1] Solr index directory '/x1/jenkins/jenkins-slave/workspace/Lucene-Solr-Tests-6.x/solr/build/solr-core/test/J2/temp/solr.handler.TestReqParamsAPI_74A81CCE89B35964-001/shard-1-001/cores/collection1/data/index' doesn't exist. Creating new index...
   [junit4]   2> 775588 INFO  (coreLoadExecutor-3609-thread-1-processing-n:127.0.0.1:47964_) [n:127.0.0.1:47964_ c:collection1 s:shard2 r:core_node1 x:collection1] o.a.s.c.CachingDirectoryFactory return new directory for /x1/jenkins/jenkins-slave/workspace/Lucene-Solr-Tests-6.x/solr/build/solr-core/test/J2/temp/solr.handler.TestReqParamsAPI_74A81C

[...truncated too long message...]

d-1-processing-n:127.0.0.1:50616_) [n:127.0.0.1:50616_ c:collection1 s:shard1 r:core_node4 x:collection1] o.a.s.c.ElectionContext Canceling election /collections/collection1/leader_elect/shard1/election/95936194174517265-core_node4-n_0000000001
   [junit4]   2> 800200 WARN  (zkCallback-1483-thread-1-processing-n:127.0.0.1:50616_) [n:127.0.0.1:50616_ c:collection1 s:shard1 r:core_node4 x:collection1] o.a.s.c.LeaderElector 
   [junit4]   2> org.apache.zookeeper.KeeperException$SessionExpiredException: KeeperErrorCode = Session expired for /collections/collection1/leader_elect/shard1/election/95936194174517265-core_node4-n_0000000001
   [junit4]   2> 	at org.apache.zookeeper.KeeperException.create(KeeperException.java:127)
   [junit4]   2> 	at org.apache.zookeeper.KeeperException.create(KeeperException.java:51)
   [junit4]   2> 	at org.apache.zookeeper.ZooKeeper.delete(ZooKeeper.java:873)
   [junit4]   2> 	at org.apache.solr.common.cloud.SolrZkClient$2.execute(SolrZkClient.java:244)
   [junit4]   2> 	at org.apache.solr.common.cloud.SolrZkClient$2.execute(SolrZkClient.java:241)
   [junit4]   2> 	at org.apache.solr.common.cloud.ZkCmdExecutor.retryOperation(ZkCmdExecutor.java:60)
   [junit4]   2> 	at org.apache.solr.common.cloud.SolrZkClient.delete(SolrZkClient.java:241)
   [junit4]   2> 	at org.apache.solr.cloud.ElectionContext.cancelElection(ElectionContext.java:86)
   [junit4]   2> 	at org.apache.solr.cloud.ShardLeaderElectionContextBase.cancelElection(ElectionContext.java:143)
   [junit4]   2> 	at org.apache.solr.cloud.ShardLeaderElectionContext.cancelElection(ElectionContext.java:279)
   [junit4]   2> 	at org.apache.solr.cloud.ShardLeaderElectionContext.runLeaderProcess(ElectionContext.java:455)
   [junit4]   2> 	at org.apache.solr.cloud.LeaderElector.runIamLeaderProcess(LeaderElector.java:170)
   [junit4]   2> 	at org.apache.solr.cloud.LeaderElector.checkIfIamLeader(LeaderElector.java:135)
   [junit4]   2> 	at org.apache.solr.cloud.LeaderElector.access$200(LeaderElector.java:56)
   [junit4]   2> 	at org.apache.solr.cloud.LeaderElector$ElectionWatcher.process(LeaderElector.java:348)
   [junit4]   2> 	at org.apache.solr.common.cloud.SolrZkClient$3.lambda$process$0(SolrZkClient.java:266)
   [junit4]   2> 	at java.util.concurrent.Executors$RunnableAdapter.call(Executors.java:511)
   [junit4]   2> 	at java.util.concurrent.FutureTask.run(FutureTask.java:266)
   [junit4]   2> 	at org.apache.solr.common.util.ExecutorUtil$MDCAwareThreadPoolExecutor.lambda$execute$0(ExecutorUtil.java:229)
   [junit4]   2> 	at java.util.concurrent.ThreadPoolExecutor.runWorker(ThreadPoolExecutor.java:1142)
   [junit4]   2> 	at java.util.concurrent.ThreadPoolExecutor$Worker.run(ThreadPoolExecutor.java:617)
   [junit4]   2> 	at java.lang.Thread.run(Thread.java:745)
   [junit4]   2> 800202 INFO  (TEST-TestReqParamsAPI.test-seed#[74A81CCE89B35964]) [    ] o.e.j.s.ServerConnector Stopped ServerConnector@b93b787{HTTP/1.1,[http/1.1]}{127.0.0.1:0}
   [junit4]   2> 800202 INFO  (TEST-TestReqParamsAPI.test-seed#[74A81CCE89B35964]) [    ] o.e.j.s.h.ContextHandler Stopped o.e.j.s.ServletContextHandler@2c09f220{/,null,UNAVAILABLE}
   [junit4]   2> 800203 INFO  (TEST-TestReqParamsAPI.test-seed#[74A81CCE89B35964]) [    ] o.a.s.c.ZkTestServer connecting to 127.0.0.1:36346 36346
   [junit4]   2> 800512 INFO  (Thread-5029) [    ] o.a.s.c.ZkTestServer connecting to 127.0.0.1:36346 36346
   [junit4]   2> 800512 WARN  (Thread-5029) [    ] o.a.s.c.ZkTestServer Watch limit violations: 
   [junit4]   2> Maximum concurrent create/delete watches above limit:
   [junit4]   2> 
   [junit4]   2> 	25	/solr/configs/conf1
   [junit4]   2> 	6	/solr/aliases.json
   [junit4]   2> 	6	/solr/clusterprops.json
   [junit4]   2> 	5	/solr/security.json
   [junit4]   2> 	4	/solr/collections/collection1/state.json
   [junit4]   2> 
   [junit4]   2> Maximum concurrent data watches above limit:
   [junit4]   2> 
   [junit4]   2> 	6	/solr/clusterstate.json
   [junit4]   2> 
   [junit4]   2> Maximum concurrent children watches above limit:
   [junit4]   2> 
   [junit4]   2> 	6	/solr/live_nodes
   [junit4]   2> 	6	/solr/collections
   [junit4]   2> 	4	/solr/overseer/queue
   [junit4]   2> 	4	/solr/overseer/collection-queue-work
   [junit4]   2> 
   [junit4]   2> NOTE: reproduce with: ant test  -Dtestcase=TestReqParamsAPI -Dtests.method=test -Dtests.seed=74A81CCE89B35964 -Dtests.multiplier=2 -Dtests.slow=true -Dtests.locale=zh-CN -Dtests.timezone=Etc/GMT+4 -Dtests.asserts=true -Dtests.file.encoding=ISO-8859-1
   [junit4] FAILURE 28.9s J2 | TestReqParamsAPI.test <<<
   [junit4]    > Throwable #1: java.lang.AssertionError: Could not get expected value  'CY val' for path 'response/params/y/c' full output: {
   [junit4]    >   "responseHeader":{
   [junit4]    >     "status":0,
   [junit4]    >     "QTime":0},
   [junit4]    >   "response":{
   [junit4]    >     "znodeVersion":0,
   [junit4]    >     "params":{"x":{
   [junit4]    >         "a":"A val",
   [junit4]    >         "b":"B val",
   [junit4]    >         "":{"v":0}}}}},  from server:  http://127.0.0.1:41630/collection1
   [junit4]    > 	at __randomizedtesting.SeedInfo.seed([74A81CCE89B35964:FCFC2314274F349C]:0)
   [junit4]    > 	at org.apache.solr.core.TestSolrConfigHandler.testForResponseElement(TestSolrConfigHandler.java:457)
   [junit4]    > 	at org.apache.solr.handler.TestReqParamsAPI.testReqParams(TestReqParamsAPI.java:160)
   [junit4]    > 	at org.apache.solr.handler.TestReqParamsAPI.test(TestReqParamsAPI.java:62)
   [junit4]    > 	at org.apache.solr.BaseDistributedSearchTestCase$ShardsRepeatRule$ShardsFixedStatement.callStatement(BaseDistributedSearchTestCase.java:992)
   [junit4]    > 	at org.apache.solr.BaseDistributedSearchTestCase$ShardsRepeatRule$ShardsStatement.evaluate(BaseDistributedSearchTestCase.java:967)
   [junit4]    > 	at java.lang.Thread.run(Thread.java:745)
   [junit4]   2> 800515 INFO  (SUITE-TestReqParamsAPI-seed#[74A81CCE89B35964]-worker) [    ] o.a.s.SolrTestCaseJ4 ###deleteCore
   [junit4]   2> NOTE: leaving temporary files on disk at: /x1/jenkins/jenkins-slave/workspace/Lucene-Solr-Tests-6.x/solr/build/solr-core/test/J2/temp/solr.handler.TestReqParamsAPI_74A81CCE89B35964-001
   [junit4]   2> NOTE: test params are: codec=Asserting(Lucene60): {}, docValues:{}, maxPointsInLeafNode=1774, maxMBSortInHeap=6.315197091848368, sim=RandomSimilarity(queryNorm=false,coord=crazy): {}, locale=zh-CN, timezone=Etc/GMT+4
   [junit4]   2> NOTE: Linux 3.13.0-85-generic amd64/Oracle Corporation 1.8.0_74 (64-bit)/cpus=4,threads=1,free=86984440,total=531628032
   [junit4]   2> NOTE: All tests run in this JVM: [TestAddFieldRealTimeGet, TestHighFrequencyDictionaryFactory, TestFuzzyAnalyzedSuggestions, DirectSolrConnectionTest, TriLevelCompositeIdRoutingTest, StatsComponentTest, TestRecovery, TestSolrIndexConfig, HLLUtilTest, DateMathParserTest, ZkStateReaderTest, TestIndexingPerformance, DistributedExpandComponentTest, SearchHandlerTest, StatelessScriptUpdateProcessorFactoryTest, TestInfoStreamLogging, PluginInfoTest, SuggestComponentTest, SliceStateTest, TestCharFilters, CdcrRequestHandlerTest, BufferStoreTest, DocExpirationUpdateProcessorFactoryTest, TestMiniSolrCloudClusterSSL, QueryParsingTest, TestExtendedDismaxParser, TestSolrConfigHandlerCloud, CollectionsAPISolrJTest, TestRecoveryHdfs, TestMacros, LukeRequestHandlerTest, CollectionStateFormat2Test, DataDrivenBlockJoinTest, HdfsCollectionsAPIDistributedZkTest, CoreAdminRequestStatusTest, ClusterStateTest, PrimitiveFieldTypeTest, TestSuggestSpellingConverter, TestRebalanceLeaders, TestCloudInspectUtil, TestJmxIntegration, TestTolerantUpdateProcessorCloud, BigEndianAscendingWordDeserializerTest, TestConfigOverlay, TestBlendedInfixSuggestions, TestPHPSerializedResponseWriter, AssignTest, TestSchemaManager, FieldAnalysisRequestHandlerTest, TestSolrFieldCacheMBean, SimpleCollectionCreateDeleteTest, TestTolerantSearch, TestCloudManagedSchema, OverriddenZkACLAndCredentialsProvidersTest, BadComponentTest, DeleteInactiveReplicaTest, SolrCoreCheckLockOnStartupTest, LeaderElectionTest, TestRandomCollapseQParserPlugin, BasicDistributedZk2Test, TestSimpleQParserPlugin, DeleteShardTest, CleanupOldIndexTest, DistributedFacetPivotSmallAdvancedTest, TestCSVResponseWriter, TestSort, TestBlobHandler, ShowFileRequestHandlerTest, LeaderFailoverAfterPartitionTest, BaseCdcrDistributedZkTest, TestReversedWildcardFilterFactory, TestSolrJ, TestSearchPerf, TestFastWriter, ConnectionManagerTest, TestPKIAuthenticationPlugin, TestCoreDiscovery, AddBlockUpdateTest, TestSubQueryTransformer, DirectUpdateHandlerOptimizeTest, TestManagedStopFilterFactory, TestReqParamsAPI]
   [junit4] Completed [214/598 (1!)] on J2 in 28.92s, 1 test, 1 failure <<< FAILURES!

[...truncated 1227 lines...]
BUILD FAILED
/x1/jenkins/jenkins-slave/workspace/Lucene-Solr-Tests-6.x/build.xml:740: The following error occurred while executing this line:
/x1/jenkins/jenkins-slave/workspace/Lucene-Solr-Tests-6.x/build.xml:684: The following error occurred while executing this line:
/x1/jenkins/jenkins-slave/workspace/Lucene-Solr-Tests-6.x/build.xml:59: The following error occurred while executing this line:
/x1/jenkins/jenkins-slave/workspace/Lucene-Solr-Tests-6.x/solr/build.xml:233: The following error occurred while executing this line:
/x1/jenkins/jenkins-slave/workspace/Lucene-Solr-Tests-6.x/solr/common-build.xml:529: The following error occurred while executing this line:
/x1/jenkins/jenkins-slave/workspace/Lucene-Solr-Tests-6.x/lucene/common-build.xml:1427: The following error occurred while executing this line:
/x1/jenkins/jenkins-slave/workspace/Lucene-Solr-Tests-6.x/lucene/common-build.xml:984: There were test failures: 598 suites (10 ignored), 2435 tests, 1 failure, 86 ignored (71 assumptions) [seed: 74A81CCE89B35964]

Total time: 54 minutes 4 seconds
Build step 'Invoke Ant' marked build as failure
Archiving artifacts
Recording test results
Email was triggered for: Failure - Any
Sending email for trigger: Failure - Any




Mime
View raw message