lucene-dev mailing list archives

Site index · List index
Message view « Date » · « Thread »
Top « Date » · « Thread »
From Policeman Jenkins Server <jenk...@thetaphi.de>
Subject [JENKINS] Lucene-Solr-master-Solaris (64bit/jdk1.8.0) - Build # 615 - Still Failing!
Date Mon, 30 May 2016 13:22:36 GMT
Build: http://jenkins.thetaphi.de/job/Lucene-Solr-master-Solaris/615/
Java: 64bit/jdk1.8.0 -XX:-UseCompressedOops -XX:+UseG1GC

1 tests failed.
FAILED:  org.apache.solr.schema.TestManagedSchemaAPI.test

Error Message:
Error from server at http://127.0.0.1:53175/solr/testschemaapi_shard1_replica2: ERROR: [doc=2] unknown field 'myNewField1'

Stack Trace:
org.apache.solr.client.solrj.impl.CloudSolrClient$RouteException: Error from server at http://127.0.0.1:53175/solr/testschemaapi_shard1_replica2: ERROR: [doc=2] unknown field 'myNewField1'
	at __randomizedtesting.SeedInfo.seed([CE53042B9F3D0D9E:46073BF131C16066]:0)
	at org.apache.solr.client.solrj.impl.CloudSolrClient.directUpdate(CloudSolrClient.java:697)
	at org.apache.solr.client.solrj.impl.CloudSolrClient.sendRequest(CloudSolrClient.java:1109)
	at org.apache.solr.client.solrj.impl.CloudSolrClient.requestWithRetryOnStaleState(CloudSolrClient.java:998)
	at org.apache.solr.client.solrj.impl.CloudSolrClient.request(CloudSolrClient.java:934)
	at org.apache.solr.schema.TestManagedSchemaAPI.testAddFieldAndDocument(TestManagedSchemaAPI.java:86)
	at org.apache.solr.schema.TestManagedSchemaAPI.test(TestManagedSchemaAPI.java:55)
	at sun.reflect.NativeMethodAccessorImpl.invoke0(Native Method)
	at sun.reflect.NativeMethodAccessorImpl.invoke(NativeMethodAccessorImpl.java:62)
	at sun.reflect.DelegatingMethodAccessorImpl.invoke(DelegatingMethodAccessorImpl.java:43)
	at java.lang.reflect.Method.invoke(Method.java:498)
	at com.carrotsearch.randomizedtesting.RandomizedRunner.invoke(RandomizedRunner.java:1764)
	at com.carrotsearch.randomizedtesting.RandomizedRunner$8.evaluate(RandomizedRunner.java:871)
	at com.carrotsearch.randomizedtesting.RandomizedRunner$9.evaluate(RandomizedRunner.java:907)
	at com.carrotsearch.randomizedtesting.RandomizedRunner$10.evaluate(RandomizedRunner.java:921)
	at com.carrotsearch.randomizedtesting.rules.SystemPropertiesRestoreRule$1.evaluate(SystemPropertiesRestoreRule.java:57)
	at org.apache.lucene.util.TestRuleSetupTeardownChained$1.evaluate(TestRuleSetupTeardownChained.java:49)
	at org.apache.lucene.util.AbstractBeforeAfterRule$1.evaluate(AbstractBeforeAfterRule.java:45)
	at org.apache.lucene.util.TestRuleThreadAndTestName$1.evaluate(TestRuleThreadAndTestName.java:48)
	at org.apache.lucene.util.TestRuleIgnoreAfterMaxFailures$1.evaluate(TestRuleIgnoreAfterMaxFailures.java:64)
	at org.apache.lucene.util.TestRuleMarkFailure$1.evaluate(TestRuleMarkFailure.java:47)
	at com.carrotsearch.randomizedtesting.rules.StatementAdapter.evaluate(StatementAdapter.java:36)
	at com.carrotsearch.randomizedtesting.ThreadLeakControl$StatementRunner.run(ThreadLeakControl.java:367)
	at com.carrotsearch.randomizedtesting.ThreadLeakControl.forkTimeoutingTask(ThreadLeakControl.java:809)
	at com.carrotsearch.randomizedtesting.ThreadLeakControl$3.evaluate(ThreadLeakControl.java:460)
	at com.carrotsearch.randomizedtesting.RandomizedRunner.runSingleTest(RandomizedRunner.java:880)
	at com.carrotsearch.randomizedtesting.RandomizedRunner$5.evaluate(RandomizedRunner.java:781)
	at com.carrotsearch.randomizedtesting.RandomizedRunner$6.evaluate(RandomizedRunner.java:816)
	at com.carrotsearch.randomizedtesting.RandomizedRunner$7.evaluate(RandomizedRunner.java:827)
	at com.carrotsearch.randomizedtesting.rules.StatementAdapter.evaluate(StatementAdapter.java:36)
	at com.carrotsearch.randomizedtesting.rules.SystemPropertiesRestoreRule$1.evaluate(SystemPropertiesRestoreRule.java:57)
	at org.apache.lucene.util.AbstractBeforeAfterRule$1.evaluate(AbstractBeforeAfterRule.java:45)
	at com.carrotsearch.randomizedtesting.rules.StatementAdapter.evaluate(StatementAdapter.java:36)
	at org.apache.lucene.util.TestRuleStoreClassName$1.evaluate(TestRuleStoreClassName.java:41)
	at com.carrotsearch.randomizedtesting.rules.NoShadowingOrOverridesOnMethodsRule$1.evaluate(NoShadowingOrOverridesOnMethodsRule.java:40)
	at com.carrotsearch.randomizedtesting.rules.NoShadowingOrOverridesOnMethodsRule$1.evaluate(NoShadowingOrOverridesOnMethodsRule.java:40)
	at com.carrotsearch.randomizedtesting.rules.StatementAdapter.evaluate(StatementAdapter.java:36)
	at com.carrotsearch.randomizedtesting.rules.StatementAdapter.evaluate(StatementAdapter.java:36)
	at com.carrotsearch.randomizedtesting.rules.StatementAdapter.evaluate(StatementAdapter.java:36)
	at org.apache.lucene.util.TestRuleAssertionsRequired$1.evaluate(TestRuleAssertionsRequired.java:53)
	at org.apache.lucene.util.TestRuleMarkFailure$1.evaluate(TestRuleMarkFailure.java:47)
	at org.apache.lucene.util.TestRuleIgnoreAfterMaxFailures$1.evaluate(TestRuleIgnoreAfterMaxFailures.java:64)
	at org.apache.lucene.util.TestRuleIgnoreTestSuites$1.evaluate(TestRuleIgnoreTestSuites.java:54)
	at com.carrotsearch.randomizedtesting.rules.StatementAdapter.evaluate(StatementAdapter.java:36)
	at com.carrotsearch.randomizedtesting.ThreadLeakControl$StatementRunner.run(ThreadLeakControl.java:367)
	at java.lang.Thread.run(Thread.java:745)
Caused by: org.apache.solr.client.solrj.impl.HttpSolrClient$RemoteSolrException: Error from server at http://127.0.0.1:53175/solr/testschemaapi_shard1_replica2: ERROR: [doc=2] unknown field 'myNewField1'
	at org.apache.solr.client.solrj.impl.HttpSolrClient.executeMethod(HttpSolrClient.java:606)
	at org.apache.solr.client.solrj.impl.HttpSolrClient.request(HttpSolrClient.java:259)
	at org.apache.solr.client.solrj.impl.HttpSolrClient.request(HttpSolrClient.java:248)
	at org.apache.solr.client.solrj.impl.LBHttpSolrClient.doRequest(LBHttpSolrClient.java:413)
	at org.apache.solr.client.solrj.impl.LBHttpSolrClient.request(LBHttpSolrClient.java:366)
	at org.apache.solr.client.solrj.impl.CloudSolrClient.lambda$directUpdate$0(CloudSolrClient.java:674)
	at java.util.concurrent.FutureTask.run(FutureTask.java:266)
	at org.apache.solr.common.util.ExecutorUtil$MDCAwareThreadPoolExecutor.lambda$execute$0(ExecutorUtil.java:229)
	at java.util.concurrent.ThreadPoolExecutor.runWorker(ThreadPoolExecutor.java:1142)
	at java.util.concurrent.ThreadPoolExecutor$Worker.run(ThreadPoolExecutor.java:617)
	... 1 more




Build Log:
[...truncated 10704 lines...]
   [junit4] Suite: org.apache.solr.schema.TestManagedSchemaAPI
   [junit4]   2> Creating dataDir: /export/home/jenkins/workspace/Lucene-Solr-master-Solaris/solr/build/solr-core/test/J1/temp/solr.schema.TestManagedSchemaAPI_CE53042B9F3D0D9E-001/init-core-data-001
   [junit4]   2> 649844 INFO  (SUITE-TestManagedSchemaAPI-seed#[CE53042B9F3D0D9E]-worker) [    ] o.a.s.SolrTestCaseJ4 Randomized ssl (false) and clientAuth (true)
   [junit4]   2> 649851 INFO  (SUITE-TestManagedSchemaAPI-seed#[CE53042B9F3D0D9E]-worker) [    ] o.a.s.c.ZkTestServer STARTING ZK TEST SERVER
   [junit4]   2> 649851 INFO  (Thread-1172) [    ] o.a.s.c.ZkTestServer client port:0.0.0.0/0.0.0.0:0
   [junit4]   2> 649851 INFO  (Thread-1172) [    ] o.a.s.c.ZkTestServer Starting server
   [junit4]   2> 649951 INFO  (SUITE-TestManagedSchemaAPI-seed#[CE53042B9F3D0D9E]-worker) [    ] o.a.s.c.ZkTestServer start zk server on port:59874
   [junit4]   2> 649951 INFO  (SUITE-TestManagedSchemaAPI-seed#[CE53042B9F3D0D9E]-worker) [    ] o.a.s.c.c.SolrZkClient Using default ZkCredentialsProvider
   [junit4]   2> 649952 INFO  (SUITE-TestManagedSchemaAPI-seed#[CE53042B9F3D0D9E]-worker) [    ] o.a.s.c.c.ConnectionManager Waiting for client to connect to ZooKeeper
   [junit4]   2> 649956 INFO  (zkCallback-342-thread-1) [    ] o.a.s.c.c.ConnectionManager Watcher org.apache.solr.common.cloud.ConnectionManager@3b9e4457 name:ZooKeeperConnection Watcher:127.0.0.1:59874 got event WatchedEvent state:SyncConnected type:None path:null path:null type:None
   [junit4]   2> 649957 INFO  (SUITE-TestManagedSchemaAPI-seed#[CE53042B9F3D0D9E]-worker) [    ] o.a.s.c.c.ConnectionManager Client is connected to ZooKeeper
   [junit4]   2> 649957 INFO  (SUITE-TestManagedSchemaAPI-seed#[CE53042B9F3D0D9E]-worker) [    ] o.a.s.c.c.SolrZkClient Using default ZkACLProvider
   [junit4]   2> 649957 INFO  (SUITE-TestManagedSchemaAPI-seed#[CE53042B9F3D0D9E]-worker) [    ] o.a.s.c.c.SolrZkClient makePath: /solr/solr.xml
   [junit4]   2> 649965 INFO  (jetty-launcher-341-thread-2) [    ] o.e.j.s.Server jetty-9.3.8.v20160314
   [junit4]   2> 649965 INFO  (jetty-launcher-341-thread-1) [    ] o.e.j.s.Server jetty-9.3.8.v20160314
   [junit4]   2> 649967 INFO  (jetty-launcher-341-thread-2) [    ] o.e.j.s.h.ContextHandler Started o.e.j.s.ServletContextHandler@11921d79{/solr,null,AVAILABLE}
   [junit4]   2> 649971 INFO  (jetty-launcher-341-thread-1) [    ] o.e.j.s.h.ContextHandler Started o.e.j.s.ServletContextHandler@1a74b541{/solr,null,AVAILABLE}
   [junit4]   2> 649971 INFO  (jetty-launcher-341-thread-2) [    ] o.e.j.s.ServerConnector Started ServerConnector@3e5f3697{HTTP/1.1,[http/1.1]}{127.0.0.1:37822}
   [junit4]   2> 649971 INFO  (jetty-launcher-341-thread-2) [    ] o.e.j.s.Server Started @653599ms
   [junit4]   2> 649971 INFO  (jetty-launcher-341-thread-2) [    ] o.a.s.c.s.e.JettySolrRunner Jetty properties: {hostContext=/solr, hostPort=37822}
   [junit4]   2> 649971 INFO  (jetty-launcher-341-thread-1) [    ] o.e.j.s.ServerConnector Started ServerConnector@1540fb32{HTTP/1.1,[http/1.1]}{127.0.0.1:53175}
   [junit4]   2> 649971 INFO  (jetty-launcher-341-thread-1) [    ] o.e.j.s.Server Started @653599ms
   [junit4]   2> 649971 INFO  (jetty-launcher-341-thread-1) [    ] o.a.s.c.s.e.JettySolrRunner Jetty properties: {hostContext=/solr, hostPort=53175}
   [junit4]   2> 649972 INFO  (jetty-launcher-341-thread-1) [    ] o.a.s.s.SolrDispatchFilter SolrDispatchFilter.init(): sun.misc.Launcher$AppClassLoader@6d06d69c
   [junit4]   2> 649972 INFO  (jetty-launcher-341-thread-1) [    ] o.a.s.c.SolrResourceLoader new SolrResourceLoader for directory: '/export/home/jenkins/workspace/Lucene-Solr-master-Solaris/solr/build/solr-core/test/J1/temp/solr.schema.TestManagedSchemaAPI_CE53042B9F3D0D9E-001/tempDir-001/node1'
   [junit4]   2> 649973 INFO  (jetty-launcher-341-thread-2) [    ] o.a.s.s.SolrDispatchFilter SolrDispatchFilter.init(): sun.misc.Launcher$AppClassLoader@6d06d69c
   [junit4]   2> 649973 INFO  (jetty-launcher-341-thread-2) [    ] o.a.s.c.SolrResourceLoader new SolrResourceLoader for directory: '/export/home/jenkins/workspace/Lucene-Solr-master-Solaris/solr/build/solr-core/test/J1/temp/solr.schema.TestManagedSchemaAPI_CE53042B9F3D0D9E-001/tempDir-001/node2'
   [junit4]   2> 649974 INFO  (jetty-launcher-341-thread-2) [    ] o.a.s.c.SolrResourceLoader JNDI not configured for solr (NoInitialContextEx)
   [junit4]   2> 649974 INFO  (jetty-launcher-341-thread-2) [    ] o.a.s.c.SolrResourceLoader solr home defaulted to 'solr/' (could not find system property or JNDI)
   [junit4]   2> 649975 INFO  (jetty-launcher-341-thread-1) [    ] o.a.s.c.SolrResourceLoader JNDI not configured for solr (NoInitialContextEx)
   [junit4]   2> 649975 INFO  (jetty-launcher-341-thread-1) [    ] o.a.s.c.SolrResourceLoader solr home defaulted to 'solr/' (could not find system property or JNDI)
   [junit4]   2> 649975 INFO  (jetty-launcher-341-thread-1) [    ] o.a.s.c.c.SolrZkClient Using default ZkCredentialsProvider
   [junit4]   2> 649975 INFO  (jetty-launcher-341-thread-2) [    ] o.a.s.c.c.SolrZkClient Using default ZkCredentialsProvider
   [junit4]   2> 649976 INFO  (jetty-launcher-341-thread-2) [    ] o.a.s.c.c.ConnectionManager Waiting for client to connect to ZooKeeper
   [junit4]   2> 649979 INFO  (jetty-launcher-341-thread-1) [    ] o.a.s.c.c.ConnectionManager Waiting for client to connect to ZooKeeper
   [junit4]   2> 649982 INFO  (zkCallback-344-thread-1) [    ] o.a.s.c.c.ConnectionManager Watcher org.apache.solr.common.cloud.ConnectionManager@5761ba22 name:ZooKeeperConnection Watcher:127.0.0.1:59874/solr got event WatchedEvent state:SyncConnected type:None path:null path:null type:None
   [junit4]   2> 649982 INFO  (jetty-launcher-341-thread-2) [    ] o.a.s.c.c.ConnectionManager Client is connected to ZooKeeper
   [junit4]   2> 649982 INFO  (zkCallback-343-thread-1) [    ] o.a.s.c.c.ConnectionManager Watcher org.apache.solr.common.cloud.ConnectionManager@21cdc45c name:ZooKeeperConnection Watcher:127.0.0.1:59874/solr got event WatchedEvent state:SyncConnected type:None path:null path:null type:None
   [junit4]   2> 649982 INFO  (jetty-launcher-341-thread-2) [    ] o.a.s.c.c.SolrZkClient Using default ZkACLProvider
   [junit4]   2> 649982 INFO  (jetty-launcher-341-thread-1) [    ] o.a.s.c.c.ConnectionManager Client is connected to ZooKeeper
   [junit4]   2> 649982 INFO  (jetty-launcher-341-thread-1) [    ] o.a.s.c.c.SolrZkClient Using default ZkACLProvider
   [junit4]   2> 649983 INFO  (jetty-launcher-341-thread-2) [    ] o.a.s.s.SolrDispatchFilter solr.xml found in ZooKeeper. Loading...
   [junit4]   2> 649983 INFO  (jetty-launcher-341-thread-1) [    ] o.a.s.s.SolrDispatchFilter solr.xml found in ZooKeeper. Loading...
   [junit4]   2> 649993 WARN  (NIOServerCxn.Factory:0.0.0.0/0.0.0.0:0) [    ] o.a.z.s.NIOServerCnxn caught end of stream exception
   [junit4]   2> EndOfStreamException: Unable to read additional data from client sessionid 0x15501a2316b0002, likely client has closed socket
   [junit4]   2> 	at org.apache.zookeeper.server.NIOServerCnxn.doIO(NIOServerCnxn.java:228)
   [junit4]   2> 	at org.apache.zookeeper.server.NIOServerCnxnFactory.run(NIOServerCnxnFactory.java:208)
   [junit4]   2> 	at java.lang.Thread.run(Thread.java:745)
   [junit4]   2> 649994 INFO  (jetty-launcher-341-thread-1) [    ] o.a.s.c.CorePropertiesLocator Config-defined core root directory: /export/home/jenkins/workspace/Lucene-Solr-master-Solaris/solr/build/solr-core/test/J1/temp/solr.schema.TestManagedSchemaAPI_CE53042B9F3D0D9E-001/tempDir-001/node1/.
   [junit4]   2> 649994 INFO  (jetty-launcher-341-thread-1) [    ] o.a.s.c.CoreContainer New CoreContainer 1994355579
   [junit4]   2> 649994 INFO  (jetty-launcher-341-thread-1) [    ] o.a.s.c.CoreContainer Loading cores into CoreContainer [instanceDir=/export/home/jenkins/workspace/Lucene-Solr-master-Solaris/solr/build/solr-core/test/J1/temp/solr.schema.TestManagedSchemaAPI_CE53042B9F3D0D9E-001/tempDir-001/node1]
   [junit4]   2> 649994 WARN  (NIOServerCxn.Factory:0.0.0.0/0.0.0.0:0) [    ] o.a.z.s.NIOServerCnxn caught end of stream exception
   [junit4]   2> EndOfStreamException: Unable to read additional data from client sessionid 0x15501a2316b0001, likely client has closed socket
   [junit4]   2> 	at org.apache.zookeeper.server.NIOServerCnxn.doIO(NIOServerCnxn.java:228)
   [junit4]   2> 	at org.apache.zookeeper.server.NIOServerCnxnFactory.run(NIOServerCnxnFactory.java:208)
   [junit4]   2> 	at java.lang.Thread.run(Thread.java:745)
   [junit4]   2> 649994 WARN  (jetty-launcher-341-thread-1) [    ] o.a.s.c.CoreContainer Couldn't add files from /export/home/jenkins/workspace/Lucene-Solr-master-Solaris/solr/build/solr-core/test/J1/temp/solr.schema.TestManagedSchemaAPI_CE53042B9F3D0D9E-001/tempDir-001/node1/lib to classpath: /export/home/jenkins/workspace/Lucene-Solr-master-Solaris/solr/build/solr-core/test/J1/temp/solr.schema.TestManagedSchemaAPI_CE53042B9F3D0D9E-001/tempDir-001/node1/lib
   [junit4]   2> 649994 INFO  (jetty-launcher-341-thread-2) [    ] o.a.s.c.CorePropertiesLocator Config-defined core root directory: /export/home/jenkins/workspace/Lucene-Solr-master-Solaris/solr/build/solr-core/test/J1/temp/solr.schema.TestManagedSchemaAPI_CE53042B9F3D0D9E-001/tempDir-001/node2/.
   [junit4]   2> 649994 INFO  (jetty-launcher-341-thread-1) [    ] o.a.s.h.c.HttpShardHandlerFactory created with socketTimeout : 90000,urlScheme : ,connTimeout : 15000,maxConnectionsPerHost : 20,maxConnections : 10000,corePoolSize : 0,maximumPoolSize : 2147483647,maxThreadIdleTime : 5,sizeOfQueue : -1,fairnessPolicy : false,
   [junit4]   2> 649994 INFO  (jetty-launcher-341-thread-2) [    ] o.a.s.c.CoreContainer New CoreContainer 447079140
   [junit4]   2> 649994 INFO  (jetty-launcher-341-thread-2) [    ] o.a.s.c.CoreContainer Loading cores into CoreContainer [instanceDir=/export/home/jenkins/workspace/Lucene-Solr-master-Solaris/solr/build/solr-core/test/J1/temp/solr.schema.TestManagedSchemaAPI_CE53042B9F3D0D9E-001/tempDir-001/node2]
   [junit4]   2> 649994 WARN  (jetty-launcher-341-thread-2) [    ] o.a.s.c.CoreContainer Couldn't add files from /export/home/jenkins/workspace/Lucene-Solr-master-Solaris/solr/build/solr-core/test/J1/temp/solr.schema.TestManagedSchemaAPI_CE53042B9F3D0D9E-001/tempDir-001/node2/lib to classpath: /export/home/jenkins/workspace/Lucene-Solr-master-Solaris/solr/build/solr-core/test/J1/temp/solr.schema.TestManagedSchemaAPI_CE53042B9F3D0D9E-001/tempDir-001/node2/lib
   [junit4]   2> 649994 INFO  (jetty-launcher-341-thread-2) [    ] o.a.s.h.c.HttpShardHandlerFactory created with socketTimeout : 90000,urlScheme : ,connTimeout : 15000,maxConnectionsPerHost : 20,maxConnections : 10000,corePoolSize : 0,maximumPoolSize : 2147483647,maxThreadIdleTime : 5,sizeOfQueue : -1,fairnessPolicy : false,
   [junit4]   2> 649996 INFO  (jetty-launcher-341-thread-1) [    ] o.a.s.u.UpdateShardHandler Creating UpdateShardHandler HTTP client with params: 
   [junit4]   2> 649996 INFO  (jetty-launcher-341-thread-2) [    ] o.a.s.u.UpdateShardHandler Creating UpdateShardHandler HTTP client with params: 
   [junit4]   2> 649997 INFO  (jetty-launcher-341-thread-1) [    ] o.a.s.l.LogWatcher SLF4J impl is org.slf4j.impl.Log4jLoggerFactory
   [junit4]   2> 649997 INFO  (jetty-launcher-341-thread-1) [    ] o.a.s.l.LogWatcher Registering Log Listener [Log4j (org.slf4j.impl.Log4jLoggerFactory)]
   [junit4]   2> 649997 INFO  (jetty-launcher-341-thread-1) [    ] o.a.s.c.ZkContainer Zookeeper client=127.0.0.1:59874/solr
   [junit4]   2> 649997 INFO  (jetty-launcher-341-thread-1) [    ] o.a.s.c.ZkController zkHost includes chroot
   [junit4]   2> 649997 INFO  (jetty-launcher-341-thread-1) [    ] o.a.s.c.c.SolrZkClient Using default ZkCredentialsProvider
   [junit4]   2> 649997 INFO  (jetty-launcher-341-thread-2) [    ] o.a.s.l.LogWatcher SLF4J impl is org.slf4j.impl.Log4jLoggerFactory
   [junit4]   2> 649998 INFO  (jetty-launcher-341-thread-2) [    ] o.a.s.l.LogWatcher Registering Log Listener [Log4j (org.slf4j.impl.Log4jLoggerFactory)]
   [junit4]   2> 649999 INFO  (jetty-launcher-341-thread-2) [    ] o.a.s.c.ZkContainer Zookeeper client=127.0.0.1:59874/solr
   [junit4]   2> 649999 INFO  (jetty-launcher-341-thread-2) [    ] o.a.s.c.ZkController zkHost includes chroot
   [junit4]   2> 649999 INFO  (jetty-launcher-341-thread-2) [    ] o.a.s.c.c.SolrZkClient Using default ZkCredentialsProvider
   [junit4]   2> 649998 INFO  (jetty-launcher-341-thread-1) [    ] o.a.s.c.c.ConnectionManager Waiting for client to connect to ZooKeeper
   [junit4]   2> 650001 INFO  (jetty-launcher-341-thread-2) [    ] o.a.s.c.c.ConnectionManager Waiting for client to connect to ZooKeeper
   [junit4]   2> 650004 INFO  (zkCallback-349-thread-1) [    ] o.a.s.c.c.ConnectionManager Watcher org.apache.solr.common.cloud.ConnectionManager@384c0393 name:ZooKeeperConnection Watcher:127.0.0.1:59874 got event WatchedEvent state:SyncConnected type:None path:null path:null type:None
   [junit4]   2> 650004 INFO  (zkCallback-350-thread-1) [    ] o.a.s.c.c.ConnectionManager Watcher org.apache.solr.common.cloud.ConnectionManager@74049525 name:ZooKeeperConnection Watcher:127.0.0.1:59874 got event WatchedEvent state:SyncConnected type:None path:null path:null type:None
   [junit4]   2> 650004 INFO  (jetty-launcher-341-thread-1) [    ] o.a.s.c.c.ConnectionManager Client is connected to ZooKeeper
   [junit4]   2> 650004 INFO  (jetty-launcher-341-thread-2) [    ] o.a.s.c.c.ConnectionManager Client is connected to ZooKeeper
   [junit4]   2> 650004 INFO  (jetty-launcher-341-thread-1) [    ] o.a.s.c.c.SolrZkClient Using default ZkACLProvider
   [junit4]   2> 650004 INFO  (jetty-launcher-341-thread-2) [    ] o.a.s.c.c.SolrZkClient Using default ZkACLProvider
   [junit4]   2> 650006 INFO  (jetty-launcher-341-thread-1) [n:127.0.0.1:53175_solr    ] o.a.s.c.ZkController Added new OnReconnect listener org.apache.solr.cloud.ZkController$$Lambda$39/697305550@77263700
   [junit4]   2> 650007 INFO  (jetty-launcher-341-thread-1) [n:127.0.0.1:53175_solr    ] o.a.s.c.c.ConnectionManager Waiting for client to connect to ZooKeeper
   [junit4]   2> 650008 INFO  (jetty-launcher-341-thread-2) [n:127.0.0.1:37822_solr    ] o.a.s.c.ZkController Added new OnReconnect listener org.apache.solr.cloud.ZkController$$Lambda$39/697305550@3d60431d
   [junit4]   2> 650009 INFO  (jetty-launcher-341-thread-2) [n:127.0.0.1:37822_solr    ] o.a.s.c.c.ConnectionManager Waiting for client to connect to ZooKeeper
   [junit4]   2> 650010 INFO  (zkCallback-351-thread-1-processing-n:127.0.0.1:53175_solr) [n:127.0.0.1:53175_solr    ] o.a.s.c.c.ConnectionManager Watcher org.apache.solr.common.cloud.ConnectionManager@51c00dcc name:ZooKeeperConnection Watcher:127.0.0.1:59874/solr got event WatchedEvent state:SyncConnected type:None path:null path:null type:None
   [junit4]   2> 650010 INFO  (jetty-launcher-341-thread-1) [n:127.0.0.1:53175_solr    ] o.a.s.c.c.ConnectionManager Client is connected to ZooKeeper
   [junit4]   2> 650011 INFO  (zkCallback-352-thread-1-processing-n:127.0.0.1:37822_solr) [n:127.0.0.1:37822_solr    ] o.a.s.c.c.ConnectionManager Watcher org.apache.solr.common.cloud.ConnectionManager@2024a38e name:ZooKeeperConnection Watcher:127.0.0.1:59874/solr got event WatchedEvent state:SyncConnected type:None path:null path:null type:None
   [junit4]   2> 650011 INFO  (jetty-launcher-341-thread-2) [n:127.0.0.1:37822_solr    ] o.a.s.c.c.ConnectionManager Client is connected to ZooKeeper
   [junit4]   2> 650012 INFO  (jetty-launcher-341-thread-1) [n:127.0.0.1:53175_solr    ] o.a.s.c.c.SolrZkClient makePath: /overseer/queue
   [junit4]   2> 650013 INFO  (jetty-launcher-341-thread-2) [n:127.0.0.1:37822_solr    ] o.a.s.c.c.SolrZkClient makePath: /overseer/queue
   [junit4]   2> 650016 INFO  (jetty-launcher-341-thread-2) [n:127.0.0.1:37822_solr    ] o.a.s.c.c.SolrZkClient makePath: /overseer/collection-queue-work
   [junit4]   2> 650016 INFO  (jetty-launcher-341-thread-1) [n:127.0.0.1:53175_solr    ] o.a.s.c.c.SolrZkClient makePath: /overseer/collection-queue-work
   [junit4]   2> 650020 INFO  (jetty-launcher-341-thread-1) [n:127.0.0.1:53175_solr    ] o.a.s.c.c.SolrZkClient makePath: /overseer/collection-map-running
   [junit4]   2> 650020 INFO  (jetty-launcher-341-thread-2) [n:127.0.0.1:37822_solr    ] o.a.s.c.c.SolrZkClient makePath: /overseer/collection-map-running
   [junit4]   2> 650024 INFO  (jetty-launcher-341-thread-2) [n:127.0.0.1:37822_solr    ] o.a.s.c.c.SolrZkClient makePath: /overseer/collection-map-completed
   [junit4]   2> 650029 INFO  (jetty-launcher-341-thread-2) [n:127.0.0.1:37822_solr    ] o.a.s.c.c.SolrZkClient makePath: /overseer/collection-map-failure
   [junit4]   2> 650029 INFO  (jetty-launcher-341-thread-1) [n:127.0.0.1:53175_solr    ] o.a.s.c.c.SolrZkClient makePath: /overseer/collection-map-failure
   [junit4]   2> 650031 INFO  (jetty-launcher-341-thread-1) [n:127.0.0.1:53175_solr    ] o.a.s.c.c.SolrZkClient makePath: /live_nodes
   [junit4]   2> 650031 INFO  (jetty-launcher-341-thread-2) [n:127.0.0.1:37822_solr    ] o.a.s.c.c.SolrZkClient makePath: /live_nodes
   [junit4]   2> 650033 INFO  (jetty-launcher-341-thread-2) [n:127.0.0.1:37822_solr    ] o.a.s.c.c.SolrZkClient makePath: /collections
   [junit4]   2> 650033 INFO  (jetty-launcher-341-thread-1) [n:127.0.0.1:53175_solr    ] o.a.s.c.c.SolrZkClient makePath: /collections
   [junit4]   2> 650034 INFO  (jetty-launcher-341-thread-1) [n:127.0.0.1:53175_solr    ] o.a.s.c.c.SolrZkClient makePath: /aliases.json
   [junit4]   2> 650035 INFO  (jetty-launcher-341-thread-2) [n:127.0.0.1:37822_solr    ] o.a.s.c.c.SolrZkClient makePath: /aliases.json
   [junit4]   2> 650037 INFO  (jetty-launcher-341-thread-2) [n:127.0.0.1:37822_solr    ] o.a.s.c.c.SolrZkClient makePath: /clusterstate.json
   [junit4]   2> 650037 INFO  (jetty-launcher-341-thread-1) [n:127.0.0.1:53175_solr    ] o.a.s.c.c.SolrZkClient makePath: /clusterstate.json
   [junit4]   2> 650038 INFO  (jetty-launcher-341-thread-2) [n:127.0.0.1:37822_solr    ] o.a.s.c.c.SolrZkClient makePath: /security.json
   [junit4]   2> 650039 INFO  (jetty-launcher-341-thread-1) [n:127.0.0.1:53175_solr    ] o.a.s.c.c.SolrZkClient makePath: /security.json
   [junit4]   2> 650040 INFO  (jetty-launcher-341-thread-2) [n:127.0.0.1:37822_solr    ] o.a.s.c.c.ZkStateReader Updating cluster state from ZooKeeper... 
   [junit4]   2> 650040 INFO  (jetty-launcher-341-thread-1) [n:127.0.0.1:53175_solr    ] o.a.s.c.c.ZkStateReader Updating cluster state from ZooKeeper... 
   [junit4]   2> 650041 INFO  (jetty-launcher-341-thread-1) [n:127.0.0.1:53175_solr    ] o.a.s.c.c.ZkStateReader Loaded empty cluster properties
   [junit4]   2> 650041 INFO  (jetty-launcher-341-thread-2) [n:127.0.0.1:37822_solr    ] o.a.s.c.c.ZkStateReader Loaded empty cluster properties
   [junit4]   2> 650042 INFO  (jetty-launcher-341-thread-1) [n:127.0.0.1:53175_solr    ] o.a.s.c.c.ZkStateReader Updated live nodes from ZooKeeper... (0) -> (0)
   [junit4]   2> 650042 INFO  (jetty-launcher-341-thread-2) [n:127.0.0.1:37822_solr    ] o.a.s.c.c.ZkStateReader Updated live nodes from ZooKeeper... (0) -> (0)
   [junit4]   2> 650045 INFO  (jetty-launcher-341-thread-1) [n:127.0.0.1:53175_solr    ] o.a.s.c.c.SolrZkClient makePath: /overseer_elect
   [junit4]   2> 650047 INFO  (jetty-launcher-341-thread-2) [n:127.0.0.1:37822_solr    ] o.a.s.c.c.SolrZkClient makePath: /overseer_elect/election
   [junit4]   2> 650047 INFO  (jetty-launcher-341-thread-1) [n:127.0.0.1:53175_solr    ] o.a.s.c.c.SolrZkClient makePath: /overseer_elect/election
   [junit4]   2> 650049 INFO  (jetty-launcher-341-thread-2) [n:127.0.0.1:37822_solr    ] o.a.s.c.Overseer Overseer (id=null) closing
   [junit4]   2> 650049 INFO  (jetty-launcher-341-thread-1) [n:127.0.0.1:53175_solr    ] o.a.s.c.Overseer Overseer (id=null) closing
   [junit4]   2> 650049 INFO  (jetty-launcher-341-thread-2) [n:127.0.0.1:37822_solr    ] o.a.s.c.LeaderElector Joined leadership election with path: /overseer_elect/election/95984763183759366-127.0.0.1:37822_solr-n_0000000000
   [junit4]   2> 650050 INFO  (jetty-launcher-341-thread-1) [n:127.0.0.1:53175_solr    ] o.a.s.c.LeaderElector Joined leadership election with path: /overseer_elect/election/95984763183759365-127.0.0.1:53175_solr-n_0000000001
   [junit4]   2> 650050 INFO  (jetty-launcher-341-thread-2) [n:127.0.0.1:37822_solr    ] o.a.s.c.OverseerElectionContext I am going to be the leader 127.0.0.1:37822_solr
   [junit4]   2> 650050 INFO  (jetty-launcher-341-thread-2) [n:127.0.0.1:37822_solr    ] o.a.s.c.c.SolrZkClient makePath: /overseer_elect/leader
   [junit4]   2> 650050 INFO  (jetty-launcher-341-thread-1) [n:127.0.0.1:53175_solr    ] o.a.s.c.LeaderElector Watching path /overseer_elect/election/95984763183759366-127.0.0.1:37822_solr-n_0000000000 to know if I could be the leader
   [junit4]   2> 650051 INFO  (jetty-launcher-341-thread-1) [n:127.0.0.1:53175_solr    ] o.a.s.c.ZkController Register node as live in ZooKeeper:/live_nodes/127.0.0.1:53175_solr
   [junit4]   2> 650052 INFO  (jetty-launcher-341-thread-1) [n:127.0.0.1:53175_solr    ] o.a.s.c.c.SolrZkClient makePath: /live_nodes/127.0.0.1:53175_solr
   [junit4]   2> 650052 INFO  (jetty-launcher-341-thread-2) [n:127.0.0.1:37822_solr    ] o.a.s.c.Overseer Overseer (id=95984763183759366-127.0.0.1:37822_solr-n_0000000000) starting
   [junit4]   2> 650054 INFO  (zkCallback-351-thread-1-processing-n:127.0.0.1:53175_solr) [n:127.0.0.1:53175_solr    ] o.a.s.c.c.ZkStateReader A live node change: [WatchedEvent state:SyncConnected type:NodeChildrenChanged path:/live_nodes], has occurred - updating... (live nodes size: [0])
   [junit4]   2> 650056 INFO  (zkCallback-352-thread-1-processing-n:127.0.0.1:37822_solr) [n:127.0.0.1:37822_solr    ] o.a.s.c.c.ZkStateReader A live node change: [WatchedEvent state:SyncConnected type:NodeChildrenChanged path:/live_nodes], has occurred - updating... (live nodes size: [0])
   [junit4]   2> 650056 INFO  (zkCallback-351-thread-1-processing-n:127.0.0.1:53175_solr) [n:127.0.0.1:53175_solr    ] o.a.s.c.c.ZkStateReader Updated live nodes from ZooKeeper... (0) -> (1)
   [junit4]   2> 650056 INFO  (jetty-launcher-341-thread-2) [n:127.0.0.1:37822_solr    ] o.a.s.c.c.SolrZkClient makePath: /overseer/queue-work
   [junit4]   2> 650058 INFO  (zkCallback-352-thread-1-processing-n:127.0.0.1:37822_solr) [n:127.0.0.1:37822_solr    ] o.a.s.c.c.ZkStateReader Updated live nodes from ZooKeeper... (0) -> (1)
   [junit4]   2> 650067 INFO  (jetty-launcher-341-thread-2) [n:127.0.0.1:37822_solr    ] o.a.s.c.OverseerAutoReplicaFailoverThread Starting OverseerAutoReplicaFailoverThread autoReplicaFailoverWorkLoopDelay=10000 autoReplicaFailoverWaitAfterExpiration=30000 autoReplicaFailoverBadNodeExpiration=60000
   [junit4]   2> 650068 INFO  (OverseerCollectionConfigSetProcessor-95984763183759366-127.0.0.1:37822_solr-n_0000000000) [n:127.0.0.1:37822_solr    ] o.a.s.c.OverseerTaskProcessor Process current queue of overseer operations
   [junit4]   2> 650068 INFO  (OverseerStateUpdate-95984763183759366-127.0.0.1:37822_solr-n_0000000000) [n:127.0.0.1:37822_solr    ] o.a.s.c.Overseer Starting to work on the main queue
   [junit4]   2> 650069 INFO  (jetty-launcher-341-thread-2) [n:127.0.0.1:37822_solr    ] o.a.s.c.ZkController Publish node=127.0.0.1:37822_solr as DOWN
   [junit4]   2> 650071 INFO  (OverseerStateUpdate-95984763183759366-127.0.0.1:37822_solr-n_0000000000) [n:127.0.0.1:37822_solr    ] o.a.s.c.c.ZkStateReader Updated live nodes from ZooKeeper... (1) -> (1)
   [junit4]   2> 650073 INFO  (OverseerStateUpdate-95984763183759366-127.0.0.1:37822_solr-n_0000000000) [n:127.0.0.1:37822_solr    ] o.a.s.c.Overseer processMessage: queueSize: 1, message = {
   [junit4]   2>   "operation":"downnode",
   [junit4]   2>   "node_name":"127.0.0.1:37822_solr"} current state version: 0
   [junit4]   2> 650073 INFO  (OverseerStateUpdate-95984763183759366-127.0.0.1:37822_solr-n_0000000000) [n:127.0.0.1:37822_solr    ] o.a.s.c.o.NodeMutator DownNode state invoked for node: 127.0.0.1:37822_solr
   [junit4]   2> 650101 INFO  (jetty-launcher-341-thread-1) [n:127.0.0.1:53175_solr    ] o.a.s.c.CoreContainer Security conf doesn't exist. Skipping setup for authorization module.
   [junit4]   2> 650101 INFO  (jetty-launcher-341-thread-1) [n:127.0.0.1:53175_solr    ] o.a.s.c.CoreContainer No authentication plugin used.
   [junit4]   2> 650102 INFO  (jetty-launcher-341-thread-1) [n:127.0.0.1:53175_solr    ] o.a.s.c.CorePropertiesLocator Looking for core definitions underneath /export/home/jenkins/workspace/Lucene-Solr-master-Solaris/solr/build/solr-core/test/J1/temp/solr.schema.TestManagedSchemaAPI_CE53042B9F3D0D9E-001/tempDir-001/node1/.
   [junit4]   2> 650102 INFO  (jetty-launcher-341-thread-1) [n:127.0.0.1:53175_solr    ] o.a.s.c.CorePropertiesLocator Found 0 core definitions
   [junit4]   2> 650103 INFO  (jetty-launcher-341-thread-1) [n:127.0.0.1:53175_solr    ] o.a.s.s.SolrDispatchFilter user.dir=/export/home/jenkins/workspace/Lucene-Solr-master-Solaris/solr/build/solr-core/test/J1
   [junit4]   2> 650103 INFO  (jetty-launcher-341-thread-1) [n:127.0.0.1:53175_solr    ] o.a.s.s.SolrDispatchFilter SolrDispatchFilter.init() done
   [junit4]   2> 651072 INFO  (jetty-launcher-341-thread-2) [n:127.0.0.1:37822_solr    ] o.a.s.c.ZkController Register node as live in ZooKeeper:/live_nodes/127.0.0.1:37822_solr
   [junit4]   2> 651073 INFO  (jetty-launcher-341-thread-2) [n:127.0.0.1:37822_solr    ] o.a.s.c.c.SolrZkClient makePath: /live_nodes/127.0.0.1:37822_solr
   [junit4]   2> 651075 INFO  (zkCallback-351-thread-1-processing-n:127.0.0.1:53175_solr) [n:127.0.0.1:53175_solr    ] o.a.s.c.c.ZkStateReader A live node change: [WatchedEvent state:SyncConnected type:NodeChildrenChanged path:/live_nodes], has occurred - updating... (live nodes size: [1])
   [junit4]   2> 651075 INFO  (zkCallback-352-thread-1-processing-n:127.0.0.1:37822_solr) [n:127.0.0.1:37822_solr    ] o.a.s.c.c.ZkStateReader A live node change: [WatchedEvent state:SyncConnected type:NodeChildrenChanged path:/live_nodes], has occurred - updating... (live nodes size: [1])
   [junit4]   2> 651075 INFO  (zkCallback-352-thread-1-processing-n:127.0.0.1:37822_solr) [n:127.0.0.1:37822_solr    ] o.a.s.c.c.ZkStateReader Updated live nodes from ZooKeeper... (1) -> (2)
   [junit4]   2> 651075 INFO  (zkCallback-351-thread-1-processing-n:127.0.0.1:53175_solr) [n:127.0.0.1:53175_solr    ] o.a.s.c.c.ZkStateReader Updated live nodes from ZooKeeper... (1) -> (2)
   [junit4]   2> 651110 INFO  (jetty-launcher-341-thread-2) [n:127.0.0.1:37822_solr    ] o.a.s.c.CoreContainer Security conf doesn't exist. Skipping setup for authorization module.
   [junit4]   2> 651110 INFO  (jetty-launcher-341-thread-2) [n:127.0.0.1:37822_solr    ] o.a.s.c.CoreContainer No authentication plugin used.
   [junit4]   2> 651111 INFO  (jetty-launcher-341-thread-2) [n:127.0.0.1:37822_solr    ] o.a.s.c.CorePropertiesLocator Looking for core definitions underneath /export/home/jenkins/workspace/Lucene-Solr-master-Solaris/solr/build/solr-core/test/J1/temp/solr.schema.TestManagedSchemaAPI_CE53042B9F3D0D9E-001/tempDir-001/node2/.
   [junit4]   2> 651111 INFO  (jetty-launcher-341-thread-2) [n:127.0.0.1:37822_solr    ] o.a.s.c.CorePropertiesLocator Found 0 core definitions
   [junit4]   2> 651112 INFO  (jetty-launcher-341-thread-2) [n:127.0.0.1:37822_solr    ] o.a.s.s.SolrDispatchFilter user.dir=/export/home/jenkins/workspace/Lucene-Solr-master-Solaris/solr/build/solr-core/test/J1
   [junit4]   2> 651112 INFO  (jetty-launcher-341-thread-2) [n:127.0.0.1:37822_solr    ] o.a.s.s.SolrDispatchFilter SolrDispatchFilter.init() done
   [junit4]   2> 651113 INFO  (SUITE-TestManagedSchemaAPI-seed#[CE53042B9F3D0D9E]-worker) [    ] o.a.s.c.c.SolrZkClient Using default ZkCredentialsProvider
   [junit4]   2> 651113 INFO  (SUITE-TestManagedSchemaAPI-seed#[CE53042B9F3D0D9E]-worker) [    ] o.a.s.c.c.ConnectionManager Waiting for client to connect to ZooKeeper
   [junit4]   2> 651117 INFO  (zkCallback-355-thread-1) [    ] o.a.s.c.c.ConnectionManager Watcher org.apache.solr.common.cloud.ConnectionManager@41e8a8ac name:ZooKeeperConnection Watcher:127.0.0.1:59874 got event WatchedEvent state:SyncConnected type:None path:null path:null type:None
   [junit4]   2> 651117 INFO  (SUITE-TestManagedSchemaAPI-seed#[CE53042B9F3D0D9E]-worker) [    ] o.a.s.c.c.ConnectionManager Client is connected to ZooKeeper
   [junit4]   2> 651117 INFO  (SUITE-TestManagedSchemaAPI-seed#[CE53042B9F3D0D9E]-worker) [    ] o.a.s.c.c.SolrZkClient Using default ZkACLProvider
   [junit4]   2> 651119 INFO  (SUITE-TestManagedSchemaAPI-seed#[CE53042B9F3D0D9E]-worker) [    ] o.a.s.c.s.i.CloudSolrClient Final constructed zkHost string: 127.0.0.1:59874/solr
   [junit4]   2> 651121 INFO  (SUITE-TestManagedSchemaAPI-seed#[CE53042B9F3D0D9E]-worker) [    ] o.a.s.c.c.SolrZkClient Using default ZkCredentialsProvider
   [junit4]   2> 651122 INFO  (SUITE-TestManagedSchemaAPI-seed#[CE53042B9F3D0D9E]-worker) [    ] o.a.s.c.c.ConnectionManager Waiting for client to connect to ZooKeeper
   [junit4]   2> 651125 INFO  (zkCallback-358-thread-1) [    ] o.a.s.c.c.ConnectionManager Watcher org.apache.solr.common.cloud.ConnectionManager@65c107af name:ZooKeeperConnection Watcher:127.0.0.1:59874/solr got event WatchedEvent state:SyncConnected type:None path:null path:null type:None
   [junit4]   2> 651125 INFO  (SUITE-TestManagedSchemaAPI-seed#[CE53042B9F3D0D9E]-worker) [    ] o.a.s.c.c.ConnectionManager Client is connected to ZooKeeper
   [junit4]   2> 651125 INFO  (SUITE-TestManagedSchemaAPI-seed#[CE53042B9F3D0D9E]-worker) [    ] o.a.s.c.c.SolrZkClient Using default ZkACLProvider
   [junit4]   2> 651125 INFO  (SUITE-TestManagedSchemaAPI-seed#[CE53042B9F3D0D9E]-worker) [    ] o.a.s.c.c.ZkStateReader Updating cluster state from ZooKeeper... 
   [junit4]   2> 651126 INFO  (SUITE-TestManagedSchemaAPI-seed#[CE53042B9F3D0D9E]-worker) [    ] o.a.s.c.c.ZkStateReader Loaded empty cluster properties
   [junit4]   2> 651127 INFO  (SUITE-TestManagedSchemaAPI-seed#[CE53042B9F3D0D9E]-worker) [    ] o.a.s.c.c.ZkStateReader Updated live nodes from ZooKeeper... (0) -> (2)
   [junit4]   2> 651152 INFO  (SUITE-TestManagedSchemaAPI-seed#[CE53042B9F3D0D9E]-worker) [    ] o.a.s.c.c.SolrZkClient makePath: /configs/conf1/managed-schema
   [junit4]   2> 651156 INFO  (SUITE-TestManagedSchemaAPI-seed#[CE53042B9F3D0D9E]-worker) [    ] o.a.s.c.c.SolrZkClient makePath: /configs/conf1/solrconfig.xml
   [junit4]   2> 651204 INFO  (TEST-TestManagedSchemaAPI.test-seed#[CE53042B9F3D0D9E]) [    ] o.a.s.SolrTestCaseJ4 ###Starting test
   [junit4]   2> 651210 INFO  (qtp70421955-3203) [n:127.0.0.1:53175_solr    ] o.a.s.h.a.CollectionsHandler Invoked Collection Action :create with params replicationFactor=2&collection.configName=conf1&name=testschemaapi&action=CREATE&numShards=1&wt=javabin&version=2 and sendToOCPQueue=true
   [junit4]   2> 651215 INFO  (OverseerCollectionConfigSetProcessor-95984763183759366-127.0.0.1:37822_solr-n_0000000000) [n:127.0.0.1:37822_solr    ] o.a.s.c.OverseerTaskProcessor Overseer Collection Message Handler: Get the message id:/overseer/collection-queue-work/qn-0000000000 message:{
   [junit4]   2>   "name":"testschemaapi",
   [junit4]   2>   "fromApi":"true",
   [junit4]   2>   "replicationFactor":"2",
   [junit4]   2>   "collection.configName":"conf1",
   [junit4]   2>   "numShards":"1",
   [junit4]   2>   "stateFormat":"2",
   [junit4]   2>   "operation":"create"}
   [junit4]   2> 651216 INFO  (OverseerThreadFactory-1251-thread-1-processing-n:127.0.0.1:37822_solr) [n:127.0.0.1:37822_solr    ] o.a.s.c.OverseerCollectionMessageHandler OverseerCollectionMessageHandler.processMessage : create , {
   [junit4]   2>   "name":"testschemaapi",
   [junit4]   2>   "fromApi":"true",
   [junit4]   2>   "replicationFactor":"2",
   [junit4]   2>   "collection.configName":"conf1",
   [junit4]   2>   "numShards":"1",
   [junit4]   2>   "stateFormat":"2",
   [junit4]   2>   "operation":"create"}
   [junit4]   2> 651216 INFO  (OverseerThreadFactory-1251-thread-1-processing-n:127.0.0.1:37822_solr) [n:127.0.0.1:37822_solr    ] o.a.s.c.OverseerCollectionMessageHandler Create collection testschemaapi
   [junit4]   2> 651217 INFO  (OverseerThreadFactory-1251-thread-1-processing-n:127.0.0.1:37822_solr) [n:127.0.0.1:37822_solr    ] o.a.s.c.OverseerCollectionMessageHandler creating collections conf node /collections/testschemaapi 
   [junit4]   2> 651217 INFO  (OverseerThreadFactory-1251-thread-1-processing-n:127.0.0.1:37822_solr) [n:127.0.0.1:37822_solr    ] o.a.s.c.c.SolrZkClient makePath: /collections/testschemaapi
   [junit4]   2> 651219 INFO  (zkCallback-351-thread-1-processing-n:127.0.0.1:53175_solr) [n:127.0.0.1:53175_solr    ] o.a.s.c.c.ZkStateReader A collections change: [WatchedEvent state:SyncConnected type:NodeChildrenChanged path:/collections], has occurred - updating...
   [junit4]   2> 651219 INFO  (zkCallback-358-thread-1) [    ] o.a.s.c.c.ZkStateReader A collections change: [WatchedEvent state:SyncConnected type:NodeChildrenChanged path:/collections], has occurred - updating...
   [junit4]   2> 651220 INFO  (zkCallback-352-thread-1-processing-n:127.0.0.1:37822_solr) [n:127.0.0.1:37822_solr    ] o.a.s.c.c.ZkStateReader A collections change: [WatchedEvent state:SyncConnected type:NodeChildrenChanged path:/collections], has occurred - updating...
   [junit4]   2> 651224 INFO  (OverseerStateUpdate-95984763183759366-127.0.0.1:37822_solr-n_0000000000) [n:127.0.0.1:37822_solr    ] o.a.s.c.Overseer processMessage: queueSize: 1, message = {
   [junit4]   2>   "name":"testschemaapi",
   [junit4]   2>   "fromApi":"true",
   [junit4]   2>   "replicationFactor":"2",
   [junit4]   2>   "collection.configName":"conf1",
   [junit4]   2>   "numShards":"1",
   [junit4]   2>   "stateFormat":"2",
   [junit4]   2>   "operation":"create"} current state version: 0
   [junit4]   2> 651224 INFO  (OverseerStateUpdate-95984763183759366-127.0.0.1:37822_solr-n_0000000000) [n:127.0.0.1:37822_solr    ] o.a.s.c.o.ClusterStateMutator building a new cName: testschemaapi
   [junit4]   2> 651226 INFO  (OverseerStateUpdate-95984763183759366-127.0.0.1:37822_solr-n_0000000000) [n:127.0.0.1:37822_solr    ] o.a.s.c.o.ZkStateWriter going to create_collection /collections/testschemaapi/state.json
   [junit4]   2> 651324 INFO  (OverseerThreadFactory-1251-thread-1-processing-n:127.0.0.1:37822_solr) [n:127.0.0.1:37822_solr    ] o.a.s.c.OverseerCollectionMessageHandler Creating SolrCores for new collection testschemaapi, shardNames [shard1] , replicationFactor : 2
   [junit4]   2> 651324 INFO  (OverseerThreadFactory-1251-thread-1-processing-n:127.0.0.1:37822_solr) [n:127.0.0.1:37822_solr    ] o.a.s.c.OverseerCollectionMessageHandler Creating core testschemaapi_shard1_replica1 as part of shard shard1 of collection testschemaapi on 127.0.0.1:37822_solr
   [junit4]   2> 651324 INFO  (OverseerThreadFactory-1251-thread-1-processing-n:127.0.0.1:37822_solr) [n:127.0.0.1:37822_solr    ] o.a.s.c.OverseerCollectionMessageHandler Creating core testschemaapi_shard1_replica2 as part of shard shard1 of collection testschemaapi on 127.0.0.1:53175_solr
   [junit4]   2> 651339 INFO  (qtp70421955-3204) [n:127.0.0.1:53175_solr    ] o.a.s.h.a.CoreAdminOperation core create command qt=/admin/cores&collection.configName=conf1&name=testschemaapi_shard1_replica2&action=CREATE&numShards=1&collection=testschemaapi&shard=shard1&wt=javabin&version=2
   [junit4]   2> 651339 INFO  (qtp70421955-3204) [n:127.0.0.1:53175_solr    ] o.a.s.c.CoreDescriptor Created CoreDescriptor: {name=testschemaapi_shard1_replica2, collection.configName=conf1, config=solrconfig.xml, transient=false, schema=schema.xml, loadOnStartup=true, configSetProperties=configsetprops.json, collection=testschemaapi, numShards=1, dataDir=data/, shard=shard1}
   [junit4]   2> 651340 INFO  (qtp70421955-3204) [n:127.0.0.1:53175_solr c:testschemaapi s:shard1  x:testschemaapi_shard1_replica2] o.a.s.c.ZkController publishing state=down
   [junit4]   2> 651343 INFO  (qtp70421955-3204) [n:127.0.0.1:53175_solr c:testschemaapi s:shard1  x:testschemaapi_shard1_replica2] o.a.s.c.ZkController Registering watch for collection testschemaapi
   [junit4]   2> 651343 INFO  (OverseerStateUpdate-95984763183759366-127.0.0.1:37822_solr-n_0000000000) [n:127.0.0.1:37822_solr    ] o.a.s.c.Overseer processMessage: queueSize: 1, message = {
   [junit4]   2>   "core":"testschemaapi_shard1_replica2",
   [junit4]   2>   "roles":null,
   [junit4]   2>   "base_url":"http://127.0.0.1:53175/solr",
   [junit4]   2>   "node_name":"127.0.0.1:53175_solr",
   [junit4]   2>   "numShards":"1",
   [junit4]   2>   "state":"down",
   [junit4]   2>   "shard":"shard1",
   [junit4]   2>   "collection":"testschemaapi",
   [junit4]   2>   "operation":"state"} current state version: 0
   [junit4]   2> 651343 INFO  (qtp70421955-3204) [n:127.0.0.1:53175_solr c:testschemaapi s:shard1  x:testschemaapi_shard1_replica2] o.a.s.c.c.ZkStateReader Add data for [testschemaapi] ver [0]
   [junit4]   2> 651343 INFO  (OverseerStateUpdate-95984763183759366-127.0.0.1:37822_solr-n_0000000000) [n:127.0.0.1:37822_solr    ] o.a.s.c.o.ReplicaMutator Update state numShards=1 message={
   [junit4]   2>   "core":"testschemaapi_shard1_replica2",
   [junit4]   2>   "roles":null,
   [junit4]   2>   "base_url":"http://127.0.0.1:53175/solr",
   [junit4]   2>   "node_name":"127.0.0.1:53175_solr",
   [junit4]   2>   "numShards":"1",
   [junit4]   2>   "state":"down",
   [junit4]   2>   "shard":"shard1",
   [junit4]   2>   "collection":"testschemaapi",
   [junit4]   2>   "operation":"state"}
   [junit4]   2> 651344 INFO  (qtp70421955-3204) [n:127.0.0.1:53175_solr c:testschemaapi s:shard1  x:testschemaapi_shard1_replica2] o.a.s.c.ZkController look for our core node name
   [junit4]   2> 651344 INFO  (qtp2068844374-3207) [n:127.0.0.1:37822_solr    ] o.a.s.h.a.CoreAdminOperation core create command qt=/admin/cores&collection.configName=conf1&name=testschemaapi_shard1_replica1&action=CREATE&numShards=1&collection=testschemaapi&shard=shard1&wt=javabin&version=2
   [junit4]   2> 651344 INFO  (qtp2068844374-3207) [n:127.0.0.1:37822_solr    ] o.a.s.c.CoreDescriptor Created CoreDescriptor: {name=testschemaapi_shard1_replica1, collection.configName=conf1, config=solrconfig.xml, transient=false, schema=schema.xml, loadOnStartup=true, configSetProperties=configsetprops.json, collection=testschemaapi, numShards=1, dataDir=data/, shard=shard1}
   [junit4]   2> 651346 INFO  (qtp2068844374-3207) [n:127.0.0.1:37822_solr c:testschemaapi s:shard1  x:testschemaapi_shard1_replica1] o.a.s.c.ZkController publishing state=down
   [junit4]   2> 651347 INFO  (qtp2068844374-3207) [n:127.0.0.1:37822_solr c:testschemaapi s:shard1  x:testschemaapi_shard1_replica1] o.a.s.c.ZkController Registering watch for collection testschemaapi
   [junit4]   2> 651348 INFO  (qtp2068844374-3207) [n:127.0.0.1:37822_solr c:testschemaapi s:shard1  x:testschemaapi_shard1_replica1] o.a.s.c.c.ZkStateReader Add data for [testschemaapi] ver [0]
   [junit4]   2> 651349 INFO  (qtp2068844374-3207) [n:127.0.0.1:37822_solr c:testschemaapi s:shard1  x:testschemaapi_shard1_replica1] o.a.s.c.ZkController look for our core node name
   [junit4]   2> 651349 INFO  (OverseerStateUpdate-95984763183759366-127.0.0.1:37822_solr-n_0000000000) [n:127.0.0.1:37822_solr    ] o.a.s.c.Overseer processMessage: queueSize: 1, message = {
   [junit4]   2>   "core":"testschemaapi_shard1_replica1",
   [junit4]   2>   "roles":null,
   [junit4]   2>   "base_url":"http://127.0.0.1:37822/solr",
   [junit4]   2>   "node_name":"127.0.0.1:37822_solr",
   [junit4]   2>   "numShards":"1",
   [junit4]   2>   "state":"down",
   [junit4]   2>   "shard":"shard1",
   [junit4]   2>   "collection":"testschemaapi",
   [junit4]   2>   "operation":"state"} current state version: 0
   [junit4]   2> 651349 INFO  (OverseerStateUpdate-95984763183759366-127.0.0.1:37822_solr-n_0000000000) [n:127.0.0.1:37822_solr    ] o.a.s.c.o.ReplicaMutator Update state numShards=1 message={
   [junit4]   2>   "core":"testschemaapi_shard1_replica1",
   [junit4]   2>   "roles":null,
   [junit4]   2>   "base_url":"http://127.0.0.1:37822/solr",
   [junit4]   2>   "node_name":"127.0.0.1:37822_solr",
   [junit4]   2>   "numShards":"1",
   [junit4]   2>   "state":"down",
   [junit4]   2>   "shard":"shard1",
   [junit4]   2>   "collection":"testschemaapi",
   [junit4]   2>   "operation":"state"}
   [junit4]   2> 651452 INFO  (OverseerStateUpdate-95984763183759366-127.0.0.1:37822_solr-n_0000000000) [n:127.0.0.1:37822_solr    ] o.a.s.c.o.ZkStateWriter going to update_collection /collections/testschemaapi/state.json version: 0
   [junit4]   2> 651452 INFO  (zkCallback-352-thread-1-processing-n:127.0.0.1:37822_solr) [n:127.0.0.1:37822_solr    ] o.a.s.c.c.ZkStateReader A cluster state change: [WatchedEvent state:SyncConnected type:NodeDataChanged path:/collections/testschemaapi/state.json] for collection [testschemaapi] has occurred - updating... (live nodes size: [2])
   [junit4]   2> 651453 INFO  (zkCallback-351-thread-1-processing-n:127.0.0.1:53175_solr) [n:127.0.0.1:53175_solr    ] o.a.s.c.c.ZkStateReader A cluster state change: [WatchedEvent state:SyncConnected type:NodeDataChanged path:/collections/testschemaapi/state.json] for collection [testschemaapi] has occurred - updating... (live nodes size: [2])
   [junit4]   2> 651453 INFO  (zkCallback-352-thread-1-processing-n:127.0.0.1:37822_solr) [n:127.0.0.1:37822_solr    ] o.a.s.c.c.ZkStateReader Updating data for [testschemaapi] from [0] to [1]
   [junit4]   2> 651453 INFO  (zkCallback-351-thread-1-processing-n:127.0.0.1:53175_solr) [n:127.0.0.1:53175_solr    ] o.a.s.c.c.ZkStateReader Updating data for [testschemaapi] from [0] to [1]
   [junit4]   2> 652345 INFO  (qtp70421955-3204) [n:127.0.0.1:53175_solr c:testschemaapi s:shard1  x:testschemaapi_shard1_replica2] o.a.s.c.ZkController waiting to find shard id in clusterstate for testschemaapi_shard1_replica2
   [junit4]   2> 652345 INFO  (qtp70421955-3204) [n:127.0.0.1:53175_solr c:testschemaapi s:shard1  x:testschemaapi_shard1_replica2] o.a.s.c.ZkController Check for collection zkNode:testschemaapi
   [junit4]   2> 652345 INFO  (qtp70421955-3204) [n:127.0.0.1:53175_solr c:testschemaapi s:shard1  x:testschemaapi_shard1_replica2] o.a.s.c.ZkController Collection zkNode exists
   [junit4]   2> 652345 INFO  (qtp70421955-3204) [n:127.0.0.1:53175_solr c:testschemaapi s:shard1  x:testschemaapi_shard1_replica2] o.a.s.c.c.ZkStateReader Load collection config from: [/collections/testschemaapi]
   [junit4]   2> 652346 INFO  (qtp70421955-3204) [n:127.0.0.1:53175_solr c:testschemaapi s:shard1  x:testschemaapi_shard1_replica2] o.a.s.c.c.ZkStateReader path=[/collections/testschemaapi] [configName]=[conf1] specified config exists in ZooKeeper
   [junit4]   2> 652346 INFO  (qtp70421955-3204) [n:127.0.0.1:53175_solr c:testschemaapi s:shard1  x:testschemaapi_shard1_replica2] o.a.s.c.SolrResourceLoader new SolrResourceLoader for directory: '/export/home/jenkins/workspace/Lucene-Solr-master-Solaris/solr/build/solr-core/test/J1/temp/solr.schema.TestManagedSchemaAPI_CE53042B9F3D0D9E-001/tempDir-001/node1/testschemaapi_shard1_replica2'
   [junit4]   2> 652346 INFO  (qtp70421955-3204) [n:127.0.0.1:53175_solr c:testschemaapi s:shard1  x:testschemaapi_shard1_replica2] o.a.s.c.SolrResourceLoader JNDI not configured for solr (NoInitialContextEx)
   [junit4]   2> 652347 INFO  (qtp70421955-3204) [n:127.0.0.1:53175_solr c:testschemaapi s:shard1  x:testschemaapi_shard1_replica2] o.a.s.c.SolrResourceLoader solr home defaulted to 'solr/' (could not find system property or JNDI)
   [junit4]   2> 652349 INFO  (qtp2068844374-3207) [n:127.0.0.1:37822_solr c:testschemaapi s:shard1  x:testschemaapi_shard1_replica1] o.a.s.c.ZkController waiting to find shard id in clusterstate for testschemaapi_shard1_replica1
   [junit4]   2> 652349 INFO  (qtp2068844374-3207) [n:127.0.0.1:37822_solr c:testschemaapi s:shard1  x:testschemaapi_shard1_replica1] o.a.s.c.ZkController Check for collection zkNode:testschemaapi
   [junit4]   2> 652350 INFO  (qtp70421955-3204) [n:127.0.0.1:53175_solr c:testschemaapi s:shard1  x:testschemaapi_shard1_replica2] o.a.s.c.Config loaded config solrconfig.xml with version 0 
   [junit4]   2> 652350 INFO  (qtp2068844374-3207) [n:127.0.0.1:37822_solr c:testschemaapi s:shard1  x:testschemaapi_shard1_replica1] o.a.s.c.ZkController Collection zkNode exists
   [junit4]   2> 652350 INFO  (qtp2068844374-3207) [n:127.0.0.1:37822_solr c:testschemaapi s:shard1  x:testschemaapi_shard1_replica1] o.a.s.c.c.ZkStateReader Load collection config from: [/collections/testschemaapi]
   [junit4]   2> 652351 INFO  (qtp2068844374-3207) [n:127.0.0.1:37822_solr c:testschemaapi s:shard1  x:testschemaapi_shard1_replica1] o.a.s.c.c.ZkStateReader path=[/collections/testschemaapi] [configName]=[conf1] specified config exists in ZooKeeper
   [junit4]   2> 652351 INFO  (qtp2068844374-3207) [n:127.0.0.1:37822_solr c:testschemaapi s:shard1  x:testschemaapi_shard1_replica1] o.a.s.c.SolrResourceLoader new SolrResourceLoader for directory: '/export/home/jenkins/workspace/Lucene-Solr-master-Solaris/solr/build/solr-core/test/J1/temp/solr.schema.TestManagedSchemaAPI_CE53042B9F3D0D9E-001/tempDir-001/node2/testschemaapi_shard1_replica1'
   [junit4]   2> 652352 INFO  (qtp2068844374-3207) [n:127.0.0.1:37822_solr c:testschemaapi s:shard1  x:testschemaapi_shard1_replica1] o.a.s.c.SolrResourceLoader JNDI not configured for solr (NoInitialContextEx)
   [junit4]   2> 652352 INFO  (qtp2068844374-3207) [n:127.0.0.1:37822_solr c:testschemaapi s:shard1  x:testschemaapi_shard1_replica1] o.a.s.c.SolrResourceLoader solr home defaulted to 'solr/' (could not find system property or JNDI)
   [junit4]   2> 652355 INFO  (qtp2068844374-3207) [n:127.0.0.1:37822_solr c:testschemaapi s:shard1  x:testschemaapi_shard1_replica1] o.a.s.c.Config loaded config solrconfig.xml with version 0 
   [junit4]   2> 652355 INFO  (qtp70421955-3204) [n:127.0.0.1:53175_solr c:testschemaapi s:shard1  x:testschemaapi_shard1_replica2] o.a.s.c.SolrConfig current version of requestparams : -1
   [junit4]   2> 652357 INFO  (qtp70421955-3204) [n:127.0.0.1:53175_solr c:testschemaapi s:shard1  x:testschemaapi_shard1_replica2] o.a.s.c.SolrConfig Using Lucene MatchVersion: 7.0.0
   [junit4]   2> 652361 INFO  (qtp2068844374-3207) [n:127.0.0.1:37822_solr c:testschemaapi s:shard1  x:testschemaapi_shard1_replica1] o.a.s.c.SolrConfig current version of requestparams : -1
   [junit4]   2> 652363 INFO  (qtp70421955-3204) [n:127.0.0.1:53175_solr c:testschemaapi s:shard1  x:testschemaapi_shard1_replica2] o.a.s.c.SolrConfig Loaded SolrConfig: solrconfig.xml
   [junit4]   2> 652364 INFO  (qtp2068844374-3207) [n:127.0.0.1:37822_solr c:testschemaapi s:shard1  x:testschemaapi_shard1_replica1] o.a.s.c.SolrConfig Using Lucene MatchVersion: 7.0.0
   [junit4]   2> 652369 INFO  (qtp70421955-3204) [n:127.0.0.1:53175_solr c:testschemaapi s:shard1  x:testschemaapi_shard1_replica2] o.a.s.s.IndexSchema [testschemaapi_shard1_replica2] Schema name=minimal
   [junit4]   2> 652371 INFO  (qtp2068844374-3207) [n:127.0.0.1:37822_solr c:testschemaapi s:shard1  x:testschemaapi_shard1_replica1] o.a.s.c.SolrConfig Loaded SolrConfig: solrconfig.xml
   [junit4]   2> 652372 INFO  (qtp70421955-3204) [n:127.0.0.1:53175_solr c:testschemaapi s:shard1  x:testschemaapi_shard1_replica2] o.a.s.s.IndexSchema unique key field: id
   [junit4]   2> 652374 INFO  (qtp70421955-3204) [n:127.0.0.1:53175_solr c:testschemaapi s:shard1  x:testschemaapi_shard1_replica2] o.a.s.c.ConfigSetProperties Did not find ConfigSet properties, assuming default properties: Can't find resource 'configsetprops.json' in classpath or '/configs/conf1', cwd=/export/home/jenkins/workspace/Lucene-Solr-master-Solaris/solr/build/solr-core/test/J1
   [junit4]   2> 652374 INFO  (qtp70421955-3204) [n:127.0.0.1:53175_solr c:testschemaapi s:shard1  x:testschemaapi_shard1_replica2] o.a.s.c.CoreContainer Creating SolrCore 'testschemaapi_shard1_replica2' using configuration from collection testschemaapi
   [junit4]   2> 652374 INFO  (qtp70421955-3204) [n:127.0.0.1:53175_solr c:testschemaapi s:shard1 r:core_node1 x:testschemaapi_shard1_replica2] o.a.s.c.SolrCore org.apache.solr.core.MockDirectoryFactory
   [junit4]   2> 652374 INFO  (qtp70421955-3204) [n:127.0.0.1:53175_solr c:testschemaapi s:shard1 r:core_node1 x:testschemaapi_shard1_replica2] o.a.s.c.SolrCore [[testschemaapi_shard1_replica2] ] Opening new SolrCore at [/export/home/jenkins/workspace/Lucene-Solr-master-Solaris/solr/build/solr-core/test/J1/temp/solr.schema.TestManagedSchemaAPI_CE53042B9F3D0D9E-001/tempDir-001/node1/testschemaapi_shard1_replica2], dataDir=[/export/home/jenkins/workspace/Lucene-Solr-master-Solaris/solr/build/solr-core/test/J1/temp/solr.schema.TestManagedSchemaAPI_CE53042B9F3D0D9E-001/tempDir-001/node1/./testschemaapi_shard1_replica2/data/]
   [junit4]   2> 652375 INFO  (qtp70421955-3204) [n:127.0.0.1:53175_solr c:testschemaapi s:shard1 r:core_node1 x:testschemaapi_shard1_replica2] o.a.s.c.SolrCore JMX monitoring not detected for core: testschemaapi_shard1_replica2
   [junit4]   2> 652375 INFO  (qtp70421955-3204) [n:127.0.0.1:53175_solr c:testschemaapi s:shard1 r:core_node1 x:testschemaapi_shard1_replica2] o.a.s.c.CachingDirectoryFactory return new directory for /export/home/jenkins/workspace/Lucene-Solr-master-Solaris/solr/build/solr-core/test/J1/temp/solr.schema.TestManagedSchemaAPI_CE53042B9F3D0D9E-001/tempDir-001/node1/./testschemaapi_shard1_replica2/data
   [junit4]   2> 652375 INFO  (qtp70421955-3204) [n:127.0.0.1:53175_solr c:testschemaapi s:shard1 r:core_node1 x:testschemaapi_shard1_replica2] o.a.s.c.SolrCore New index directory detected: old=null new=/export/home/jenkins/workspace/Lucene-Solr-master-Solaris/solr/build/solr-core/test/J1/temp/solr.schema.TestManagedSchemaAPI_CE53042B9F3D0D9E-001/tempDir-001/node1/./testschemaapi_shard1_replica2/data/index/
   [junit4]   2> 652375 WARN  (qtp70421955-3204) [n:127.0.0.1:53175_solr c:testschemaapi s:shard1 r:core_node1 x:testschemaapi_shard1_replica2] o.a.s.c.SolrCore [testschemaapi_shard1_replica2] Solr index directory '/export/home/jenkins/workspace/Lucene-Solr-master-Solaris/solr/build/solr-core/test/J1/temp/solr.schema.TestManagedSchemaAPI_CE53042B9F3D0D9E-001/tempDir-001/node1/./testschemaapi_shard1_replica2/data/index' doesn't exist. Creating new index...
   [junit4]   2> 652375 INFO  (qtp70421955-3204) [n:127.0.0.1:53175_solr c:testschemaapi s:shard1 r:core_node1 x:testschemaapi_shard1_replica2] o.a.s.c.CachingDirectoryFactory return new directory for /export/home/jenkins/workspace/Lucene-Solr-master-Solaris/solr/build/solr-core/test/J1/temp/solr.schema.TestManagedSchemaAPI_CE53042B9F3D0D9E-001/tempDir-001/node1/./testschemaapi_shard1_replica2/data/index
   [junit4]   2> 652376 INFO  (qtp2068844374-3207) [n:127.0.0.1:37822_solr c:testschemaapi s:shard1  x:testschemaapi_shard1_replica1] o.a.s.s.IndexSchema [testschemaapi_shard1_replica1] Schema name=minimal
   [junit4]   2> 652376 INFO  (qtp70421955-3204) [n:127.0.0.1:53175_solr c:testschemaapi s:shard1 r:core_node1 x:testschemaapi_shard1_replica2] o.a.s.c.SolrDeletionPolicy SolrDeletionPolicy.onCommit: commits: num=1
   [junit4]   2> 	commit{dir=MockDirectoryWrapper(RAMDirectory@5c1f7cd7 lockFactory=org.apache.lucene.store.SingleInstanceLockFactory@4966581a),segFN=segments_1,generation=1}
   [junit4]   2> 652376 INFO  (qtp70421955-3204) [n:127.0.0.1:53175_solr c:testschemaapi s:shard1 r:core_node1 x:testschemaapi_shard1_replica2] o.a.s.c.SolrDeletionPolicy newest commit generation = 1
   [junit4]   2> 652377 INFO  (OldIndexDirectoryCleanupThreadForCore-testschemaapi_shard1_replica2) [n:127.0.0.1:53175_solr c:testschemaapi s:shard1 r:core_node1 x:testschemaapi_shard1_replica2] o.a.s.c.SolrCore Looking for old index directories to cleanup for core testschemaapi_shard1_replica2 in /export/home/jenkins/workspace/Lucene-Solr-master-Solaris/solr/build/solr-core/test/J1/temp/solr.schema.TestManagedSchemaAPI_CE53042B9F3D0D9E-001/tempDir-001/node1/./testschemaapi_shard1_replica2/data/
   [junit4]   2> 652377 WARN  (OldIndexDirectoryCleanupThreadForCore-testschemaapi_shard1_replica2) [n:127.0.0.1:53175_solr c:testschemaapi s:shard1 r:core_node1 x:testschemaapi_shard1_replica2] o.a.s.c.DirectoryFactory /export/home/jenkins/workspace/Lucene-Solr-master-Solaris/solr/build/solr-core/test/J1/temp/solr.schema.TestManagedSchemaAPI_CE53042B9F3D0D9E-001/tempDir-001/node1/./testschemaapi_shard1_replica2/data/ does not point to a valid data directory; skipping clean-up of old index directories.
   [junit4]   2> 652378 INFO  (qtp70421955-3204) [n:127.0.0.1:53175_solr c:testschemaapi s:shard1 r:core_node1 x:testschemaapi_shard1_replica2] o.a.s.c.SolrCore no updateRequestProcessorChain defined as default, creating implicit default
   [junit4]   2> 652382 INFO  (qtp2068844374-3207) [n:127.0.0.1:37822_solr c:testschemaapi s:shard1  x:testschemaapi_shard1_replica1] o.a.s.s.IndexSchema unique key field: id
   [junit4]   2> 652382 INFO  (qtp70421955-3204) [n:127.0.0.1:53175_solr c:testschemaapi s:shard1 r:core_node1 x:testschemaapi_shard1_replica2] o.a.s.h.l.XMLLoader xsltCacheLifetimeSeconds=60
   [junit4]   2> 652383 INFO  (qtp2068844374-3207) [n:127.0.0.1:37822_solr c:testschemaapi s:shard1  x:testschemaapi_shard1_replica1] o.a.s.c.ConfigSetProperties Did not find ConfigSet properties, assuming default properties: Can't find resource 'configsetprops.json' in classpath or '/configs/conf1', cwd=/export/home/jenkins/workspace/Lucene-Solr-master-Solaris/solr/build/solr-core/test/J1
   [junit4]   2> 652383 INFO  (qtp70421955-3204) [n:127.0.0.1:53175_solr c:testschemaapi s:shard1 r:core_node1 x:testschemaapi_shard1_replica2] o.a.s.h.l.XMLLoader xsltCacheLifetimeSeconds=60
   [junit4]   2> 652383 INFO  (qtp2068844374-3207) [n:127.0.0.1:37822_solr c:testschemaapi s:shard1  x:testschemaapi_shard1_replica1] o.a.s.c.CoreContainer Creating SolrCore 'testschemaapi_shard1_replica1' using configuration from collection testschemaapi
   [junit4]   2> 652384 INFO  (qtp2068844374-3207) [n:127.0.0.1:37822_solr c:testschemaapi s:shard1 r:core_node2 x:testschemaapi_shard1_replica1] o.a.s.c.SolrCore org.apache.solr.core.MockDirectoryFactory
   [junit4]   2> 652384 INFO  (qtp2068844374-3207) [n:127.0.0.1:37822_solr c:testschemaapi s:shard1 r:core_node2 x:testschemaapi_shard1_replica1] o.a.s.c.SolrCore [[testschemaapi_shard1_replica1] ] Opening new SolrCore at [/export/home/jenkins/workspace/Lucene-Solr-master-Solaris/solr/build/solr-core/test/J1/temp/solr.schema.TestManagedSchemaAPI_CE53042B9F3D0D9E-001/tempDir-001/node2/testschemaapi_shard1_replica1], dataDir=[/export/home/jenkins/workspace/Lucene-Solr-master-Solaris/solr/build/solr-core/test/J1/temp/solr.schema.TestManagedSchemaAPI_CE53042B9F3D0D9E-001/tempDir-001/node2/./testschemaapi_shard1_replica1/data/]
   [junit4]   2> 652384 INFO  (qtp2068844374-3207) [n:127.0.0.1:37822_solr c:testschemaapi s:shard1 r:core_node2 x:testschemaapi_shard1_replica1] o.a.s.c.SolrCore JMX monitoring not detected for core: testschemaapi_shard1_replica1
   [junit4]   2> 652384 INFO  (qtp70421955-3204) [n:127.0.0.1:53175_solr c:testschemaapi s:shard1 r:core_node1 x:testschemaapi_shard1_replica2] o.a.s.h.l.XMLLoader xsltCacheLifetimeSeconds=60
   [junit4]   2> 652385 INFO  (qtp2068844374-3207) [n:127.0.0.1:37822_solr c:testschemaapi s:shard1 r:core_node2 x:testschemaapi_shard1_replica1] o.a.s.c.CachingDirectoryFactory return new directory for /export/home/jenkins/workspace/Lucene-Solr-master-Solaris/solr/build/solr-core/test/J1/temp/solr.schema.TestManagedSchemaAPI_CE53042B9F3D0D9E-001/tempDir-001/node2/./testschemaapi_shard1_replica1/data
   [junit4]   2> 652385 INFO  (qtp2068844374-3207) [n:127.0.0.1:37822_solr c:testschemaapi s:shard1 r:core_node2 x:testschemaapi_shard1_replica1] o.a.s.c.SolrCore New index directory detected: old=null new=/export/home/jenkins/workspace/Lucene-Solr-master-Solaris/solr/build/solr-core/test/J1/temp/solr.schema.TestManagedSchemaAPI_CE53042B9F3D0D9E-001/tempDir-001/node2/./testschemaapi_shard1_replica1/data/index/
   [junit4]   2> 652385 WARN  (qtp2068844374-3207) [n:127.0.0.1:37822_solr c:testschemaapi s:shard1 r:core_node2 x:testschemaapi_shard1_replica1] o.a.s.c.SolrCore [testschemaapi_shard1_replica1] Solr index directory '/export/home/jenkins/workspace/Lucene-Solr-master-Solaris/solr/build/solr-core/test/J1/temp/solr.schema.TestManagedSchemaAPI_CE53042B9F3D0D9E-001/tempDir-001/node2/./testschemaapi_shard1_replica1/data/index' doesn't exist. Creating new index...
   [junit4]   2> 652385 INFO  (qtp70421955-3204) [n:127.0.0.1:53175_solr c:testschemaapi s:shard1 r:core_node1 x:testschemaapi_shard1_replica2] o.a.s.h.l.XMLLoader xsltCacheLifetimeSeconds=60
   [junit4]   2> 652385 INFO  (qtp2068844374-3207) [n:127.0.0.1:37822_solr c:testschemaapi s:shard1 r:core_node2 x:testschemaapi_shard1_replica1] o.a.s.c.CachingDirectoryFactory return new directory for /export/home/jenkins/workspace/Lucene-Solr-master-Solaris/solr/build/solr-core/test/J1/temp/solr.schema.TestManagedSchemaAPI_CE53042B9F3D0D9E-001/tempDir-001/node2/./testschemaapi_shard1_replica1/data/index
   [junit4]   2> 652386 INFO  (qtp2068844374-3207) [n:127.0.0.1:37822_solr c:testschemaapi s:shard1 r:core_node2 x:testschemaapi_shard1_replica1] o.a.s.c.SolrDeletionPolicy SolrDeletionPolicy.onCommit: commits: num=1
   [junit4]   2> 	commit{dir=MockDirectoryWrapper(RAMDirectory@699dde02 lockFactory=org.apache.lucene.store.SingleInstanceLockFactory@2354c0e8),segFN=segments_1,generation=1}
   [junit4]   2> 652386 INFO  (qtp2068844374-3207) [n:127.0.0.1:37822_solr c:testschemaapi s:shard1 r:core_node2 x:testschemaapi_shard1_replica1] o.a.s.c.SolrDeletionPolicy newest commit generation = 1
   [junit4]   2> 652386 INFO  (OldIndexDirectoryCleanupThreadForCore-testschemaapi_shard1_replica1) [n:127.0.0.1:37822_solr c:testschemaapi s:shard1 r:core_node2 x:testschemaapi_shard1_replica1] o.a.s.c.SolrCore Looking for old index directories to cleanup for core testschemaapi_shard1_replica1 in /export/home/jenkins/workspace/Lucene-Solr-master-Solaris/solr/build/solr-core/test/J1/temp/solr.schema.TestManagedSchemaAPI_CE53042B9F3D0D9E-001/tempDir-001/node2/./testschemaapi_shard1_replica1/data/
   [junit4]   2> 652387 WARN  (OldIndexDirectoryCleanupThreadForCore-testschemaapi_shard1_replica1) [n:127.0.0.1:37822_solr c:testschemaapi s:shard1 r:core_node2 x:testschemaapi_shard1_replica1] o.a.s.c.DirectoryFactory /export/home/jenkins/workspace/Lucene-Solr-master-Solaris/solr/build/solr-core/test/J1/temp/solr.schema.TestManagedSchemaAPI_CE53042B9F3D0D9E-001/tempDir-001/node2/./testschemaapi_shard1_replica1/data/ does not point to a valid data directory; skipping clean-up of old index directories.
   [junit4]   2> 652387 INFO  (qtp70421955-3204) [n:127.0.0.1:53175_solr c:testschemaapi s:shard1 r:core_node1 x:testschemaapi_shard1_replica2] o.a.s.c.RequestHandlers Registered paths: /admin/mbeans,/update/csv,/sql,/update/json/docs,/admin/luke,/graph,/export,/select,/admin/segments,/get,/admin/system,/replication,/admin/properties,/config,/stream,/schema,/admin/plugins,/admin/logging,/update/json,/admin/ping,/admin/threads,/update,/admin/file
   [junit4]   2> 652388 INFO  (qtp70421955-3204) [n:127.0.0.1:53175_solr c:testschemaapi s:shard1 r:core_node1 x:testschemaapi_shard1_replica2] o.a.s.c.SolrCore Using default statsCache cache: org.apache.solr.search.stats.LocalStatsCache
   [junit4]   2> 652388 INFO  (qtp70421955-3204) [n:127.0.0.1:53175_solr c:testschemaapi s:shard1 r:core_node1 x:testschemaapi_shard1_replica2] o.a.s.u.UpdateHandler Using UpdateLog implementation: org.apache.solr.update.UpdateLog
   [junit4]   2> 652388 INFO  (qtp70421955-3204) [n:127.0.0.1:53175_solr c:testschemaapi s:shard1 r:core_node1 x:testschemaapi_shard1_replica2] o.a.s.u.UpdateLog Initializing UpdateLog: dataDir=null defaultSyncLevel=FLUSH numRecordsToKeep=100 maxNumLogsToKeep=10 numVersionBuckets=65536
   [junit4]   2> 652389 INFO  (qtp2068844374-3207) [n:127.0.0.1:37822_solr c:testschemaapi s:shard1 r:core_node2 x:testschemaapi_shard1_replica1] o.a.s.c.SolrCore no updateRequestProcessorChain defined as default, creating implicit default
   [junit4]   2> 652391 INFO  (qtp70421955-3204) [n:127.0.0.1:53175_solr c:testschemaapi s:shard1 r:core_node1 x:testschemaapi_shard1_replica2] o.a.s.u.CommitTracker Hard AutoCommit: disabled
   [junit4]   2> 652391 INFO  (qtp70421955-3204) [n:127.0.0.1:53175_solr c:testschemaapi s:shard1 r:core_node1 x:testschemaapi_shard1_replica2] o.a.s.u.CommitTracker Soft AutoCommit: disabled
   [junit4]   2> 652391 INFO  (qtp70421955-3204) [n:127.0.0.1:53175_solr c:testschemaapi s:shard1 r:core_node1 x:testschemaapi_shard1_replica2] o.a.s.c.SolrDeletionPolicy SolrDeletionPolicy.onInit: commits: num=1
   [junit4]   2> 	commit{dir=MockDirectoryWrapper(RAMDirectory@5c1f7cd7 lockFactory=org.apache.lucene.store.SingleInstanceLockFactory@4966581a),segFN=segments_1,generation=1}
   [junit4]   2> 652391 INFO  (qtp2068844374-3207) [n:127.0.0.1:37822_solr c:testschemaapi s:shard1 r:core_node2 x:testschemaapi_shard1_replica1] o.a.s.h.l.XMLLoader xsltCacheLifetimeSeconds=60
   [junit4]   2> 652393 INFO  (qtp2068844374-3207) [n:127.0.0.1:37822_solr c:testschemaapi s:shard1 r:core_node2 x:testschemaapi_shard1_replica1] o.a.s.h.l.XMLLoader xsltCacheLifetimeSeconds=60
   [junit4]   2> 652391 INFO  (qtp70421955-3204) [n:127.0.0.1:53175_solr c:testschemaapi s:shard1 r:core_node1 x:testschemaapi_shard1_replica2] o.a.s.c.SolrDeletionPolicy newest commit generation = 1
   [junit4]   2> 652394 INFO  (qtp70421955-3204) [n:127.0.0.1:53175_solr c:testschemaapi s:shard1 r:core_node1 x:testschemaapi_shard1_replica2] o.a.s.s.SolrIndexSearcher Opening [Searcher@5adc89cd[testschemaapi_shard1_replica2] main]
   [junit4]   2> 652394 INFO  (qtp2068844374-3207) [n:127.0.0.1:37822_solr c:testschemaapi s:shard1 r:core_node2 x:testschemaapi_shard1_replica1] o.a.s.h.l.XMLLoader xsltCacheLifetimeSeconds=60
   [junit4]   2> 652394 INFO  (qtp70421955-3204) [n:127.0.0.1:53175_solr c:testschemaapi s:shard1 r:core_node1 x:testschemaapi_shard1_replica2] o.a.s.c.c.ZkStateReader Load collection config from: [/collections/testschemaapi]
   [junit4]   2> 652395 INFO  (qtp70421955-3204) [n:127.0.0.1:53175_solr c:testschemaapi s:shard1 r:core_node1 x:testschemaapi_shard1_replica2] o.a.s.c.c.ZkStateReader path=[/collections/testschemaapi] [configName]=[conf1] specified config exists in ZooKeeper
   [junit4]   2> 652395 INFO  (qtp70421955-3204) [n:127.0.0.1:53175_solr c:testschemaapi s:shard1 r:core_node1 x:testschemaapi_shard1_replica2] o.a.s.r.ManagedResourceStorage Setting up ZooKeeper-based storage for the RestManager with znodeBase: /configs/conf1
   [junit4]   2> 652395 INFO  (qtp2068844374-3207) [n:127.0.0.1:37822_solr c:testschemaapi s:shard1 r:core_node2 x:testschemaapi_shard1_replica1] o.a.s.h.l.XMLLoader xsltCacheLifetimeSeconds=60
   [junit4]   2> 652396 INFO  (qtp70421955-3204) [n:127.0.0.1:53175_solr c:testschemaapi s:shard1 r:core_node1 x:testschemaapi_shard1_replica2] o.a.s.r.ManagedResourceStorage Configured ZooKeeperStorageIO with znodeBase: /configs/conf1
   [junit4]   2> 652396 INFO  (qtp70421955-3204) [n:127.0.0.1:53175_solr c:testschemaapi s:shard1 r:core_node1 x:testschemaapi_shard1_replica2] o.a.s.r.RestManager Initializing RestManager with initArgs: {}
   [junit4]   2> 652396 INFO  (qtp70421955-3204) [n:127.0.0.1:53175_solr c:testschemaapi s:shard1 r:core_node1 x:testschemaapi_shard1_replica2] o.a.s.r.ManagedResourceStorage Reading _rest_managed.json using ZooKeeperStorageIO:path=/configs/conf1
   [junit4]   2> 652396 INFO  (qtp70421955-3204) [n:127.0.0.1:53175_solr c:testschemaapi s:shard1 r:core_node1 x:testschemaapi_shard1_replica2] o.a.s.r.ManagedResourceStorage No data found for znode /configs/conf1/_rest_managed.json
   [junit4]   2> 652396 INFO  (qtp70421955-3204) [n:127.0.0.1:53175_solr c:testschemaapi s:shard1 r:core_node1 x:testschemaapi_shard1_replica2] o.a.s.r.ManagedResourceStorage Loaded null at path _rest_managed.json using ZooKeeperStorageIO:path=/configs/conf1
   [junit4]   2> 652396 INFO  (qtp70421955-3204) [n:127.0.0.1:53175_solr c:testschemaapi s:shard1 r:core_node1 x:testschemaapi_shard1_replica2] o.a.s.r.RestManager Initializing 0 registered ManagedResources
   [junit4]   2> 652398 INFO  (qtp2068844374-3207) [n:127.0.0.1:37822_solr c:testschemaapi s:shard1 r:core_node2 x:testschemaapi_shard1_replica1] o.a.s.c.RequestHandlers Registered paths: /admin/mbeans,/update/csv,/sql,/update/json/docs,/admin/luke,/graph,/export,/select,/admin/segments,/get,/admin/system,/replication,/admin/properties,/config,/stream,/schema,/admin/plugins,/admin/logging,/update/json,/admin/ping,/admin/threads,/update,/admin/file
   [junit4]   2> 652398 INFO  (qtp2068844374-3207) [n:127.0.0.1:37822_solr c:testschemaapi s:shard1 r:core_node2 x:testschemaapi_shard1_replica1] o.a.s.c.SolrCore Using default statsCache cache: org.apache.solr.search.stats.LocalStatsCache
   [junit4]   2> 652398 INFO  (qtp2068844374-3207) [n:127.0.0.1:37822_solr c:testschemaapi s:shard1 r:core_node2 x:testschemaapi_shard1_replica1] o.a.s.u.UpdateHandler Using UpdateLog implementation: org.apache.solr.update.UpdateLog
   [junit4]   2> 652399 INFO  (qtp2068844374-3207) [n:127.0.0.1:37822_solr c:testschemaapi s:shard1 r:core_node2 x:testschemaapi_shard1_replica1] o.a.s.u.UpdateLog Initializing UpdateLog: dataDir=null defaultSyncLevel=FLUSH numRecordsToKeep=100 maxNumLogsToKeep=10 numVersionBuckets=65536
   [junit4]   2> 652401 INFO  (qtp2068844374-3207) [n:127.0.0.1:37822_solr c:testschemaapi s:shard1 r:core_node2 x:testschemaapi_shard1_replica1] o.a.s.u.CommitTracker Hard AutoCommit: disabled
   [junit4]   2> 652401 INFO  (qtp2068844374-3207) [n:127.0.0.1:37822_solr c:testschemaapi s:shard1 r:core_node2 x:testschemaapi_shard1_replica1] o.a.s.u.CommitTracker Soft AutoCommit: disabled
   [junit4]   2> 652402 INFO  (qtp70421955-3204) [n:127.0.0.1:53175_solr c:testschemaapi s:shard1 r:core_node1 x:testschemaapi_shard1_replica2] o.a.s.s.ZkIndexSchemaReader Creating ZooKeeper watch for the managed schema at /configs/conf1/managed-schema
   [junit4]   2> 652402 INFO  (qtp2068844374-3207) [n:127.0.0.1:37822_solr c:testschemaapi s:shard1 r:core_node2 x:testschemaapi_shard1_replica1] o.a.s.c.SolrDeletionPolicy SolrDeletionPolicy.onInit: commits: num=1
   [junit4]   2> 	commit{dir=MockDirectoryWrapper(RAMDirectory@699dde02 lockFactory=org.apache.lucene.store.SingleInstanceLockFactory@2354c0e8),segFN=segments_1,generation=1}
   [junit4]   2> 652402 INFO  (qtp2068844374-3207) [n:127.0.0.1:37822_solr c:testschemaapi s:shard1 r:core_node2 x:testschemaapi_shard1_replica1] o.a.s.c.SolrDeletionPolicy newest commit generation = 1
   [junit4]   2> 652402 INFO  (qtp2068844374-3207) [n:127.0.0.1:37822_solr c:testschemaapi s:shard1 r:core_node2 x:testschemaapi_shard1_replica1] o.a.s.s.SolrIndexSearcher Opening [Searcher@167dbb9e[testschemaapi_shard1_replica1] main]
   [junit4]   2> 652402 INFO  (qtp2068844374-3207) [n:127.0.0.1:37822_solr c:testschemaapi s:shard1 r:core_node2 x:testschemaapi_shard1_replica1] o.a.s.c.c.ZkStateReader Load collection config from: [/collections/testschemaapi]
   [junit4]   2> 652404 INFO  (qtp2068844374-3207) [n:127.0.0.1:37822_solr c:testschemaapi s:shard1 r:core_node2 x:testschemaapi_shard1_replica1] o.a.s.c.c.ZkStateReader path=[/collections/testschemaapi] [configName]=[conf1] specified config exists in ZooKeeper
   [junit4]   2> 652404 INFO  (qtp2068844374-3207) [n:127.0.0.1:37822_solr c:testschemaapi s:shard1 r:core_node2 x:testschemaapi_shard1_replica1] o.a.s.r.ManagedResourceStorage Setting up ZooKeeper-based storage for the RestManager with znodeBase: /configs/conf1
   [junit4]   2> 652406 INFO  (qtp70421955-3204) [n:127.0.0.1:53175_solr c:testschemaapi s:shard1 r:core_node1 x:testschemaapi_shard1_replica2] o.a.s.c.ZkController Added new OnReconnect listener ZkIndexSchemaReader: /configs/conf1/managed-schema, uniqueCoreId: testschemaapi_shard1_replica2:2070520882685471
   [junit4]   2> 652406 INFO  (qtp70421955-3204) [n:127.0.0.1:53175_solr c:testschemaapi s:shard1 r:core_node1 x:testschemaapi_shard1_replica2] o.a.s.h.ReplicationHandler Commits will be reserved for  10000
   [junit4]   2> 652406 INFO  (searcherExecutor-1256-thread-1-processing-n:127.0.0.1:53175_solr x:testschemaapi_shard1_replica2 s:shard1 c:testschemaapi r:core_node1) [n:127.0.0.1:53175_solr c:testschemaapi s:shard1 r:core_node1 x:testschemaapi_shard1_replica2] o.a.s.c.SolrCore [testschemaapi_shard1_replica2] Registered new searcher Searcher@5adc89cd[testschemaapi_shard1_replica2] main{ExitableDirectoryReader(UninvertingDirectoryReader())}
   [junit4]   2> 652406 INFO  (qtp2068844374-3207) [n:127.0.0.1:37822_solr c:testschemaapi s:shard1 r:core_node2 x:testschemaapi_shard1_replica1] o.a.s.r.ManagedResourceStorage Configured ZooKeeperStorageIO with znodeBase: /configs/conf1
   [junit4]   2> 652406 INFO  (qtp70421955-3204) [n:127.0.0.1:53175_solr c:testschemaapi s:shard1 r:core_node1 x:testschemaapi_shard1_replica2] o.a.s.u.UpdateLog Looking up max value of version field to seed version buckets
   [junit4]   2> 652406 INFO  (qtp2068844374-3207) [n:127.0.0.1:37822_solr c:testschemaapi s:shard1 r:core_node2 x:testschemaapi_shard1_replica1] o.a.s.r.RestManager Initializing RestManager with initArgs: {}
   [junit4]   2> 652406 INFO  (qtp70421955-3204) [n:127.0.0.1:53175_solr c:testschemaapi s:shard1 r:core_node1 x:testschemaapi_shard1_replica2] o.a.s.u.VersionInfo Refreshing highest value of _version_ for 65536 version buckets from index
   [junit4]   2> 652406 INFO  (qtp2068844374-3207) [n:127.0.0.1:37822_solr c:testschemaapi s:shard1 r:core_node2 x:testschemaapi_shard1_replica1] o.a.s.r.ManagedResourceStorage Reading _rest_managed.json using ZooKeeperStorageIO:path=/configs/conf1
   [junit4]   2> 652406 INFO  (qtp70421955-3204) [n:127.0.0.1:53175_solr c:testschemaapi s:shard1 r:core_node1 x:testschemaapi_shard1_replica2] o.a.s.u.VersionInfo No terms found for _version_, cannot seed version bucket highest value from index
   [junit4]   2> 652406 INFO  (qtp70421955-3204) [n:127.0.0.1:53175_solr c:testschemaapi s:shard1 r:core_node1 x:testschemaapi_shard1_replica2] o.a.s.u.UpdateLog Could not find max version in index or recent updates, using new clock 1535756213616115712
   [junit4]   2> 652407 INFO  (qtp2068844374-3207) [n:127.0.0.1:37822_solr c:testschemaapi s:shard1 r:core_node2 x:testschemaapi_shard1_replica1] o.a.s.r.ManagedResourceStorage No data found for znode /configs/conf1/_rest_managed.json
   [junit4]   2> 652407 INFO  (qtp2068844374-3207) [n:127.0.0.1:37822_solr c:testschemaapi s:shard1 r:core_node2 x:testschemaapi_shard1_replica1] o.a.s.r.ManagedResourceStorage Loaded null at path _rest_managed.json using ZooKeeperStorageIO:path=/configs/conf1
   [junit4]   2> 652407 INFO  (qtp2068844374-3207) [n:127.0.0.1:37822_solr c:testschemaapi s:shard1 r:core_node2 x:testschemaapi_shard1_replica1] o.a.s.r.RestManager Initializing 0 registered ManagedResources
   [junit4]   2> 652407 INFO  (qtp2068844374-3207) [n:127.0.0.1:37822_solr c:testschemaapi s:shard1 r:core_node2 x:testschemaapi_shard1_replica1] o.a.s.s.ZkIndexSchemaReader Creating ZooKeeper watch for the managed schema at /configs/conf1/managed-schema
   [junit4]   2> 652408 INFO  (qtp70421955-3204) [n:127.0.0.1:53175_solr c:testschemaapi s:shard1 r:core_node1 x:testschemaapi_shard1_replica2] o.a.s.u.UpdateLog Took 2.0ms to seed version buckets with highest version 1535756213616115712
   [junit4]   2> 652408 INFO  (qtp70421955-3204) [n:127.0.0.1:53175_solr c:testschemaapi s:shard1 r:core_node1 x:testschemaapi_shard1_replica2] o.a.s.c.ZkController watch zkdir /configs/conf1
   [junit4]   2> 652409 INFO  (qtp70421955-3204) [n:127.0.0.1:53175_solr c:testschemaapi s:shard1 r:core_node1 x:testschemaapi_shard1_replica2] o.a.s.c.CoreContainer registering core: testschemaapi_shard1_replica2
   [junit4]   2> 652409 INFO  (qtp70421955-3204) [n:127.0.0.1:53175_solr c:testschemaapi s:shard1 r:core_node1 x:testschemaapi_shard1_replica2] o.a.s.c.ZkController Register replica - core:testschemaapi_shard1_replica2 address:http://127.0.0.1:53175/solr collection:testschemaapi shard:shard1
   [junit4]   2> 652410 INFO  (qtp70421955-3204) [n:127.0.0.1:53175_solr c:testschemaapi s:shard1 r:core_node1 x:testschemaapi_shard1_replica2] o.a.s.c.c.SolrZkClient makePath: /collections/testschemaapi/leader_elect/shard1/election
   [junit4]   2> 652412 INFO  (qtp2068844374-3207) [n:127.0.0.1:37822_solr c:testschemaapi s:shard1 r:core_node2 x:testschemaapi_shard1_replica1] o.a.s.c.ZkController Added new OnReconnect listener ZkIndexSchemaReader: /configs/conf1/managed-schema, uniqueCoreId: testschemaapi_shard1_replica1:2070520891897769
   [junit4]   2> 652412 INFO  (qtp2068844374-3207) [n:127.0.0.1:37822_solr c:testschemaapi s:shard1 r:core_node2 x:testschemaapi_shard1_replica1] o.a.s.h.ReplicationHandler Commits will be reserved for  10000
   [junit4]   2> 652412 INFO  (qtp2068844374-3207) [n:127.0.0.1:37822_solr c:testschemaapi s:shard1 r:core_node2 x:testschemaapi_shard1_replica1] o.a.s.u.UpdateLog Looking up max value of version field to seed version buckets
   [junit4]   2> 652412 INFO  (qtp2068844374-3207) [n:127.0.0.1:37822_solr c:testschemaapi s:shard1 r:core_node2 x:testschemaapi_shard1_replica1] o.a.s.u.VersionInfo Refreshing highest value of _version_ for 65536 version buckets from index
   [junit4]   2> 652412 INFO  (searcherExecutor-1257-thread-1-processing-n:127.0.0.1:37822_solr x:testschemaapi_shard1_replica1 s:shard1 c:testschemaapi r:core_node2) [n:127.0.0.1:37822_solr c:testschemaapi s:shard1 r:core_node2 x:testschemaapi_shard1_replica1] o.a.s.c.SolrCore [testschemaapi_shard1_replica1] Registered new searcher Searcher@167dbb9e[testschemaapi_shard1_replica1] main{ExitableDirectoryReader(UninvertingDirectoryReader())}
   [junit4]   2> 652412 INFO  (qtp2068844374-3207) [n:127.0.0.1:37822_solr c:testschemaapi s:shard1 r:core_node2 x:testschemaapi_shard1_replica1] o.a.s.u.VersionInfo No terms found for _version_, cannot seed version bucket highest value from index
   [junit4]   2> 652412 INFO  (qtp2068844374-3207) [n:127.0.0.1:37822_solr c:testschemaapi s:shard1 r:core_node2 x:testschemaapi_shard1_replica1] o.a.s.u.UpdateLog Could not find max version in index or recent updates, using new clock 1535756213622407168
   [junit4]   2> 652414 INFO  (qtp2068844374-3207) [n:127.0.0.1:37822_solr c:testschemaapi s:shard1 r:core_node2 x:testschemaapi_shard1_replica1] o.a.s.u.UpdateLog Took 1.0ms to seed version buckets with highest version 1535756213622407168
   [junit4]   2> 652414 INFO  (qtp2068844374-3207) [n:127.0.0.1:37822_solr c:testschemaapi s:shard1 r:core_node2 x:testschemaapi_shard1_replica1] o.a.s.c.ZkController watch zkdir /configs/conf1
   [junit4]   2> 652415 INFO  (qtp2068844374-3207) [n:127.0.0.1:37822_solr c:testschemaapi s:shard1 r:core_node2 x:testschemaapi_shard1_replica1] o.a.s.c.CoreContainer registering core: testschemaapi_shard1_replica1
   [junit4]   2> 652416 INFO  (qtp2068844374-3207) [n:127.0.0.1:37822_solr c:testschemaapi s:shard1 r:core_node2 x:testschemaapi_shard1_replica1] o.a.s.c.ZkController Register replica - core:testschemaapi_shard1_replica1 address:http://127.0.0.1:37822/solr collection:testschemaapi shard:shard1
   [junit4]   2> 652418 INFO  (qtp70421955-3204) [n:127.0.0.1:53175_solr c:testschemaapi s:shard1 r:core_node1 x:testschemaapi_shard1_replica2] o.a.s.c.LeaderElector Joined leadership election with path: /collections/testschemaapi/leader_elect/shard1/election/95984763183759365-core_node1-n_0000000000
   [junit4]   2> 652418 INFO  (qtp70421955-3204) [n:127.0.0.1:53175_solr c:testschemaapi s:shard1 r:core_node1 x:testschemaapi_shard1_replica2] o.a.s.c.ShardLeaderElectionContext Running the leader process for shard=shard1 and weAreReplacement=false and leaderVoteWait=10000
   [junit4]   2> 652419 INFO  (qtp2068844374-3207) [n:127.0.0.1:37822_solr c:testschemaapi s:shard1 r:core_node2 x:testschemaapi_shard1_replica1] o.a.s.c.LeaderElector Joined leadership election with path: /collections/testschemaapi/leader_elect/shard1/election/95984763183759366-core_node2-n_0000000001
   [junit4]   2> 652421 INFO  (qtp70421955-3204) [n:127.0.0.1:53175_solr c:testschemaapi s:shard1 r:core_node1 x:testschemaapi_shard1_replica2] o.a.s.c.ShardLeaderElectionContext Enough replicas found to continue.
   [junit4]   2> 652421 INFO  (qtp70421955-3204) [n:127.0.0.1:53175_solr c:testschemaapi s:shard1 r:core_node1 x:testschemaapi_shard1_replica2] o.a.s.c.ShardLeaderElectionContext I may be the new leader - try and sync
   [junit4]   2> 652421 INFO  (qtp70421955-3204) [n:127.0.0.1:53175_solr c:testschemaapi s:shard1 r:core_node1 x:testschemaapi_shard1_replica2] o.a.s.c.SyncStrategy Sync replicas to http://127.0.0.1:53175/solr/testschemaapi_shard1_replica2/
   [junit4]   2> 652421 INFO  (qtp70421955-3204) [n:127.0.0.1:53175_solr c:testschemaapi s:shard1 r:core_node1 x:testschemaapi_shard1_replica2] o.a.s.u.PeerSync PeerSync: core=testschemaapi_shard1_replica2 url=http://127.0.0.1:53175/solr START replicas=[http://127.0.0.1:37822/solr/testschemaapi_shard1_replica1/] nUpdates=100
   [junit4]   2> 652422 INFO  (qtp70421955-3204) [n:127.0.0.1:53175_solr c:testschemaapi s:shard1 r:core_node1 x:testschemaapi_shard1_replica2] o.a.s.u.PeerSync PeerSync: core=testschemaapi_shard1_replica2 url=http://127.0.0.1:53175/solr DONE.  We have no versions.  sync failed.
   [junit4]   2> 652423 INFO  (OverseerStateUpdate-95984763183759366-127.0.0.1:37822_solr-n_0000000000) [n:127.0.0.1:37822_solr    ] o.a.s.c.Overseer processMessage: queueSize: 1, message = {
   [junit4]   2>   "operation":"leader",
   [junit4]   2>   "shard":"shard1",
   [junit4]   2>   "collection":"testschemaapi"} current state version: 0
   [junit4]   2> 652423 INFO  (qtp70421955-3204) [n:127.0.0.1:53175_solr c:testschemaapi s:shard1 r:core_node1 x:testschemaapi_shard1_replica2] o.a.s.c.SyncStrategy Leader's attempt to sync with shard failed, moving to the next candidate
   [junit4]   2> 652423 INFO  (qtp70421955-3204) [n:127.0.0.1:53175_solr c:testschemaapi s:shard1 r:core_node1 x:testschemaapi_shard1_replica2] o.a.s.c.ShardLeaderElectionContext We failed sync, but we have no versions - we can't sync in that case - we were active before, so become leader anyway
   [junit4]   2> 652422 INFO  (qtp2068844374-3207) [n:127.0.0.1:37822_solr c:testschemaapi s:shard1 r:core_node2 x:testschemaapi_shard1_replica1] o.a.s.c.LeaderElector Watching path /collections/testschemaapi/leader_elect/shard1/election/95984763183759365-core_node1-n_0000000000 to know if I could be the leader
   [junit4]   2> 652426 INFO  (qtp2068844374-3202) [n:127.0.0.1:37822_solr c:testschemaapi s:shard1 r:core_node2 x:testschemaapi_shard1_replica1] o.a.s.c.S.Request [testschemaapi_shard1_replica1]  webapp=/solr path=/get params={distrib=false&qt=/get&fingerprint=false&getVersions=100&wt=javabin&version=2} status=0 QTime=1
   [junit4]   2> 652428 INFO  (qtp70421955-3204) [n:127.0.0.1:53175_solr c:testschemaapi s:shard1 r:core_node1 x:testschemaapi_shard1_replica2] o.a.s.c.c.SolrZkClient makePath: /collections/testschemaapi/leaders/shard1
   [junit4]   2> 652432 INFO  (qtp70421955-3204) [n:127.0.0.1:53175_solr c:testschemaapi s:shard1 r:core_node1 x:testschemaapi_shard1_replica2] o.a.s.c.ShardLeaderElectionContextBase Creating leader registration node /collections/testschemaapi/leaders/shard1/leader after winning as /collections/testschemaapi/leader_elect/shard1/election/95984763183759365-core_node1-n_0000000000
   [junit4]   2> 652434 INFO  (qtp70421955-3204) [n:127.0.0.1:53175_solr c:testschemaapi s:shard1 r:core_node1 x:testschemaapi_shard1_replica2] o.a.s.c.ShardLeaderElectionContext I am the new leader: http://127.0.0.1:53175/solr/testschemaapi_shard1_replica2/ shard1
   [junit4]   2> 652436 INFO  (OverseerStateUpdate-95984763183759366-127.0.0.1:37822_solr-n_0000000000) [n:127.0.0.1:37822_solr    ] o.a.s.c.Overseer processMessage: queueSize: 1, message = {
   [junit4]   2>   "operation":"leader",
   [junit4]   2>   "shard":"shard1",
   [junit4]   2>   "collection":"testschemaapi",
   [junit4]   2>   "base_url":"http://127.0.0.1:53175/solr",
   [junit4]   2>   "core":"testschemaapi_shard1_replica2",
   [junit4]   2>   "state":"active"} current state version: 0
   [junit4]   2> 652539 INFO  (OverseerStateUpdate-95984763183759366-127.0.0.1:37822_solr-n_0000000000) [n:127.0.0.1:37822_solr    ] o.a.s.c.o.ZkStateWriter going to update_collection /collections/testschemaapi/state.json version: 1
   [junit4]   2> 652540 INFO  (zkCallback-351-thread-1-processing-n:127.0.0.1:53175_solr) [n:127.0.0.1:53175_solr    ] o.a.s.c.c.ZkStateReader A cluster state change: [WatchedEvent state:SyncConnected type:NodeDataChanged path:/collections/testschemaapi/state.json] for collection [testschemaapi] has occurred - updating... (live nodes size: [2])
   [junit4]   2> 652541 INFO  (zkCallback-352-thread-1-processing-n:127.0.0.1:37822_solr) [n:127.0.0.1:37822_solr    ] o.a.s.c.c.ZkStateReader A cluster state change: [WatchedEvent state:SyncConnected type:NodeDataChanged path:/collections/testschemaapi/state.json] for collection [testschemaapi] has occurred - updating... (live nodes size: [2])
   [junit4]   2> 652541 INFO  (zkCallback-351-thread-1-processing-n:127.0.0.1:53175_solr) [n:127.0.0.1:53175_solr    ] o.a.s.c.c.ZkStateReader Updating data for [testschemaapi] from [1] to [2]
   [junit4]   2> 652542 INFO  (zkCallback-352-thread-1-processing-n:127.0.0.1:37822_solr) [n:127.0.0.1:37822_solr    ] o.a.s.c.c.ZkStateReader Updating data for [testschemaapi] from [1] to [2]
   [junit4]   2> 652585 INFO  (qtp70421955-3204) [n:127.0.0.1:53175_solr c:testschemaapi s:shard1 r:core_node1 x:testschemaapi_shard1_replica2] o.a.s.c.ZkController We are http://127.0.0.1:53175/solr/testschemaapi_shard1_replica2/ and leader is http://127.0.0.1:53175/solr/testschemaapi_shard1_replica2/
   [junit4]   2> 652585 INFO  (qtp70421955-3204) [n:127.0.0.1:53175_solr c:testschemaapi s:shard1 r:core_node1 x:testschemaapi_shard1_replica2] o.a.s.c.ZkController No LogReplay needed for core=testschemaapi_shard1_replica2 baseURL=http://127.0.0.1:53175/solr
   [junit4]   2> 652585 INFO  (qtp70421955-3204) [n:127.0.0.1:53175_solr c:testschemaapi s:shard1 r:core_node1 x:testschemaapi_shard1_replica2] o.a.s.c.ZkController I am the leader, no recovery necessary
   [junit4]   2> 652585 INFO  (qtp70421955-3204) [n:127.0.0.1:53175_solr c:testschemaapi s:shard1 r:core_node1 x:testschemaapi_shard1_replica2] o.a.s.c.ZkController publishing state=active
   [junit4]   2> 652588 INFO  (OverseerStateUpdate-95984763183759366-127.0.0.1:37822_solr-n_0000000000) [n:127.0.0.1:37822_solr    ] o.a.s.c.Overseer processMessage: queueSize: 1, message = {
   [junit4]   2>   "core":"testschemaapi_shard1_replica2",
   [junit4]   2>   "core_node_name":"core_node1",
   [junit4]   2>   "roles":null,
   [junit4]   2>   "base_url":"http://127.0.0.1:53175/solr",
   [junit4]   2>   "node_name":"127.0.0.1:53175_solr",
   [junit4]   2>   "numShards":"1",
   [junit4]   2>   "state":"active",
   [junit4]   2>   "shard":"shard1",
   [junit4]   2>   "collection":"testschemaapi",
   [junit4]   2>   "operation":"state"} current state version: 0
   [junit4]   2> 652588 INFO  (OverseerStateUpdate-95984763183759366-127.0.0.1:37822_solr-n_0000000000) [n:127.0.0.1:37822_solr    ] o.a.s.c.o.ReplicaMutator Update state numShards=1 message={
   [junit4]   2>   "core":"testschemaapi_shard1_replica2",
   [junit4]   2>   "core_node_name":"core_node1",
   [junit4]   2>   "roles":null,
   [junit4]   2>   "base_url":"http://127.0.0.1:53175/solr",
   [junit4]   2>   "node_name":"127.0.0.1:53

[...truncated too long message...]

_solr c:testschemaapi s:shard1 r:core_node2 x:testschemaapi_shard1_replica1] o.a.s.c.SolrCore [testschemaapi_shard1_replica1] Registered new searcher Searcher@1852091d[testschemaapi_shard1_replica1] main{ExitableDirectoryReader(UninvertingDirectoryReader(Uninverting(_0(7.0.0):C1)))}
   [junit4]   2> 662957 INFO  (Thread-1205) [n:127.0.0.1:37822_solr c:testschemaapi s:shard1 r:core_node2 x:testschemaapi_shard1_replica1] o.a.s.c.SolrDeletionPolicy SolrDeletionPolicy.onCommit: commits: num=2
   [junit4]   2> 	commit{dir=MockDirectoryWrapper(RAMDirectory@699dde02 lockFactory=org.apache.lucene.store.SingleInstanceLockFactory@2354c0e8),segFN=segments_2,generation=2}
   [junit4]   2> 	commit{dir=MockDirectoryWrapper(RAMDirectory@699dde02 lockFactory=org.apache.lucene.store.SingleInstanceLockFactory@2354c0e8),segFN=segments_3,generation=3}
   [junit4]   2> 662957 INFO  (Thread-1205) [n:127.0.0.1:37822_solr c:testschemaapi s:shard1 r:core_node2 x:testschemaapi_shard1_replica1] o.a.s.c.SolrDeletionPolicy newest commit generation = 3
   [junit4]   2> 662962 INFO  (Thread-1205) [n:127.0.0.1:37822_solr c:testschemaapi s:shard1 r:core_node2 x:testschemaapi_shard1_replica1] o.a.s.c.SolrCore [testschemaapi_shard1_replica1] Closing main searcher on request.
   [junit4]   2> 662962 INFO  (Thread-1205) [n:127.0.0.1:37822_solr c:testschemaapi s:shard1 r:core_node2 x:testschemaapi_shard1_replica1] o.a.s.c.CachingDirectoryFactory Closing MockDirectoryFactory - 2 directories currently being tracked
   [junit4]   2> 662962 INFO  (Thread-1205) [n:127.0.0.1:37822_solr c:testschemaapi s:shard1 r:core_node2 x:testschemaapi_shard1_replica1] o.a.s.c.CachingDirectoryFactory looking to close /export/home/jenkins/workspace/Lucene-Solr-master-Solaris/solr/build/solr-core/test/J1/temp/solr.schema.TestManagedSchemaAPI_CE53042B9F3D0D9E-001/tempDir-001/node2/./testschemaapi_shard1_replica1/data/index [CachedDir<<refCount=0;path=/export/home/jenkins/workspace/Lucene-Solr-master-Solaris/solr/build/solr-core/test/J1/temp/solr.schema.TestManagedSchemaAPI_CE53042B9F3D0D9E-001/tempDir-001/node2/./testschemaapi_shard1_replica1/data/index;done=false>>]
   [junit4]   2> 662962 INFO  (Thread-1205) [n:127.0.0.1:37822_solr c:testschemaapi s:shard1 r:core_node2 x:testschemaapi_shard1_replica1] o.a.s.c.CachingDirectoryFactory Closing directory, CoreContainer#isShutdown=true
   [junit4]   2> 662962 INFO  (Thread-1205) [n:127.0.0.1:37822_solr c:testschemaapi s:shard1 r:core_node2 x:testschemaapi_shard1_replica1] o.a.s.c.CachingDirectoryFactory Closing directory: /export/home/jenkins/workspace/Lucene-Solr-master-Solaris/solr/build/solr-core/test/J1/temp/solr.schema.TestManagedSchemaAPI_CE53042B9F3D0D9E-001/tempDir-001/node2/./testschemaapi_shard1_replica1/data/index
   [junit4]   2> 662962 INFO  (Thread-1205) [n:127.0.0.1:37822_solr c:testschemaapi s:shard1 r:core_node2 x:testschemaapi_shard1_replica1] o.a.s.c.CachingDirectoryFactory looking to close /export/home/jenkins/workspace/Lucene-Solr-master-Solaris/solr/build/solr-core/test/J1/temp/solr.schema.TestManagedSchemaAPI_CE53042B9F3D0D9E-001/tempDir-001/node2/./testschemaapi_shard1_replica1/data [CachedDir<<refCount=0;path=/export/home/jenkins/workspace/Lucene-Solr-master-Solaris/solr/build/solr-core/test/J1/temp/solr.schema.TestManagedSchemaAPI_CE53042B9F3D0D9E-001/tempDir-001/node2/./testschemaapi_shard1_replica1/data;done=false>>]
   [junit4]   2> 662963 INFO  (Thread-1205) [n:127.0.0.1:37822_solr c:testschemaapi s:shard1 r:core_node2 x:testschemaapi_shard1_replica1] o.a.s.c.CachingDirectoryFactory Closing directory, CoreContainer#isShutdown=true
   [junit4]   2> 662963 INFO  (Thread-1205) [n:127.0.0.1:37822_solr c:testschemaapi s:shard1 r:core_node2 x:testschemaapi_shard1_replica1] o.a.s.c.CachingDirectoryFactory Closing directory: /export/home/jenkins/workspace/Lucene-Solr-master-Solaris/solr/build/solr-core/test/J1/temp/solr.schema.TestManagedSchemaAPI_CE53042B9F3D0D9E-001/tempDir-001/node2/./testschemaapi_shard1_replica1/data
   [junit4]   2> 662963 WARN  (Thread-1205) [n:127.0.0.1:37822_solr c:testschemaapi s:shard1 r:core_node2 x:testschemaapi_shard1_replica1] o.a.s.c.ZkController listener throws error
   [junit4]   2> org.apache.solr.common.SolrException: Unable to reload core [testschemaapi_shard1_replica1]
   [junit4]   2> 	at org.apache.solr.core.CoreContainer.reload(CoreContainer.java:944)
   [junit4]   2> 	at org.apache.solr.core.SolrCore.lambda$getConfListener$6(SolrCore.java:2510)
   [junit4]   2> 	at org.apache.solr.cloud.ZkController$4.run(ZkController.java:2408)
   [junit4]   2> Caused by: java.lang.IllegalStateException: This CoreContainer has been closed
   [junit4]   2> 	at org.apache.solr.core.CoreContainer.registerCore(CoreContainer.java:700)
   [junit4]   2> 	at org.apache.solr.core.CoreContainer.reload(CoreContainer.java:939)
   [junit4]   2> 	... 2 more
   [junit4]   2> 664457 WARN  (zkCallback-352-thread-1-processing-n:127.0.0.1:37822_solr) [n:127.0.0.1:37822_solr    ] o.a.s.c.c.ZkStateReader ZooKeeper watch triggered, but Solr cannot talk to ZK: [KeeperErrorCode = Session expired for /live_nodes]
   [junit4]   2> 664457 INFO  (jetty-launcher-341-thread-1) [    ] o.e.j.s.h.ContextHandler Stopped o.e.j.s.ServletContextHandler@11921d79{/solr,null,UNAVAILABLE}
   [junit4]   2> 664459 INFO  (SUITE-TestManagedSchemaAPI-seed#[CE53042B9F3D0D9E]-worker) [    ] o.a.s.c.ZkTestServer connecting to 127.0.0.1:59874 59874
   [junit4]   2> 664561 WARN  (NIOServerCxn.Factory:0.0.0.0/0.0.0.0:0) [    ] o.a.z.s.NIOServerCnxnFactory Ignoring unexpected runtime exception
   [junit4]   2> java.nio.channels.CancelledKeyException
   [junit4]   2> 	at sun.nio.ch.SelectionKeyImpl.ensureValid(SelectionKeyImpl.java:73)
   [junit4]   2> 	at sun.nio.ch.SelectionKeyImpl.readyOps(SelectionKeyImpl.java:87)
   [junit4]   2> 	at org.apache.zookeeper.server.NIOServerCnxnFactory.run(NIOServerCnxnFactory.java:187)
   [junit4]   2> 	at java.lang.Thread.run(Thread.java:745)
   [junit4]   2> 664562 INFO  (Thread-1172) [    ] o.a.s.c.ZkTestServer connecting to 127.0.0.1:59874 59874
   [junit4]   2> 664564 WARN  (Thread-1172) [    ] o.a.s.c.ZkTestServer Watch limit violations: 
   [junit4]   2> Maximum concurrent create/delete watches above limit:
   [junit4]   2> 
   [junit4]   2> 	7	/solr/configs/conf1/managed-schema
   [junit4]   2> 	7	/solr/configs/conf1
   [junit4]   2> 	3	/solr/aliases.json
   [junit4]   2> 	3	/solr/clusterprops.json
   [junit4]   2> 	2	/solr/security.json
   [junit4]   2> 
   [junit4]   2> Maximum concurrent data watches above limit:
   [junit4]   2> 
   [junit4]   2> 	3	/solr/clusterstate.json
   [junit4]   2> 	2	/solr/collections/testschemaapi/state.json
   [junit4]   2> 
   [junit4]   2> Maximum concurrent children watches above limit:
   [junit4]   2> 
   [junit4]   2> 	3	/solr/live_nodes
   [junit4]   2> 	3	/solr/collections
   [junit4]   2> 
   [junit4]   2> 664564 INFO  (SUITE-TestManagedSchemaAPI-seed#[CE53042B9F3D0D9E]-worker) [    ] o.a.s.SolrTestCaseJ4 ###deleteCore
   [junit4]   2> NOTE: leaving temporary files on disk at: /export/home/jenkins/workspace/Lucene-Solr-master-Solaris/solr/build/solr-core/test/J1/temp/solr.schema.TestManagedSchemaAPI_CE53042B9F3D0D9E-001
   [junit4]   2> May 30, 2016 12:27:49 PM com.carrotsearch.randomizedtesting.ThreadLeakControl checkThreadLeaks
   [junit4]   2> WARNING: Will linger awaiting termination of 1 leaked thread(s).
   [junit4]   2> NOTE: test params are: codec=Asserting(Lucene62): {_version_=PostingsFormat(name=MockRandom), id=PostingsFormat(name=Asserting), myNewField=PostingsFormat(name=MockRandom)}, docValues:{}, maxPointsInLeafNode=382, maxMBSortInHeap=7.203112491249442, sim=RandomSimilarity(queryNorm=false,coord=no): {}, locale=is-IS, timezone=Asia/Dhaka
   [junit4]   2> NOTE: SunOS 5.11 amd64/Oracle Corporation 1.8.0_92 (64-bit)/cpus=3,threads=1,free=310246376,total=533725184
   [junit4]   2> NOTE: All tests run in this JVM: [DebugComponentTest, VersionInfoTest, TestCrossCoreJoin, IgnoreCommitOptimizeUpdateProcessorFactoryTest, TestStressUserVersions, ShardSplitTest, TestDFISimilarityFactory, TestNumericTerms32, SolrPluginUtilsTest, OutputWriterTest, CollectionsAPIDistributedZkTest, TestConfigOverlay, DistributedExpandComponentTest, AnalysisErrorHandlingTest, TestMinMaxOnMultiValuedField, DirectSolrConnectionTest, ShowFileRequestHandlerTest, ConjunctionSolrSpellCheckerTest, DistanceUnitsTest, ResponseLogComponentTest, BufferStoreTest, HdfsCollectionsAPIDistributedZkTest, TestConfigReload, StressHdfsTest, LeaderFailoverAfterPartitionTest, TestManagedSchemaAPI]
   [junit4] Completed [81/611 (1!)] on J1 in 15.50s, 1 test, 1 error <<< FAILURES!

[...truncated 1720 lines...]
BUILD FAILED
/export/home/jenkins/workspace/Lucene-Solr-master-Solaris/build.xml:740: The following error occurred while executing this line:
/export/home/jenkins/workspace/Lucene-Solr-master-Solaris/build.xml:684: The following error occurred while executing this line:
/export/home/jenkins/workspace/Lucene-Solr-master-Solaris/build.xml:59: The following error occurred while executing this line:
/export/home/jenkins/workspace/Lucene-Solr-master-Solaris/solr/build.xml:233: The following error occurred while executing this line:
/export/home/jenkins/workspace/Lucene-Solr-master-Solaris/solr/common-build.xml:531: The following error occurred while executing this line:
/export/home/jenkins/workspace/Lucene-Solr-master-Solaris/lucene/common-build.xml:1427: The following error occurred while executing this line:
/export/home/jenkins/workspace/Lucene-Solr-master-Solaris/lucene/common-build.xml:984: There were test failures: 611 suites (10 ignored), 2558 tests, 1 error, 87 ignored (72 assumptions) [seed: CE53042B9F3D0D9E]

Total time: 86 minutes 58 seconds
Build step 'Invoke Ant' marked build as failure
Archiving artifacts
[WARNINGS] Skipping publisher since build result is FAILURE
Recording test results
Email was triggered for: Failure - Any
Sending email for trigger: Failure - Any



Mime
View raw message