lucene-dev mailing list archives

Site index · List index
Message view « Date » · « Thread »
Top « Date » · « Thread »
From Policeman Jenkins Server <jenk...@thetaphi.de>
Subject [JENKINS] Lucene-Solr-master-Linux (64bit/jdk1.8.0_92) - Build # 16641 - Failure!
Date Mon, 02 May 2016 15:13:53 GMT
Build: http://jenkins.thetaphi.de/job/Lucene-Solr-master-Linux/16641/
Java: 64bit/jdk1.8.0_92 -XX:-UseCompressedOops -XX:+UseConcMarkSweepGC

2 tests failed.
FAILED:  junit.framework.TestSuite.org.apache.lucene.search.TestPointQueries

Error Message:
The test or suite printed 13886 bytes to stdout and stderr, even though the limit was set
to 8192 bytes. Increase the limit with @Limit, ignore it completely with @SuppressSysoutChecks
or run with -Dtests.verbose=true

Stack Trace:
java.lang.AssertionError: The test or suite printed 13886 bytes to stdout and stderr, even
though the limit was set to 8192 bytes. Increase the limit with @Limit, ignore it completely
with @SuppressSysoutChecks or run with -Dtests.verbose=true
	at __randomizedtesting.SeedInfo.seed([853BD8FA355081B0]:0)
	at org.apache.lucene.util.TestRuleLimitSysouts.afterIfSuccessful(TestRuleLimitSysouts.java:211)
	at com.carrotsearch.randomizedtesting.rules.TestRuleAdapter$1.afterIfSuccessful(TestRuleAdapter.java:36)
	at com.carrotsearch.randomizedtesting.rules.StatementAdapter.evaluate(StatementAdapter.java:37)
	at org.apache.lucene.util.TestRuleAssertionsRequired$1.evaluate(TestRuleAssertionsRequired.java:53)
	at org.apache.lucene.util.TestRuleMarkFailure$1.evaluate(TestRuleMarkFailure.java:47)
	at org.apache.lucene.util.TestRuleIgnoreAfterMaxFailures$1.evaluate(TestRuleIgnoreAfterMaxFailures.java:64)
	at org.apache.lucene.util.TestRuleIgnoreTestSuites$1.evaluate(TestRuleIgnoreTestSuites.java:54)
	at com.carrotsearch.randomizedtesting.rules.StatementAdapter.evaluate(StatementAdapter.java:36)
	at com.carrotsearch.randomizedtesting.ThreadLeakControl$StatementRunner.run(ThreadLeakControl.java:367)
	at java.lang.Thread.run(Thread.java:745)


FAILED:  org.apache.lucene.search.TestPointQueries.testRandomBinaryTiny

Error Message:
Captured an uncaught exception in thread: Thread[id=673, name=T4, state=RUNNABLE, group=TGRP-TestPointQueries]

Stack Trace:
com.carrotsearch.randomizedtesting.UncaughtExceptionError: Captured an uncaught exception
in thread: Thread[id=673, name=T4, state=RUNNABLE, group=TGRP-TestPointQueries]
Caused by: java.lang.AssertionError
	at __randomizedtesting.SeedInfo.seed([853BD8FA355081B0]:0)
	at org.apache.lucene.util.DocIdSetBuilder.<init>(DocIdSetBuilder.java:110)
	at org.apache.lucene.util.DocIdSetBuilder.<init>(DocIdSetBuilder.java:98)
	at org.apache.lucene.search.PointRangeQuery$1.buildMatchingDocIdSet(PointRangeQuery.java:109)
	at org.apache.lucene.search.PointRangeQuery$1.scorer(PointRangeQuery.java:213)
	at org.apache.lucene.search.Weight.bulkScorer(Weight.java:135)
	at org.apache.lucene.search.LRUQueryCache$CachingWrapperWeight.bulkScorer(LRUQueryCache.java:754)
	at org.apache.lucene.search.AssertingWeight.bulkScorer(AssertingWeight.java:68)
	at org.apache.lucene.search.AssertingWeight.bulkScorer(AssertingWeight.java:68)
	at org.apache.lucene.search.IndexSearcher.search(IndexSearcher.java:666)
	at org.apache.lucene.search.AssertingIndexSearcher.search(AssertingIndexSearcher.java:91)
	at org.apache.lucene.search.IndexSearcher.search(IndexSearcher.java:473)
	at org.apache.lucene.search.TestPointQueries$2._run(TestPointQueries.java:805)
	at org.apache.lucene.search.TestPointQueries$2.run(TestPointQueries.java:758)




Build Log:
[...truncated 632 lines...]
   [junit4] Suite: org.apache.lucene.search.TestPointQueries
   [junit4] IGNOR/A 0.00s J2 | TestPointQueries.testRandomLongsBig
   [junit4]    > Assumption #1: 'nightly' test group is disabled (@Nightly())
   [junit4]   2> may 02, 2016 12:09:59 PM com.carrotsearch.randomizedtesting.RandomizedRunner$QueueUncaughtExceptionsHandler
uncaughtException
   [junit4]   2> WARNING: Uncaught exception in thread: Thread[T0,5,TGRP-TestPointQueries]
   [junit4]   2> java.lang.AssertionError
   [junit4]   2> 	at __randomizedtesting.SeedInfo.seed([853BD8FA355081B0]:0)
   [junit4]   2> 	at org.apache.lucene.util.DocIdSetBuilder.<init>(DocIdSetBuilder.java:110)
   [junit4]   2> 	at org.apache.lucene.util.DocIdSetBuilder.<init>(DocIdSetBuilder.java:98)
   [junit4]   2> 	at org.apache.lucene.search.PointRangeQuery$1.buildMatchingDocIdSet(PointRangeQuery.java:109)
   [junit4]   2> 	at org.apache.lucene.search.PointRangeQuery$1.scorer(PointRangeQuery.java:213)
   [junit4]   2> 	at org.apache.lucene.search.Weight.bulkScorer(Weight.java:135)
   [junit4]   2> 	at org.apache.lucene.search.LRUQueryCache$CachingWrapperWeight.bulkScorer(LRUQueryCache.java:769)
   [junit4]   2> 	at org.apache.lucene.search.AssertingWeight.bulkScorer(AssertingWeight.java:68)
   [junit4]   2> 	at org.apache.lucene.search.AssertingWeight.bulkScorer(AssertingWeight.java:68)
   [junit4]   2> 	at org.apache.lucene.search.IndexSearcher.search(IndexSearcher.java:666)
   [junit4]   2> 	at org.apache.lucene.search.AssertingIndexSearcher.search(AssertingIndexSearcher.java:91)
   [junit4]   2> 	at org.apache.lucene.search.IndexSearcher.search(IndexSearcher.java:473)
   [junit4]   2> 	at org.apache.lucene.search.TestPointQueries$2._run(TestPointQueries.java:805)
   [junit4]   2> 	at org.apache.lucene.search.TestPointQueries$2.run(TestPointQueries.java:758)
   [junit4]   2> 
   [junit4]   2> may 02, 2016 12:09:59 PM com.carrotsearch.randomizedtesting.RandomizedRunner$QueueUncaughtExceptionsHandler
uncaughtException
   [junit4]   2> WARNING: Uncaught exception in thread: Thread[T2,5,TGRP-TestPointQueries]
   [junit4]   2> java.lang.AssertionError
   [junit4]   2> 	at __randomizedtesting.SeedInfo.seed([853BD8FA355081B0]:0)
   [junit4]   2> 	at org.apache.lucene.util.DocIdSetBuilder.<init>(DocIdSetBuilder.java:110)
   [junit4]   2> 	at org.apache.lucene.util.DocIdSetBuilder.<init>(DocIdSetBuilder.java:98)
   [junit4]   2> 	at org.apache.lucene.search.PointRangeQuery$1.buildMatchingDocIdSet(PointRangeQuery.java:109)
   [junit4]   2> 	at org.apache.lucene.search.PointRangeQuery$1.scorer(PointRangeQuery.java:213)
   [junit4]   2> 	at org.apache.lucene.search.Weight.bulkScorer(Weight.java:135)
   [junit4]   2> 	at org.apache.lucene.search.LRUQueryCache$CachingWrapperWeight.bulkScorer(LRUQueryCache.java:769)
   [junit4]   2> 	at org.apache.lucene.search.AssertingWeight.bulkScorer(AssertingWeight.java:68)
   [junit4]   2> 	at org.apache.lucene.search.AssertingWeight.bulkScorer(AssertingWeight.java:68)
   [junit4]   2> 	at org.apache.lucene.search.IndexSearcher.search(IndexSearcher.java:666)
   [junit4]   2> 	at org.apache.lucene.search.AssertingIndexSearcher.search(AssertingIndexSearcher.java:91)
   [junit4]   2> 	at org.apache.lucene.search.IndexSearcher.search(IndexSearcher.java:473)
   [junit4]   2> 	at org.apache.lucene.search.TestPointQueries$2._run(TestPointQueries.java:805)
   [junit4]   2> 	at org.apache.lucene.search.TestPointQueries$2.run(TestPointQueries.java:758)
   [junit4]   2> 
   [junit4]   2> may 02, 2016 12:09:59 PM com.carrotsearch.randomizedtesting.RandomizedRunner$QueueUncaughtExceptionsHandler
uncaughtException
   [junit4]   2> WARNING: Uncaught exception in thread: Thread[T1,5,TGRP-TestPointQueries]
   [junit4]   2> java.lang.AssertionError
   [junit4]   2> 	at __randomizedtesting.SeedInfo.seed([853BD8FA355081B0]:0)
   [junit4]   2> 	at org.apache.lucene.util.DocIdSetBuilder.<init>(DocIdSetBuilder.java:110)
   [junit4]   2> 	at org.apache.lucene.util.DocIdSetBuilder.<init>(DocIdSetBuilder.java:98)
   [junit4]   2> 	at org.apache.lucene.search.PointRangeQuery$1.buildMatchingDocIdSet(PointRangeQuery.java:109)
   [junit4]   2> 	at org.apache.lucene.search.PointRangeQuery$1.scorer(PointRangeQuery.java:213)
   [junit4]   2> 	at org.apache.lucene.search.Weight.bulkScorer(Weight.java:135)
   [junit4]   2> 	at org.apache.lucene.search.LRUQueryCache$CachingWrapperWeight.bulkScorer(LRUQueryCache.java:754)
   [junit4]   2> 	at org.apache.lucene.search.AssertingWeight.bulkScorer(AssertingWeight.java:68)
   [junit4]   2> 	at org.apache.lucene.search.AssertingWeight.bulkScorer(AssertingWeight.java:68)
   [junit4]   2> 	at org.apache.lucene.search.IndexSearcher.search(IndexSearcher.java:666)
   [junit4]   2> 	at org.apache.lucene.search.AssertingIndexSearcher.search(AssertingIndexSearcher.java:91)
   [junit4]   2> 	at org.apache.lucene.search.IndexSearcher.search(IndexSearcher.java:473)
   [junit4]   2> 	at org.apache.lucene.search.TestPointQueries$2._run(TestPointQueries.java:805)
   [junit4]   2> 	at org.apache.lucene.search.TestPointQueries$2.run(TestPointQueries.java:758)
   [junit4]   2> 
   [junit4]   2> may 02, 2016 12:09:59 PM com.carrotsearch.randomizedtesting.RandomizedRunner$QueueUncaughtExceptionsHandler
uncaughtException
   [junit4]   2> WARNING: Uncaught exception in thread: Thread[T3,5,TGRP-TestPointQueries]
   [junit4]   2> java.lang.AssertionError
   [junit4]   2> 	at __randomizedtesting.SeedInfo.seed([853BD8FA355081B0]:0)
   [junit4]   2> 	at org.apache.lucene.util.DocIdSetBuilder.<init>(DocIdSetBuilder.java:110)
   [junit4]   2> 	at org.apache.lucene.util.DocIdSetBuilder.<init>(DocIdSetBuilder.java:98)
   [junit4]   2> 	at org.apache.lucene.search.PointRangeQuery$1.buildMatchingDocIdSet(PointRangeQuery.java:109)
   [junit4]   2> 	at org.apache.lucene.search.PointRangeQuery$1.scorer(PointRangeQuery.java:213)
   [junit4]   2> 	at org.apache.lucene.search.Weight.bulkScorer(Weight.java:135)
   [junit4]   2> 	at org.apache.lucene.search.LRUQueryCache$CachingWrapperWeight.bulkScorer(LRUQueryCache.java:769)
   [junit4]   2> 	at org.apache.lucene.search.AssertingWeight.bulkScorer(AssertingWeight.java:68)
   [junit4]   2> 	at org.apache.lucene.search.AssertingWeight.bulkScorer(AssertingWeight.java:68)
   [junit4]   2> 	at org.apache.lucene.search.IndexSearcher.search(IndexSearcher.java:666)
   [junit4]   2> 	at org.apache.lucene.search.AssertingIndexSearcher.search(AssertingIndexSearcher.java:91)
   [junit4]   2> 	at org.apache.lucene.search.IndexSearcher.search(IndexSearcher.java:473)
   [junit4]   2> 	at org.apache.lucene.search.TestPointQueries$2._run(TestPointQueries.java:805)
   [junit4]   2> 	at org.apache.lucene.search.TestPointQueries$2.run(TestPointQueries.java:758)
   [junit4]   2> 
   [junit4]   2> may 02, 2016 12:09:59 PM com.carrotsearch.randomizedtesting.RandomizedRunner$QueueUncaughtExceptionsHandler
uncaughtException
   [junit4]   2> WARNING: Uncaught exception in thread: Thread[T4,5,TGRP-TestPointQueries]
   [junit4]   2> java.lang.AssertionError
   [junit4]   2> 	at __randomizedtesting.SeedInfo.seed([853BD8FA355081B0]:0)
   [junit4]   2> 	at org.apache.lucene.util.DocIdSetBuilder.<init>(DocIdSetBuilder.java:110)
   [junit4]   2> 	at org.apache.lucene.util.DocIdSetBuilder.<init>(DocIdSetBuilder.java:98)
   [junit4]   2> 	at org.apache.lucene.search.PointRangeQuery$1.buildMatchingDocIdSet(PointRangeQuery.java:109)
   [junit4]   2> 	at org.apache.lucene.search.PointRangeQuery$1.scorer(PointRangeQuery.java:213)
   [junit4]   2> 	at org.apache.lucene.search.Weight.bulkScorer(Weight.java:135)
   [junit4]   2> 	at org.apache.lucene.search.LRUQueryCache$CachingWrapperWeight.bulkScorer(LRUQueryCache.java:754)
   [junit4]   2> 	at org.apache.lucene.search.AssertingWeight.bulkScorer(AssertingWeight.java:68)
   [junit4]   2> 	at org.apache.lucene.search.AssertingWeight.bulkScorer(AssertingWeight.java:68)
   [junit4]   2> 	at org.apache.lucene.search.IndexSearcher.search(IndexSearcher.java:666)
   [junit4]   2> 	at org.apache.lucene.search.AssertingIndexSearcher.search(AssertingIndexSearcher.java:91)
   [junit4]   2> 	at org.apache.lucene.search.IndexSearcher.search(IndexSearcher.java:473)
   [junit4]   2> 	at org.apache.lucene.search.TestPointQueries$2._run(TestPointQueries.java:805)
   [junit4]   2> 	at org.apache.lucene.search.TestPointQueries$2.run(TestPointQueries.java:758)
   [junit4]   2> 
   [junit4]   2> NOTE: reproduce with: ant test  -Dtestcase=TestPointQueries -Dtests.method=testRandomBinaryTiny
-Dtests.seed=853BD8FA355081B0 -Dtests.multiplier=3 -Dtests.slow=true -Dtests.locale=es-CU
-Dtests.timezone=America/Mendoza -Dtests.asserts=true -Dtests.file.encoding=UTF-8
   [junit4] ERROR   0.03s J2 | TestPointQueries.testRandomBinaryTiny <<<
   [junit4]    > Throwable #1: com.carrotsearch.randomizedtesting.UncaughtExceptionError:
Captured an uncaught exception in thread: Thread[id=673, name=T4, state=RUNNABLE, group=TGRP-TestPointQueries]
   [junit4]    > Caused by: java.lang.AssertionError
   [junit4]    > 	at __randomizedtesting.SeedInfo.seed([853BD8FA355081B0]:0)
   [junit4]    > 	at org.apache.lucene.util.DocIdSetBuilder.<init>(DocIdSetBuilder.java:110)
   [junit4]    > 	at org.apache.lucene.util.DocIdSetBuilder.<init>(DocIdSetBuilder.java:98)
   [junit4]    > 	at org.apache.lucene.search.PointRangeQuery$1.buildMatchingDocIdSet(PointRangeQuery.java:109)
   [junit4]    > 	at org.apache.lucene.search.PointRangeQuery$1.scorer(PointRangeQuery.java:213)
   [junit4]    > 	at org.apache.lucene.search.Weight.bulkScorer(Weight.java:135)
   [junit4]    > 	at org.apache.lucene.search.LRUQueryCache$CachingWrapperWeight.bulkScorer(LRUQueryCache.java:754)
   [junit4]    > 	at org.apache.lucene.search.AssertingWeight.bulkScorer(AssertingWeight.java:68)
   [junit4]    > 	at org.apache.lucene.search.AssertingWeight.bulkScorer(AssertingWeight.java:68)
   [junit4]    > 	at org.apache.lucene.search.IndexSearcher.search(IndexSearcher.java:666)
   [junit4]    > 	at org.apache.lucene.search.AssertingIndexSearcher.search(AssertingIndexSearcher.java:91)
   [junit4]    > 	at org.apache.lucene.search.IndexSearcher.search(IndexSearcher.java:473)
   [junit4]    > 	at org.apache.lucene.search.TestPointQueries$2._run(TestPointQueries.java:805)
   [junit4]    > 	at org.apache.lucene.search.TestPointQueries$2.run(TestPointQueries.java:758)Throwable
#2: com.carrotsearch.randomizedtesting.UncaughtExceptionError: Captured an uncaught exception
in thread: Thread[id=671, name=T2, state=RUNNABLE, group=TGRP-TestPointQueries]
   [junit4]    > Caused by: java.lang.AssertionError
   [junit4]    > 	at __randomizedtesting.SeedInfo.seed([853BD8FA355081B0]:0)
   [junit4]    > 	at org.apache.lucene.util.DocIdSetBuilder.<init>(DocIdSetBuilder.java:110)
   [junit4]    > 	at org.apache.lucene.util.DocIdSetBuilder.<init>(DocIdSetBuilder.java:98)
   [junit4]    > 	at org.apache.lucene.search.PointRangeQuery$1.buildMatchingDocIdSet(PointRangeQuery.java:109)
   [junit4]    > 	at org.apache.lucene.search.PointRangeQuery$1.scorer(PointRangeQuery.java:213)
   [junit4]    > 	at org.apache.lucene.search.Weight.bulkScorer(Weight.java:135)
   [junit4]    > 	at org.apache.lucene.search.LRUQueryCache$CachingWrapperWeight.bulkScorer(LRUQueryCache.java:769)
   [junit4]    > 	at org.apache.lucene.search.AssertingWeight.bulkScorer(AssertingWeight.java:68)
   [junit4]    > 	at org.apache.lucene.search.AssertingWeight.bulkScorer(AssertingWeight.java:68)
   [junit4]    > 	at org.apache.lucene.search.IndexSearcher.search(IndexSearcher.java:666)
   [junit4]    > 	at org.apache.lucene.search.AssertingIndexSearcher.search(AssertingIndexSearcher.java:91)
   [junit4]    > 	at org.apache.lucene.search.IndexSearcher.search(IndexSearcher.java:473)
   [junit4]    > 	at org.apache.lucene.search.TestPointQueries$2._run(TestPointQueries.java:805)
   [junit4]    > 	at org.apache.lucene.search.TestPointQueries$2.run(TestPointQueries.java:758)Throwable
#3: com.carrotsearch.randomizedtesting.UncaughtExceptionError: Captured an uncaught exception
in thread: Thread[id=669, name=T0, state=RUNNABLE, group=TGRP-TestPointQueries]
   [junit4]    > Caused by: java.lang.AssertionError
   [junit4]    > 	at __randomizedtesting.SeedInfo.seed([853BD8FA355081B0]:0)
   [junit4]    > 	at org.apache.lucene.util.DocIdSetBuilder.<init>(DocIdSetBuilder.java:110)
   [junit4]    > 	at org.apache.lucene.util.DocIdSetBuilder.<init>(DocIdSetBuilder.java:98)
   [junit4]    > 	at org.apache.lucene.search.PointRangeQuery$1.buildMatchingDocIdSet(PointRangeQuery.java:109)
   [junit4]    > 	at org.apache.lucene.search.PointRangeQuery$1.scorer(PointRangeQuery.java:213)
   [junit4]    > 	at org.apache.lucene.search.Weight.bulkScorer(Weight.java:135)
   [junit4]    > 	at org.apache.lucene.search.LRUQueryCache$CachingWrapperWeight.bulkScorer(LRUQueryCache.java:769)
   [junit4]    > 	at org.apache.lucene.search.AssertingWeight.bulkScorer(AssertingWeight.java:68)
   [junit4]    > 	at org.apache.lucene.search.AssertingWeight.bulkScorer(AssertingWeight.java:68)
   [junit4]    > 	at org.apache.lucene.search.IndexSearcher.search(IndexSearcher.java:666)
   [junit4]    > 	at org.apache.lucene.search.AssertingIndexSearcher.search(AssertingIndexSearcher.java:91)
   [junit4]    > 	at org.apache.lucene.search.IndexSearcher.search(IndexSearcher.java:473)
   [junit4]    > 	at org.apache.lucene.search.TestPointQueries$2._run(TestPointQueries.java:805)
   [junit4]    > 	at org.apache.lucene.search.TestPointQueries$2.run(TestPointQueries.java:758)Throwable
#4: com.carrotsearch.randomizedtesting.UncaughtExceptionError: Captured an uncaught exception
in thread: Thread[id=672, name=T3, state=RUNNABLE, group=TGRP-TestPointQueries]
   [junit4]    > Caused by: java.lang.AssertionError
   [junit4]    > 	at __randomizedtesting.SeedInfo.seed([853BD8FA355081B0]:0)
   [junit4]    > 	at org.apache.lucene.util.DocIdSetBuilder.<init>(DocIdSetBuilder.java:110)
   [junit4]    > 	at org.apache.lucene.util.DocIdSetBuilder.<init>(DocIdSetBuilder.java:98)
   [junit4]    > 	at org.apache.lucene.search.PointRangeQuery$1.buildMatchingDocIdSet(PointRangeQuery.java:109)
   [junit4]    > 	at org.apache.lucene.search.PointRangeQuery$1.scorer(PointRangeQuery.java:213)
   [junit4]    > 	at org.apache.lucene.search.Weight.bulkScorer(Weight.java:135)
   [junit4]    > 	at org.apache.lucene.search.LRUQueryCache$CachingWrapperWeight.bulkScorer(LRUQueryCache.java:769)
   [junit4]    > 	at org.apache.lucene.search.AssertingWeight.bulkScorer(AssertingWeight.java:68)
   [junit4]    > 	at org.apache.lucene.search.AssertingWeight.bulkScorer(AssertingWeight.java:68)
   [junit4]    > 	at org.apache.lucene.search.IndexSearcher.search(IndexSearcher.java:666)
   [junit4]    > 	at org.apache.lucene.search.AssertingIndexSearcher.search(AssertingIndexSearcher.java:91)
   [junit4]    > 	at org.apache.lucene.search.IndexSearcher.search(IndexSearcher.java:473)
   [junit4]    > 	at org.apache.lucene.search.TestPointQueries$2._run(TestPointQueries.java:805)
   [junit4]    > 	at org.apache.lucene.search.TestPointQueries$2.run(TestPointQueries.java:758)Throwable
#5: com.carrotsearch.randomizedtesting.UncaughtExceptionError: Captured an uncaught exception
in thread: Thread[id=670, name=T1, state=RUNNABLE, group=TGRP-TestPointQueries]
   [junit4]    > Caused by: java.lang.AssertionError
   [junit4]    > 	at __randomizedtesting.SeedInfo.seed([853BD8FA355081B0]:0)
   [junit4]    > 	at org.apache.lucene.util.DocIdSetBuilder.<init>(DocIdSetBuilder.java:110)
   [junit4]    > 	at org.apache.lucene.util.DocIdSetBuilder.<init>(DocIdSetBuilder.java:98)
   [junit4]    > 	at org.apache.lucene.search.PointRangeQuery$1.buildMatchingDocIdSet(PointRangeQuery.java:109)
   [junit4]    > 	at org.apache.lucene.search.PointRangeQuery$1.scorer(PointRangeQuery.java:213)
   [junit4]    > 	at org.apache.lucene.search.Weight.bulkScorer(Weight.java:135)
   [junit4]    > 	at org.apache.lucene.search.LRUQueryCache$CachingWrapperWeight.bulkScorer(LRUQueryCache.java:754)
   [junit4]    > 	at org.apache.lucene.search.AssertingWeight.bulkScorer(AssertingWeight.java:68)
   [junit4]    > 	at org.apache.lucene.search.AssertingWeight.bulkScorer(AssertingWeight.java:68)
   [junit4]    > 	at org.apache.lucene.search.IndexSearcher.search(IndexSearcher.java:666)
   [junit4]    > 	at org.apache.lucene.search.AssertingIndexSearcher.search(AssertingIndexSearcher.java:91)
   [junit4]    > 	at org.apache.lucene.search.IndexSearcher.search(IndexSearcher.java:473)
   [junit4]    > 	at org.apache.lucene.search.TestPointQueries$2._run(TestPointQueries.java:805)
   [junit4]    > 	at org.apache.lucene.search.TestPointQueries$2.run(TestPointQueries.java:758)
   [junit4] IGNOR/A 0.00s J2 | TestPointQueries.testRandomBinaryBig
   [junit4]    > Assumption #1: 'nightly' test group is disabled (@Nightly())
   [junit4]   2> NOTE: test params are: codec=Asserting(Lucene60): {id=PostingsFormat(name=MockRandom)},
docValues:{id=DocValuesFormat(name=Lucene54), value=DocValuesFormat(name=Asserting)}, maxPointsInLeafNode=1512,
maxMBSortInHeap=5.454717378708793, sim=ClassicSimilarity, locale=es-CU, timezone=America/Mendoza
   [junit4]   2> NOTE: Linux 4.2.0-35-generic amd64/Oracle Corporation 1.8.0_92 (64-bit)/cpus=12,threads=1,free=314256296,total=508887040
   [junit4]   2> NOTE: All tests run in this JVM: [TestIndexWriterReader, TestPrefixCodedTerms,
TestBytesRefHash, TestFieldValueQuery, TestIntBlockPool, TestSpanNearQuery, TestElevationComparator,
TestTermVectors, TestTimSorter, TestCharsRef, TestMultiThreadTermVectors, TestSortedSetDocValues,
TestTryDelete, TestSortedSetSortField, TestBM25Similarity, TestFrequencyTrackingRingBuffer,
TestTotalHitCountCollector, TestGeoUtils, TestSimpleFSLockFactory, TestIntsRef, TestCachingCollector,
TestNumericRangeQuery32, TestMergeSchedulerExternal, TestNativeFSLockFactory, TestControlledRealTimeReopenThread,
TestFilterDirectoryReader, TestNearSpansOrdered, TestArrayUtil, TestPhrasePrefixQuery, TestIOUtils,
TestApproximationSearchEquivalence, TestIndexInput, TestSearchWithThreads, Test2BBinaryDocValues,
Test2BNumericDocValues, TestBooleanRewrites, TestTwoPhaseCommitTool, TestRollingUpdates, TestTransactions,
TestMultiMMap, TestSimpleSearchEquivalence, TestSearch, TestBooleanOr, TestMixedCodecs, TestLazyProxSkipping,
TestTrackingDirectoryWrapper, TestSpanExplanationsOfNonMatches, TestIndexFileDeleter, TestForUtil,
TestBagOfPositions, TestTermsEnum2, TestDocBoost, TestSpanFirstQuery, TestMutableValues, TestComplexExplanations,
TestIntroSorter, TestLucene60PointsFormat, TestSpanBoostQuery, TestPointQueries]
   [junit4]   2> NOTE: reproduce with: ant test  -Dtestcase=TestPointQueries -Dtests.seed=853BD8FA355081B0
-Dtests.multiplier=3 -Dtests.slow=true -Dtests.locale=es-CU -Dtests.timezone=America/Mendoza
-Dtests.asserts=true -Dtests.file.encoding=UTF-8
   [junit4] ERROR   0.00s J2 | TestPointQueries (suite) <<<
   [junit4]    > Throwable #1: java.lang.AssertionError: The test or suite printed 13886
bytes to stdout and stderr, even though the limit was set to 8192 bytes. Increase the limit
with @Limit, ignore it completely with @SuppressSysoutChecks or run with -Dtests.verbose=true
   [junit4]    > 	at __randomizedtesting.SeedInfo.seed([853BD8FA355081B0]:0)
   [junit4]    > 	at java.lang.Thread.run(Thread.java:745)
   [junit4] Completed [125/419 (1!)] on J2 in 8.33s, 45 tests, 1 failure, 1 error, 2 skipped
<<< FAILURES!

[...truncated 973 lines...]
BUILD FAILED
/home/jenkins/workspace/Lucene-Solr-master-Linux/build.xml:740: The following error occurred
while executing this line:
/home/jenkins/workspace/Lucene-Solr-master-Linux/build.xml:684: The following error occurred
while executing this line:
/home/jenkins/workspace/Lucene-Solr-master-Linux/build.xml:59: The following error occurred
while executing this line:
/home/jenkins/workspace/Lucene-Solr-master-Linux/lucene/build.xml:50: The following error
occurred while executing this line:
/home/jenkins/workspace/Lucene-Solr-master-Linux/lucene/common-build.xml:1457: The following
error occurred while executing this line:
/home/jenkins/workspace/Lucene-Solr-master-Linux/lucene/common-build.xml:1014: There were
test failures: 419 suites (1 ignored), 3505 tests, 1 suite-level error, 1 error, 64 ignored
(60 assumptions) [seed: 853BD8FA355081B0]

Total time: 6 minutes 5 seconds
Build step 'Invoke Ant' marked build as failure
Archiving artifacts
[WARNINGS] Skipping publisher since build result is FAILURE
Recording test results
Email was triggered for: Failure - Any
Sending email for trigger: Failure - Any



Mime
View raw message