lucene-dev mailing list archives

Site index · List index
Message view « Date » · « Thread »
Top « Date » · « Thread »
From Policeman Jenkins Server <jenk...@thetaphi.de>
Subject [JENKINS] Lucene-Solr-6.x-Solaris (64bit/jdk1.8.0) - Build # 143 - Failure!
Date Thu, 19 May 2016 11:11:46 GMT
Build: http://jenkins.thetaphi.de/job/Lucene-Solr-6.x-Solaris/143/
Java: 64bit/jdk1.8.0 -XX:-UseCompressedOops -XX:+UseG1GC

3 tests failed.
FAILED:  org.apache.solr.cloud.CustomCollectionTest.test

Error Message:
No live SolrServers available to handle this request:[http://127.0.0.1:62330, http://127.0.0.1:55285, http://127.0.0.1:39933, http://127.0.0.1:50965, http://127.0.0.1:34488]

Stack Trace:
org.apache.solr.client.solrj.SolrServerException: No live SolrServers available to handle this request:[http://127.0.0.1:62330, http://127.0.0.1:55285, http://127.0.0.1:39933, http://127.0.0.1:50965, http://127.0.0.1:34488]
	at __randomizedtesting.SeedInfo.seed([4AE541750EB8EEBA:C2B17EAFA0448342]:0)
	at org.apache.solr.client.solrj.impl.LBHttpSolrClient.request(LBHttpSolrClient.java:384)
	at org.apache.solr.client.solrj.impl.CloudSolrClient.sendRequest(CloudSolrClient.java:1228)
	at org.apache.solr.client.solrj.impl.CloudSolrClient.requestWithRetryOnStaleState(CloudSolrClient.java:998)
	at org.apache.solr.client.solrj.impl.CloudSolrClient.request(CloudSolrClient.java:934)
	at org.apache.solr.client.solrj.SolrClient.request(SolrClient.java:1219)
	at org.apache.solr.cloud.AbstractFullDistribZkTestBase.createCollection(AbstractFullDistribZkTestBase.java:1595)
	at org.apache.solr.cloud.AbstractFullDistribZkTestBase.createCollection(AbstractFullDistribZkTestBase.java:1549)
	at org.apache.solr.cloud.CustomCollectionTest.testRouteFieldForHashRouter(CustomCollectionTest.java:337)
	at org.apache.solr.cloud.CustomCollectionTest.test(CustomCollectionTest.java:100)
	at sun.reflect.NativeMethodAccessorImpl.invoke0(Native Method)
	at sun.reflect.NativeMethodAccessorImpl.invoke(NativeMethodAccessorImpl.java:62)
	at sun.reflect.DelegatingMethodAccessorImpl.invoke(DelegatingMethodAccessorImpl.java:43)
	at java.lang.reflect.Method.invoke(Method.java:498)
	at com.carrotsearch.randomizedtesting.RandomizedRunner.invoke(RandomizedRunner.java:1764)
	at com.carrotsearch.randomizedtesting.RandomizedRunner$8.evaluate(RandomizedRunner.java:871)
	at com.carrotsearch.randomizedtesting.RandomizedRunner$9.evaluate(RandomizedRunner.java:907)
	at com.carrotsearch.randomizedtesting.RandomizedRunner$10.evaluate(RandomizedRunner.java:921)
	at org.apache.solr.BaseDistributedSearchTestCase$ShardsRepeatRule$ShardsFixedStatement.callStatement(BaseDistributedSearchTestCase.java:992)
	at org.apache.solr.BaseDistributedSearchTestCase$ShardsRepeatRule$ShardsStatement.evaluate(BaseDistributedSearchTestCase.java:967)
	at com.carrotsearch.randomizedtesting.rules.SystemPropertiesRestoreRule$1.evaluate(SystemPropertiesRestoreRule.java:57)
	at org.apache.lucene.util.TestRuleSetupTeardownChained$1.evaluate(TestRuleSetupTeardownChained.java:49)
	at org.apache.lucene.util.AbstractBeforeAfterRule$1.evaluate(AbstractBeforeAfterRule.java:45)
	at org.apache.lucene.util.TestRuleThreadAndTestName$1.evaluate(TestRuleThreadAndTestName.java:48)
	at org.apache.lucene.util.TestRuleIgnoreAfterMaxFailures$1.evaluate(TestRuleIgnoreAfterMaxFailures.java:64)
	at org.apache.lucene.util.TestRuleMarkFailure$1.evaluate(TestRuleMarkFailure.java:47)
	at com.carrotsearch.randomizedtesting.rules.StatementAdapter.evaluate(StatementAdapter.java:36)
	at com.carrotsearch.randomizedtesting.ThreadLeakControl$StatementRunner.run(ThreadLeakControl.java:367)
	at com.carrotsearch.randomizedtesting.ThreadLeakControl.forkTimeoutingTask(ThreadLeakControl.java:809)
	at com.carrotsearch.randomizedtesting.ThreadLeakControl$3.evaluate(ThreadLeakControl.java:460)
	at com.carrotsearch.randomizedtesting.RandomizedRunner.runSingleTest(RandomizedRunner.java:880)
	at com.carrotsearch.randomizedtesting.RandomizedRunner$5.evaluate(RandomizedRunner.java:781)
	at com.carrotsearch.randomizedtesting.RandomizedRunner$6.evaluate(RandomizedRunner.java:816)
	at com.carrotsearch.randomizedtesting.RandomizedRunner$7.evaluate(RandomizedRunner.java:827)
	at com.carrotsearch.randomizedtesting.rules.StatementAdapter.evaluate(StatementAdapter.java:36)
	at com.carrotsearch.randomizedtesting.rules.SystemPropertiesRestoreRule$1.evaluate(SystemPropertiesRestoreRule.java:57)
	at org.apache.lucene.util.AbstractBeforeAfterRule$1.evaluate(AbstractBeforeAfterRule.java:45)
	at com.carrotsearch.randomizedtesting.rules.StatementAdapter.evaluate(StatementAdapter.java:36)
	at org.apache.lucene.util.TestRuleStoreClassName$1.evaluate(TestRuleStoreClassName.java:41)
	at com.carrotsearch.randomizedtesting.rules.NoShadowingOrOverridesOnMethodsRule$1.evaluate(NoShadowingOrOverridesOnMethodsRule.java:40)
	at com.carrotsearch.randomizedtesting.rules.NoShadowingOrOverridesOnMethodsRule$1.evaluate(NoShadowingOrOverridesOnMethodsRule.java:40)
	at com.carrotsearch.randomizedtesting.rules.StatementAdapter.evaluate(StatementAdapter.java:36)
	at com.carrotsearch.randomizedtesting.rules.StatementAdapter.evaluate(StatementAdapter.java:36)
	at com.carrotsearch.randomizedtesting.rules.StatementAdapter.evaluate(StatementAdapter.java:36)
	at org.apache.lucene.util.TestRuleAssertionsRequired$1.evaluate(TestRuleAssertionsRequired.java:53)
	at org.apache.lucene.util.TestRuleMarkFailure$1.evaluate(TestRuleMarkFailure.java:47)
	at org.apache.lucene.util.TestRuleIgnoreAfterMaxFailures$1.evaluate(TestRuleIgnoreAfterMaxFailures.java:64)
	at org.apache.lucene.util.TestRuleIgnoreTestSuites$1.evaluate(TestRuleIgnoreTestSuites.java:54)
	at com.carrotsearch.randomizedtesting.rules.StatementAdapter.evaluate(StatementAdapter.java:36)
	at com.carrotsearch.randomizedtesting.ThreadLeakControl$StatementRunner.run(ThreadLeakControl.java:367)
	at java.lang.Thread.run(Thread.java:745)
Caused by: org.apache.solr.client.solrj.impl.HttpSolrClient$RemoteSolrException: Error from server at http://127.0.0.1:34488: KeeperErrorCode = Session expired for /overseer/collection-queue-work/qnr-
	at org.apache.solr.client.solrj.impl.HttpSolrClient.executeMethod(HttpSolrClient.java:590)
	at org.apache.solr.client.solrj.impl.HttpSolrClient.request(HttpSolrClient.java:259)
	at org.apache.solr.client.solrj.impl.HttpSolrClient.request(HttpSolrClient.java:248)
	at org.apache.solr.client.solrj.impl.LBHttpSolrClient.doRequest(LBHttpSolrClient.java:404)
	at org.apache.solr.client.solrj.impl.LBHttpSolrClient.request(LBHttpSolrClient.java:357)
	... 49 more


FAILED:  org.apache.solr.security.BasicAuthIntegrationTest.testBasics

Error Message:
Test abandoned because suite timeout was reached.

Stack Trace:
java.lang.Exception: Test abandoned because suite timeout was reached.
	at __randomizedtesting.SeedInfo.seed([4AE541750EB8EEBA]:0)


FAILED:  junit.framework.TestSuite.org.apache.solr.security.BasicAuthIntegrationTest

Error Message:
Suite timeout exceeded (>= 7200000 msec).

Stack Trace:
java.lang.Exception: Suite timeout exceeded (>= 7200000 msec).
	at __randomizedtesting.SeedInfo.seed([4AE541750EB8EEBA]:0)




Build Log:
[...truncated 11942 lines...]
   [junit4] Suite: org.apache.solr.cloud.CustomCollectionTest
   [junit4]   2> Creating dataDir: /export/home/jenkins/workspace/Lucene-Solr-6.x-Solaris/solr/build/solr-core/test/J1/temp/solr.cloud.CustomCollectionTest_4AE541750EB8EEBA-001/init-core-data-001
   [junit4]   2> 2813237 INFO  (SUITE-CustomCollectionTest-seed#[4AE541750EB8EEBA]-worker) [    ] o.a.s.BaseDistributedSearchTestCase Setting hostContext system property: /
   [junit4]   2> 2813240 INFO  (TEST-CustomCollectionTest.test-seed#[4AE541750EB8EEBA]) [    ] o.a.s.c.ZkTestServer STARTING ZK TEST SERVER
   [junit4]   2> 2813240 INFO  (Thread-10088) [    ] o.a.s.c.ZkTestServer client port:0.0.0.0/0.0.0.0:0
   [junit4]   2> 2813240 INFO  (Thread-10088) [    ] o.a.s.c.ZkTestServer Starting server
   [junit4]   2> 2813340 INFO  (TEST-CustomCollectionTest.test-seed#[4AE541750EB8EEBA]) [    ] o.a.s.c.ZkTestServer start zk server on port:55788
   [junit4]   2> 2813341 INFO  (TEST-CustomCollectionTest.test-seed#[4AE541750EB8EEBA]) [    ] o.a.s.c.c.SolrZkClient Using default ZkCredentialsProvider
   [junit4]   2> 2813341 INFO  (TEST-CustomCollectionTest.test-seed#[4AE541750EB8EEBA]) [    ] o.a.s.c.c.ConnectionManager Waiting for client to connect to ZooKeeper
   [junit4]   2> 2813344 INFO  (zkCallback-3279-thread-1) [    ] o.a.s.c.c.ConnectionManager Watcher org.apache.solr.common.cloud.ConnectionManager@66d9f6fa name:ZooKeeperConnection Watcher:127.0.0.1:55788 got event WatchedEvent state:SyncConnected type:None path:null path:null type:None
   [junit4]   2> 2813345 INFO  (TEST-CustomCollectionTest.test-seed#[4AE541750EB8EEBA]) [    ] o.a.s.c.c.ConnectionManager Client is connected to ZooKeeper
   [junit4]   2> 2813345 INFO  (TEST-CustomCollectionTest.test-seed#[4AE541750EB8EEBA]) [    ] o.a.s.c.c.SolrZkClient Using default ZkACLProvider
   [junit4]   2> 2813345 INFO  (TEST-CustomCollectionTest.test-seed#[4AE541750EB8EEBA]) [    ] o.a.s.c.c.SolrZkClient makePath: /solr
   [junit4]   2> 2813349 INFO  (TEST-CustomCollectionTest.test-seed#[4AE541750EB8EEBA]) [    ] o.a.s.c.c.SolrZkClient Using default ZkCredentialsProvider
   [junit4]   2> 2813350 INFO  (TEST-CustomCollectionTest.test-seed#[4AE541750EB8EEBA]) [    ] o.a.s.c.c.ConnectionManager Waiting for client to connect to ZooKeeper
   [junit4]   2> 2813352 INFO  (zkCallback-3280-thread-1) [    ] o.a.s.c.c.ConnectionManager Watcher org.apache.solr.common.cloud.ConnectionManager@1d79dd3a name:ZooKeeperConnection Watcher:127.0.0.1:55788/solr got event WatchedEvent state:SyncConnected type:None path:null path:null type:None
   [junit4]   2> 2813352 INFO  (TEST-CustomCollectionTest.test-seed#[4AE541750EB8EEBA]) [    ] o.a.s.c.c.ConnectionManager Client is connected to ZooKeeper
   [junit4]   2> 2813352 INFO  (TEST-CustomCollectionTest.test-seed#[4AE541750EB8EEBA]) [    ] o.a.s.c.c.SolrZkClient Using default ZkACLProvider
   [junit4]   2> 2813353 INFO  (TEST-CustomCollectionTest.test-seed#[4AE541750EB8EEBA]) [    ] o.a.s.c.c.SolrZkClient makePath: /collections/collection1
   [junit4]   2> 2813355 INFO  (TEST-CustomCollectionTest.test-seed#[4AE541750EB8EEBA]) [    ] o.a.s.c.c.SolrZkClient makePath: /collections/collection1/shards
   [junit4]   2> 2813358 INFO  (TEST-CustomCollectionTest.test-seed#[4AE541750EB8EEBA]) [    ] o.a.s.c.c.SolrZkClient makePath: /collections/control_collection
   [junit4]   2> 2813360 INFO  (TEST-CustomCollectionTest.test-seed#[4AE541750EB8EEBA]) [    ] o.a.s.c.c.SolrZkClient makePath: /collections/control_collection/shards
   [junit4]   2> 2813364 INFO  (TEST-CustomCollectionTest.test-seed#[4AE541750EB8EEBA]) [    ] o.a.s.c.AbstractZkTestCase put /export/home/jenkins/workspace/Lucene-Solr-6.x-Solaris/solr/core/src/test-files/solr/collection1/conf/solrconfig-tlog.xml to /configs/conf1/solrconfig.xml
   [junit4]   2> 2813364 INFO  (TEST-CustomCollectionTest.test-seed#[4AE541750EB8EEBA]) [    ] o.a.s.c.c.SolrZkClient makePath: /configs/conf1/solrconfig.xml
   [junit4]   2> 2813369 INFO  (TEST-CustomCollectionTest.test-seed#[4AE541750EB8EEBA]) [    ] o.a.s.c.AbstractZkTestCase put /export/home/jenkins/workspace/Lucene-Solr-6.x-Solaris/solr/core/src/test-files/solr/collection1/conf/schema.xml to /configs/conf1/schema.xml
   [junit4]   2> 2813369 INFO  (TEST-CustomCollectionTest.test-seed#[4AE541750EB8EEBA]) [    ] o.a.s.c.c.SolrZkClient makePath: /configs/conf1/schema.xml
   [junit4]   2> 2813372 INFO  (TEST-CustomCollectionTest.test-seed#[4AE541750EB8EEBA]) [    ] o.a.s.c.AbstractZkTestCase put /export/home/jenkins/workspace/Lucene-Solr-6.x-Solaris/solr/core/src/test-files/solr/collection1/conf/solrconfig.snippet.randomindexconfig.xml to /configs/conf1/solrconfig.snippet.randomindexconfig.xml
   [junit4]   2> 2813372 INFO  (TEST-CustomCollectionTest.test-seed#[4AE541750EB8EEBA]) [    ] o.a.s.c.c.SolrZkClient makePath: /configs/conf1/solrconfig.snippet.randomindexconfig.xml
   [junit4]   2> 2813375 INFO  (TEST-CustomCollectionTest.test-seed#[4AE541750EB8EEBA]) [    ] o.a.s.c.AbstractZkTestCase put /export/home/jenkins/workspace/Lucene-Solr-6.x-Solaris/solr/core/src/test-files/solr/collection1/conf/stopwords.txt to /configs/conf1/stopwords.txt
   [junit4]   2> 2813376 INFO  (TEST-CustomCollectionTest.test-seed#[4AE541750EB8EEBA]) [    ] o.a.s.c.c.SolrZkClient makePath: /configs/conf1/stopwords.txt
   [junit4]   2> 2813379 INFO  (TEST-CustomCollectionTest.test-seed#[4AE541750EB8EEBA]) [    ] o.a.s.c.AbstractZkTestCase put /export/home/jenkins/workspace/Lucene-Solr-6.x-Solaris/solr/core/src/test-files/solr/collection1/conf/protwords.txt to /configs/conf1/protwords.txt
   [junit4]   2> 2813379 INFO  (TEST-CustomCollectionTest.test-seed#[4AE541750EB8EEBA]) [    ] o.a.s.c.c.SolrZkClient makePath: /configs/conf1/protwords.txt
   [junit4]   2> 2813382 INFO  (TEST-CustomCollectionTest.test-seed#[4AE541750EB8EEBA]) [    ] o.a.s.c.AbstractZkTestCase put /export/home/jenkins/workspace/Lucene-Solr-6.x-Solaris/solr/core/src/test-files/solr/collection1/conf/currency.xml to /configs/conf1/currency.xml
   [junit4]   2> 2813383 INFO  (TEST-CustomCollectionTest.test-seed#[4AE541750EB8EEBA]) [    ] o.a.s.c.c.SolrZkClient makePath: /configs/conf1/currency.xml
   [junit4]   2> 2813387 INFO  (TEST-CustomCollectionTest.test-seed#[4AE541750EB8EEBA]) [    ] o.a.s.c.AbstractZkTestCase put /export/home/jenkins/workspace/Lucene-Solr-6.x-Solaris/solr/core/src/test-files/solr/collection1/conf/enumsConfig.xml to /configs/conf1/enumsConfig.xml
   [junit4]   2> 2813387 INFO  (TEST-CustomCollectionTest.test-seed#[4AE541750EB8EEBA]) [    ] o.a.s.c.c.SolrZkClient makePath: /configs/conf1/enumsConfig.xml
   [junit4]   2> 2813390 INFO  (TEST-CustomCollectionTest.test-seed#[4AE541750EB8EEBA]) [    ] o.a.s.c.AbstractZkTestCase put /export/home/jenkins/workspace/Lucene-Solr-6.x-Solaris/solr/core/src/test-files/solr/collection1/conf/open-exchange-rates.json to /configs/conf1/open-exchange-rates.json
   [junit4]   2> 2813390 INFO  (TEST-CustomCollectionTest.test-seed#[4AE541750EB8EEBA]) [    ] o.a.s.c.c.SolrZkClient makePath: /configs/conf1/open-exchange-rates.json
   [junit4]   2> 2813393 INFO  (TEST-CustomCollectionTest.test-seed#[4AE541750EB8EEBA]) [    ] o.a.s.c.AbstractZkTestCase put /export/home/jenkins/workspace/Lucene-Solr-6.x-Solaris/solr/core/src/test-files/solr/collection1/conf/mapping-ISOLatin1Accent.txt to /configs/conf1/mapping-ISOLatin1Accent.txt
   [junit4]   2> 2813393 INFO  (TEST-CustomCollectionTest.test-seed#[4AE541750EB8EEBA]) [    ] o.a.s.c.c.SolrZkClient makePath: /configs/conf1/mapping-ISOLatin1Accent.txt
   [junit4]   2> 2813396 INFO  (TEST-CustomCollectionTest.test-seed#[4AE541750EB8EEBA]) [    ] o.a.s.c.AbstractZkTestCase put /export/home/jenkins/workspace/Lucene-Solr-6.x-Solaris/solr/core/src/test-files/solr/collection1/conf/old_synonyms.txt to /configs/conf1/old_synonyms.txt
   [junit4]   2> 2813396 INFO  (TEST-CustomCollectionTest.test-seed#[4AE541750EB8EEBA]) [    ] o.a.s.c.c.SolrZkClient makePath: /configs/conf1/old_synonyms.txt
   [junit4]   2> 2813400 INFO  (TEST-CustomCollectionTest.test-seed#[4AE541750EB8EEBA]) [    ] o.a.s.c.AbstractZkTestCase put /export/home/jenkins/workspace/Lucene-Solr-6.x-Solaris/solr/core/src/test-files/solr/collection1/conf/synonyms.txt to /configs/conf1/synonyms.txt
   [junit4]   2> 2813400 INFO  (TEST-CustomCollectionTest.test-seed#[4AE541750EB8EEBA]) [    ] o.a.s.c.c.SolrZkClient makePath: /configs/conf1/synonyms.txt
   [junit4]   2> 2813802 INFO  (TEST-CustomCollectionTest.test-seed#[4AE541750EB8EEBA]) [    ] o.a.s.SolrTestCaseJ4 Writing core.properties file to /export/home/jenkins/workspace/Lucene-Solr-6.x-Solaris/solr/build/solr-core/test/J1/temp/solr.cloud.CustomCollectionTest_4AE541750EB8EEBA-001/control-001/cores/collection1
   [junit4]   2> 2813805 INFO  (TEST-CustomCollectionTest.test-seed#[4AE541750EB8EEBA]) [    ] o.e.j.s.Server jetty-9.3.8.v20160314
   [junit4]   2> 2813807 INFO  (TEST-CustomCollectionTest.test-seed#[4AE541750EB8EEBA]) [    ] o.e.j.s.h.ContextHandler Started o.e.j.s.ServletContextHandler@666f5ffd{/,null,AVAILABLE}
   [junit4]   2> 2813807 INFO  (TEST-CustomCollectionTest.test-seed#[4AE541750EB8EEBA]) [    ] o.e.j.s.ServerConnector Started ServerConnector@7b6e6a57{HTTP/1.1,[http/1.1]}{127.0.0.1:55285}
   [junit4]   2> 2813808 INFO  (TEST-CustomCollectionTest.test-seed#[4AE541750EB8EEBA]) [    ] o.e.j.s.Server Started @2819513ms
   [junit4]   2> 2813808 INFO  (TEST-CustomCollectionTest.test-seed#[4AE541750EB8EEBA]) [    ] o.a.s.c.s.e.JettySolrRunner Jetty properties: {solr.data.dir=/export/home/jenkins/workspace/Lucene-Solr-6.x-Solaris/solr/build/solr-core/test/J1/temp/solr.cloud.CustomCollectionTest_4AE541750EB8EEBA-001/tempDir-001/control/data, hostContext=/, hostPort=55285, coreRootDirectory=/export/home/jenkins/workspace/Lucene-Solr-6.x-Solaris/solr/build/solr-core/test/J1/temp/solr.cloud.CustomCollectionTest_4AE541750EB8EEBA-001/control-001/cores}
   [junit4]   2> 2813808 INFO  (TEST-CustomCollectionTest.test-seed#[4AE541750EB8EEBA]) [    ] o.a.s.s.SolrDispatchFilter SolrDispatchFilter.init(): sun.misc.Launcher$AppClassLoader@6d06d69c
   [junit4]   2> 2813808 INFO  (TEST-CustomCollectionTest.test-seed#[4AE541750EB8EEBA]) [    ] o.a.s.c.SolrResourceLoader new SolrResourceLoader for directory: '/export/home/jenkins/workspace/Lucene-Solr-6.x-Solaris/solr/build/solr-core/test/J1/temp/solr.cloud.CustomCollectionTest_4AE541750EB8EEBA-001/control-001'
   [junit4]   2> 2813808 INFO  (TEST-CustomCollectionTest.test-seed#[4AE541750EB8EEBA]) [    ] o.a.s.c.SolrResourceLoader JNDI not configured for solr (NoInitialContextEx)
   [junit4]   2> 2813808 INFO  (TEST-CustomCollectionTest.test-seed#[4AE541750EB8EEBA]) [    ] o.a.s.c.SolrResourceLoader solr home defaulted to 'solr/' (could not find system property or JNDI)
   [junit4]   2> 2813809 INFO  (TEST-CustomCollectionTest.test-seed#[4AE541750EB8EEBA]) [    ] o.a.s.c.c.SolrZkClient Using default ZkCredentialsProvider
   [junit4]   2> 2813809 INFO  (TEST-CustomCollectionTest.test-seed#[4AE541750EB8EEBA]) [    ] o.a.s.c.c.ConnectionManager Waiting for client to connect to ZooKeeper
   [junit4]   2> 2813856 INFO  (zkCallback-3281-thread-1) [    ] o.a.s.c.c.ConnectionManager Watcher org.apache.solr.common.cloud.ConnectionManager@3f4b29 name:ZooKeeperConnection Watcher:127.0.0.1:55788/solr got event WatchedEvent state:SyncConnected type:None path:null path:null type:None
   [junit4]   2> 2813856 INFO  (TEST-CustomCollectionTest.test-seed#[4AE541750EB8EEBA]) [    ] o.a.s.c.c.ConnectionManager Client is connected to ZooKeeper
   [junit4]   2> 2813857 INFO  (TEST-CustomCollectionTest.test-seed#[4AE541750EB8EEBA]) [    ] o.a.s.c.c.SolrZkClient Using default ZkACLProvider
   [junit4]   2> 2813860 INFO  (TEST-CustomCollectionTest.test-seed#[4AE541750EB8EEBA]) [    ] o.a.s.s.SolrDispatchFilter Loading solr.xml from SolrHome (not found in ZooKeeper)
   [junit4]   2> 2813860 INFO  (TEST-CustomCollectionTest.test-seed#[4AE541750EB8EEBA]) [    ] o.a.s.c.SolrXmlConfig Loading container configuration from /export/home/jenkins/workspace/Lucene-Solr-6.x-Solaris/solr/build/solr-core/test/J1/temp/solr.cloud.CustomCollectionTest_4AE541750EB8EEBA-001/control-001/solr.xml
   [junit4]   2> 2813870 INFO  (TEST-CustomCollectionTest.test-seed#[4AE541750EB8EEBA]) [    ] o.a.s.c.CorePropertiesLocator Config-defined core root directory: /export/home/jenkins/workspace/Lucene-Solr-6.x-Solaris/solr/build/solr-core/test/J1/temp/solr.cloud.CustomCollectionTest_4AE541750EB8EEBA-001/control-001/cores
   [junit4]   2> 2813870 INFO  (TEST-CustomCollectionTest.test-seed#[4AE541750EB8EEBA]) [    ] o.a.s.c.CoreContainer New CoreContainer 870534882
   [junit4]   2> 2813870 INFO  (TEST-CustomCollectionTest.test-seed#[4AE541750EB8EEBA]) [    ] o.a.s.c.CoreContainer Loading cores into CoreContainer [instanceDir=/export/home/jenkins/workspace/Lucene-Solr-6.x-Solaris/solr/build/solr-core/test/J1/temp/solr.cloud.CustomCollectionTest_4AE541750EB8EEBA-001/control-001]
   [junit4]   2> 2813871 WARN  (TEST-CustomCollectionTest.test-seed#[4AE541750EB8EEBA]) [    ] o.a.s.c.CoreContainer Couldn't add files from /export/home/jenkins/workspace/Lucene-Solr-6.x-Solaris/solr/build/solr-core/test/J1/temp/solr.cloud.CustomCollectionTest_4AE541750EB8EEBA-001/control-001/lib to classpath: /export/home/jenkins/workspace/Lucene-Solr-6.x-Solaris/solr/build/solr-core/test/J1/temp/solr.cloud.CustomCollectionTest_4AE541750EB8EEBA-001/control-001/lib
   [junit4]   2> 2813871 INFO  (TEST-CustomCollectionTest.test-seed#[4AE541750EB8EEBA]) [    ] o.a.s.h.c.HttpShardHandlerFactory created with socketTimeout : 90000,urlScheme : ,connTimeout : 15000,maxConnectionsPerHost : 20,maxConnections : 10000,corePoolSize : 0,maximumPoolSize : 2147483647,maxThreadIdleTime : 5,sizeOfQueue : -1,fairnessPolicy : false,useRetries : false,
   [junit4]   2> 2813873 INFO  (TEST-CustomCollectionTest.test-seed#[4AE541750EB8EEBA]) [    ] o.a.s.u.UpdateShardHandler Creating UpdateShardHandler HTTP client with params: socketTimeout=340000&connTimeout=45000&retry=true
   [junit4]   2> 2813875 INFO  (TEST-CustomCollectionTest.test-seed#[4AE541750EB8EEBA]) [    ] o.a.s.l.LogWatcher SLF4J impl is org.slf4j.impl.Log4jLoggerFactory
   [junit4]   2> 2813875 INFO  (TEST-CustomCollectionTest.test-seed#[4AE541750EB8EEBA]) [    ] o.a.s.l.LogWatcher Registering Log Listener [Log4j (org.slf4j.impl.Log4jLoggerFactory)]
   [junit4]   2> 2813875 INFO  (TEST-CustomCollectionTest.test-seed#[4AE541750EB8EEBA]) [    ] o.a.s.c.ZkContainer Zookeeper client=127.0.0.1:55788/solr
   [junit4]   2> 2813875 INFO  (TEST-CustomCollectionTest.test-seed#[4AE541750EB8EEBA]) [    ] o.a.s.c.ZkController zkHost includes chroot
   [junit4]   2> 2813875 INFO  (TEST-CustomCollectionTest.test-seed#[4AE541750EB8EEBA]) [    ] o.a.s.c.c.SolrZkClient Using default ZkCredentialsProvider
   [junit4]   2> 2813877 INFO  (TEST-CustomCollectionTest.test-seed#[4AE541750EB8EEBA]) [    ] o.a.s.c.c.ConnectionManager Waiting for client to connect to ZooKeeper
   [junit4]   2> 2813879 INFO  (zkCallback-3284-thread-1) [    ] o.a.s.c.c.ConnectionManager Watcher org.apache.solr.common.cloud.ConnectionManager@5ffc4b91 name:ZooKeeperConnection Watcher:127.0.0.1:55788 got event WatchedEvent state:SyncConnected type:None path:null path:null type:None
   [junit4]   2> 2813879 INFO  (TEST-CustomCollectionTest.test-seed#[4AE541750EB8EEBA]) [    ] o.a.s.c.c.ConnectionManager Client is connected to ZooKeeper
   [junit4]   2> 2813880 INFO  (TEST-CustomCollectionTest.test-seed#[4AE541750EB8EEBA]) [    ] o.a.s.c.c.SolrZkClient Using default ZkACLProvider
   [junit4]   2> 2813882 INFO  (TEST-CustomCollectionTest.test-seed#[4AE541750EB8EEBA]) [n:127.0.0.1:55285_    ] o.a.s.c.ZkController Added new OnReconnect listener org.apache.solr.cloud.ZkController$$Lambda$78/695550353@714d9fc4
   [junit4]   2> 2813883 INFO  (TEST-CustomCollectionTest.test-seed#[4AE541750EB8EEBA]) [n:127.0.0.1:55285_    ] o.a.s.c.c.ConnectionManager Waiting for client to connect to ZooKeeper
   [junit4]   2> 2813885 INFO  (zkCallback-3285-thread-1-processing-n:127.0.0.1:55285_) [n:127.0.0.1:55285_    ] o.a.s.c.c.ConnectionManager Watcher org.apache.solr.common.cloud.ConnectionManager@4354b5fc name:ZooKeeperConnection Watcher:127.0.0.1:55788/solr got event WatchedEvent state:SyncConnected type:None path:null path:null type:None
   [junit4]   2> 2813885 INFO  (TEST-CustomCollectionTest.test-seed#[4AE541750EB8EEBA]) [n:127.0.0.1:55285_    ] o.a.s.c.c.ConnectionManager Client is connected to ZooKeeper
   [junit4]   2> 2813887 INFO  (TEST-CustomCollectionTest.test-seed#[4AE541750EB8EEBA]) [n:127.0.0.1:55285_    ] o.a.s.c.c.SolrZkClient makePath: /overseer/queue
   [junit4]   2> 2813891 INFO  (TEST-CustomCollectionTest.test-seed#[4AE541750EB8EEBA]) [n:127.0.0.1:55285_    ] o.a.s.c.c.SolrZkClient makePath: /overseer/collection-queue-work
   [junit4]   2> 2813897 INFO  (TEST-CustomCollectionTest.test-seed#[4AE541750EB8EEBA]) [n:127.0.0.1:55285_    ] o.a.s.c.c.SolrZkClient makePath: /overseer/collection-map-running
   [junit4]   2> 2813900 INFO  (TEST-CustomCollectionTest.test-seed#[4AE541750EB8EEBA]) [n:127.0.0.1:55285_    ] o.a.s.c.c.SolrZkClient makePath: /overseer/collection-map-completed
   [junit4]   2> 2813904 INFO  (TEST-CustomCollectionTest.test-seed#[4AE541750EB8EEBA]) [n:127.0.0.1:55285_    ] o.a.s.c.c.SolrZkClient makePath: /overseer/collection-map-failure
   [junit4]   2> 2813907 INFO  (TEST-CustomCollectionTest.test-seed#[4AE541750EB8EEBA]) [n:127.0.0.1:55285_    ] o.a.s.c.c.SolrZkClient makePath: /live_nodes
   [junit4]   2> 2813910 INFO  (TEST-CustomCollectionTest.test-seed#[4AE541750EB8EEBA]) [n:127.0.0.1:55285_    ] o.a.s.c.c.SolrZkClient makePath: /aliases.json
   [junit4]   2> 2813912 INFO  (TEST-CustomCollectionTest.test-seed#[4AE541750EB8EEBA]) [n:127.0.0.1:55285_    ] o.a.s.c.c.SolrZkClient makePath: /clusterstate.json
   [junit4]   2> 2813915 INFO  (TEST-CustomCollectionTest.test-seed#[4AE541750EB8EEBA]) [n:127.0.0.1:55285_    ] o.a.s.c.c.SolrZkClient makePath: /security.json
   [junit4]   2> 2813917 INFO  (TEST-CustomCollectionTest.test-seed#[4AE541750EB8EEBA]) [n:127.0.0.1:55285_    ] o.a.s.c.c.ZkStateReader Updating cluster state from ZooKeeper... 
   [junit4]   2> 2813918 INFO  (TEST-CustomCollectionTest.test-seed#[4AE541750EB8EEBA]) [n:127.0.0.1:55285_    ] o.a.s.c.c.ZkStateReader Loaded empty cluster properties
   [junit4]   2> 2813919 INFO  (TEST-CustomCollectionTest.test-seed#[4AE541750EB8EEBA]) [n:127.0.0.1:55285_    ] o.a.s.c.c.ZkStateReader Updated live nodes from ZooKeeper... (0) -> (0)
   [junit4]   2> 2813925 INFO  (TEST-CustomCollectionTest.test-seed#[4AE541750EB8EEBA]) [n:127.0.0.1:55285_    ] o.a.s.c.c.SolrZkClient makePath: /overseer_elect
   [junit4]   2> 2813930 INFO  (TEST-CustomCollectionTest.test-seed#[4AE541750EB8EEBA]) [n:127.0.0.1:55285_    ] o.a.s.c.c.SolrZkClient makePath: /overseer_elect/election
   [junit4]   2> 2813933 INFO  (TEST-CustomCollectionTest.test-seed#[4AE541750EB8EEBA]) [n:127.0.0.1:55285_    ] o.a.s.c.Overseer Overseer (id=null) closing
   [junit4]   2> 2813935 INFO  (TEST-CustomCollectionTest.test-seed#[4AE541750EB8EEBA]) [n:127.0.0.1:55285_    ] o.a.s.c.LeaderElector Joined leadership election with path: /overseer_elect/election/95921608477966340-127.0.0.1:55285_-n_0000000000
   [junit4]   2> 2813936 INFO  (TEST-CustomCollectionTest.test-seed#[4AE541750EB8EEBA]) [n:127.0.0.1:55285_    ] o.a.s.c.OverseerElectionContext I am going to be the leader 127.0.0.1:55285_
   [junit4]   2> 2813937 INFO  (TEST-CustomCollectionTest.test-seed#[4AE541750EB8EEBA]) [n:127.0.0.1:55285_    ] o.a.s.c.c.SolrZkClient makePath: /overseer_elect/leader
   [junit4]   2> 2813940 INFO  (TEST-CustomCollectionTest.test-seed#[4AE541750EB8EEBA]) [n:127.0.0.1:55285_    ] o.a.s.c.Overseer Overseer (id=95921608477966340-127.0.0.1:55285_-n_0000000000) starting
   [junit4]   2> 2813946 INFO  (TEST-CustomCollectionTest.test-seed#[4AE541750EB8EEBA]) [n:127.0.0.1:55285_    ] o.a.s.c.c.SolrZkClient makePath: /overseer/queue-work
   [junit4]   2> 2813961 INFO  (TEST-CustomCollectionTest.test-seed#[4AE541750EB8EEBA]) [n:127.0.0.1:55285_    ] o.a.s.c.OverseerAutoReplicaFailoverThread Starting OverseerAutoReplicaFailoverThread autoReplicaFailoverWorkLoopDelay=10000 autoReplicaFailoverWaitAfterExpiration=10000 autoReplicaFailoverBadNodeExpiration=60000
   [junit4]   2> 2813962 INFO  (OverseerCollectionConfigSetProcessor-95921608477966340-127.0.0.1:55285_-n_0000000000) [n:127.0.0.1:55285_    ] o.a.s.c.OverseerTaskProcessor Process current queue of overseer operations
   [junit4]   2> 2813962 INFO  (OverseerStateUpdate-95921608477966340-127.0.0.1:55285_-n_0000000000) [n:127.0.0.1:55285_    ] o.a.s.c.Overseer Starting to work on the main queue
   [junit4]   2> 2813963 INFO  (TEST-CustomCollectionTest.test-seed#[4AE541750EB8EEBA]) [n:127.0.0.1:55285_    ] o.a.s.c.ZkController Register node as live in ZooKeeper:/live_nodes/127.0.0.1:55285_
   [junit4]   2> 2813968 INFO  (TEST-CustomCollectionTest.test-seed#[4AE541750EB8EEBA]) [n:127.0.0.1:55285_    ] o.a.s.c.c.SolrZkClient makePath: /live_nodes/127.0.0.1:55285_
   [junit4]   2> 2813968 INFO  (OverseerStateUpdate-95921608477966340-127.0.0.1:55285_-n_0000000000) [n:127.0.0.1:55285_    ] o.a.s.c.c.ZkStateReader Updated live nodes from ZooKeeper... (0) -> (0)
   [junit4]   2> 2813970 INFO  (zkCallback-3285-thread-1-processing-n:127.0.0.1:55285_) [n:127.0.0.1:55285_    ] o.a.s.c.c.ZkStateReader A live node change: [WatchedEvent state:SyncConnected type:NodeChildrenChanged path:/live_nodes], has occurred - updating... (live nodes size: [0])
   [junit4]   2> 2813971 INFO  (zkCallback-3285-thread-1-processing-n:127.0.0.1:55285_) [n:127.0.0.1:55285_    ] o.a.s.c.c.ZkStateReader Updated live nodes from ZooKeeper... (0) -> (1)
   [junit4]   2> 2813993 INFO  (TEST-CustomCollectionTest.test-seed#[4AE541750EB8EEBA]) [n:127.0.0.1:55285_    ] o.a.s.c.CoreContainer Security conf doesn't exist. Skipping setup for authorization module.
   [junit4]   2> 2813993 INFO  (TEST-CustomCollectionTest.test-seed#[4AE541750EB8EEBA]) [n:127.0.0.1:55285_    ] o.a.s.c.CoreContainer No authentication plugin used.
   [junit4]   2> 2813995 INFO  (TEST-CustomCollectionTest.test-seed#[4AE541750EB8EEBA]) [n:127.0.0.1:55285_    ] o.a.s.c.CorePropertiesLocator Looking for core definitions underneath /export/home/jenkins/workspace/Lucene-Solr-6.x-Solaris/solr/build/solr-core/test/J1/temp/solr.cloud.CustomCollectionTest_4AE541750EB8EEBA-001/control-001/cores
   [junit4]   2> 2813996 INFO  (TEST-CustomCollectionTest.test-seed#[4AE541750EB8EEBA]) [n:127.0.0.1:55285_    ] o.a.s.c.CoreDescriptor Created CoreDescriptor: {name=collection1, config=solrconfig.xml, transient=false, schema=schema.xml, loadOnStartup=true, configSetProperties=configsetprops.json, collection=control_collection, coreNodeName=, dataDir=data/, shard=}
   [junit4]   2> 2813996 INFO  (TEST-CustomCollectionTest.test-seed#[4AE541750EB8EEBA]) [n:127.0.0.1:55285_    ] o.a.s.c.CorePropertiesLocator Found core collection1 in /export/home/jenkins/workspace/Lucene-Solr-6.x-Solaris/solr/build/solr-core/test/J1/temp/solr.cloud.CustomCollectionTest_4AE541750EB8EEBA-001/control-001/cores/collection1
   [junit4]   2> 2813996 INFO  (TEST-CustomCollectionTest.test-seed#[4AE541750EB8EEBA]) [n:127.0.0.1:55285_    ] o.a.s.c.CorePropertiesLocator Found 1 core definitions
   [junit4]   2> 2813999 INFO  (TEST-CustomCollectionTest.test-seed#[4AE541750EB8EEBA]) [n:127.0.0.1:55285_    ] o.a.s.s.SolrDispatchFilter user.dir=/export/home/jenkins/workspace/Lucene-Solr-6.x-Solaris/solr/build/solr-core/test/J1
   [junit4]   2> 2813999 INFO  (TEST-CustomCollectionTest.test-seed#[4AE541750EB8EEBA]) [n:127.0.0.1:55285_    ] o.a.s.s.SolrDispatchFilter SolrDispatchFilter.init() done
   [junit4]   2> 2813999 INFO  (coreLoadExecutor-8752-thread-1-processing-n:127.0.0.1:55285_) [n:127.0.0.1:55285_ c:control_collection   x:collection1] o.a.s.c.ZkController publishing state=down
   [junit4]   2> 2813999 INFO  (coreLoadExecutor-8752-thread-1-processing-n:127.0.0.1:55285_) [n:127.0.0.1:55285_ c:control_collection   x:collection1] o.a.s.c.ZkController numShards not found on descriptor - reading it from system property
   [junit4]   2> 2814000 INFO  (coreLoadExecutor-8752-thread-1-processing-n:127.0.0.1:55285_) [n:127.0.0.1:55285_ c:control_collection   x:collection1] o.a.s.c.ZkController Collection control_collection not visible yet, but flagging it so a watch is registered when it becomes visible
   [junit4]   2> 2814002 INFO  (coreLoadExecutor-8752-thread-1-processing-n:127.0.0.1:55285_) [n:127.0.0.1:55285_ c:control_collection   x:collection1] o.a.s.c.c.ZkStateReader Deleting data for [control_collection]
   [junit4]   2> 2814002 INFO  (OverseerStateUpdate-95921608477966340-127.0.0.1:55285_-n_0000000000) [n:127.0.0.1:55285_    ] o.a.s.c.Overseer processMessage: queueSize: 1, message = {
   [junit4]   2>   "core":"collection1",
   [junit4]   2>   "roles":null,
   [junit4]   2>   "base_url":"http://127.0.0.1:55285",
   [junit4]   2>   "node_name":"127.0.0.1:55285_",
   [junit4]   2>   "numShards":"1",
   [junit4]   2>   "state":"down",
   [junit4]   2>   "shard":null,
   [junit4]   2>   "collection":"control_collection",
   [junit4]   2>   "operation":"state"} current state version: 0
   [junit4]   2> 2814003 INFO  (OverseerStateUpdate-95921608477966340-127.0.0.1:55285_-n_0000000000) [n:127.0.0.1:55285_    ] o.a.s.c.o.ReplicaMutator Update state numShards=1 message={
   [junit4]   2>   "core":"collection1",
   [junit4]   2>   "roles":null,
   [junit4]   2>   "base_url":"http://127.0.0.1:55285",
   [junit4]   2>   "node_name":"127.0.0.1:55285_",
   [junit4]   2>   "numShards":"1",
   [junit4]   2>   "state":"down",
   [junit4]   2>   "shard":null,
   [junit4]   2>   "collection":"control_collection",
   [junit4]   2>   "operation":"state"}
   [junit4]   2> 2814004 INFO  (OverseerStateUpdate-95921608477966340-127.0.0.1:55285_-n_0000000000) [n:127.0.0.1:55285_    ] o.a.s.c.o.ClusterStateMutator building a new cName: control_collection
   [junit4]   2> 2814004 INFO  (coreLoadExecutor-8752-thread-1-processing-n:127.0.0.1:55285_) [n:127.0.0.1:55285_ c:control_collection   x:collection1] o.a.s.c.ZkController look for our core node name
   [junit4]   2> 2814005 INFO  (OverseerStateUpdate-95921608477966340-127.0.0.1:55285_-n_0000000000) [n:127.0.0.1:55285_    ] o.a.s.c.o.ReplicaMutator Assigning new node to shard shard=shard1
   [junit4]   2> 2814008 INFO  (zkCallback-3285-thread-1-processing-n:127.0.0.1:55285_) [n:127.0.0.1:55285_    ] o.a.s.c.c.ZkStateReader A cluster state change: [WatchedEvent state:SyncConnected type:NodeDataChanged path:/clusterstate.json], has occurred - updating... (live nodes size: [1])
   [junit4]   2> 2815006 INFO  (coreLoadExecutor-8752-thread-1-processing-n:127.0.0.1:55285_) [n:127.0.0.1:55285_ c:control_collection   x:collection1] o.a.s.c.ZkController waiting to find shard id in clusterstate for collection1
   [junit4]   2> 2815006 INFO  (coreLoadExecutor-8752-thread-1-processing-n:127.0.0.1:55285_) [n:127.0.0.1:55285_ c:control_collection   x:collection1] o.a.s.c.ZkController Check for collection zkNode:control_collection
   [junit4]   2> 2815007 INFO  (coreLoadExecutor-8752-thread-1-processing-n:127.0.0.1:55285_) [n:127.0.0.1:55285_ c:control_collection   x:collection1] o.a.s.c.ZkController Collection zkNode exists
   [junit4]   2> 2815007 INFO  (coreLoadExecutor-8752-thread-1-processing-n:127.0.0.1:55285_) [n:127.0.0.1:55285_ c:control_collection   x:collection1] o.a.s.c.c.ZkStateReader Load collection config from: [/collections/control_collection]
   [junit4]   2> 2815009 INFO  (coreLoadExecutor-8752-thread-1-processing-n:127.0.0.1:55285_) [n:127.0.0.1:55285_ c:control_collection   x:collection1] o.a.s.c.c.ZkStateReader path=[/collections/control_collection] [configName]=[conf1] specified config exists in ZooKeeper
   [junit4]   2> 2815009 INFO  (coreLoadExecutor-8752-thread-1-processing-n:127.0.0.1:55285_) [n:127.0.0.1:55285_ c:control_collection   x:collection1] o.a.s.c.SolrResourceLoader new SolrResourceLoader for directory: '/export/home/jenkins/workspace/Lucene-Solr-6.x-Solaris/solr/build/solr-core/test/J1/temp/solr.cloud.CustomCollectionTest_4AE541750EB8EEBA-001/control-001/cores/collection1'
   [junit4]   2> 2815009 INFO  (coreLoadExecutor-8752-thread-1-processing-n:127.0.0.1:55285_) [n:127.0.0.1:55285_ c:control_collection   x:collection1] o.a.s.c.SolrResourceLoader JNDI not configured for solr (NoInitialContextEx)
   [junit4]   2> 2815010 INFO  (coreLoadExecutor-8752-thread-1-processing-n:127.0.0.1:55285_) [n:127.0.0.1:55285_ c:control_collection   x:collection1] o.a.s.c.SolrResourceLoader solr home defaulted to 'solr/' (could not find system property or JNDI)
   [junit4]   2> 2815013 INFO  (coreLoadExecutor-8752-thread-1-processing-n:127.0.0.1:55285_) [n:127.0.0.1:55285_ c:control_collection   x:collection1] o.a.s.c.Config loaded config solrconfig.xml with version 0 
   [junit4]   2> 2815022 INFO  (coreLoadExecutor-8752-thread-1-processing-n:127.0.0.1:55285_) [n:127.0.0.1:55285_ c:control_collection   x:collection1] o.a.s.c.SolrConfig current version of requestparams : -1
   [junit4]   2> 2815027 INFO  (coreLoadExecutor-8752-thread-1-processing-n:127.0.0.1:55285_) [n:127.0.0.1:55285_ c:control_collection   x:collection1] o.a.s.c.SolrConfig Using Lucene MatchVersion: 6.1.0
   [junit4]   2> 2815044 INFO  (coreLoadExecutor-8752-thread-1-processing-n:127.0.0.1:55285_) [n:127.0.0.1:55285_ c:control_collection   x:collection1] o.a.s.c.SolrConfig Loaded SolrConfig: solrconfig.xml
   [junit4]   2> 2815053 INFO  (coreLoadExecutor-8752-thread-1-processing-n:127.0.0.1:55285_) [n:127.0.0.1:55285_ c:control_collection   x:collection1] o.a.s.s.IndexSchema [collection1] Schema name=test
   [junit4]   2> 2815193 INFO  (coreLoadExecutor-8752-thread-1-processing-n:127.0.0.1:55285_) [n:127.0.0.1:55285_ c:control_collection   x:collection1] o.a.s.s.OpenExchangeRatesOrgProvider Initialized with rates=open-exchange-rates.json, refreshInterval=1440.
   [junit4]   2> 2815203 INFO  (coreLoadExecutor-8752-thread-1-processing-n:127.0.0.1:55285_) [n:127.0.0.1:55285_ c:control_collection   x:collection1] o.a.s.s.IndexSchema default search field in schema is text
   [junit4]   2> 2815205 INFO  (coreLoadExecutor-8752-thread-1-processing-n:127.0.0.1:55285_) [n:127.0.0.1:55285_ c:control_collection   x:collection1] o.a.s.s.IndexSchema unique key field: id
   [junit4]   2> 2815239 INFO  (coreLoadExecutor-8752-thread-1-processing-n:127.0.0.1:55285_) [n:127.0.0.1:55285_ c:control_collection   x:collection1] o.a.s.s.FileExchangeRateProvider Reloading exchange rates from file currency.xml
   [junit4]   2> 2815243 INFO  (coreLoadExecutor-8752-thread-1-processing-n:127.0.0.1:55285_) [n:127.0.0.1:55285_ c:control_collection   x:collection1] o.a.s.s.FileExchangeRateProvider Reloading exchange rates from file currency.xml
   [junit4]   2> 2815248 INFO  (coreLoadExecutor-8752-thread-1-processing-n:127.0.0.1:55285_) [n:127.0.0.1:55285_ c:control_collection   x:collection1] o.a.s.s.OpenExchangeRatesOrgProvider Reloading exchange rates from open-exchange-rates.json
   [junit4]   2> 2815250 INFO  (coreLoadExecutor-8752-thread-1-processing-n:127.0.0.1:55285_) [n:127.0.0.1:55285_ c:control_collection   x:collection1] o.a.s.s.OpenExchangeRatesOrgProvider Reloading exchange rates from open-exchange-rates.json
   [junit4]   2> 2815253 INFO  (coreLoadExecutor-8752-thread-1-processing-n:127.0.0.1:55285_) [n:127.0.0.1:55285_ c:control_collection   x:collection1] o.a.s.c.ConfigSetProperties Did not find ConfigSet properties, assuming default properties: Can't find resource 'configsetprops.json' in classpath or '/configs/conf1', cwd=/export/home/jenkins/workspace/Lucene-Solr-6.x-Solaris/solr/build/solr-core/test/J1
   [junit4]   2> 2815253 INFO  (coreLoadExecutor-8752-thread-1-processing-n:127.0.0.1:55285_) [n:127.0.0.1:55285_ c:control_collection   x:collection1] o.a.s.c.CoreContainer Creating SolrCore 'collection1' using configuration from collection control_collection
   [junit4]   2> 2815254 INFO  (coreLoadExecutor-8752-thread-1-processing-n:127.0.0.1:55285_) [n:127.0.0.1:55285_ c:control_collection s:shard1 r:core_node1 x:collection1] o.a.s.c.SolrCore org.apache.solr.core.MockDirectoryFactory
   [junit4]   2> 2815256 INFO  (coreLoadExecutor-8752-thread-1-processing-n:127.0.0.1:55285_) [n:127.0.0.1:55285_ c:control_collection s:shard1 r:core_node1 x:collection1] o.a.s.c.SolrCore [[collection1] ] Opening new SolrCore at [/export/home/jenkins/workspace/Lucene-Solr-6.x-Solaris/solr/build/solr-core/test/J1/temp/solr.cloud.CustomCollectionTest_4AE541750EB8EEBA-001/control-001/cores/collection1], dataDir=[/export/home/jenkins/workspace/Lucene-Solr-6.x-Solaris/solr/build/solr-core/test/J1/temp/solr.cloud.CustomCollectionTest_4AE541750EB8EEBA-001/control-001/cores/collection1/data/]
   [junit4]   2> 2815256 INFO  (coreLoadExecutor-8752-thread-1-processing-n:127.0.0.1:55285_) [n:127.0.0.1:55285_ c:control_collection s:shard1 r:core_node1 x:collection1] o.a.s.c.JmxMonitoredMap JMX monitoring is enabled. Adding Solr mbeans to JMX Server: com.sun.jmx.mbeanserver.JmxMBeanServer@72a65fa4
   [junit4]   2> 2815257 INFO  (coreLoadExecutor-8752-thread-1-processing-n:127.0.0.1:55285_) [n:127.0.0.1:55285_ c:control_collection s:shard1 r:core_node1 x:collection1] o.a.s.c.CachingDirectoryFactory return new directory for /export/home/jenkins/workspace/Lucene-Solr-6.x-Solaris/solr/build/solr-core/test/J1/temp/solr.cloud.CustomCollectionTest_4AE541750EB8EEBA-001/control-001/cores/collection1/data
   [junit4]   2> 2815257 INFO  (coreLoadExecutor-8752-thread-1-processing-n:127.0.0.1:55285_) [n:127.0.0.1:55285_ c:control_collection s:shard1 r:core_node1 x:collection1] o.a.s.c.SolrCore New index directory detected: old=null new=/export/home/jenkins/workspace/Lucene-Solr-6.x-Solaris/solr/build/solr-core/test/J1/temp/solr.cloud.CustomCollectionTest_4AE541750EB8EEBA-001/control-001/cores/collection1/data/index/
   [junit4]   2> 2815257 WARN  (coreLoadExecutor-8752-thread-1-processing-n:127.0.0.1:55285_) [n:127.0.0.1:55285_ c:control_collection s:shard1 r:core_node1 x:collection1] o.a.s.c.SolrCore [collection1] Solr index directory '/export/home/jenkins/workspace/Lucene-Solr-6.x-Solaris/solr/build/solr-core/test/J1/temp/solr.cloud.CustomCollectionTest_4AE541750EB8EEBA-001/control-001/cores/collection1/data/index' doesn't exist. Creating new index...
   [junit4]   2> 2815259 INFO  (coreLoadExecutor-8752-thread-1-processing-n:127.0.0.1:55285_) [n:127.0.0.1:55285_ c:control_collection s:shard1 r:core_node1 x:collection1] o.a.s.c.CachingDirectoryFactory return new directory for /export/home/jenkins/workspace/Lucene-Solr-6.x-Solaris/solr/build/solr-core/test/J1/temp/solr.cloud.CustomCollectionTest_4AE541750EB8EEBA-001/control-001/cores/collection1/data/index
   [junit4]   2> 2815259 INFO  (coreLoadExecutor-8752-thread-1-processing-n:127.0.0.1:55285_) [n:127.0.0.1:55285_ c:control_collection s:shard1 r:core_node1 x:collection1] o.a.s.u.RandomMergePolicy RandomMergePolicy wrapping class org.apache.lucene.index.LogDocMergePolicy: [LogDocMergePolicy: minMergeSize=1000, mergeFactor=46, maxMergeSize=9223372036854775807, maxMergeSizeForForcedMerge=9223372036854775807, calibrateSizeByDeletes=false, maxMergeDocs=2147483647, maxCFSSegmentSizeMB=8.796093022207999E12, noCFSRatio=0.0]
   [junit4]   2> 2815260 INFO  (coreLoadExecutor-8752-thread-1-processing-n:127.0.0.1:55285_) [n:127.0.0.1:55285_ c:control_collection s:shard1 r:core_node1 x:collection1] o.a.s.c.SolrDeletionPolicy SolrDeletionPolicy.onCommit: commits: num=1
   [junit4]   2> 	commit{dir=MockDirectoryWrapper(RAMDirectory@54e6c702 lockFactory=org.apache.lucene.store.SingleInstanceLockFactory@5608661b),segFN=segments_1,generation=1}
   [junit4]   2> 2815260 INFO  (coreLoadExecutor-8752-thread-1-processing-n:127.0.0.1:55285_) [n:127.0.0.1:55285_ c:control_collection s:shard1 r:core_node1 x:collection1] o.a.s.c.SolrDeletionPolicy newest commit generation = 1
   [junit4]   2> 2815262 INFO  (OldIndexDirectoryCleanupThreadForCore-collection1) [n:127.0.0.1:55285_ c:control_collection s:shard1 r:core_node1 x:collection1] o.a.s.c.SolrCore Looking for old index directories to cleanup for core collection1 in /export/home/jenkins/workspace/Lucene-Solr-6.x-Solaris/solr/build/solr-core/test/J1/temp/solr.cloud.CustomCollectionTest_4AE541750EB8EEBA-001/control-001/cores/collection1/data/
   [junit4]   2> 2815264 WARN  (OldIndexDirectoryCleanupThreadForCore-collection1) [n:127.0.0.1:55285_ c:control_collection s:shard1 r:core_node1 x:collection1] o.a.s.c.DirectoryFactory /export/home/jenkins/workspace/Lucene-Solr-6.x-Solaris/solr/build/solr-core/test/J1/temp/solr.cloud.CustomCollectionTest_4AE541750EB8EEBA-001/control-001/cores/collection1/data/ does not point to a valid data directory; skipping clean-up of old index directories.
   [junit4]   2> 2815266 INFO  (coreLoadExecutor-8752-thread-1-processing-n:127.0.0.1:55285_) [n:127.0.0.1:55285_ c:control_collection s:shard1 r:core_node1 x:collection1] o.a.s.u.p.UpdateRequestProcessorChain creating updateRequestProcessorChain "nodistrib"
   [junit4]   2> 2815266 INFO  (coreLoadExecutor-8752-thread-1-processing-n:127.0.0.1:55285_) [n:127.0.0.1:55285_ c:control_collection s:shard1 r:core_node1 x:collection1] o.a.s.u.p.UpdateRequestProcessorChain creating updateRequestProcessorChain "dedupe"
   [junit4]   2> 2815266 INFO  (coreLoadExecutor-8752-thread-1-processing-n:127.0.0.1:55285_) [n:127.0.0.1:55285_ c:control_collection s:shard1 r:core_node1 x:collection1] o.a.s.u.p.UpdateRequestProcessorChain inserting DistributedUpdateProcessorFactory into updateRequestProcessorChain "dedupe"
   [junit4]   2> 2815266 INFO  (coreLoadExecutor-8752-thread-1-processing-n:127.0.0.1:55285_) [n:127.0.0.1:55285_ c:control_collection s:shard1 r:core_node1 x:collection1] o.a.s.u.p.UpdateRequestProcessorChain creating updateRequestProcessorChain "stored_sig"
   [junit4]   2> 2815266 INFO  (coreLoadExecutor-8752-thread-1-processing-n:127.0.0.1:55285_) [n:127.0.0.1:55285_ c:control_collection s:shard1 r:core_node1 x:collection1] o.a.s.u.p.UpdateRequestProcessorChain inserting DistributedUpdateProcessorFactory into updateRequestProcessorChain "stored_sig"
   [junit4]   2> 2815266 INFO  (coreLoadExecutor-8752-thread-1-processing-n:127.0.0.1:55285_) [n:127.0.0.1:55285_ c:control_collection s:shard1 r:core_node1 x:collection1] o.a.s.u.p.UpdateRequestProcessorChain creating updateRequestProcessorChain "distrib-dup-test-chain-explicit"
   [junit4]   2> 2815267 INFO  (coreLoadExecutor-8752-thread-1-processing-n:127.0.0.1:55285_) [n:127.0.0.1:55285_ c:control_collection s:shard1 r:core_node1 x:collection1] o.a.s.u.p.UpdateRequestProcessorChain creating updateRequestProcessorChain "distrib-dup-test-chain-implicit"
   [junit4]   2> 2815267 INFO  (coreLoadExecutor-8752-thread-1-processing-n:127.0.0.1:55285_) [n:127.0.0.1:55285_ c:control_collection s:shard1 r:core_node1 x:collection1] o.a.s.u.p.UpdateRequestProcessorChain inserting DistributedUpdateProcessorFactory into updateRequestProcessorChain "distrib-dup-test-chain-implicit"
   [junit4]   2> 2815267 INFO  (coreLoadExecutor-8752-thread-1-processing-n:127.0.0.1:55285_) [n:127.0.0.1:55285_ c:control_collection s:shard1 r:core_node1 x:collection1] o.a.s.c.SolrCore no updateRequestProcessorChain defined as default, creating implicit default
   [junit4]   2> 2815267 WARN  (coreLoadExecutor-8752-thread-1-processing-n:127.0.0.1:55285_) [n:127.0.0.1:55285_ c:control_collection s:shard1 r:core_node1 x:collection1] o.a.s.c.RequestHandlers INVALID paramSet a in requestHandler {type = requestHandler,name = /dump,class = DumpRequestHandler,args = {defaults={a=A,b=B}}}
   [junit4]   2> 2815270 INFO  (coreLoadExecutor-8752-thread-1-processing-n:127.0.0.1:55285_) [n:127.0.0.1:55285_ c:control_collection s:shard1 r:core_node1 x:collection1] o.a.s.h.l.XMLLoader xsltCacheLifetimeSeconds=60
   [junit4]   2> 2815271 INFO  (coreLoadExecutor-8752-thread-1-processing-n:127.0.0.1:55285_) [n:127.0.0.1:55285_ c:control_collection s:shard1 r:core_node1 x:collection1] o.a.s.h.l.XMLLoader xsltCacheLifetimeSeconds=60
   [junit4]   2> 2815273 INFO  (coreLoadExecutor-8752-thread-1-processing-n:127.0.0.1:55285_) [n:127.0.0.1:55285_ c:control_collection s:shard1 r:core_node1 x:collection1] o.a.s.h.l.XMLLoader xsltCacheLifetimeSeconds=60
   [junit4]   2> 2815274 INFO  (coreLoadExecutor-8752-thread-1-processing-n:127.0.0.1:55285_) [n:127.0.0.1:55285_ c:control_collection s:shard1 r:core_node1 x:collection1] o.a.s.h.l.XMLLoader xsltCacheLifetimeSeconds=60
   [junit4]   2> 2815279 INFO  (coreLoadExecutor-8752-thread-1-processing-n:127.0.0.1:55285_) [n:127.0.0.1:55285_ c:control_collection s:shard1 r:core_node1 x:collection1] o.a.s.c.RequestHandlers Registered paths: /admin/mbeans,standard,/update/json/docs,/admin/luke,/export,/get,/admin/properties,/update/json,/admin/threads,/dump,/update/csv,/sql,/graph,/admin/segments,/admin/system,/replication,/config,/stream,/schema,/admin/plugins,/admin/logging,/admin/ping,/update,/admin/file
   [junit4]   2> 2815279 INFO  (coreLoadExecutor-8752-thread-1-processing-n:127.0.0.1:55285_) [n:127.0.0.1:55285_ c:control_collection s:shard1 r:core_node1 x:collection1] o.a.s.c.SolrCore Using default statsCache cache: org.apache.solr.search.stats.LocalStatsCache
   [junit4]   2> 2815279 INFO  (coreLoadExecutor-8752-thread-1-processing-n:127.0.0.1:55285_) [n:127.0.0.1:55285_ c:control_collection s:shard1 r:core_node1 x:collection1] o.a.s.u.UpdateHandler Using UpdateLog implementation: org.apache.solr.update.UpdateLog
   [junit4]   2> 2815279 INFO  (coreLoadExecutor-8752-thread-1-processing-n:127.0.0.1:55285_) [n:127.0.0.1:55285_ c:control_collection s:shard1 r:core_node1 x:collection1] o.a.s.u.UpdateLog Initializing UpdateLog: dataDir= defaultSyncLevel=FLUSH numRecordsToKeep=100 maxNumLogsToKeep=10 numVersionBuckets=65536
   [junit4]   2> 2815281 INFO  (coreLoadExecutor-8752-thread-1-processing-n:127.0.0.1:55285_) [n:127.0.0.1:55285_ c:control_collection s:shard1 r:core_node1 x:collection1] o.a.s.u.CommitTracker Hard AutoCommit: disabled
   [junit4]   2> 2815281 INFO  (coreLoadExecutor-8752-thread-1-processing-n:127.0.0.1:55285_) [n:127.0.0.1:55285_ c:control_collection s:shard1 r:core_node1 x:collection1] o.a.s.u.CommitTracker Soft AutoCommit: disabled
   [junit4]   2> 2815282 INFO  (coreLoadExecutor-8752-thread-1-processing-n:127.0.0.1:55285_) [n:127.0.0.1:55285_ c:control_collection s:shard1 r:core_node1 x:collection1] o.a.s.u.RandomMergePolicy RandomMergePolicy wrapping class org.apache.lucene.index.LogDocMergePolicy: [LogDocMergePolicy: minMergeSize=1000, mergeFactor=29, maxMergeSize=9223372036854775807, maxMergeSizeForForcedMerge=9223372036854775807, calibrateSizeByDeletes=true, maxMergeDocs=2147483647, maxCFSSegmentSizeMB=8.796093022207999E12, noCFSRatio=1.0]
   [junit4]   2> 2815283 INFO  (coreLoadExecutor-8752-thread-1-processing-n:127.0.0.1:55285_) [n:127.0.0.1:55285_ c:control_collection s:shard1 r:core_node1 x:collection1] o.a.s.c.SolrDeletionPolicy SolrDeletionPolicy.onInit: commits: num=1
   [junit4]   2> 	commit{dir=MockDirectoryWrapper(RAMDirectory@54e6c702 lockFactory=org.apache.lucene.store.SingleInstanceLockFactory@5608661b),segFN=segments_1,generation=1}
   [junit4]   2> 2815283 INFO  (coreLoadExecutor-8752-thread-1-processing-n:127.0.0.1:55285_) [n:127.0.0.1:55285_ c:control_collection s:shard1 r:core_node1 x:collection1] o.a.s.c.SolrDeletionPolicy newest commit generation = 1
   [junit4]   2> 2815283 INFO  (coreLoadExecutor-8752-thread-1-processing-n:127.0.0.1:55285_) [n:127.0.0.1:55285_ c:control_collection s:shard1 r:core_node1 x:collection1] o.a.s.s.SolrIndexSearcher Opening [Searcher@79cb3d9a[collection1] main]
   [junit4]   2> 2815283 INFO  (coreLoadExecutor-8752-thread-1-processing-n:127.0.0.1:55285_) [n:127.0.0.1:55285_ c:control_collection s:shard1 r:core_node1 x:collection1] o.a.s.c.c.ZkStateReader Load collection config from: [/collections/control_collection]
   [junit4]   2> 2815284 INFO  (coreLoadExecutor-8752-thread-1-processing-n:127.0.0.1:55285_) [n:127.0.0.1:55285_ c:control_collection s:shard1 r:core_node1 x:collection1] o.a.s.c.c.ZkStateReader path=[/collections/control_collection] [configName]=[conf1] specified config exists in ZooKeeper
   [junit4]   2> 2815284 INFO  (coreLoadExecutor-8752-thread-1-processing-n:127.0.0.1:55285_) [n:127.0.0.1:55285_ c:control_collection s:shard1 r:core_node1 x:collection1] o.a.s.r.ManagedResourceStorage Setting up ZooKeeper-based storage for the RestManager with znodeBase: /configs/conf1
   [junit4]   2> 2815285 INFO  (coreLoadExecutor-8752-thread-1-processing-n:127.0.0.1:55285_) [n:127.0.0.1:55285_ c:control_collection s:shard1 r:core_node1 x:collection1] o.a.s.r.ManagedResourceStorage Configured ZooKeeperStorageIO with znodeBase: /configs/conf1
   [junit4]   2> 2815285 INFO  (coreLoadExecutor-8752-thread-1-processing-n:127.0.0.1:55285_) [n:127.0.0.1:55285_ c:control_collection s:shard1 r:core_node1 x:collection1] o.a.s.r.RestManager Initializing RestManager with initArgs: {}
   [junit4]   2> 2815285 INFO  (coreLoadExecutor-8752-thread-1-processing-n:127.0.0.1:55285_) [n:127.0.0.1:55285_ c:control_collection s:shard1 r:core_node1 x:collection1] o.a.s.r.ManagedResourceStorage Reading _rest_managed.json using ZooKeeperStorageIO:path=/configs/conf1
   [junit4]   2> 2815287 INFO  (coreLoadExecutor-8752-thread-1-processing-n:127.0.0.1:55285_) [n:127.0.0.1:55285_ c:control_collection s:shard1 r:core_node1 x:collection1] o.a.s.r.ManagedResourceStorage No data found for znode /configs/conf1/_rest_managed.json
   [junit4]   2> 2815287 INFO  (coreLoadExecutor-8752-thread-1-processing-n:127.0.0.1:55285_) [n:127.0.0.1:55285_ c:control_collection s:shard1 r:core_node1 x:collection1] o.a.s.r.ManagedResourceStorage Loaded null at path _rest_managed.json using ZooKeeperStorageIO:path=/configs/conf1
   [junit4]   2> 2815287 INFO  (coreLoadExecutor-8752-thread-1-processing-n:127.0.0.1:55285_) [n:127.0.0.1:55285_ c:control_collection s:shard1 r:core_node1 x:collection1] o.a.s.r.RestManager Initializing 0 registered ManagedResources
   [junit4]   2> 2815287 INFO  (coreLoadExecutor-8752-thread-1-processing-n:127.0.0.1:55285_) [n:127.0.0.1:55285_ c:control_collection s:shard1 r:core_node1 x:collection1] o.a.s.h.ReplicationHandler Commits will be reserved for  10000
   [junit4]   2> 2815287 INFO  (coreLoadExecutor-8752-thread-1-processing-n:127.0.0.1:55285_) [n:127.0.0.1:55285_ c:control_collection s:shard1 r:core_node1 x:collection1] o.a.s.u.UpdateLog Looking up max value of version field to seed version buckets
   [junit4]   2> 2815287 INFO  (coreLoadExecutor-8752-thread-1-processing-n:127.0.0.1:55285_) [n:127.0.0.1:55285_ c:control_collection s:shard1 r:core_node1 x:collection1] o.a.s.u.VersionInfo Refreshing highest value of _version_ for 65536 version buckets from index
   [junit4]   2> 2815288 INFO  (coreLoadExecutor-8752-thread-1-processing-n:127.0.0.1:55285_) [n:127.0.0.1:55285_ c:control_collection s:shard1 r:core_node1 x:collection1] o.a.s.u.VersionInfo No terms found for _version_, cannot seed version bucket highest value from index
   [junit4]   2> 2815288 INFO  (coreLoadExecutor-8752-thread-1-processing-n:127.0.0.1:55285_) [n:127.0.0.1:55285_ c:control_collection s:shard1 r:core_node1 x:collection1] o.a.s.u.UpdateLog Could not find max version in index or recent updates, using new clock 1534745737791799296
   [junit4]   2> 2815290 INFO  (coreLoadExecutor-8752-thread-1-processing-n:127.0.0.1:55285_) [n:127.0.0.1:55285_ c:control_collection s:shard1 r:core_node1 x:collection1] o.a.s.u.UpdateLog Took 2.0ms to seed version buckets with highest version 1534745737791799296
   [junit4]   2> 2815290 INFO  (coreLoadExecutor-8752-thread-1-processing-n:127.0.0.1:55285_) [n:127.0.0.1:55285_ c:control_collection s:shard1 r:core_node1 x:collection1] o.a.s.c.ZkController watch zkdir /configs/conf1
   [junit4]   2> 2815291 INFO  (searcherExecutor-8753-thread-1-processing-n:127.0.0.1:55285_ x:collection1 s:shard1 c:control_collection r:core_node1) [n:127.0.0.1:55285_ c:control_collection s:shard1 r:core_node1 x:collection1] o.a.s.c.SolrCore [collection1] Registered new searcher Searcher@79cb3d9a[collection1] main{ExitableDirectoryReader(UninvertingDirectoryReader())}
   [junit4]   2> 2815291 INFO  (coreLoadExecutor-8752-thread-1-processing-n:127.0.0.1:55285_) [n:127.0.0.1:55285_ c:control_collection s:shard1 r:core_node1 x:collection1] o.a.s.c.CoreContainer registering core: collection1
   [junit4]   2> 2815301 INFO  (coreZkRegister-8746-thread-1-processing-n:127.0.0.1:55285_ x:collection1 s:shard1 c:control_collection r:core_node1) [n:127.0.0.1:55285_ c:control_collection s:shard1 r:core_node1 x:collection1] o.a.s.c.ZkController Register replica - core:collection1 address:http://127.0.0.1:55285 collection:control_collection shard:shard1
   [junit4]   2> 2815303 INFO  (coreZkRegister-8746-thread-1-processing-n:127.0.0.1:55285_ x:collection1 s:shard1 c:control_collection r:core_node1) [n:127.0.0.1:55285_ c:control_collection s:shard1 r:core_node1 x:collection1] o.a.s.c.c.SolrZkClient makePath: /collections/control_collection/leader_elect/shard1/election
   [junit4]   2> 2815311 INFO  (coreZkRegister-8746-thread-1-processing-n:127.0.0.1:55285_ x:collection1 s:shard1 c:control_collection r:core_node1) [n:127.0.0.1:55285_ c:control_collection s:shard1 r:core_node1 x:collection1] o.a.s.c.LeaderElector Joined leadership election with path: /collections/control_collection/leader_elect/shard1/election/95921608477966340-core_node1-n_0000000000
   [junit4]   2> 2815312 INFO  (coreZkRegister-8746-thread-1-processing-n:127.0.0.1:55285_ x:collection1 s:shard1 c:control_collection r:core_node1) [n:127.0.0.1:55285_ c:control_collection s:shard1 r:core_node1 x:collection1] o.a.s.c.ShardLeaderElectionContext Running the leader process for shard=shard1 and weAreReplacement=false and leaderVoteWait=180000
   [junit4]   2> 2815315 INFO  (coreZkRegister-8746-thread-1-processing-n:127.0.0.1:55285_ x:collection1 s:shard1 c:control_collection r:core_node1) [n:127.0.0.1:55285_ c:control_collection s:shard1 r:core_node1 x:collection1] o.a.s.c.ShardLeaderElectionContext Enough replicas found to continue.
   [junit4]   2> 2815316 INFO  (coreZkRegister-8746-thread-1-processing-n:127.0.0.1:55285_ x:collection1 s:shard1 c:control_collection r:core_node1) [n:127.0.0.1:55285_ c:control_collection s:shard1 r:core_node1 x:collection1] o.a.s.c.ShardLeaderElectionContext I may be the new leader - try and sync
   [junit4]   2> 2815316 INFO  (OverseerStateUpdate-95921608477966340-127.0.0.1:55285_-n_0000000000) [n:127.0.0.1:55285_    ] o.a.s.c.Overseer processMessage: queueSize: 1, message = {
   [junit4]   2>   "operation":"leader",
   [junit4]   2>   "shard":"shard1",
   [junit4]   2>   "collection":"control_collection"} current state version: 1
   [junit4]   2> 2815316 INFO  (coreZkRegister-8746-thread-1-processing-n:127.0.0.1:55285_ x:collection1 s:shard1 c:control_collection r:core_node1) [n:127.0.0.1:55285_ c:control_collection s:shard1 r:core_node1 x:collection1] o.a.s.c.SyncStrategy Sync replicas to http://127.0.0.1:55285/collection1/
   [junit4]   2> 2815316 INFO  (coreZkRegister-8746-thread-1-processing-n:127.0.0.1:55285_ x:collection1 s:shard1 c:control_collection r:core_node1) [n:127.0.0.1:55285_ c:control_collection s:shard1 r:core_node1 x:collection1] o.a.s.c.SyncStrategy Sync Success - now sync replicas to me
   [junit4]   2> 2815316 INFO  (coreZkRegister-8746-thread-1-processing-n:127.0.0.1:55285_ x:collection1 s:shard1 c:control_collection r:core_node1) [n:127.0.0.1:55285_ c:control_collection s:shard1 r:core_node1 x:collection1] o.a.s.c.SyncStrategy http://127.0.0.1:55285/collection1/ has no replicas
   [junit4]   2> 2815319 INFO  (coreZkRegister-8746-thread-1-processing-n:127.0.0.1:55285_ x:collection1 s:shard1 c:control_collection r:core_node1) [n:127.0.0.1:55285_ c:control_collection s:shard1 r:core_node1 x:collection1] o.a.s.c.c.SolrZkClient makePath: /collections/control_collection/leaders/shard1
   [junit4]   2> 2815325 INFO  (coreZkRegister-8746-thread-1-processing-n:127.0.0.1:55285_ x:collection1 s:shard1 c:control_collection r:core_node1) [n:127.0.0.1:55285_ c:control_collection s:shard1 r:core_node1 x:collection1] o.a.s.c.ShardLeaderElectionContextBase Creating leader registration node /collections/control_collection/leaders/shard1/leader after winning as /collections/control_collection/leader_elect/shard1/election/95921608477966340-core_node1-n_0000000000
   [junit4]   2> 2815329 INFO  (coreZkRegister-8746-thread-1-processing-n:127.0.0.1:55285_ x:collection1 s:shard1 c:control_collection r:core_node1) [n:127.0.0.1:55285_ c:control_collection s:shard1 r:core_node1 x:collection1] o.a.s.c.ShardLeaderElectionContext I am the new leader: http://127.0.0.1:55285/collection1/ shard1
   [junit4]   2> 2815331 INFO  (OverseerStateUpdate-95921608477966340-127.0.0.1:55285_-n_0000000000) [n:127.0.0.1:55285_    ] o.a.s.c.Overseer processMessage: queueSize: 1, message = {
   [junit4]   2>   "operation":"leader",
   [junit4]   2>   "shard":"shard1",
   [junit4]   2>   "collection":"control_collection",
   [junit4]   2>   "base_url":"http://127.0.0.1:55285",
   [junit4]   2>   "core":"collection1",
   [junit4]   2>   "state":"active"} current state version: 1
   [junit4]   2> 2815436 INFO  (zkCallback-3285-thread-1-processing-n:127.0.0.1:55285_) [n:127.0.0.1:55285_    ] o.a.s.c.c.ZkStateReader A cluster state change: [WatchedEvent state:SyncConnected type:NodeDataChanged path:/clusterstate.json], has occurred - updating... (live nodes size: [1])
   [junit4]   2> 2815485 INFO  (coreZkRegister-8746-thread-1-processing-n:127.0.0.1:55285_ x:collection1 s:shard1 c:control_collection r:core_node1) [n:127.0.0.1:55285_ c:control_collection s:shard1 r:core_node1 x:collection1] o.a.s.c.ZkController We are http://127.0.0.1:55285/collection1/ and leader is http://127.0.0.1:55285/collection1/
   [junit4]   2> 2815485 INFO  (coreZkRegister-8746-thread-1-processing-n:127.0.0.1:55285_ x:collection1 s:shard1 c:control_collection r:core_node1) [n:127.0.0.1:55285_ c:control_collection s:shard1 r:core_node1 x:collection1] o.a.s.c.ZkController No LogReplay needed for core=collection1 baseURL=http://127.0.0.1:55285
   [junit4]   2> 2815485 INFO  (coreZkRegister-8746-thread-1-processing-n:127.0.0.1:55285_ x:collection1 s:shard1 c:control_collection r:core_node1) [n:127.0.0.1:55285_ c:control_collection s:shard1 r:core_node1 x:collection1] o.a.s.c.ZkController I am the leader, no recovery necessary
   [junit4]   2> 2815485 INFO  (coreZkRegister-8746-thread-1-processing-n:127.0.0.1:55285_ x:collection1 s:shard1 c:control_collection r:core_node1) [n:127.0.0.1:55285_ c:control_collection s:shard1 r:core_node1 x:collection1] o.a.s.c.ZkController publishing state=active
   [junit4]   2> 2815485 INFO  (coreZkRegister-8746-thread-1-processing-n:127.0.0.1:55285_ x:collection1 s:shard1 c:control_collection r:core_node1) [n:127.0.0.1:55285_ c:control_collection s:shard1 r:core_node1 x:collection1] o.a.s.c.ZkController numShards not found on descriptor - reading it from system property
   [junit4]   2> 2815489 INFO  (OverseerStateUpdate-95921608477966340-127.0.0.1:55285_-n_0000000000) [n:127.0.0.1:55285_    ] o.a.s.c.Overseer processMessage: queueSize: 1, message = {
   [junit4]   2>   "core":"collection1",
   [junit4]   2>   "core_node_name":"core_node1",
   [junit4]   2>   "roles":null,
   [junit4]   2>   "base_url":"http://127.0.0.1:55285",
   [junit4]   2>   "node_name":"127.0.0.1:55285_",
   [junit4]   2>   "numShards":"1",
   [junit4]   2>   "state":"active",
   [junit4]   2>   "shard":"shard1",
   [junit4]   2>   "collection":"control_collection",
   [junit4]   2>   "operation":"state"} current state version: 2
   [junit4]   2> 2815489 INFO  (OverseerStateUpdate-95921608477966340-127.0.0.1:55285_-n_0000000000) [n:127.0.0.1:55285_    ] o.a.s.c.o.ReplicaMutator Update state numShards=1 message={
   [junit4]   2>   "core":"collection1",
   [junit4]   2>   "core_node_name":"core_node1",
   [junit4]   2>   "roles":null,
   [junit4]   2>   "base_url":"http://127.0.0.1:55285",
   [junit4]   2>   "node_name":"127.0.0.1:55285_",
   [junit4]   2>   "numShards":"1",
   [junit4]   2>   "state":"active",
   [junit4]   2>   "shard":"shard1",
   [junit4]   2>   "collection":"control_collection",
   [junit4]   2>   "operation":"state"}
   [junit4]   2> 2815503 INFO  (TEST-CustomCollectionTest.test-seed#[4AE541750EB8EEBA]) [    ] o.a.s.c.s.i.CloudSolrClient Final constructed zkHost string: 127.0.0.1:55788/solr
   [junit4]   2> 2815504 INFO  (TEST-CustomCollectionTest.test-seed#[4AE541750EB8EEBA]) [    ] o.a.s.c.c.SolrZkClient Using default ZkCredentialsProvider
   [junit4]   2> 2815505 INFO  (TEST-CustomCollectionTest.test-seed#[4AE541750EB8EEBA]) [    ] o.a.s.c.c.ConnectionManager Waiting for client to connect to ZooKeeper
   [junit4]   2> 2815508 INFO  (zkCallback-3289-thread-1) [    ] o.a.s.c.c.ConnectionManager Watcher org.apache.solr.common.cloud.ConnectionManager@56881471 name:ZooKeeperConnection Watcher:127.0.0.1:55788/solr got event WatchedEvent state:SyncConnected type:None path:null path:null type:None
   [junit4]   2> 2815508 INFO  (TEST-CustomCollectionTest.test-seed#[4AE541750EB8EEBA]) [    ] o.a.s.c.c.ConnectionManager Client is connected to ZooKeeper
   [junit4]   2> 2815509 INFO  (TEST-CustomCollectionTest.test-seed#[4AE541750EB8EEBA]) [    ] o.a.s.c.c.SolrZkClient Using default ZkACLProvider
   [junit4]   2> 2815509 INFO  (TEST-CustomCollectionTest.test-seed#[4AE541750EB8EEBA]) [    ] o.a.s.c.c.ZkStateReader Updating cluster state from ZooKeeper... 
   [junit4]   2> 2815510 INFO  (TEST-CustomCollectionTest.test-seed#[4AE541750EB8EEBA]) [    ] o.a.s.c.c.ZkStateReader Loaded empty cluster properties
   [junit4]   2> 2815512 INFO  (TEST-CustomCollectionTest.test-seed#[4AE541750EB8EEBA]) [    ] o.a.s.c.c.ZkStateReader Updated live nodes from ZooKeeper... (0) -> (1)
   [junit4]   2> 2815515 INFO  (TEST-CustomCollectionTest.test-seed#[4AE541750EB8EEBA]) [    ] o.a.s.c.ChaosMonkey monkey: init - expire sessions:false cause connection loss:false
   [junit4]   2> 2815515 INFO  (TEST-CustomCollectionTest.test-seed#[4AE541750EB8EEBA]) [    ] o.a.s.c.AbstractFullDistribZkTestBase Creating collection1 with stateFormat=2
   [junit4]   2> 2815515 INFO  (TEST-CustomCollectionTest.test-seed#[4AE541750EB8EEBA]) [    ] o.a.s.c.c.SolrZkClient Using default ZkCredentialsProvider
   [junit4]   2> 2815517 INFO  (TEST-CustomCollectionTest.test-seed#[4AE541750EB8EEBA]) [    ] o.a.s.c.c.ConnectionManager Waiting for client to connect to ZooKeeper
   [junit4]   2> 2815520 INFO  (zkCallback-3290-thread-1) [    ] o.a.s.c.c.ConnectionManager Watcher org.apache.solr.common.cloud.ConnectionManager@45d077b2 name:ZooKeeperConnection Watcher:127.0.0.1:55788/solr got event WatchedEvent state:SyncConnected type:None path:null path:null type:None
   [junit4]   2> 2815521 INFO  (TEST-CustomCollectionTest.test-seed#[4AE541750EB8EEBA]) [    ] o.a.s.c.c.ConnectionManager Client is connected to ZooKeeper
   [junit4]   2> 2815522 INFO  (TEST-CustomCollectionTest.test-seed#[4AE541750EB8EEBA]) [    ] o.a.s.c.c.SolrZkClient Using default ZkACLProvider
   [junit4]   2> 2815526 INFO  (OverseerStateUpdate-95921608477966340-127.0.0.1:55285_-n_0000000000) [n:127.0.0.1:55285_    ] o.a.s.c.Overseer processMessage: queueSize: 1, message = {
   [junit4]   2>   "operation":"create",
   [junit4]   2>   "name":"collection1",
   [junit4]   2>   "numShards":"2",
   [junit4]   2>   "stateFormat":"2"} current state version: 2
   [junit4]   2> 2815527 INFO  (OverseerStateUpdate-95921608477966340-127.0.0.1:55285_-n_0000000000) [n:127.0.0.1:55285_    ] o.a.s.c.o.ClusterStateMutator building a new cName: collection1
   [junit4]   2> 2815528 INFO  (zkCallback-3285-thread-1-processing-n:127.0.0.1:55285_) [n:127.0.0.1:55285_    ] o.a.s.c.c.ZkStateReader A cluster state change: [WatchedEvent state:SyncConnected type:NodeDataChanged path:/clusterstate.json], has occurred - updating... (live nodes size: [1])
   [junit4]   2> 2815529 INFO  (zkCallback-3289-thread-1) [    ] o.a.s.c.c.ZkStateReader A cluster state change: [WatchedEvent state:SyncConnected type:NodeDataChanged path:/clusterstate.json], has occurred - updating... (live nodes size: [1])
   [junit4]   2> 2815634 INFO  (OverseerStateUpdate-95921608477966340-127.0.0.1:55285_-n_0000000000) [n:127.0.0.1:55285_    ] o.a.s.c.o.ZkStateWriter going to create_collection /collections/collection1/state.json
   [junit4]   2> 2815976 INFO  (TEST-CustomCollectionTest.test-seed#[4AE541750EB8EEBA]) [    ] o.a.s.SolrTestCaseJ4 Writing core.properties file to /export/home/jenkins/workspace/Lucene-Solr-6.x-Solaris/solr/build/solr-core/test/J1/temp/solr.cloud.CustomCollectionTest_4AE541750EB8EEBA-001/shard-1-001/cores/collection1
   [junit4]   2> 2815978 INFO  (TEST-CustomCollectionTest.test-seed#[4AE541750EB8EEBA]) [    ] o.a.s.c.AbstractFullDistribZkTestBase create jetty 1 in directory /export/home/jenkins/workspace/Lucene-Solr-6.x-Solaris/solr/build/solr-core/test/J1/temp/solr.cloud.CustomCollectionTest_4AE541750EB8EEBA-001/shard-1-001
   [junit4]   2> 2815979 INFO  (TEST-CustomCollectionTest.test-seed#[4AE541750EB8EEBA]) [    ] o.e.j.s.Server jetty-9.3.8.v20160314
   [junit4]   2> 2815997 INFO  (TEST-CustomCollectionTest.test-seed#[4AE541750EB8EEBA]) [    ] o.e.j.s.h.ContextHandler Started o.e.j.s.ServletContextHandler@318b1931{/,null,AVAILABLE}
   [junit4]   2> 2815998 INFO  (TEST-CustomCollectionTest.test-seed#[4AE541750EB8EEBA]) [    ] o.e.j.s.ServerConnector Started ServerConnector@843d9be{HTTP/1.1,[http/1.1]}{127.0.0.1:34488}
   [junit4]   2> 2815998 INFO  (TEST-CustomCollectionTest.test-seed#[4AE541750EB8EEBA]) [    ] o.e.j.s.Server Started @2821705ms
   [junit4]   2> 2815998 INFO  (TEST-CustomCollectionTest.test-seed#[4AE541750EB8EEBA]) [    ] o.a.s.c.s.e.JettySolrRunner Jetty properties: {solr.data.dir=/export/home/jenkins/workspace/Lucene-Solr-6.x-Solaris/solr/build/solr-core/test/J1/temp/solr.cloud.CustomCollectionTest_4AE541750EB8EEBA-001/tempDir-001/jetty1, solrconfig=solrconfig.xml, hostContext=/, hostPort=34488, coreRootDirectory=/export/home/jenkins/workspace/Lucene-Solr-6.x-Solaris/solr/build/solr-core/test/J1/temp/solr.cloud.CustomCollectionTest_4AE541750EB8EEBA-001/shard-1-001/cores}
   [junit4]   2> 2815998 INFO  (TEST-CustomCollectionTest.test-seed#[4AE541750EB8EEBA]) [    ] o.a.s.s.SolrDispatchFilter SolrDispatchFilter.init(): sun.misc.Launcher$AppClassLoader@6d06d69c
   [junit4]   2> 2815999 INFO  (TEST-CustomCollectionTest.test-seed#[4AE541750EB8EEBA]) [    ] o.a.s.c.SolrResourceLoader new SolrResourceLoader for directory: '/export/home/jenkins/workspace/Lucene-Solr-6.x-Solaris/solr/build/solr-core/test/J1/temp/solr.cloud.CustomCollectionTest_4AE541750EB8EEBA-001/shard-1-001'
   [junit4]   2> 2816000 INFO  (TEST-CustomCollectionTest.test-seed#[4AE541750EB8EEBA]) [    ] o.a.s.c.SolrResourceLoader JNDI not configured for solr (NoInitialContextEx)
   [junit4]   2> 2816000 INFO  (TEST-CustomCollectionTest.test-seed#[4AE541750EB8EEBA]) [    ] o.a.s.c.SolrResourceLoader solr home defaulted to 'solr/' (could not find system property or JNDI)
   [junit4]   2> 2816000 INFO  (TEST-CustomCollectionTest.test-seed#[4AE541750EB8EEBA]) [    ] o.a.s.c.c.SolrZkClient Using default ZkCredentialsProvider
   [junit4]   2> 2816022 INFO  (TEST-CustomCollectionTest.test-seed#[4AE541750EB8EEBA]) [    ] o.a.s.c.c.ConnectionManager Waiting for client to connect to ZooKeeper
   [junit4]   2> 2816026 INFO  (zkCallback-3291-thread-1) [    ] o.a.s.c.c.ConnectionManager Watcher org.apache.solr.common.cloud.ConnectionManager@4519e9d5 name:ZooKeeperConnection Watcher:127.0.0.1:55788/solr got event WatchedEvent state:SyncConnected type:None path:null path:null type:None
   [junit4]   2> 2816026 INFO  (TEST-CustomCollectionTest.test-seed#[4AE541750EB8EEBA]) [    ] o.a.s.c.c.ConnectionManager Client is connected to ZooKeeper
   [junit4]   2> 2816027 INFO  (TEST-CustomCollectionTest.test-seed#[4AE541750EB8EEBA]) [    ] o.a.s.c.c.SolrZkClient Using default ZkACLProvider
   [junit4]   2> 2816029 INFO  (TEST-CustomCollectionTest.test-seed#[4AE541750EB8EEBA]) [    ] o.a.s.s.SolrDispatchFilter Loading solr.xml from SolrHome (not found in ZooKeeper)
   [junit4]   2> 2816029 INFO  (TEST-CustomCollectionTest.test-seed#[4AE541750EB8EEBA]) [    ] o.a.s.c.SolrXmlConfig Loading container configuration from /export/home/jenkins/workspace/Lucene-Solr-6.x-Solaris/solr/build/solr-core/test/J1/temp/solr.cloud.CustomCollectionTest_4AE541750EB8EEBA-001/shard-1-001/solr.xml
   [junit4]   2> 2816034 INFO  (TEST-CustomCollectionTest.test-seed#[4AE541750EB8EEBA]) [    ] o.a.s.c.CorePropertiesLocator Config-defined core root directory: /export/home/jenkins/workspace/Lucene-Solr-6.x-Solaris/solr/build/solr-core/test/J1/temp/solr.cloud.CustomCollectionTest_4AE541750EB8EEBA-001/shard-1-001/cores
   [junit4]   2> 2816034 INFO  (TEST-CustomCollectionTest.test-seed#[4AE541750EB8EEBA]) [    ] o.a.s.c.CoreContainer New CoreContainer 619226413
   [junit4]   2> 2816034 INFO  (TEST-CustomCollectionTest.test-seed#[4AE541750EB8EEBA]) [    ] o.a.s.c.CoreContainer Loading cores into CoreContainer [instanceDir=/export/home/jenkins/workspace/Lucene-Solr-6.x-Solaris/solr/build/solr-core/test/J1/temp/solr.cloud.CustomCollectionTest_4AE541750EB8EEBA-001/shard-1-001]
   [junit4]   2> 2816034 WARN  (TEST-CustomCollectionTest.test-seed#[4AE541750EB8EEBA]) [    ] o.a.s.c.CoreContainer Couldn't add files from /export/home/jenkins/workspace/Lucene-Solr-6.x-Solaris/solr/build/solr-core/test/J1/temp/solr.cloud.CustomCollectionTest_4AE541750EB8EEBA-001/shard-1-001/lib to classpath: /export/home/jenkins/workspace/Lucene-Solr-6.x-Solaris/solr/build/solr-core/test/J1/temp/solr.cloud.CustomCollectionTest_4AE541750EB8EEBA-001/shard-1-001/lib
   [junit4]   2> 2816034 INFO  (TEST-CustomCollectionTest.test-seed#[4AE541750EB8EEBA]) [    ] o.a.s.h.c.HttpShardHandlerFactory created with socketTimeout : 90000,urlScheme : ,connTimeout : 15000,maxConnectionsPerHost : 20,maxConnections : 10000,corePoolSize : 0,maximumPoolSize : 2147483647,maxThreadIdleTime : 5,sizeOfQueue : -1,fairnessPolicy : false,useRetries : false,
   [junit4]   2> 2816035 INFO  (TEST-CustomCollectionTest.test-seed#[4AE541750EB8EEBA]) [    ] o.a.s.u.UpdateShardHandler Creating UpdateShardHandler HTTP client with params: socketTimeout=340000&connTimeout=45000&retry=true
   [junit4]   2> 2816036 INFO  (TEST-CustomCollectionTest.test-seed#[4AE541750EB8EEBA]) [    ] o.a.s.l.LogWatcher SLF4J impl is org.slf4j.impl.Log4jLoggerFactory
   [junit4]   2> 2816036 INFO  (TEST-CustomCollectionTest.test-seed#[4AE541750EB8EEBA]) [    ] o.a.s.l.LogWatcher Registering Log Listener [Log4j (org.slf4j.impl.Log4jLoggerFactory)]
   [junit4]   2> 2816036 INFO  (TEST-CustomCollectionTest.test-seed#[4AE541750EB8EEBA]) [    ] o.a.s.c.ZkContainer Zookeeper client=127.0.0.1:55788/solr
   [junit4]   2> 2816036 INFO  (TEST-CustomCollectionTest.test-seed#[4AE541750EB8EEBA]) [    ] o.a.s.c.ZkController zkHost includes chroot
   [junit4]   2> 2816036 INFO  (TEST-CustomCollectionTest.test-seed#[4AE541750EB8EEBA]) [    ] o.a.s.c.c.SolrZkClient Using default ZkCredentialsProvider
   [junit4]   2> 2816037 INFO  (TEST-CustomCollectionTest.test-seed#[4AE541750EB8EEBA]) [    ] o.a.s.c.c.ConnectionManager Waiting for client to connect to ZooKeeper
   [junit4]   2> 2816088 INFO  (zkCallback-3294-thread-1) [    ] o.a.s.c.c.ConnectionManager Watcher org.apache.solr.common.cloud.ConnectionManager@19231746 name:ZooKeeperConnection Watcher:127.0.0.1:55788 got event WatchedEvent state:SyncConnected type:None path:null path:null type:None
   [junit4]   2> 2816091 INFO  (TEST-CustomCollectionTest.test-seed#[4AE541750EB8EEBA]) [    ] o.a.s.c.c.ConnectionManager Client is connected to ZooKeeper
   [junit4]   2> 2816092 INFO  (TEST-CustomCollectionTest.test-seed#[4AE541750EB8EEBA]) [    ] o.a.s.c.c.SolrZkClient Using default ZkACLProvider
   [junit4]   2> 2816095 INFO  (TEST-CustomCollectionTest.test-seed#[4AE541750EB8EEBA]) [n:127.0.0.1:34488_    ] o.a.s.c.ZkController Added new OnReconnect listener org.apache.solr.cloud.ZkController$$Lambda$78/695550353@6434e3ce
   [junit4]   2> 2816096 INFO  (TEST-CustomCollectionTest.test-seed#[4AE541750EB8EEBA]) [n:127.0.0.1:34488_    ] o.a.s.c.c.ConnectionManager Waiting for client to connect to ZooKeeper
   [junit4]   2> 2816101 INFO  (zkCallback-3295-thread-1-processing-n:127.0.0.1:34488_) [n:127.0.0.1:34488_    ] o.a.s.c.c.ConnectionManager Watcher org.apache.solr.common.cloud.ConnectionManager@29e881ea name:ZooKeeperConnection Watcher:127.0.0.1:55788/solr got event WatchedEvent state:SyncConnected type:None path:null path:null type:None
   [junit4]   2> 2816102 INFO  (TEST-CustomCollectionTest.test-seed#[4AE541750EB8EEBA]) [n:127.0.0.1:34488_    ] o.a.s.c.c.ConnectionManager Client is connected to ZooKeeper
   [junit4]   2> 2816118 INFO  (TEST-CustomCollectionTest.test-seed#[4AE541750EB8EEBA]) [n:127.0.0.1:34488_    ] o.a.s.c.c.ZkStateReader Updating cluster state from ZooKeeper... 
   [junit4]   2> 2816120 INFO  (TEST-CustomCollectionTest.test-seed#[4AE541750EB8EEBA]) [n:127.0.0.1:34488_    ] o.a.s.c.c.ZkStateReader Loaded empty cluster properties
   [junit4]   2> 2816121 INFO  (TEST-CustomCollectionTest.test-seed#[4AE541750EB8EEBA]) [n:127.0.0.1:34488_    ] o.a.s.c.c.ZkStateReader Updated live nodes from ZooKeeper... (0) -> (1)
   [junit4]   2> 2816127 INFO  (TEST-CustomCollectionTest.test-seed#[4AE541750EB8EEBA]) [n:127.0.0.1:34488_    ] o.a.s.c.Overseer Overseer (id=null) closing
   [junit4]   2> 2816129 INFO  (TEST-CustomCollectionTest.test-seed#[4AE541750EB8EEBA]) [n:127.0.0.1:34488_    ] o.a.s.c.LeaderElector Joined leadership election with path: /overseer_elect/election/95921608477966345-127.0.0.1:34488_-n_0000000001
   [junit4]   2> 2816130 INFO  (TEST-CustomCollectionTest.test-seed#[4AE541750EB8EEBA]) [n:127.0.0.1:34488_    ] o.a.s.c.LeaderElector Watching path /overseer_elect/election/95921608477966340-127.0.0.1:55285_-n_0000000000 to know if I could be the leader
   [junit4]   2> 2816131 INFO  (TEST-CustomCollectionTest.test-seed#[4AE541750EB8EEBA]) [n:127.0.0.1:34488_    ] o.a.s.c.ZkController Publish node=127.0.0.1:34488_ as DOWN
   [junit4]   2> 2816136 INFO  (OverseerStateUpdate-95921608477966340-127.0.0.1:55285_-n_0000000000) [n:127.0.0.1:55285_    ] o.a.s.c.Overseer processMessage: queueSize: 1, message = {
   [junit4]   2>   "operation":"downnode",
   [junit4]   2>   "node_name":"127.0.0.1:34488_"} current state version: 3
   [junit4]   2> 2816136 INFO  (OverseerStateUpdate-95921608477966340-127.0.0.1:55285_-n_0000000000) [n:127.0.0.1:55285_    ] o.a.s.c.o.NodeMutator DownNode state invoked for node: 127.0.0.1:34488_
   [junit4]   2> 2816141 INFO  (zkCallback-3289-thread-1) [    ] o.a.s.c.c.ZkStateReader A cluster state change: [WatchedEvent state:SyncConnected type:NodeDataChanged path:/clusterstate.json], has occurred - updating... (live nodes size: [1])
   [junit4]   2> 2816141 INFO  (zkCallback-3285-thread-1-processing-n:127.0.0.1:55285_) [n:127.0.0.1:55285_    ] o.a.s.c.c.ZkStateReader A cluster state change: [WatchedEvent state:SyncConnected type:NodeDataChanged path:/clusterstate.json], has occurred - updating... (live nodes size: [1])
   [junit4]   2> 2816147 INFO  (zkCallback-3295-thread-1-processing-n:127.0.0.1:34488_) [n:127.0.0.1:34488_    ] o.a.s.c.c.ZkStateReader A cluster state change: [WatchedEvent state:SyncConnected type:NodeDataChanged path:/clusterstate.json], has occurred - updating... (live nodes size: [1])
   [junit4]   2> 2816251 INFO  (OverseerStateUpdate-95921608477966340-127.0.0.1:55285_-n_0000000000) [n:127.0.0.1:55285_    ] o.a.s.c.o.ZkStateWriter going to update_collection /collections/collection1/state.json version: 0
   [junit4]   2> 2817146 INFO  (TEST-CustomCollectionTest.test-seed#[4AE541750EB8EEBA]) [n:127.0.0.1:34488_    ] o.a.s.c.ZkController Register node as live in ZooKeeper:/live_nodes/127.0.0.1:34488_
   [junit4]   2> 2817149 INFO  (TEST-CustomCollectionTest.test-seed#[4AE541750EB8EEBA]) [n:127.0.0.1:34488_    ] o.a.s.c.c.SolrZkClient makePath: /live_nodes/127.0.0.1:34488_
   [junit4]   2> 2817152 INFO  (zkCallback-3289-thread-1) [    ] o.a.s.c.c.ZkStateReader A live node change: [WatchedEvent state:SyncConnected type:NodeChildrenChanged path:/live_nodes], has occurred - updating... (live nodes size: [1])
   [junit4]   2> 2817152 INFO  (zkCallback-3285-thread-1-processing-n:127.0.0.1:55285_) [n:127.0.0.1:55285_    ] o.a.s.c.c.ZkStateReader A live node change: [WatchedEvent state:SyncConnected type:NodeChildrenChanged path:/live_nodes], has occurred - updating... (live nodes size: [1])
   [junit4]   2> 2817152 INFO  (zkCallback-3295-thread-1-processing-n:127.0.0.1:34488_) [n:127.0.0.1:34488_    ] o.a.s.c.c.ZkStateReader A live node change: [WatchedEvent state:SyncConnected type:NodeChildrenChanged path:/live_nodes], has occurred - updating... (live nodes size: [1])
   [junit4]   2> 2817152 INFO  (zkCallback-3289-thread-1) [    ] o.a.s.c.c.ZkStateReader Updated live nodes from ZooKeeper... (1) -> (2)
   [junit4]   2> 2817153 INFO  (zkCallback-3285-thread-1-processing-n:127.0.0.1:55285_) [n:127.0.0.1:55285_    ] o.a.s.c.c.ZkStateReader Updated live nodes from ZooKeeper... (1) -> (2)
   [junit4]   2> 2817153 INFO  (zkCallback-3295-thread-1-processing-n:127.0.0.1:34488_) [n:127.0.0.1:34488_    ] o.a.s.c.c.ZkStateReader Updated live nodes from ZooKeeper... (1) -> (2)
   [junit4]   2> 2817189 INFO  (TEST-CustomCollectionTest.test-seed#[4AE541750EB8EEBA]) [n:127.0.0.1:34488_    ] o.a.s.c.CoreContainer Security conf doesn't exist. Skipping setup for authorization module.
   [junit4]   2> 2817189 INFO  (TEST-CustomCollectionTest.test-seed#[4AE541750EB8EEBA]) [n:127.0.0.1:34488_    ] o.a.s.c.CoreContainer No authentication plugin used.
   [junit4]   2> 2817191 INFO  (TEST-CustomCollectionTest.test-seed#[4AE541750EB8EEBA]) [n:127.0.0.1:34488_    ] o.a.s.c.CorePropertiesLocator Looking for core definitions underneath /export/home/jenkins/workspace/Lucene-Solr-6.x-Solaris/solr/build/solr-core/test/J1/temp/solr.cloud.CustomCollectionTest_4AE541750EB8EEBA-001/shard-1-001/cores
   [junit4]   2> 2817192 INFO  (TEST-CustomCollectionTest.test-seed#[4AE541750EB8EEBA]) [n:127.0.0.1:34488_    ] o.a.s.c.CoreDescriptor Created CoreDescriptor: {name=collection1, config=solrconfig.xml, transient=false, schema=schema.xml, loadOnStartup=true, configSetProperties=configsetprops.json, collection=collection1, coreNodeName=, dataDir=data/, shard=}
   [junit4]   2> 2817192 INFO  (TEST-CustomCollectionTest.test-seed#[4AE541750EB8EEBA]) [n:127.0.0.1:34488_    ] o.a.s.c.CorePropertiesLocator Found core collection1 in /export/home/jenkins/workspace/Lucene-Solr-6.x-Solaris/solr/build/solr-core/test/J1/temp/solr.cloud.CustomCollectionTest_4AE541750EB8EEBA-001/shard-1-001/cores/collection1
   [junit4]   2> 2817192 INFO  (TEST-CustomCollectionTest.test-seed#[4AE541750EB8EEBA]) [n:127.0.0.1:34488_    ] o.a.s.c.CorePropertiesLocator Found 1 core definitions
   [junit4]   2> 2817195 INFO  (TEST-CustomCollectionTest.test-seed#[4AE541750EB8EEBA]) [n:127.0.0.1:34488_    ] o.a.s.s.SolrDispatchFilter user.dir=/export/home/jenkins/workspace/Lucene-Solr-6.x-Solaris/solr/build/solr-core/test/J1
   [junit4]   2> 2817195 INFO  (TEST-CustomCollectionTest.test-seed#[4AE541750EB8EEBA]) [n:127.0.0.1:34488_    ] o.a.s.s.SolrDispatchFilter SolrDispatchFilter.init() done
   [junit4]   2> 2817196 INFO  (coreLoadExecutor-8763-thread-1-processing-n:127.0.0.1:34488_) [n:127.0.0.1:34488_ c:collection1   x:collection1] o.a.s.c.ZkController publishing state=down
   [junit4]   2> 2817196 INFO  (coreLoadExecutor-8763-thread-1-processing-n:127.0.0.1:34488_) [n:127.0.0.1:34488_ c:collection1   x:collection1] o.a.s.c.ZkController numShards not found on descriptor - reading it from system property
   [junit4]   2> 2817198 INFO  (OverseerStateUpdate-95921608477966340-127.0.0.1:55285_-n_0000000000) [n:127.0.0.1:55285_    ] o.a.s.c.Overseer processMessage: queueSize: 1, message = {
   [junit4]   2>   "core":"collection1",
   [junit4]   2>   "roles":null,
   [junit4]   2>   "base_url":"http://127.0.0.1:34488",
   [junit4]   2>   "node_name":"127.0.0.1:34488_",
   [junit4]   2>   "numShards":"2",
   [junit4]   2>   "state":"down",
   [junit4]   2>   "shard":null,
   [junit4]   2>   "collection":"collection1",
   [junit4]   2>   "operation":"state"} current state version: 4
   [junit4]   2> 2817198 INFO  (coreLoadExecutor-8763-thread-1-processing-n:127.0.0.1:34488_) [n:127.0.0.1:34488_ c:collection1   x:collection1] o.a.s.c.ZkController Registering watch for collection collection1
   [junit4]   2> 2817198 INFO  (OverseerStateUpdate-95921608477966340-127.0.0.1:55285_-n_0000000000) [n:127.0.0.1:55285_    ] o.a.s.c.o.ReplicaMutator Update state numShards=2 message={
   [junit4]   2>   "core":"collection1",
   [junit4]   2>   "roles":null,
   [junit4]   2>   "base_url":"http://127.0.0.1:34488",
   [junit4]   2>   "node_name":"127.0.0.1:34488_",
   [junit4]   2>   "numShards":"2",
   [junit4]   2>   "state":"down",
   [junit4]   2>   "shard":null,
   [junit4]   2>   "collection":"collection1",
   [junit4]   2>   "operation":"state"}
   [junit4]   2> 2817199 INFO  (OverseerStateUpdate-95921608477966340-127.0.0.1:55285_-n_0000000000) [n:127.0.0.1:55285_    ] o.a.s.c.o.ReplicaMutator Collection already exists with numShards=2
   [junit4]   2> 2817199 INFO  (OverseerStateUpdate-95921608477966340-127.0.0.1:55285_-n_0000000000) [n:127.0.0.1:55285_    ] o.a.s.c.o.ReplicaMutator Assigning new node to shard shard=shard2
   [junit4]   2> 2817199 INFO  (coreLoadExecutor-8763-thread-1-processing-n:127.0.0.1:34488_) [n:127.0.0.1:34488_ c:collection1   x:collection1] o.a.s.c.c.ZkStateReader Add data for [collection1] ver [1]
   [junit4]   2> 2817200 INFO  (coreLoadExecutor-8763-thread-1-processing-n:127.0.0.1:34488_) [n:127.0.0.1:34488_ c:collection1   x:collection1] o.a.s.c.ZkController look for our core node name
   [junit4]   2> 2817302 INFO  (OverseerStateUpdate-95921608477966340-127.0.0.1:55285_-n_0000000000) [n:127.0.0.1:55285_    ] o.a.s.c.o.ZkStateWriter going to update_collection /collections/collection1/state.json version: 1
   [junit4]   2> 2817303 INFO  (zkCallback-3295-thread-1-processing-n:127.0.0.1:34488_) [n:127.0.0.1:34488_    ] o.a.s.c.c.ZkStateReader A cluster state change: [WatchedEvent state:SyncConnected type:NodeDataChanged path:/collections/collection1/state.json] for collection [collection1] has occurred - updating... (live nodes size: [2])
   [junit4]   2> 2817304 INFO  (zkCallback-3295-thread-1-processing-n:127.0.0.1:34488_) [n:127.0.0.1:34488_    ] o.a.s.c.c.ZkStateReader Updating data for [collection1] from [1] to [2]
   [junit4]   2> 2818201 INFO  (coreLoadExecutor-8763-thread-1-processing-n:127.0.0.1:34488_) [n:127.0.0.1:34488_ c:collection1   x:collection1] o.a.s.c.ZkController waiting to find shard id in clusterstate for collection1
   [junit4]   2> 2818201 INFO  (coreLoadExecutor-8763-thread-1-processing-n:127.0.0.1:34488_) [n:127.0.0.1:34488_ c:collection1   x:collection1] o.a.s.c.ZkController Check for collection zkNode:collection1
   [junit4]   2> 2818202 INFO  (coreLoadExecutor-8763-thread-1-processing-n:127.0.0.1:34488_) [n:127.0.0.1:34488_ c:collection1   x:collection1] o.a.s.c.ZkController Collection zkNode exists
   [junit4]   2> 2818202 INFO  (coreLoadExecutor-8763-thread-1-processing-n:127.0.0.1:34488_) [n:127.0.0.1:34488_ c:collection1   x:collection1] o.a.s.c.c.ZkStateReader Load collection config from: [/collections/collection1]
   [junit4]   2> 2818204 INFO  (coreLoadExecutor-8763-thread-1-processing-n:127.0.0.1:34488_) [n:127.0.0.1:34488_ c:collection1   x:collection1] o.a.s.c.c.ZkStateReader path=[/collections/collection1] [configName]=[conf1] specified config exists in ZooKeeper
   [junit4]   2> 2818204 INFO  (coreLoadExecutor-8763-thread-1-processing-n:127.0.0.1:34488_) [n:127.0.0.1:34488_ c:collection1   x:collection1] o.a.s.c.SolrResourceLoader new SolrResourceLoader for directory: '/export/home/jenkins/workspace/Lucene-Solr-6.x-Solaris/solr/build/solr-core/test/J1/temp/solr.cloud.CustomCollectionTest_4AE541750EB8EEBA-001/shard-1-001/cores/collection1'
   [junit4]   2> 2818204 INFO  (coreLoadExecutor-8763-thread-1-processing-n:127.0.0.1:34488_) [n:127.0.0.1:34488_ c:collection1   x:collection1] o.a.s.c.SolrResourceLoader JNDI not configured for solr (NoInitialContextEx)
   [junit4]   2> 2818204 INFO  (coreLoadExecutor-8763-thread-1-processing-n:127.0.0.1:34488_) [n:127.0.0.1:34488_ c:collection1   x:collection1] o.a.s.c.SolrResourceLoader solr home defaulted to 'solr/' (could not find system property or JNDI)
   [junit4]   2> 2818207 INFO  (coreLoadExecutor-8763-thread-1-processing-n:127.0.0.1:34488_) [n:127.0.0.1:34488_ c:collection1   x:collection1] o.a.s.c.Config loaded config solrconfig.xml with version 0 
   [junit4]   2> 2818215 INFO  (coreLoadExecutor-8763-thread-1-processing-n:127.0.0.1:34488_) [n:127.0.0.1:34488_ c:collection1   x:collection1] o.a.s.c.SolrConfig current version of requestparams : -1
   [junit4]   2> 2818221 INFO  (coreLoadExecutor-8763-thread-1-processing-n:127.0.0.1:34488_) [n:127.0.0.1:34488_ c:collection1   x:collection1] o.a.s.c.SolrConfig Using Lucene MatchVersion: 6.1.0
   [junit4]   2> 2818269 INFO  (coreLoadExecutor-8763-thread-1-processing-n:127.0.0.1:34488_) [n:127.0.0.1:34488_ c:collection1   x:collection1] o.a.s.c.SolrConfig Loaded SolrConfig: solrconfig.xml
   [junit4]   2> 2818277 INFO  (coreLoadExecutor-8763-thread-1-processing-n:127.0.0.1:34488_) [n:127.0.0.1:34488_ c:collection1   x:collection1] o.a.s.s.IndexSchema [collection1] Schema name=test
   [junit4]   2> 2818401 INFO  (coreLoadExecutor-8763-thread-1-processing-n:127.0.0.1:34488_) [n:127.0.0.1:34488_ c:collection1   x:collection1] o.a.s.s.OpenExchangeRatesOrgProvider Initialized with rates=open-exchange-rates.json, refreshInterval=1440.
   [junit4]   2> 2818409 INFO  (coreLoadExecutor-8763-thread-1-processing-n:127.0.0.1:34488_) [n:127.0.0.1:34488_ c:collection1   x:collection1] o.a.s.s.IndexSchema default search field in schema is text
   [junit4]   2> 2818411 INFO  (coreLoadExecutor-8763-thread-1-processing-n:127.0.0.1:34488_) [n:127.0.0.1:34488_ c:collection1   x:collection1] o.a.s.s.IndexSchema unique key field: id
   [junit4]   2> 2818427 INFO  (coreLoadExecutor-8763-thread-1-processing-n:127.0.0.1:34488_) [n:127.0.0.1:34488_ c:collection1   x:collection1] o.a.s.s.FileExchangeRateProvider Reloading exchange rates from file currency.xml
   [junit4]   2> 2818432 INFO  (coreLoadExecutor-8763-thread-1-processing-n:127.0.0.1:34488_) [n:127.0.0.1:34488_ c:collection1   x:collection1] o.a.s.s.FileExchangeRateProvider Reloading exchange rates from f

[...truncated too long message...]

pter.java:36)
   [junit4]   2>         at com.carrotsearch.randomizedtesting.ThreadLeakControl$StatementRunner.run(ThreadLeakControl.java:367)
   [junit4]   2>         at java.lang.Thread.run(Thread.java:745)
   [junit4]   2> NOTE: leaving temporary files on disk at: /export/home/jenkins/workspace/Lucene-Solr-6.x-Solaris/solr/build/solr-core/test/J1/temp/solr.security.BasicAuthIntegrationTest_4AE541750EB8EEBA-001
   [junit4]   2> 11506069 ERROR (TEST-BasicAuthIntegrationTest.testBasics-seed#[4AE541750EB8EEBA]-SendThread(127.0.0.1:57915)) [n:127.0.0.1:34972_solr    ] o.a.z.ClientCnxnSocketNIO Unable to open socket to 127.0.0.1/127.0.0.1:57915
   [junit4]   2> NOTE: test params are: codec=Asserting(Lucene60), sim=ClassicSimilarity, locale=uk, timezone=America/Indiana/Knox
   [junit4]   2> NOTE: SunOS 5.11 amd64/Oracle Corporation 1.8.0_92 (64-bit)/cpus=3,threads=1,free=116631464,total=536870912
   [junit4]   2> NOTE: All tests run in this JVM: [TestFieldCollectionResource, SecurityConfHandlerTest, TestBadConfig, ZkStateWriterTest, BadIndexSchemaTest, TestHighFrequencyDictionaryFactory, LoggingHandlerTest, DateFieldTest, TestSolrCloudWithKerberosAlt, UUIDUpdateProcessorFallbackTest, TestPerFieldSimilarityClassic, CollectionReloadTest, TestSmileRequest, DeleteStatusTest, TestCollapseQParserPlugin, TestAddFieldRealTimeGet, HdfsDirectoryTest, BlockDirectoryTest, BigEndianAscendingWordDeserializerTest, HdfsNNFailoverTest, TestUtils, RankQueryTest, SolrCloudExampleTest, EchoParamsTest, TestSubQueryTransformer, SimpleMLTQParserTest, DistributedTermsComponentTest, SpellCheckComponentTest, TestMaxScoreQueryParser, TestPHPSerializedResponseWriter, TestRandomFaceting, OpenExchangeRatesOrgProviderTest, TestCrossCoreJoin, UpdateRequestProcessorFactoryTest, CursorMarkTest, TestFastOutputStream, TestSortingResponseWriter, SpellPossibilityIteratorTest, TestHashQParserPlugin, BasicDistributedZk2Test, ResourceLoaderTest, TestXmlQParser, SignatureUpdateProcessorFactoryTest, OutputWriterTest, SolrIndexSplitterTest, TestSerializedLuceneMatchVersion, ShowFileRequestHandlerTest, TestBlobHandler, ZkNodePropsTest, HdfsBasicDistributedZkTest, CoreAdminHandlerTest, TestJettySolrRunner, RestartWhileUpdatingTest, TestSubQueryTransformerDistrib, StatsComponentTest, TestRecovery, TestZkChroot, FacetPivotSmallTest, TestSolrConfigHandlerCloud, TestRecoveryHdfs, TestExactStatsCache, CollectionsAPIDistributedZkTest, TestTolerantUpdateProcessorCloud, TestSolrQueryParser, TestAtomicUpdateErrorCases, TestDistributedStatsComponentCardinality, DeleteInactiveReplicaTest, TestAuthenticationFramework, BaseCdcrDistributedZkTest, TestRequestStatusCollectionAPI, DebugComponentTest, MinimalSchemaTest, TestTrie, TestFuzzyAnalyzedSuggestions, TestConfigSetImmutable, LukeRequestHandlerTest, VMParamsZkACLAndCredentialsProvidersTest, TestSolrDeletionPolicy2, QueryResultKeyTest, TestDynamicFieldCollectionResource, TestCustomSort, TestSolrCLIRunExample, ShardSplitTest, AddSchemaFieldsUpdateProcessorFactoryTest, TestMinMaxOnMultiValuedField, TestHdfsUpdateLog, BadCopyFieldTest, DeleteReplicaTest, TestJsonRequest, SortByFunctionTest, AddBlockUpdateTest, TestNoOpRegenerator, BlockJoinFacetSimpleTest, TestCloudPivotFacet, TestInitParams, CleanupOldIndexTest, TestQueryUtils, CollectionTooManyReplicasTest, TestGraphMLResponseWriter, TestBM25SimilarityFactory, TestConfigSetsAPIZkFailure, RuleEngineTest, CdcrReplicationHandlerTest, TestNamedUpdateProcessors, ConvertedLegacyTest, TestImplicitCoreProperties, ConfigSetsAPITest, TestQuerySenderListener, HighlighterConfigTest, SynonymTokenizerTest, TestDistribIDF, TestReloadAndDeleteDocs, TestAuthorizationFramework, OpenCloseCoreStressTest, DistributedDebugComponentTest, BasicZkTest, SolrCoreCheckLockOnStartupTest, TestSolrJ, MultiThreadedOCPTest, ResponseLogComponentTest, TestExclusionRuleCollectionAccess, TestDistributedMissingSort, DistanceFunctionTest, TestSolrConfigHandler, MultiTermTest, TestCharFilters, ParsingFieldUpdateProcessorsTest, QueryParsingTest, FileUtilsTest, AnalyticsMergeStrategyTest, TlogReplayBufferedWhileIndexingTest, TestClusterStateMutator, TestAnalyzeInfixSuggestions, SolrInfoMBeanTest, TestDistribDocBasedVersion, IndexSchemaRuntimeFieldTest, TestCopyFieldCollectionResource, OverseerTaskQueueTest, TestReload, LeaderFailoverAfterPartitionTest, TestStressUserVersions, HdfsTlogReplayBufferedWhileIndexingTest, TestDFISimilarityFactory, HdfsWriteToMultipleCollectionsTest, NumericFieldsTest, ShardRoutingTest, FullSolrCloudDistribCmdsTest, TestRandomDVFaceting, ZkCLITest, TermVectorComponentDistributedTest, TestRealTimeGet, TestJoin, TestRangeQuery, TestCoreContainer, SimpleFacetsTest, SolrCoreTest, QueryElevationComponentTest, BasicFunctionalityTest, DirectUpdateHandlerTest, DistributedQueryElevationComponentTest, TestExtendedDismaxParser, SuggesterFSTTest, SolrRequestParserTest, SuggesterTest, SuggesterWFSTTest, SchemaVersionSpecificBehaviorTest, TestPseudoReturnFields, FieldMutatingUpdateProcessorTest, DirectUpdateHandlerOptimizeTest, DefaultValueUpdateProcessorTest, TestSolrDeletionPolicy1, CacheHeaderTest, TestSurroundQueryParser, DisMaxRequestHandlerTest, TestWriterPerf, DocumentAnalysisRequestHandlerTest, TermsComponentTest, RequestHandlersTest, PathHierarchyTokenizerFactoryTest, TestIndexingPerformance, RequiredFieldsTest, SolrPluginUtilsTest, TestCollationField, ReturnFieldsTest, MBeansHandlerTest, UniqFieldsUpdateProcessorFactoryTest, JsonLoaderTest, TestPartialUpdateDeduplication, CSVRequestHandlerTest, TestComponentsName, SearchHandlerTest, AlternateDirectoryTest, TestQuerySenderNoQuery, SolrIndexConfigTest, TestBinaryField, TestSearchPerf, TestElisionMultitermQuery, ExternalFileFieldSortTest, TestSolrCoreProperties, DirectSolrConnectionTest, NotRequiredUniqueKeyTest, TestLuceneMatchVersion, TestSweetSpotSimilarityFactory, TestPerFieldSimilarity, TestLMDirichletSimilarityFactory, TestLMJelinekMercerSimilarityFactory, TestFastWriter, URLClassifyProcessorTest, PluginInfoTest, TestFastLRUCache, DateMathParserTest, PreAnalyzedFieldTest, TestSystemIdResolver, PrimUtilsTest, TestSuggestSpellingConverter, SpellingQueryConverterTest, DOMUtilTest, RAMDirectoryFactoryTest, ClusterStateTest, SliceStateTest, DistributedMLTComponentTest, TestRTGBase, TestSimpleTrackingShardHandler, ConnectionReuseTest, ActionThrottleTest, AssignTest, AsyncCallRequestStatusResponseTest, CdcrReplicationDistributedZkTest, CdcrVersionReplicationTest, CreateCollectionCleanupTest, CustomCollectionTest, LeaderInitiatedRecoveryOnShardRestartTest, MigrateRouteKeyTest, OverseerStatusTest, RecoveryAfterSoftCommitTest, RollingRestartTest, TestCloudDeleteByQuery, TestConfigSetsAPI, TestLeaderElectionZkExpiry, TestLeaderInitiatedRecoveryThread, TestMiniSolrCloudClusterBase, TestMiniSolrCloudClusterSSL, TestRandomRequestDistribution, TestShortCircuitedRequests, HdfsRecoveryZkTest, HdfsSyncSliceTest, RulesTest, SuggestComponentContextFilterQueryTest, TestExpandComponent, TestPivotHelperCode, TestTrackingShardHandlerFactory, TestIntervalFaceting, TestMacros, TestCustomDocTransformer, TestGeoJSONResponseWriter, TestRawTransformer, TestSubQueryTransformerCrossCore, TestManagedResource, TestManagedResourceStorage, TestRestManager, TestBulkSchemaAPI, TestDefaultSearchFieldResource, TestDynamicFieldResource, TestFieldTypeCollectionResource, TestSchemaNameResource, TestSchemaResource, TestSchemaSimilarityResource, TestSchemaVersionResource, TestSolrQueryParserResource, TestUniqueKeyFieldResource, TestManagedStopFilterFactory, TestManagedSynonymFilterFactory, DateRangeFieldTest, EnumFieldTest, SpatialRPTFieldTypeTest, TestBulkSchemaConcurrent, TestCollationFieldDocValues, TestManagedSchemaAPI, TestUseDocValuesAsStored, MergeStrategyTest, TestFilteredDocIdSet, TestGraphTermsQParserPlugin, TestMissingGroups, TestSearcherReuse, TestSolr4Spatial2, TestSolrFieldCacheMBean, TestJsonFacets, TestSortByMinMaxFunction, BlockJoinFacetDistribTest, GraphQueryTest, TestScoreJoinQPNoScore, TestClassicSimilarityFactory, TestPerFieldSimilarityWithDefaultOverride, TestDefaultStatsCache, BasicAuthIntegrationTest]
   [junit4]   2> NOTE: reproduce with: ant test  -Dtestcase=BasicAuthIntegrationTest -Dtests.seed=4AE541750EB8EEBA -Dtests.slow=true -Dtests.locale=uk -Dtests.timezone=America/Indiana/Knox -Dtests.asserts=true -Dtests.file.encoding=UTF-8
   [junit4] ERROR   0.00s J1 | BasicAuthIntegrationTest (suite) <<<
   [junit4]    > Throwable #1: java.lang.Exception: Suite timeout exceeded (>= 7200000 msec).
   [junit4]    > 	at __randomizedtesting.SeedInfo.seed([4AE541750EB8EEBA]:0)
   [junit4] Completed [598/598 (2!)] on J1 in 7247.22s, 1 test, 2 errors <<< FAILURES!

[...truncated 12 lines...]
BUILD FAILED
/export/home/jenkins/workspace/Lucene-Solr-6.x-Solaris/build.xml:740: The following error occurred while executing this line:
/export/home/jenkins/workspace/Lucene-Solr-6.x-Solaris/build.xml:684: The following error occurred while executing this line:
/export/home/jenkins/workspace/Lucene-Solr-6.x-Solaris/build.xml:59: The following error occurred while executing this line:
/export/home/jenkins/workspace/Lucene-Solr-6.x-Solaris/solr/build.xml:233: The following error occurred while executing this line:
/export/home/jenkins/workspace/Lucene-Solr-6.x-Solaris/solr/common-build.xml:529: The following error occurred while executing this line:
/export/home/jenkins/workspace/Lucene-Solr-6.x-Solaris/lucene/common-build.xml:1458: The following error occurred while executing this line:
/export/home/jenkins/workspace/Lucene-Solr-6.x-Solaris/lucene/common-build.xml:1015: There were test failures: 598 suites (10 ignored), 2421 tests, 1 suite-level error, 2 errors, 87 ignored (72 assumptions) [seed: 4AE541750EB8EEBA]

Total time: 215 minutes 15 seconds
Build step 'Invoke Ant' marked build as failure
Archiving artifacts
[WARNINGS] Skipping publisher since build result is FAILURE
Recording test results
Email was triggered for: Failure - Any
Sending email for trigger: Failure - Any



Mime
View raw message