lucene-dev mailing list archives

Site index · List index
Message view « Date » · « Thread »
Top « Date » · « Thread »
From Policeman Jenkins Server <jenk...@thetaphi.de>
Subject [JENKINS] Lucene-Solr-master-Solaris (64bit/jdk1.8.0) - Build # 564 - Still Failing!
Date Sun, 08 May 2016 11:13:22 GMT
Build: http://jenkins.thetaphi.de/job/Lucene-Solr-master-Solaris/564/
Java: 64bit/jdk1.8.0 -XX:-UseCompressedOops -XX:+UseG1GC

2 tests failed.
FAILED:  org.apache.solr.cloud.DeleteReplicaTest.deleteReplicaAndVerifyDirectoryCleanup

Error Message:


Stack Trace:
java.lang.AssertionError
	at __randomizedtesting.SeedInfo.seed([42DCC7B1106DFB94:323C430B9422529F]:0)
	at org.junit.Assert.fail(Assert.java:92)
	at org.junit.Assert.assertTrue(Assert.java:43)
	at org.junit.Assert.assertFalse(Assert.java:68)
	at org.junit.Assert.assertFalse(Assert.java:79)
	at org.apache.solr.cloud.DeleteReplicaTest.deleteReplicaAndVerifyDirectoryCleanup(DeleteReplicaTest.java:208)
	at sun.reflect.NativeMethodAccessorImpl.invoke0(Native Method)
	at sun.reflect.NativeMethodAccessorImpl.invoke(NativeMethodAccessorImpl.java:62)
	at sun.reflect.DelegatingMethodAccessorImpl.invoke(DelegatingMethodAccessorImpl.java:43)
	at java.lang.reflect.Method.invoke(Method.java:498)
	at com.carrotsearch.randomizedtesting.RandomizedRunner.invoke(RandomizedRunner.java:1764)
	at com.carrotsearch.randomizedtesting.RandomizedRunner$8.evaluate(RandomizedRunner.java:871)
	at com.carrotsearch.randomizedtesting.RandomizedRunner$9.evaluate(RandomizedRunner.java:907)
	at com.carrotsearch.randomizedtesting.RandomizedRunner$10.evaluate(RandomizedRunner.java:921)
	at org.apache.solr.BaseDistributedSearchTestCase$ShardsRepeatRule$ShardsFixedStatement.callStatement(BaseDistributedSearchTestCase.java:985)
	at org.apache.solr.BaseDistributedSearchTestCase$ShardsRepeatRule$ShardsStatement.evaluate(BaseDistributedSearchTestCase.java:960)
	at com.carrotsearch.randomizedtesting.rules.SystemPropertiesRestoreRule$1.evaluate(SystemPropertiesRestoreRule.java:57)
	at org.apache.lucene.util.TestRuleSetupTeardownChained$1.evaluate(TestRuleSetupTeardownChained.java:49)
	at org.apache.lucene.util.AbstractBeforeAfterRule$1.evaluate(AbstractBeforeAfterRule.java:45)
	at org.apache.lucene.util.TestRuleThreadAndTestName$1.evaluate(TestRuleThreadAndTestName.java:48)
	at org.apache.lucene.util.TestRuleIgnoreAfterMaxFailures$1.evaluate(TestRuleIgnoreAfterMaxFailures.java:64)
	at org.apache.lucene.util.TestRuleMarkFailure$1.evaluate(TestRuleMarkFailure.java:47)
	at com.carrotsearch.randomizedtesting.rules.StatementAdapter.evaluate(StatementAdapter.java:36)
	at com.carrotsearch.randomizedtesting.ThreadLeakControl$StatementRunner.run(ThreadLeakControl.java:367)
	at com.carrotsearch.randomizedtesting.ThreadLeakControl.forkTimeoutingTask(ThreadLeakControl.java:809)
	at com.carrotsearch.randomizedtesting.ThreadLeakControl$3.evaluate(ThreadLeakControl.java:460)
	at com.carrotsearch.randomizedtesting.RandomizedRunner.runSingleTest(RandomizedRunner.java:880)
	at com.carrotsearch.randomizedtesting.RandomizedRunner$5.evaluate(RandomizedRunner.java:781)
	at com.carrotsearch.randomizedtesting.RandomizedRunner$6.evaluate(RandomizedRunner.java:816)
	at com.carrotsearch.randomizedtesting.RandomizedRunner$7.evaluate(RandomizedRunner.java:827)
	at com.carrotsearch.randomizedtesting.rules.StatementAdapter.evaluate(StatementAdapter.java:36)
	at com.carrotsearch.randomizedtesting.rules.SystemPropertiesRestoreRule$1.evaluate(SystemPropertiesRestoreRule.java:57)
	at org.apache.lucene.util.AbstractBeforeAfterRule$1.evaluate(AbstractBeforeAfterRule.java:45)
	at com.carrotsearch.randomizedtesting.rules.StatementAdapter.evaluate(StatementAdapter.java:36)
	at org.apache.lucene.util.TestRuleStoreClassName$1.evaluate(TestRuleStoreClassName.java:41)
	at com.carrotsearch.randomizedtesting.rules.NoShadowingOrOverridesOnMethodsRule$1.evaluate(NoShadowingOrOverridesOnMethodsRule.java:40)
	at com.carrotsearch.randomizedtesting.rules.NoShadowingOrOverridesOnMethodsRule$1.evaluate(NoShadowingOrOverridesOnMethodsRule.java:40)
	at com.carrotsearch.randomizedtesting.rules.StatementAdapter.evaluate(StatementAdapter.java:36)
	at com.carrotsearch.randomizedtesting.rules.StatementAdapter.evaluate(StatementAdapter.java:36)
	at com.carrotsearch.randomizedtesting.rules.StatementAdapter.evaluate(StatementAdapter.java:36)
	at org.apache.lucene.util.TestRuleAssertionsRequired$1.evaluate(TestRuleAssertionsRequired.java:53)
	at org.apache.lucene.util.TestRuleMarkFailure$1.evaluate(TestRuleMarkFailure.java:47)
	at org.apache.lucene.util.TestRuleIgnoreAfterMaxFailures$1.evaluate(TestRuleIgnoreAfterMaxFailures.java:64)
	at org.apache.lucene.util.TestRuleIgnoreTestSuites$1.evaluate(TestRuleIgnoreTestSuites.java:54)
	at com.carrotsearch.randomizedtesting.rules.StatementAdapter.evaluate(StatementAdapter.java:36)
	at com.carrotsearch.randomizedtesting.ThreadLeakControl$StatementRunner.run(ThreadLeakControl.java:367)
	at java.lang.Thread.run(Thread.java:745)


FAILED:  org.apache.solr.handler.component.SpellCheckComponentTest.test

Error Message:
List size mismatch @ spellcheck/suggestions

Stack Trace:
java.lang.RuntimeException: List size mismatch @ spellcheck/suggestions
	at __randomizedtesting.SeedInfo.seed([42DCC7B1106DFB94:CA88F86BBE91966C]:0)
	at org.apache.solr.SolrTestCaseJ4.assertJQ(SolrTestCaseJ4.java:873)
	at org.apache.solr.SolrTestCaseJ4.assertJQ(SolrTestCaseJ4.java:820)
	at org.apache.solr.handler.component.SpellCheckComponentTest.test(SpellCheckComponentTest.java:147)
	at sun.reflect.NativeMethodAccessorImpl.invoke0(Native Method)
	at sun.reflect.NativeMethodAccessorImpl.invoke(NativeMethodAccessorImpl.java:62)
	at sun.reflect.DelegatingMethodAccessorImpl.invoke(DelegatingMethodAccessorImpl.java:43)
	at java.lang.reflect.Method.invoke(Method.java:498)
	at com.carrotsearch.randomizedtesting.RandomizedRunner.invoke(RandomizedRunner.java:1764)
	at com.carrotsearch.randomizedtesting.RandomizedRunner$8.evaluate(RandomizedRunner.java:871)
	at com.carrotsearch.randomizedtesting.RandomizedRunner$9.evaluate(RandomizedRunner.java:907)
	at com.carrotsearch.randomizedtesting.RandomizedRunner$10.evaluate(RandomizedRunner.java:921)
	at com.carrotsearch.randomizedtesting.rules.SystemPropertiesRestoreRule$1.evaluate(SystemPropertiesRestoreRule.java:57)
	at org.apache.lucene.util.TestRuleSetupTeardownChained$1.evaluate(TestRuleSetupTeardownChained.java:49)
	at org.apache.lucene.util.AbstractBeforeAfterRule$1.evaluate(AbstractBeforeAfterRule.java:45)
	at org.apache.lucene.util.TestRuleThreadAndTestName$1.evaluate(TestRuleThreadAndTestName.java:48)
	at org.apache.lucene.util.TestRuleIgnoreAfterMaxFailures$1.evaluate(TestRuleIgnoreAfterMaxFailures.java:64)
	at org.apache.lucene.util.TestRuleMarkFailure$1.evaluate(TestRuleMarkFailure.java:47)
	at com.carrotsearch.randomizedtesting.rules.StatementAdapter.evaluate(StatementAdapter.java:36)
	at com.carrotsearch.randomizedtesting.ThreadLeakControl$StatementRunner.run(ThreadLeakControl.java:367)
	at com.carrotsearch.randomizedtesting.ThreadLeakControl.forkTimeoutingTask(ThreadLeakControl.java:809)
	at com.carrotsearch.randomizedtesting.ThreadLeakControl$3.evaluate(ThreadLeakControl.java:460)
	at com.carrotsearch.randomizedtesting.RandomizedRunner.runSingleTest(RandomizedRunner.java:880)
	at com.carrotsearch.randomizedtesting.RandomizedRunner$5.evaluate(RandomizedRunner.java:781)
	at com.carrotsearch.randomizedtesting.RandomizedRunner$6.evaluate(RandomizedRunner.java:816)
	at com.carrotsearch.randomizedtesting.RandomizedRunner$7.evaluate(RandomizedRunner.java:827)
	at com.carrotsearch.randomizedtesting.rules.StatementAdapter.evaluate(StatementAdapter.java:36)
	at com.carrotsearch.randomizedtesting.rules.SystemPropertiesRestoreRule$1.evaluate(SystemPropertiesRestoreRule.java:57)
	at org.apache.lucene.util.AbstractBeforeAfterRule$1.evaluate(AbstractBeforeAfterRule.java:45)
	at com.carrotsearch.randomizedtesting.rules.StatementAdapter.evaluate(StatementAdapter.java:36)
	at org.apache.lucene.util.TestRuleStoreClassName$1.evaluate(TestRuleStoreClassName.java:41)
	at com.carrotsearch.randomizedtesting.rules.NoShadowingOrOverridesOnMethodsRule$1.evaluate(NoShadowingOrOverridesOnMethodsRule.java:40)
	at com.carrotsearch.randomizedtesting.rules.NoShadowingOrOverridesOnMethodsRule$1.evaluate(NoShadowingOrOverridesOnMethodsRule.java:40)
	at com.carrotsearch.randomizedtesting.rules.StatementAdapter.evaluate(StatementAdapter.java:36)
	at com.carrotsearch.randomizedtesting.rules.StatementAdapter.evaluate(StatementAdapter.java:36)
	at com.carrotsearch.randomizedtesting.rules.StatementAdapter.evaluate(StatementAdapter.java:36)
	at org.apache.lucene.util.TestRuleAssertionsRequired$1.evaluate(TestRuleAssertionsRequired.java:53)
	at org.apache.lucene.util.TestRuleMarkFailure$1.evaluate(TestRuleMarkFailure.java:47)
	at org.apache.lucene.util.TestRuleIgnoreAfterMaxFailures$1.evaluate(TestRuleIgnoreAfterMaxFailures.java:64)
	at org.apache.lucene.util.TestRuleIgnoreTestSuites$1.evaluate(TestRuleIgnoreTestSuites.java:54)
	at com.carrotsearch.randomizedtesting.rules.StatementAdapter.evaluate(StatementAdapter.java:36)
	at com.carrotsearch.randomizedtesting.ThreadLeakControl$StatementRunner.run(ThreadLeakControl.java:367)
	at java.lang.Thread.run(Thread.java:745)




Build Log:
[...truncated 11422 lines...]
   [junit4] Suite: org.apache.solr.cloud.DeleteReplicaTest
   [junit4]   2> Creating dataDir: /export/home/jenkins/workspace/Lucene-Solr-master-Solaris/solr/build/solr-core/test/J1/temp/solr.cloud.DeleteReplicaTest_42DCC7B1106DFB94-001/init-core-data-001
   [junit4]   2> 1820453 INFO  (SUITE-DeleteReplicaTest-seed#[42DCC7B1106DFB94]-worker) [    ] o.a.s.SolrTestCaseJ4 Randomized ssl (false) and clientAuth (false)
   [junit4]   2> 1820453 INFO  (SUITE-DeleteReplicaTest-seed#[42DCC7B1106DFB94]-worker) [    ] o.a.s.BaseDistributedSearchTestCase Setting hostContext system property: /
   [junit4]   2> 1820456 INFO  (TEST-DeleteReplicaTest.deleteReplicaAndVerifyDirectoryCleanup-seed#[42DCC7B1106DFB94]) [    ] o.a.s.c.ZkTestServer STARTING ZK TEST SERVER
   [junit4]   2> 1820456 INFO  (Thread-4556) [    ] o.a.s.c.ZkTestServer client port:0.0.0.0/0.0.0.0:0
   [junit4]   2> 1820456 INFO  (Thread-4556) [    ] o.a.s.c.ZkTestServer Starting server
   [junit4]   2> 1820556 INFO  (TEST-DeleteReplicaTest.deleteReplicaAndVerifyDirectoryCleanup-seed#[42DCC7B1106DFB94]) [    ] o.a.s.c.ZkTestServer start zk server on port:53631
   [junit4]   2> 1820556 INFO  (TEST-DeleteReplicaTest.deleteReplicaAndVerifyDirectoryCleanup-seed#[42DCC7B1106DFB94]) [    ] o.a.s.c.c.SolrZkClient Using default ZkCredentialsProvider
   [junit4]   2> 1820557 INFO  (TEST-DeleteReplicaTest.deleteReplicaAndVerifyDirectoryCleanup-seed#[42DCC7B1106DFB94]) [    ] o.a.s.c.c.ConnectionManager Waiting for client to connect to ZooKeeper
   [junit4]   2> 1820566 INFO  (zkCallback-2095-thread-1) [    ] o.a.s.c.c.ConnectionManager Watcher org.apache.solr.common.cloud.ConnectionManager@1836cf2f name:ZooKeeperConnection Watcher:127.0.0.1:53631 got event WatchedEvent state:SyncConnected type:None path:null path:null type:None
   [junit4]   2> 1820566 INFO  (TEST-DeleteReplicaTest.deleteReplicaAndVerifyDirectoryCleanup-seed#[42DCC7B1106DFB94]) [    ] o.a.s.c.c.ConnectionManager Client is connected to ZooKeeper
   [junit4]   2> 1820566 INFO  (TEST-DeleteReplicaTest.deleteReplicaAndVerifyDirectoryCleanup-seed#[42DCC7B1106DFB94]) [    ] o.a.s.c.c.SolrZkClient Using default ZkACLProvider
   [junit4]   2> 1820566 INFO  (TEST-DeleteReplicaTest.deleteReplicaAndVerifyDirectoryCleanup-seed#[42DCC7B1106DFB94]) [    ] o.a.s.c.c.SolrZkClient makePath: /solr
   [junit4]   2> 1820571 INFO  (TEST-DeleteReplicaTest.deleteReplicaAndVerifyDirectoryCleanup-seed#[42DCC7B1106DFB94]) [    ] o.a.s.c.c.SolrZkClient Using default ZkCredentialsProvider
   [junit4]   2> 1820572 INFO  (TEST-DeleteReplicaTest.deleteReplicaAndVerifyDirectoryCleanup-seed#[42DCC7B1106DFB94]) [    ] o.a.s.c.c.ConnectionManager Waiting for client to connect to ZooKeeper
   [junit4]   2> 1820578 INFO  (zkCallback-2096-thread-1) [    ] o.a.s.c.c.ConnectionManager Watcher org.apache.solr.common.cloud.ConnectionManager@3a8b5e79 name:ZooKeeperConnection Watcher:127.0.0.1:53631/solr got event WatchedEvent state:SyncConnected type:None path:null path:null type:None
   [junit4]   2> 1820579 INFO  (TEST-DeleteReplicaTest.deleteReplicaAndVerifyDirectoryCleanup-seed#[42DCC7B1106DFB94]) [    ] o.a.s.c.c.ConnectionManager Client is connected to ZooKeeper
   [junit4]   2> 1820579 INFO  (TEST-DeleteReplicaTest.deleteReplicaAndVerifyDirectoryCleanup-seed#[42DCC7B1106DFB94]) [    ] o.a.s.c.c.SolrZkClient Using default ZkACLProvider
   [junit4]   2> 1820579 INFO  (TEST-DeleteReplicaTest.deleteReplicaAndVerifyDirectoryCleanup-seed#[42DCC7B1106DFB94]) [    ] o.a.s.c.c.SolrZkClient makePath: /collections/collection1
   [junit4]   2> 1820581 INFO  (TEST-DeleteReplicaTest.deleteReplicaAndVerifyDirectoryCleanup-seed#[42DCC7B1106DFB94]) [    ] o.a.s.c.c.SolrZkClient makePath: /collections/collection1/shards
   [junit4]   2> 1820583 INFO  (TEST-DeleteReplicaTest.deleteReplicaAndVerifyDirectoryCleanup-seed#[42DCC7B1106DFB94]) [    ] o.a.s.c.c.SolrZkClient makePath: /collections/control_collection
   [junit4]   2> 1820584 INFO  (TEST-DeleteReplicaTest.deleteReplicaAndVerifyDirectoryCleanup-seed#[42DCC7B1106DFB94]) [    ] o.a.s.c.c.SolrZkClient makePath: /collections/control_collection/shards
   [junit4]   2> 1820586 INFO  (TEST-DeleteReplicaTest.deleteReplicaAndVerifyDirectoryCleanup-seed#[42DCC7B1106DFB94]) [    ] o.a.s.c.AbstractZkTestCase put /export/home/jenkins/workspace/Lucene-Solr-master-Solaris/solr/core/src/test-files/solr/collection1/conf/solrconfig-tlog.xml to /configs/conf1/solrconfig.xml
   [junit4]   2> 1820586 INFO  (TEST-DeleteReplicaTest.deleteReplicaAndVerifyDirectoryCleanup-seed#[42DCC7B1106DFB94]) [    ] o.a.s.c.c.SolrZkClient makePath: /configs/conf1/solrconfig.xml
   [junit4]   2> 1820589 INFO  (TEST-DeleteReplicaTest.deleteReplicaAndVerifyDirectoryCleanup-seed#[42DCC7B1106DFB94]) [    ] o.a.s.c.AbstractZkTestCase put /export/home/jenkins/workspace/Lucene-Solr-master-Solaris/solr/core/src/test-files/solr/collection1/conf/schema.xml to /configs/conf1/schema.xml
   [junit4]   2> 1820589 INFO  (TEST-DeleteReplicaTest.deleteReplicaAndVerifyDirectoryCleanup-seed#[42DCC7B1106DFB94]) [    ] o.a.s.c.c.SolrZkClient makePath: /configs/conf1/schema.xml
   [junit4]   2> 1820591 INFO  (TEST-DeleteReplicaTest.deleteReplicaAndVerifyDirectoryCleanup-seed#[42DCC7B1106DFB94]) [    ] o.a.s.c.AbstractZkTestCase put /export/home/jenkins/workspace/Lucene-Solr-master-Solaris/solr/core/src/test-files/solr/collection1/conf/solrconfig.snippet.randomindexconfig.xml to /configs/conf1/solrconfig.snippet.randomindexconfig.xml
   [junit4]   2> 1820591 INFO  (TEST-DeleteReplicaTest.deleteReplicaAndVerifyDirectoryCleanup-seed#[42DCC7B1106DFB94]) [    ] o.a.s.c.c.SolrZkClient makePath: /configs/conf1/solrconfig.snippet.randomindexconfig.xml
   [junit4]   2> 1820593 INFO  (TEST-DeleteReplicaTest.deleteReplicaAndVerifyDirectoryCleanup-seed#[42DCC7B1106DFB94]) [    ] o.a.s.c.AbstractZkTestCase put /export/home/jenkins/workspace/Lucene-Solr-master-Solaris/solr/core/src/test-files/solr/collection1/conf/stopwords.txt to /configs/conf1/stopwords.txt
   [junit4]   2> 1820593 INFO  (TEST-DeleteReplicaTest.deleteReplicaAndVerifyDirectoryCleanup-seed#[42DCC7B1106DFB94]) [    ] o.a.s.c.c.SolrZkClient makePath: /configs/conf1/stopwords.txt
   [junit4]   2> 1820594 INFO  (TEST-DeleteReplicaTest.deleteReplicaAndVerifyDirectoryCleanup-seed#[42DCC7B1106DFB94]) [    ] o.a.s.c.AbstractZkTestCase put /export/home/jenkins/workspace/Lucene-Solr-master-Solaris/solr/core/src/test-files/solr/collection1/conf/protwords.txt to /configs/conf1/protwords.txt
   [junit4]   2> 1820595 INFO  (TEST-DeleteReplicaTest.deleteReplicaAndVerifyDirectoryCleanup-seed#[42DCC7B1106DFB94]) [    ] o.a.s.c.c.SolrZkClient makePath: /configs/conf1/protwords.txt
   [junit4]   2> 1820596 INFO  (TEST-DeleteReplicaTest.deleteReplicaAndVerifyDirectoryCleanup-seed#[42DCC7B1106DFB94]) [    ] o.a.s.c.AbstractZkTestCase put /export/home/jenkins/workspace/Lucene-Solr-master-Solaris/solr/core/src/test-files/solr/collection1/conf/currency.xml to /configs/conf1/currency.xml
   [junit4]   2> 1820596 INFO  (TEST-DeleteReplicaTest.deleteReplicaAndVerifyDirectoryCleanup-seed#[42DCC7B1106DFB94]) [    ] o.a.s.c.c.SolrZkClient makePath: /configs/conf1/currency.xml
   [junit4]   2> 1820598 INFO  (TEST-DeleteReplicaTest.deleteReplicaAndVerifyDirectoryCleanup-seed#[42DCC7B1106DFB94]) [    ] o.a.s.c.AbstractZkTestCase put /export/home/jenkins/workspace/Lucene-Solr-master-Solaris/solr/core/src/test-files/solr/collection1/conf/enumsConfig.xml to /configs/conf1/enumsConfig.xml
   [junit4]   2> 1820599 INFO  (TEST-DeleteReplicaTest.deleteReplicaAndVerifyDirectoryCleanup-seed#[42DCC7B1106DFB94]) [    ] o.a.s.c.c.SolrZkClient makePath: /configs/conf1/enumsConfig.xml
   [junit4]   2> 1820600 INFO  (TEST-DeleteReplicaTest.deleteReplicaAndVerifyDirectoryCleanup-seed#[42DCC7B1106DFB94]) [    ] o.a.s.c.AbstractZkTestCase put /export/home/jenkins/workspace/Lucene-Solr-master-Solaris/solr/core/src/test-files/solr/collection1/conf/open-exchange-rates.json to /configs/conf1/open-exchange-rates.json
   [junit4]   2> 1820600 INFO  (TEST-DeleteReplicaTest.deleteReplicaAndVerifyDirectoryCleanup-seed#[42DCC7B1106DFB94]) [    ] o.a.s.c.c.SolrZkClient makePath: /configs/conf1/open-exchange-rates.json
   [junit4]   2> 1820602 INFO  (TEST-DeleteReplicaTest.deleteReplicaAndVerifyDirectoryCleanup-seed#[42DCC7B1106DFB94]) [    ] o.a.s.c.AbstractZkTestCase put /export/home/jenkins/workspace/Lucene-Solr-master-Solaris/solr/core/src/test-files/solr/collection1/conf/mapping-ISOLatin1Accent.txt to /configs/conf1/mapping-ISOLatin1Accent.txt
   [junit4]   2> 1820602 INFO  (TEST-DeleteReplicaTest.deleteReplicaAndVerifyDirectoryCleanup-seed#[42DCC7B1106DFB94]) [    ] o.a.s.c.c.SolrZkClient makePath: /configs/conf1/mapping-ISOLatin1Accent.txt
   [junit4]   2> 1820604 INFO  (TEST-DeleteReplicaTest.deleteReplicaAndVerifyDirectoryCleanup-seed#[42DCC7B1106DFB94]) [    ] o.a.s.c.AbstractZkTestCase put /export/home/jenkins/workspace/Lucene-Solr-master-Solaris/solr/core/src/test-files/solr/collection1/conf/old_synonyms.txt to /configs/conf1/old_synonyms.txt
   [junit4]   2> 1820604 INFO  (TEST-DeleteReplicaTest.deleteReplicaAndVerifyDirectoryCleanup-seed#[42DCC7B1106DFB94]) [    ] o.a.s.c.c.SolrZkClient makePath: /configs/conf1/old_synonyms.txt
   [junit4]   2> 1820606 INFO  (TEST-DeleteReplicaTest.deleteReplicaAndVerifyDirectoryCleanup-seed#[42DCC7B1106DFB94]) [    ] o.a.s.c.AbstractZkTestCase put /export/home/jenkins/workspace/Lucene-Solr-master-Solaris/solr/core/src/test-files/solr/collection1/conf/synonyms.txt to /configs/conf1/synonyms.txt
   [junit4]   2> 1820606 INFO  (TEST-DeleteReplicaTest.deleteReplicaAndVerifyDirectoryCleanup-seed#[42DCC7B1106DFB94]) [    ] o.a.s.c.c.SolrZkClient makePath: /configs/conf1/synonyms.txt
   [junit4]   2> 1820970 INFO  (TEST-DeleteReplicaTest.deleteReplicaAndVerifyDirectoryCleanup-seed#[42DCC7B1106DFB94]) [    ] o.a.s.SolrTestCaseJ4 Writing core.properties file to /export/home/jenkins/workspace/Lucene-Solr-master-Solaris/solr/build/solr-core/test/J1/temp/solr.cloud.DeleteReplicaTest_42DCC7B1106DFB94-001/control-001/cores/collection1
   [junit4]   2> 1820972 INFO  (TEST-DeleteReplicaTest.deleteReplicaAndVerifyDirectoryCleanup-seed#[42DCC7B1106DFB94]) [    ] o.e.j.s.Server jetty-9.3.8.v20160314
   [junit4]   2> 1820973 INFO  (TEST-DeleteReplicaTest.deleteReplicaAndVerifyDirectoryCleanup-seed#[42DCC7B1106DFB94]) [    ] o.e.j.s.h.ContextHandler Started o.e.j.s.ServletContextHandler@5e8041ba{/,null,AVAILABLE}
   [junit4]   2> 1820974 INFO  (TEST-DeleteReplicaTest.deleteReplicaAndVerifyDirectoryCleanup-seed#[42DCC7B1106DFB94]) [    ] o.e.j.s.ServerConnector Started ServerConnector@40f649b7{HTTP/1.1,[http/1.1]}{127.0.0.1:61079}
   [junit4]   2> 1820975 INFO  (TEST-DeleteReplicaTest.deleteReplicaAndVerifyDirectoryCleanup-seed#[42DCC7B1106DFB94]) [    ] o.e.j.s.Server Started @1825962ms
   [junit4]   2> 1820975 INFO  (TEST-DeleteReplicaTest.deleteReplicaAndVerifyDirectoryCleanup-seed#[42DCC7B1106DFB94]) [    ] o.a.s.c.s.e.JettySolrRunner Jetty properties: {solr.data.dir=/export/home/jenkins/workspace/Lucene-Solr-master-Solaris/solr/build/solr-core/test/J1/temp/solr.cloud.DeleteReplicaTest_42DCC7B1106DFB94-001/tempDir-001/control/data, hostContext=/, hostPort=61079, coreRootDirectory=/export/home/jenkins/workspace/Lucene-Solr-master-Solaris/solr/build/solr-core/test/J1/../../../../../../../../../../export/home/jenkins/workspace/Lucene-Solr-master-Solaris/solr/build/solr-core/test/J1/temp/solr.cloud.DeleteReplicaTest_42DCC7B1106DFB94-001/control-001/cores}
   [junit4]   2> 1820976 INFO  (TEST-DeleteReplicaTest.deleteReplicaAndVerifyDirectoryCleanup-seed#[42DCC7B1106DFB94]) [    ] o.a.s.s.SolrDispatchFilter SolrDispatchFilter.init(): sun.misc.Launcher$AppClassLoader@6d06d69c
   [junit4]   2> 1820976 INFO  (TEST-DeleteReplicaTest.deleteReplicaAndVerifyDirectoryCleanup-seed#[42DCC7B1106DFB94]) [    ] o.a.s.c.SolrResourceLoader new SolrResourceLoader for directory: '/export/home/jenkins/workspace/Lucene-Solr-master-Solaris/solr/build/solr-core/test/J1/temp/solr.cloud.DeleteReplicaTest_42DCC7B1106DFB94-001/control-001'
   [junit4]   2> 1820976 INFO  (TEST-DeleteReplicaTest.deleteReplicaAndVerifyDirectoryCleanup-seed#[42DCC7B1106DFB94]) [    ] o.a.s.c.SolrResourceLoader JNDI not configured for solr (NoInitialContextEx)
   [junit4]   2> 1820976 INFO  (TEST-DeleteReplicaTest.deleteReplicaAndVerifyDirectoryCleanup-seed#[42DCC7B1106DFB94]) [    ] o.a.s.c.SolrResourceLoader solr home defaulted to 'solr/' (could not find system property or JNDI)
   [junit4]   2> 1820976 INFO  (TEST-DeleteReplicaTest.deleteReplicaAndVerifyDirectoryCleanup-seed#[42DCC7B1106DFB94]) [    ] o.a.s.c.c.SolrZkClient Using default ZkCredentialsProvider
   [junit4]   2> 1820976 INFO  (TEST-DeleteReplicaTest.deleteReplicaAndVerifyDirectoryCleanup-seed#[42DCC7B1106DFB94]) [    ] o.a.s.c.c.ConnectionManager Waiting for client to connect to ZooKeeper
   [junit4]   2> 1820978 INFO  (zkCallback-2097-thread-1) [    ] o.a.s.c.c.ConnectionManager Watcher org.apache.solr.common.cloud.ConnectionManager@3c7b5419 name:ZooKeeperConnection Watcher:127.0.0.1:53631/solr got event WatchedEvent state:SyncConnected type:None path:null path:null type:None
   [junit4]   2> 1820978 INFO  (TEST-DeleteReplicaTest.deleteReplicaAndVerifyDirectoryCleanup-seed#[42DCC7B1106DFB94]) [    ] o.a.s.c.c.ConnectionManager Client is connected to ZooKeeper
   [junit4]   2> 1820978 INFO  (TEST-DeleteReplicaTest.deleteReplicaAndVerifyDirectoryCleanup-seed#[42DCC7B1106DFB94]) [    ] o.a.s.c.c.SolrZkClient Using default ZkACLProvider
   [junit4]   2> 1820980 INFO  (TEST-DeleteReplicaTest.deleteReplicaAndVerifyDirectoryCleanup-seed#[42DCC7B1106DFB94]) [    ] o.a.s.s.SolrDispatchFilter Loading solr.xml from SolrHome (not found in ZooKeeper)
   [junit4]   2> 1820980 INFO  (TEST-DeleteReplicaTest.deleteReplicaAndVerifyDirectoryCleanup-seed#[42DCC7B1106DFB94]) [    ] o.a.s.c.SolrXmlConfig Loading container configuration from /export/home/jenkins/workspace/Lucene-Solr-master-Solaris/solr/build/solr-core/test/J1/temp/solr.cloud.DeleteReplicaTest_42DCC7B1106DFB94-001/control-001/solr.xml
   [junit4]   2> 1820984 INFO  (TEST-DeleteReplicaTest.deleteReplicaAndVerifyDirectoryCleanup-seed#[42DCC7B1106DFB94]) [    ] o.a.s.c.CorePropertiesLocator Config-defined core root directory: /export/home/jenkins/workspace/Lucene-Solr-master-Solaris/solr/build/solr-core/test/J1/../../../../../../../../../../export/home/jenkins/workspace/Lucene-Solr-master-Solaris/solr/build/solr-core/test/J1/temp/solr.cloud.DeleteReplicaTest_42DCC7B1106DFB94-001/control-001/cores
   [junit4]   2> 1820984 INFO  (TEST-DeleteReplicaTest.deleteReplicaAndVerifyDirectoryCleanup-seed#[42DCC7B1106DFB94]) [    ] o.a.s.c.CoreContainer New CoreContainer 1216939323
   [junit4]   2> 1820984 INFO  (TEST-DeleteReplicaTest.deleteReplicaAndVerifyDirectoryCleanup-seed#[42DCC7B1106DFB94]) [    ] o.a.s.c.CoreContainer Loading cores into CoreContainer [instanceDir=/export/home/jenkins/workspace/Lucene-Solr-master-Solaris/solr/build/solr-core/test/J1/temp/solr.cloud.DeleteReplicaTest_42DCC7B1106DFB94-001/control-001]
   [junit4]   2> 1820984 WARN  (TEST-DeleteReplicaTest.deleteReplicaAndVerifyDirectoryCleanup-seed#[42DCC7B1106DFB94]) [    ] o.a.s.c.CoreContainer Couldn't add files from /export/home/jenkins/workspace/Lucene-Solr-master-Solaris/solr/build/solr-core/test/J1/temp/solr.cloud.DeleteReplicaTest_42DCC7B1106DFB94-001/control-001/lib to classpath: /export/home/jenkins/workspace/Lucene-Solr-master-Solaris/solr/build/solr-core/test/J1/temp/solr.cloud.DeleteReplicaTest_42DCC7B1106DFB94-001/control-001/lib
   [junit4]   2> 1820985 INFO  (TEST-DeleteReplicaTest.deleteReplicaAndVerifyDirectoryCleanup-seed#[42DCC7B1106DFB94]) [    ] o.a.s.h.c.HttpShardHandlerFactory created with socketTimeout : 90000,urlScheme : ,connTimeout : 15000,maxConnectionsPerHost : 20,maxConnections : 10000,corePoolSize : 0,maximumPoolSize : 2147483647,maxThreadIdleTime : 5,sizeOfQueue : -1,fairnessPolicy : false,
   [junit4]   2> 1820986 INFO  (TEST-DeleteReplicaTest.deleteReplicaAndVerifyDirectoryCleanup-seed#[42DCC7B1106DFB94]) [    ] o.a.s.u.UpdateShardHandler Creating UpdateShardHandler HTTP client with params: 
   [junit4]   2> 1820987 INFO  (TEST-DeleteReplicaTest.deleteReplicaAndVerifyDirectoryCleanup-seed#[42DCC7B1106DFB94]) [    ] o.a.s.l.LogWatcher SLF4J impl is org.slf4j.impl.Log4jLoggerFactory
   [junit4]   2> 1820987 INFO  (TEST-DeleteReplicaTest.deleteReplicaAndVerifyDirectoryCleanup-seed#[42DCC7B1106DFB94]) [    ] o.a.s.l.LogWatcher Registering Log Listener [Log4j (org.slf4j.impl.Log4jLoggerFactory)]
   [junit4]   2> 1820987 INFO  (TEST-DeleteReplicaTest.deleteReplicaAndVerifyDirectoryCleanup-seed#[42DCC7B1106DFB94]) [    ] o.a.s.c.ZkContainer Zookeeper client=127.0.0.1:53631/solr
   [junit4]   2> 1820987 INFO  (TEST-DeleteReplicaTest.deleteReplicaAndVerifyDirectoryCleanup-seed#[42DCC7B1106DFB94]) [    ] o.a.s.c.ZkController zkHost includes chroot
   [junit4]   2> 1820987 INFO  (TEST-DeleteReplicaTest.deleteReplicaAndVerifyDirectoryCleanup-seed#[42DCC7B1106DFB94]) [    ] o.a.s.c.c.SolrZkClient Using default ZkCredentialsProvider
   [junit4]   2> 1820987 INFO  (TEST-DeleteReplicaTest.deleteReplicaAndVerifyDirectoryCleanup-seed#[42DCC7B1106DFB94]) [    ] o.a.s.c.c.ConnectionManager Waiting for client to connect to ZooKeeper
   [junit4]   2> 1820989 INFO  (zkCallback-2100-thread-1) [    ] o.a.s.c.c.ConnectionManager Watcher org.apache.solr.common.cloud.ConnectionManager@230e0795 name:ZooKeeperConnection Watcher:127.0.0.1:53631 got event WatchedEvent state:SyncConnected type:None path:null path:null type:None
   [junit4]   2> 1820989 INFO  (TEST-DeleteReplicaTest.deleteReplicaAndVerifyDirectoryCleanup-seed#[42DCC7B1106DFB94]) [    ] o.a.s.c.c.ConnectionManager Client is connected to ZooKeeper
   [junit4]   2> 1820989 INFO  (TEST-DeleteReplicaTest.deleteReplicaAndVerifyDirectoryCleanup-seed#[42DCC7B1106DFB94]) [    ] o.a.s.c.c.SolrZkClient Using default ZkACLProvider
   [junit4]   2> 1820990 INFO  (TEST-DeleteReplicaTest.deleteReplicaAndVerifyDirectoryCleanup-seed#[42DCC7B1106DFB94]) [n:127.0.0.1:61079_    ] o.a.s.c.ZkController Added new OnReconnect listener org.apache.solr.cloud.ZkController$$Lambda$37/974443017@52871315
   [junit4]   2> 1820991 INFO  (TEST-DeleteReplicaTest.deleteReplicaAndVerifyDirectoryCleanup-seed#[42DCC7B1106DFB94]) [n:127.0.0.1:61079_    ] o.a.s.c.c.ConnectionManager Waiting for client to connect to ZooKeeper
   [junit4]   2> 1820992 INFO  (zkCallback-2101-thread-1-processing-n:127.0.0.1:61079_) [n:127.0.0.1:61079_    ] o.a.s.c.c.ConnectionManager Watcher org.apache.solr.common.cloud.ConnectionManager@6fe51c1b name:ZooKeeperConnection Watcher:127.0.0.1:53631/solr got event WatchedEvent state:SyncConnected type:None path:null path:null type:None
   [junit4]   2> 1820992 INFO  (TEST-DeleteReplicaTest.deleteReplicaAndVerifyDirectoryCleanup-seed#[42DCC7B1106DFB94]) [n:127.0.0.1:61079_    ] o.a.s.c.c.ConnectionManager Client is connected to ZooKeeper
   [junit4]   2> 1820993 INFO  (TEST-DeleteReplicaTest.deleteReplicaAndVerifyDirectoryCleanup-seed#[42DCC7B1106DFB94]) [n:127.0.0.1:61079_    ] o.a.s.c.c.SolrZkClient makePath: /overseer/queue
   [junit4]   2> 1820996 INFO  (TEST-DeleteReplicaTest.deleteReplicaAndVerifyDirectoryCleanup-seed#[42DCC7B1106DFB94]) [n:127.0.0.1:61079_    ] o.a.s.c.c.SolrZkClient makePath: /overseer/collection-queue-work
   [junit4]   2> 1821000 INFO  (TEST-DeleteReplicaTest.deleteReplicaAndVerifyDirectoryCleanup-seed#[42DCC7B1106DFB94]) [n:127.0.0.1:61079_    ] o.a.s.c.c.SolrZkClient makePath: /overseer/collection-map-running
   [junit4]   2> 1821003 INFO  (TEST-DeleteReplicaTest.deleteReplicaAndVerifyDirectoryCleanup-seed#[42DCC7B1106DFB94]) [n:127.0.0.1:61079_    ] o.a.s.c.c.SolrZkClient makePath: /overseer/collection-map-completed
   [junit4]   2> 1821006 INFO  (TEST-DeleteReplicaTest.deleteReplicaAndVerifyDirectoryCleanup-seed#[42DCC7B1106DFB94]) [n:127.0.0.1:61079_    ] o.a.s.c.c.SolrZkClient makePath: /overseer/collection-map-failure
   [junit4]   2> 1821008 INFO  (TEST-DeleteReplicaTest.deleteReplicaAndVerifyDirectoryCleanup-seed#[42DCC7B1106DFB94]) [n:127.0.0.1:61079_    ] o.a.s.c.c.SolrZkClient makePath: /live_nodes
   [junit4]   2> 1821011 INFO  (TEST-DeleteReplicaTest.deleteReplicaAndVerifyDirectoryCleanup-seed#[42DCC7B1106DFB94]) [n:127.0.0.1:61079_    ] o.a.s.c.c.SolrZkClient makePath: /aliases.json
   [junit4]   2> 1821013 INFO  (TEST-DeleteReplicaTest.deleteReplicaAndVerifyDirectoryCleanup-seed#[42DCC7B1106DFB94]) [n:127.0.0.1:61079_    ] o.a.s.c.c.SolrZkClient makePath: /clusterstate.json
   [junit4]   2> 1821014 INFO  (TEST-DeleteReplicaTest.deleteReplicaAndVerifyDirectoryCleanup-seed#[42DCC7B1106DFB94]) [n:127.0.0.1:61079_    ] o.a.s.c.c.SolrZkClient makePath: /security.json
   [junit4]   2> 1821016 INFO  (TEST-DeleteReplicaTest.deleteReplicaAndVerifyDirectoryCleanup-seed#[42DCC7B1106DFB94]) [n:127.0.0.1:61079_    ] o.a.s.c.c.ZkStateReader Updating cluster state from ZooKeeper... 
   [junit4]   2> 1821017 INFO  (TEST-DeleteReplicaTest.deleteReplicaAndVerifyDirectoryCleanup-seed#[42DCC7B1106DFB94]) [n:127.0.0.1:61079_    ] o.a.s.c.c.ZkStateReader Updated live nodes from ZooKeeper... (0) -> (0)
   [junit4]   2> 1821020 INFO  (TEST-DeleteReplicaTest.deleteReplicaAndVerifyDirectoryCleanup-seed#[42DCC7B1106DFB94]) [n:127.0.0.1:61079_    ] o.a.s.c.c.SolrZkClient makePath: /overseer_elect
   [junit4]   2> 1821022 INFO  (TEST-DeleteReplicaTest.deleteReplicaAndVerifyDirectoryCleanup-seed#[42DCC7B1106DFB94]) [n:127.0.0.1:61079_    ] o.a.s.c.c.SolrZkClient makePath: /overseer_elect/election
   [junit4]   2> 1821024 INFO  (TEST-DeleteReplicaTest.deleteReplicaAndVerifyDirectoryCleanup-seed#[42DCC7B1106DFB94]) [n:127.0.0.1:61079_    ] o.a.s.c.Overseer Overseer (id=null) closing
   [junit4]   2> 1821025 INFO  (TEST-DeleteReplicaTest.deleteReplicaAndVerifyDirectoryCleanup-seed#[42DCC7B1106DFB94]) [n:127.0.0.1:61079_    ] o.a.s.c.LeaderElector Joined leadership election with path: /overseer_elect/election/95859788691537924-127.0.0.1:61079_-n_0000000000
   [junit4]   2> 1821025 INFO  (TEST-DeleteReplicaTest.deleteReplicaAndVerifyDirectoryCleanup-seed#[42DCC7B1106DFB94]) [n:127.0.0.1:61079_    ] o.a.s.c.OverseerElectionContext I am going to be the leader 127.0.0.1:61079_
   [junit4]   2> 1821025 INFO  (TEST-DeleteReplicaTest.deleteReplicaAndVerifyDirectoryCleanup-seed#[42DCC7B1106DFB94]) [n:127.0.0.1:61079_    ] o.a.s.c.c.SolrZkClient makePath: /overseer_elect/leader
   [junit4]   2> 1821027 INFO  (TEST-DeleteReplicaTest.deleteReplicaAndVerifyDirectoryCleanup-seed#[42DCC7B1106DFB94]) [n:127.0.0.1:61079_    ] o.a.s.c.Overseer Overseer (id=95859788691537924-127.0.0.1:61079_-n_0000000000) starting
   [junit4]   2> 1821029 INFO  (TEST-DeleteReplicaTest.deleteReplicaAndVerifyDirectoryCleanup-seed#[42DCC7B1106DFB94]) [n:127.0.0.1:61079_    ] o.a.s.c.c.SolrZkClient makePath: /overseer/queue-work
   [junit4]   2> 1821038 INFO  (TEST-DeleteReplicaTest.deleteReplicaAndVerifyDirectoryCleanup-seed#[42DCC7B1106DFB94]) [n:127.0.0.1:61079_    ] o.a.s.c.OverseerAutoReplicaFailoverThread Starting OverseerAutoReplicaFailoverThread autoReplicaFailoverWorkLoopDelay=10000 autoReplicaFailoverWaitAfterExpiration=10000 autoReplicaFailoverBadNodeExpiration=60000
   [junit4]   2> 1821039 INFO  (OverseerCollectionConfigSetProcessor-95859788691537924-127.0.0.1:61079_-n_0000000000) [n:127.0.0.1:61079_    ] o.a.s.c.OverseerTaskProcessor Process current queue of overseer operations
   [junit4]   2> 1821039 INFO  (TEST-DeleteReplicaTest.deleteReplicaAndVerifyDirectoryCleanup-seed#[42DCC7B1106DFB94]) [n:127.0.0.1:61079_    ] o.a.s.c.ZkController Register node as live in ZooKeeper:/live_nodes/127.0.0.1:61079_
   [junit4]   2> 1821040 INFO  (OverseerStateUpdate-95859788691537924-127.0.0.1:61079_-n_0000000000) [n:127.0.0.1:61079_    ] o.a.s.c.Overseer Starting to work on the main queue
   [junit4]   2> 1821040 INFO  (TEST-DeleteReplicaTest.deleteReplicaAndVerifyDirectoryCleanup-seed#[42DCC7B1106DFB94]) [n:127.0.0.1:61079_    ] o.a.s.c.c.SolrZkClient makePath: /live_nodes/127.0.0.1:61079_
   [junit4]   2> 1821043 INFO  (zkCallback-2101-thread-1-processing-n:127.0.0.1:61079_) [n:127.0.0.1:61079_    ] o.a.s.c.c.ZkStateReader A live node change: [WatchedEvent state:SyncConnected type:NodeChildrenChanged path:/live_nodes], has occurred - updating... (live nodes size: [0])
   [junit4]   2> 1821043 INFO  (OverseerStateUpdate-95859788691537924-127.0.0.1:61079_-n_0000000000) [n:127.0.0.1:61079_    ] o.a.s.c.c.ZkStateReader Updated live nodes from ZooKeeper... (0) -> (1)
   [junit4]   2> 1821044 INFO  (zkCallback-2101-thread-1-processing-n:127.0.0.1:61079_) [n:127.0.0.1:61079_    ] o.a.s.c.c.ZkStateReader Updated live nodes from ZooKeeper... (1) -> (1)
   [junit4]   2> 1821070 INFO  (TEST-DeleteReplicaTest.deleteReplicaAndVerifyDirectoryCleanup-seed#[42DCC7B1106DFB94]) [n:127.0.0.1:61079_    ] o.a.s.c.CoreContainer Security conf doesn't exist. Skipping setup for authorization module.
   [junit4]   2> 1821071 INFO  (TEST-DeleteReplicaTest.deleteReplicaAndVerifyDirectoryCleanup-seed#[42DCC7B1106DFB94]) [n:127.0.0.1:61079_    ] o.a.s.c.CoreContainer No authentication plugin used.
   [junit4]   2> 1821071 INFO  (TEST-DeleteReplicaTest.deleteReplicaAndVerifyDirectoryCleanup-seed#[42DCC7B1106DFB94]) [n:127.0.0.1:61079_    ] o.a.s.c.CorePropertiesLocator Looking for core definitions underneath /export/home/jenkins/workspace/Lucene-Solr-master-Solaris/solr/build/solr-core/test/J1/../../../../../../../../../../export/home/jenkins/workspace/Lucene-Solr-master-Solaris/solr/build/solr-core/test/J1/temp/solr.cloud.DeleteReplicaTest_42DCC7B1106DFB94-001/control-001/cores
   [junit4]   2> 1821072 INFO  (TEST-DeleteReplicaTest.deleteReplicaAndVerifyDirectoryCleanup-seed#[42DCC7B1106DFB94]) [n:127.0.0.1:61079_    ] o.a.s.c.CoreDescriptor Created CoreDescriptor: {name=collection1, config=solrconfig.xml, transient=false, schema=schema.xml, loadOnStartup=true, configSetProperties=configsetprops.json, collection=control_collection, coreNodeName=, dataDir=data/, shard=}
   [junit4]   2> 1821072 INFO  (TEST-DeleteReplicaTest.deleteReplicaAndVerifyDirectoryCleanup-seed#[42DCC7B1106DFB94]) [n:127.0.0.1:61079_    ] o.a.s.c.CorePropertiesLocator Found core collection1 in /export/home/jenkins/workspace/Lucene-Solr-master-Solaris/solr/build/solr-core/test/J1/../../../../../../../../../../export/home/jenkins/workspace/Lucene-Solr-master-Solaris/solr/build/solr-core/test/J1/temp/solr.cloud.DeleteReplicaTest_42DCC7B1106DFB94-001/control-001/cores/collection1
   [junit4]   2> 1821072 INFO  (TEST-DeleteReplicaTest.deleteReplicaAndVerifyDirectoryCleanup-seed#[42DCC7B1106DFB94]) [n:127.0.0.1:61079_    ] o.a.s.c.CorePropertiesLocator Found 1 core definitions
   [junit4]   2> 1821074 INFO  (TEST-DeleteReplicaTest.deleteReplicaAndVerifyDirectoryCleanup-seed#[42DCC7B1106DFB94]) [n:127.0.0.1:61079_    ] o.a.s.s.SolrDispatchFilter user.dir=/export/home/jenkins/workspace/Lucene-Solr-master-Solaris/solr/build/solr-core/test/J1
   [junit4]   2> 1821074 INFO  (TEST-DeleteReplicaTest.deleteReplicaAndVerifyDirectoryCleanup-seed#[42DCC7B1106DFB94]) [n:127.0.0.1:61079_    ] o.a.s.s.SolrDispatchFilter SolrDispatchFilter.init() done
   [junit4]   2> 1821075 INFO  (coreLoadExecutor-6442-thread-1-processing-n:127.0.0.1:61079_) [n:127.0.0.1:61079_ c:control_collection   x:collection1] o.a.s.c.ZkController publishing state=down
   [junit4]   2> 1821075 INFO  (coreLoadExecutor-6442-thread-1-processing-n:127.0.0.1:61079_) [n:127.0.0.1:61079_ c:control_collection   x:collection1] o.a.s.c.ZkController numShards not found on descriptor - reading it from system property
   [junit4]   2> 1821076 INFO  (coreLoadExecutor-6442-thread-1-processing-n:127.0.0.1:61079_) [n:127.0.0.1:61079_ c:control_collection   x:collection1] o.a.s.c.ZkController Collection control_collection not visible yet, but flagging it so a watch is registered when it becomes visible
   [junit4]   2> 1821076 INFO  (coreLoadExecutor-6442-thread-1-processing-n:127.0.0.1:61079_) [n:127.0.0.1:61079_ c:control_collection   x:collection1] o.a.s.c.c.ZkStateReader addZkWatch [control_collection]
   [junit4]   2> 1821077 INFO  (OverseerStateUpdate-95859788691537924-127.0.0.1:61079_-n_0000000000) [n:127.0.0.1:61079_    ] o.a.s.c.Overseer processMessage: queueSize: 1, message = {
   [junit4]   2>   "core":"collection1",
   [junit4]   2>   "roles":null,
   [junit4]   2>   "base_url":"http://127.0.0.1:61079",
   [junit4]   2>   "node_name":"127.0.0.1:61079_",
   [junit4]   2>   "numShards":"1",
   [junit4]   2>   "state":"down",
   [junit4]   2>   "shard":null,
   [junit4]   2>   "collection":"control_collection",
   [junit4]   2>   "operation":"state"} current state version: 0
   [junit4]   2> 1821077 INFO  (OverseerStateUpdate-95859788691537924-127.0.0.1:61079_-n_0000000000) [n:127.0.0.1:61079_    ] o.a.s.c.o.ReplicaMutator Update state numShards=1 message={
   [junit4]   2>   "core":"collection1",
   [junit4]   2>   "roles":null,
   [junit4]   2>   "base_url":"http://127.0.0.1:61079",
   [junit4]   2>   "node_name":"127.0.0.1:61079_",
   [junit4]   2>   "numShards":"1",
   [junit4]   2>   "state":"down",
   [junit4]   2>   "shard":null,
   [junit4]   2>   "collection":"control_collection",
   [junit4]   2>   "operation":"state"}
   [junit4]   2> 1821078 INFO  (coreLoadExecutor-6442-thread-1-processing-n:127.0.0.1:61079_) [n:127.0.0.1:61079_ c:control_collection   x:collection1] o.a.s.c.c.ZkStateReader Deleting data for [control_collection]
   [junit4]   2> 1821078 INFO  (OverseerStateUpdate-95859788691537924-127.0.0.1:61079_-n_0000000000) [n:127.0.0.1:61079_    ] o.a.s.c.o.ClusterStateMutator building a new cName: control_collection
   [junit4]   2> 1821079 INFO  (coreLoadExecutor-6442-thread-1-processing-n:127.0.0.1:61079_) [n:127.0.0.1:61079_ c:control_collection   x:collection1] o.a.s.c.ZkController look for our core node name
   [junit4]   2> 1821079 INFO  (OverseerStateUpdate-95859788691537924-127.0.0.1:61079_-n_0000000000) [n:127.0.0.1:61079_    ] o.a.s.c.o.ReplicaMutator Assigning new node to shard shard=shard1
   [junit4]   2> 1821082 INFO  (zkCallback-2101-thread-1-processing-n:127.0.0.1:61079_) [n:127.0.0.1:61079_    ] o.a.s.c.c.ZkStateReader A cluster state change: [WatchedEvent state:SyncConnected type:NodeDataChanged path:/clusterstate.json], has occurred - updating... (live nodes size: [1])
   [junit4]   2> 1822080 INFO  (coreLoadExecutor-6442-thread-1-processing-n:127.0.0.1:61079_) [n:127.0.0.1:61079_ c:control_collection   x:collection1] o.a.s.c.ZkController waiting to find shard id in clusterstate for collection1
   [junit4]   2> 1822080 INFO  (coreLoadExecutor-6442-thread-1-processing-n:127.0.0.1:61079_) [n:127.0.0.1:61079_ c:control_collection   x:collection1] o.a.s.c.ZkController Check for collection zkNode:control_collection
   [junit4]   2> 1822080 INFO  (coreLoadExecutor-6442-thread-1-processing-n:127.0.0.1:61079_) [n:127.0.0.1:61079_ c:control_collection   x:collection1] o.a.s.c.ZkController Collection zkNode exists
   [junit4]   2> 1822080 INFO  (coreLoadExecutor-6442-thread-1-processing-n:127.0.0.1:61079_) [n:127.0.0.1:61079_ c:control_collection   x:collection1] o.a.s.c.c.ZkStateReader Load collection config from: [/collections/control_collection]
   [junit4]   2> 1822082 INFO  (coreLoadExecutor-6442-thread-1-processing-n:127.0.0.1:61079_) [n:127.0.0.1:61079_ c:control_collection   x:collection1] o.a.s.c.c.ZkStateReader path=[/collections/control_collection] [configName]=[conf1] specified config exists in ZooKeeper
   [junit4]   2> 1822082 INFO  (coreLoadExecutor-6442-thread-1-processing-n:127.0.0.1:61079_) [n:127.0.0.1:61079_ c:control_collection   x:collection1] o.a.s.c.SolrResourceLoader new SolrResourceLoader for directory: '/export/home/jenkins/workspace/Lucene-Solr-master-Solaris/solr/build/solr-core/test/J1/temp/solr.cloud.DeleteReplicaTest_42DCC7B1106DFB94-001/control-001/cores/collection1'
   [junit4]   2> 1822082 INFO  (coreLoadExecutor-6442-thread-1-processing-n:127.0.0.1:61079_) [n:127.0.0.1:61079_ c:control_collection   x:collection1] o.a.s.c.SolrResourceLoader JNDI not configured for solr (NoInitialContextEx)
   [junit4]   2> 1822082 INFO  (coreLoadExecutor-6442-thread-1-processing-n:127.0.0.1:61079_) [n:127.0.0.1:61079_ c:control_collection   x:collection1] o.a.s.c.SolrResourceLoader solr home defaulted to 'solr/' (could not find system property or JNDI)
   [junit4]   2> 1822087 INFO  (coreLoadExecutor-6442-thread-1-processing-n:127.0.0.1:61079_) [n:127.0.0.1:61079_ c:control_collection   x:collection1] o.a.s.c.Config loaded config solrconfig.xml with version 0 
   [junit4]   2> 1822092 INFO  (coreLoadExecutor-6442-thread-1-processing-n:127.0.0.1:61079_) [n:127.0.0.1:61079_ c:control_collection   x:collection1] o.a.s.c.SolrConfig current version of requestparams : -1
   [junit4]   2> 1822095 WARN  (coreLoadExecutor-6442-thread-1-processing-n:127.0.0.1:61079_) [n:127.0.0.1:61079_ c:control_collection   x:collection1] o.a.s.c.Config Beginning with Solr 5.5, <mergePolicy> is deprecated, use <mergePolicyFactory> instead.
   [junit4]   2> 1822095 INFO  (coreLoadExecutor-6442-thread-1-processing-n:127.0.0.1:61079_) [n:127.0.0.1:61079_ c:control_collection   x:collection1] o.a.s.c.SolrConfig Using Lucene MatchVersion: 7.0.0
   [junit4]   2> 1822102 INFO  (coreLoadExecutor-6442-thread-1-processing-n:127.0.0.1:61079_) [n:127.0.0.1:61079_ c:control_collection   x:collection1] o.a.s.c.SolrConfig Loaded SolrConfig: solrconfig.xml
   [junit4]   2> 1822106 INFO  (coreLoadExecutor-6442-thread-1-processing-n:127.0.0.1:61079_) [n:127.0.0.1:61079_ c:control_collection   x:collection1] o.a.s.s.IndexSchema [collection1] Schema name=test
   [junit4]   2> 1822166 INFO  (coreLoadExecutor-6442-thread-1-processing-n:127.0.0.1:61079_) [n:127.0.0.1:61079_ c:control_collection   x:collection1] o.a.s.s.OpenExchangeRatesOrgProvider Initialized with rates=open-exchange-rates.json, refreshInterval=1440.
   [junit4]   2> 1822172 INFO  (coreLoadExecutor-6442-thread-1-processing-n:127.0.0.1:61079_) [n:127.0.0.1:61079_ c:control_collection   x:collection1] o.a.s.s.IndexSchema default search field in schema is text
   [junit4]   2> 1822173 INFO  (coreLoadExecutor-6442-thread-1-processing-n:127.0.0.1:61079_) [n:127.0.0.1:61079_ c:control_collection   x:collection1] o.a.s.s.IndexSchema unique key field: id
   [junit4]   2> 1822206 INFO  (coreLoadExecutor-6442-thread-1-processing-n:127.0.0.1:61079_) [n:127.0.0.1:61079_ c:control_collection   x:collection1] o.a.s.s.FileExchangeRateProvider Reloading exchange rates from file currency.xml
   [junit4]   2> 1822208 INFO  (coreLoadExecutor-6442-thread-1-processing-n:127.0.0.1:61079_) [n:127.0.0.1:61079_ c:control_collection   x:collection1] o.a.s.s.FileExchangeRateProvider Reloading exchange rates from file currency.xml
   [junit4]   2> 1822210 INFO  (coreLoadExecutor-6442-thread-1-processing-n:127.0.0.1:61079_) [n:127.0.0.1:61079_ c:control_collection   x:collection1] o.a.s.s.OpenExchangeRatesOrgProvider Reloading exchange rates from open-exchange-rates.json
   [junit4]   2> 1822211 INFO  (coreLoadExecutor-6442-thread-1-processing-n:127.0.0.1:61079_) [n:127.0.0.1:61079_ c:control_collection   x:collection1] o.a.s.s.OpenExchangeRatesOrgProvider Reloading exchange rates from open-exchange-rates.json
   [junit4]   2> 1822212 INFO  (coreLoadExecutor-6442-thread-1-processing-n:127.0.0.1:61079_) [n:127.0.0.1:61079_ c:control_collection   x:collection1] o.a.s.c.ConfigSetProperties Did not find ConfigSet properties, assuming default properties: Can't find resource 'configsetprops.json' in classpath or '/configs/conf1', cwd=/export/home/jenkins/workspace/Lucene-Solr-master-Solaris/solr/build/solr-core/test/J1
   [junit4]   2> 1822212 INFO  (coreLoadExecutor-6442-thread-1-processing-n:127.0.0.1:61079_) [n:127.0.0.1:61079_ c:control_collection   x:collection1] o.a.s.c.CoreContainer Creating SolrCore 'collection1' using configuration from collection control_collection
   [junit4]   2> 1822212 INFO  (coreLoadExecutor-6442-thread-1-processing-n:127.0.0.1:61079_) [n:127.0.0.1:61079_ c:control_collection s:shard1 r:core_node1 x:collection1] o.a.s.c.SolrCore org.apache.solr.core.MockDirectoryFactory
   [junit4]   2> 1822213 INFO  (coreLoadExecutor-6442-thread-1-processing-n:127.0.0.1:61079_) [n:127.0.0.1:61079_ c:control_collection s:shard1 r:core_node1 x:collection1] o.a.s.c.SolrCore [[collection1] ] Opening new SolrCore at [/export/home/jenkins/workspace/Lucene-Solr-master-Solaris/solr/build/solr-core/test/J1/temp/solr.cloud.DeleteReplicaTest_42DCC7B1106DFB94-001/control-001/cores/collection1], dataDir=[/export/home/jenkins/workspace/Lucene-Solr-master-Solaris/solr/build/solr-core/test/J1/../../../../../../../../../../export/home/jenkins/workspace/Lucene-Solr-master-Solaris/solr/build/solr-core/test/J1/temp/solr.cloud.DeleteReplicaTest_42DCC7B1106DFB94-001/control-001/cores/collection1/data/]
   [junit4]   2> 1822213 INFO  (coreLoadExecutor-6442-thread-1-processing-n:127.0.0.1:61079_) [n:127.0.0.1:61079_ c:control_collection s:shard1 r:core_node1 x:collection1] o.a.s.c.JmxMonitoredMap JMX monitoring is enabled. Adding Solr mbeans to JMX Server: com.sun.jmx.mbeanserver.JmxMBeanServer@4ce49727
   [junit4]   2> 1822213 INFO  (coreLoadExecutor-6442-thread-1-processing-n:127.0.0.1:61079_) [n:127.0.0.1:61079_ c:control_collection s:shard1 r:core_node1 x:collection1] o.a.s.c.CachingDirectoryFactory return new directory for /export/home/jenkins/workspace/Lucene-Solr-master-Solaris/solr/build/solr-core/test/J1/../../../../../../../../../../export/home/jenkins/workspace/Lucene-Solr-master-Solaris/solr/build/solr-core/test/J1/temp/solr.cloud.DeleteReplicaTest_42DCC7B1106DFB94-001/control-001/cores/collection1/data
   [junit4]   2> 1822213 INFO  (coreLoadExecutor-6442-thread-1-processing-n:127.0.0.1:61079_) [n:127.0.0.1:61079_ c:control_collection s:shard1 r:core_node1 x:collection1] o.a.s.c.SolrCore New index directory detected: old=null new=/export/home/jenkins/workspace/Lucene-Solr-master-Solaris/solr/build/solr-core/test/J1/../../../../../../../../../../export/home/jenkins/workspace/Lucene-Solr-master-Solaris/solr/build/solr-core/test/J1/temp/solr.cloud.DeleteReplicaTest_42DCC7B1106DFB94-001/control-001/cores/collection1/data/index/
   [junit4]   2> 1822213 WARN  (coreLoadExecutor-6442-thread-1-processing-n:127.0.0.1:61079_) [n:127.0.0.1:61079_ c:control_collection s:shard1 r:core_node1 x:collection1] o.a.s.c.SolrCore [collection1] Solr index directory '/export/home/jenkins/workspace/Lucene-Solr-master-Solaris/solr/build/solr-core/test/J1/../../../../../../../../../../export/home/jenkins/workspace/Lucene-Solr-master-Solaris/solr/build/solr-core/test/J1/temp/solr.cloud.DeleteReplicaTest_42DCC7B1106DFB94-001/control-001/cores/collection1/data/index' doesn't exist. Creating new index...
   [junit4]   2> 1822213 INFO  (coreLoadExecutor-6442-thread-1-processing-n:127.0.0.1:61079_) [n:127.0.0.1:61079_ c:control_collection s:shard1 r:core_node1 x:collection1] o.a.s.c.CachingDirectoryFactory return new directory for /export/home/jenkins/workspace/Lucene-Solr-master-Solaris/solr/build/solr-core/test/J1/../../../../../../../../../../export/home/jenkins/workspace/Lucene-Solr-master-Solaris/solr/build/solr-core/test/J1/temp/solr.cloud.DeleteReplicaTest_42DCC7B1106DFB94-001/control-001/cores/collection1/data/index
   [junit4]   2> 1822214 INFO  (coreLoadExecutor-6442-thread-1-processing-n:127.0.0.1:61079_) [n:127.0.0.1:61079_ c:control_collection s:shard1 r:core_node1 x:collection1] o.a.s.u.RandomMergePolicy RandomMergePolicy wrapping class org.apache.lucene.index.LogDocMergePolicy: [LogDocMergePolicy: minMergeSize=1000, mergeFactor=12, maxMergeSize=9223372036854775807, maxMergeSizeForForcedMerge=9223372036854775807, calibrateSizeByDeletes=false, maxMergeDocs=2147483647, maxCFSSegmentSizeMB=8.796093022207999E12, noCFSRatio=1.0]
   [junit4]   2> 1822214 INFO  (coreLoadExecutor-6442-thread-1-processing-n:127.0.0.1:61079_) [n:127.0.0.1:61079_ c:control_collection s:shard1 r:core_node1 x:collection1] o.a.s.c.SolrDeletionPolicy SolrDeletionPolicy.onCommit: commits: num=1
   [junit4]   2> 	commit{dir=MockDirectoryWrapper(RAMDirectory@15f08f3e lockFactory=org.apache.lucene.store.SingleInstanceLockFactory@206bfc4f),segFN=segments_1,generation=1}
   [junit4]   2> 1822214 INFO  (coreLoadExecutor-6442-thread-1-processing-n:127.0.0.1:61079_) [n:127.0.0.1:61079_ c:control_collection s:shard1 r:core_node1 x:collection1] o.a.s.c.SolrDeletionPolicy newest commit generation = 1
   [junit4]   2> 1822214 INFO  (OldIndexDirectoryCleanupThreadForCore-collection1) [n:127.0.0.1:61079_ c:control_collection s:shard1 r:core_node1 x:collection1] o.a.s.c.SolrCore Looking for old index directories to cleanup for core collection1 in /export/home/jenkins/workspace/Lucene-Solr-master-Solaris/solr/build/solr-core/test/J1/../../../../../../../../../../export/home/jenkins/workspace/Lucene-Solr-master-Solaris/solr/build/solr-core/test/J1/temp/solr.cloud.DeleteReplicaTest_42DCC7B1106DFB94-001/control-001/cores/collection1/data/
   [junit4]   2> 1822214 WARN  (OldIndexDirectoryCleanupThreadForCore-collection1) [n:127.0.0.1:61079_ c:control_collection s:shard1 r:core_node1 x:collection1] o.a.s.c.DirectoryFactory /export/home/jenkins/workspace/Lucene-Solr-master-Solaris/solr/build/solr-core/test/J1/../../../../../../../../../../export/home/jenkins/workspace/Lucene-Solr-master-Solaris/solr/build/solr-core/test/J1/temp/solr.cloud.DeleteReplicaTest_42DCC7B1106DFB94-001/control-001/cores/collection1/data/ does not point to a valid data directory; skipping clean-up of old index directories.
   [junit4]   2> 1822216 INFO  (coreLoadExecutor-6442-thread-1-processing-n:127.0.0.1:61079_) [n:127.0.0.1:61079_ c:control_collection s:shard1 r:core_node1 x:collection1] o.a.s.u.p.UpdateRequestProcessorChain creating updateRequestProcessorChain "nodistrib"
   [junit4]   2> 1822216 INFO  (coreLoadExecutor-6442-thread-1-processing-n:127.0.0.1:61079_) [n:127.0.0.1:61079_ c:control_collection s:shard1 r:core_node1 x:collection1] o.a.s.u.p.UpdateRequestProcessorChain creating updateRequestProcessorChain "dedupe"
   [junit4]   2> 1822217 INFO  (coreLoadExecutor-6442-thread-1-processing-n:127.0.0.1:61079_) [n:127.0.0.1:61079_ c:control_collection s:shard1 r:core_node1 x:collection1] o.a.s.u.p.UpdateRequestProcessorChain inserting DistributedUpdateProcessorFactory into updateRequestProcessorChain "dedupe"
   [junit4]   2> 1822217 INFO  (coreLoadExecutor-6442-thread-1-processing-n:127.0.0.1:61079_) [n:127.0.0.1:61079_ c:control_collection s:shard1 r:core_node1 x:collection1] o.a.s.u.p.UpdateRequestProcessorChain creating updateRequestProcessorChain "stored_sig"
   [junit4]   2> 1822217 INFO  (coreLoadExecutor-6442-thread-1-processing-n:127.0.0.1:61079_) [n:127.0.0.1:61079_ c:control_collection s:shard1 r:core_node1 x:collection1] o.a.s.u.p.UpdateRequestProcessorChain inserting DistributedUpdateProcessorFactory into updateRequestProcessorChain "stored_sig"
   [junit4]   2> 1822217 INFO  (coreLoadExecutor-6442-thread-1-processing-n:127.0.0.1:61079_) [n:127.0.0.1:61079_ c:control_collection s:shard1 r:core_node1 x:collection1] o.a.s.u.p.UpdateRequestProcessorChain creating updateRequestProcessorChain "distrib-dup-test-chain-explicit"
   [junit4]   2> 1822217 INFO  (coreLoadExecutor-6442-thread-1-processing-n:127.0.0.1:61079_) [n:127.0.0.1:61079_ c:control_collection s:shard1 r:core_node1 x:collection1] o.a.s.u.p.UpdateRequestProcessorChain creating updateRequestProcessorChain "distrib-dup-test-chain-implicit"
   [junit4]   2> 1822217 INFO  (coreLoadExecutor-6442-thread-1-processing-n:127.0.0.1:61079_) [n:127.0.0.1:61079_ c:control_collection s:shard1 r:core_node1 x:collection1] o.a.s.u.p.UpdateRequestProcessorChain inserting DistributedUpdateProcessorFactory into updateRequestProcessorChain "distrib-dup-test-chain-implicit"
   [junit4]   2> 1822217 INFO  (coreLoadExecutor-6442-thread-1-processing-n:127.0.0.1:61079_) [n:127.0.0.1:61079_ c:control_collection s:shard1 r:core_node1 x:collection1] o.a.s.c.SolrCore no updateRequestProcessorChain defined as default, creating implicit default
   [junit4]   2> 1822217 WARN  (coreLoadExecutor-6442-thread-1-processing-n:127.0.0.1:61079_) [n:127.0.0.1:61079_ c:control_collection s:shard1 r:core_node1 x:collection1] o.a.s.c.RequestHandlers INVALID paramSet a in requestHandler {type = requestHandler,name = /dump,class = DumpRequestHandler,args = {defaults={a=A,b=B}}}
   [junit4]   2> 1822240 INFO  (coreLoadExecutor-6442-thread-1-processing-n:127.0.0.1:61079_) [n:127.0.0.1:61079_ c:control_collection s:shard1 r:core_node1 x:collection1] o.a.s.h.l.XMLLoader xsltCacheLifetimeSeconds=60
   [junit4]   2> 1822241 INFO  (coreLoadExecutor-6442-thread-1-processing-n:127.0.0.1:61079_) [n:127.0.0.1:61079_ c:control_collection s:shard1 r:core_node1 x:collection1] o.a.s.h.l.XMLLoader xsltCacheLifetimeSeconds=60
   [junit4]   2> 1822242 INFO  (coreLoadExecutor-6442-thread-1-processing-n:127.0.0.1:61079_) [n:127.0.0.1:61079_ c:control_collection s:shard1 r:core_node1 x:collection1] o.a.s.h.l.XMLLoader xsltCacheLifetimeSeconds=60
   [junit4]   2> 1822243 INFO  (coreLoadExecutor-6442-thread-1-processing-n:127.0.0.1:61079_) [n:127.0.0.1:61079_ c:control_collection s:shard1 r:core_node1 x:collection1] o.a.s.h.l.XMLLoader xsltCacheLifetimeSeconds=60
   [junit4]   2> 1822248 INFO  (coreLoadExecutor-6442-thread-1-processing-n:127.0.0.1:61079_) [n:127.0.0.1:61079_ c:control_collection s:shard1 r:core_node1 x:collection1] o.a.s.c.RequestHandlers Registered paths: /admin/mbeans,standard,/update/json/docs,/admin/luke,/export,/get,/admin/properties,/update/json,/admin/threads,/dump,/update/csv,/sql,/graph,/admin/segments,/admin/system,/replication,/config,/stream,/schema,/admin/plugins,/admin/logging,/admin/ping,/update,/admin/file
   [junit4]   2> 1822248 INFO  (coreLoadExecutor-6442-thread-1-processing-n:127.0.0.1:61079_) [n:127.0.0.1:61079_ c:control_collection s:shard1 r:core_node1 x:collection1] o.a.s.c.SolrCore Using default statsCache cache: org.apache.solr.search.stats.LocalStatsCache
   [junit4]   2> 1822248 INFO  (coreLoadExecutor-6442-thread-1-processing-n:127.0.0.1:61079_) [n:127.0.0.1:61079_ c:control_collection s:shard1 r:core_node1 x:collection1] o.a.s.u.UpdateHandler Using UpdateLog implementation: org.apache.solr.update.UpdateLog
   [junit4]   2> 1822248 INFO  (coreLoadExecutor-6442-thread-1-processing-n:127.0.0.1:61079_) [n:127.0.0.1:61079_ c:control_collection s:shard1 r:core_node1 x:collection1] o.a.s.u.UpdateLog Initializing UpdateLog: dataDir= defaultSyncLevel=FLUSH numRecordsToKeep=100 maxNumLogsToKeep=10 numVersionBuckets=65536
   [junit4]   2> 1822250 INFO  (coreLoadExecutor-6442-thread-1-processing-n:127.0.0.1:61079_) [n:127.0.0.1:61079_ c:control_collection s:shard1 r:core_node1 x:collection1] o.a.s.u.CommitTracker Hard AutoCommit: disabled
   [junit4]   2> 1822250 INFO  (coreLoadExecutor-6442-thread-1-processing-n:127.0.0.1:61079_) [n:127.0.0.1:61079_ c:control_collection s:shard1 r:core_node1 x:collection1] o.a.s.u.CommitTracker Soft AutoCommit: disabled
   [junit4]   2> 1822250 INFO  (coreLoadExecutor-6442-thread-1-processing-n:127.0.0.1:61079_) [n:127.0.0.1:61079_ c:control_collection s:shard1 r:core_node1 x:collection1] o.a.s.u.RandomMergePolicy RandomMergePolicy wrapping class org.apache.lucene.index.LogDocMergePolicy: [LogDocMergePolicy: minMergeSize=1000, mergeFactor=25, maxMergeSize=9223372036854775807, maxMergeSizeForForcedMerge=9223372036854775807, calibrateSizeByDeletes=true, maxMergeDocs=2147483647, maxCFSSegmentSizeMB=8.796093022207999E12, noCFSRatio=0.6728877348867267]
   [junit4]   2> 1822251 INFO  (coreLoadExecutor-6442-thread-1-processing-n:127.0.0.1:61079_) [n:127.0.0.1:61079_ c:control_collection s:shard1 r:core_node1 x:collection1] o.a.s.c.SolrDeletionPolicy SolrDeletionPolicy.onInit: commits: num=1
   [junit4]   2> 	commit{dir=MockDirectoryWrapper(RAMDirectory@15f08f3e lockFactory=org.apache.lucene.store.SingleInstanceLockFactory@206bfc4f),segFN=segments_1,generation=1}
   [junit4]   2> 1822251 INFO  (coreLoadExecutor-6442-thread-1-processing-n:127.0.0.1:61079_) [n:127.0.0.1:61079_ c:control_collection s:shard1 r:core_node1 x:collection1] o.a.s.c.SolrDeletionPolicy newest commit generation = 1
   [junit4]   2> 1822251 INFO  (coreLoadExecutor-6442-thread-1-processing-n:127.0.0.1:61079_) [n:127.0.0.1:61079_ c:control_collection s:shard1 r:core_node1 x:collection1] o.a.s.s.SolrIndexSearcher Opening [Searcher@3eae9280[collection1] main]
   [junit4]   2> 1822251 INFO  (coreLoadExecutor-6442-thread-1-processing-n:127.0.0.1:61079_) [n:127.0.0.1:61079_ c:control_collection s:shard1 r:core_node1 x:collection1] o.a.s.c.c.ZkStateReader Load collection config from: [/collections/control_collection]
   [junit4]   2> 1822252 INFO  (coreLoadExecutor-6442-thread-1-processing-n:127.0.0.1:61079_) [n:127.0.0.1:61079_ c:control_collection s:shard1 r:core_node1 x:collection1] o.a.s.c.c.ZkStateReader path=[/collections/control_collection] [configName]=[conf1] specified config exists in ZooKeeper
   [junit4]   2> 1822252 INFO  (coreLoadExecutor-6442-thread-1-processing-n:127.0.0.1:61079_) [n:127.0.0.1:61079_ c:control_collection s:shard1 r:core_node1 x:collection1] o.a.s.r.ManagedResourceStorage Setting up ZooKeeper-based storage for the RestManager with znodeBase: /configs/conf1
   [junit4]   2> 1822253 INFO  (coreLoadExecutor-6442-thread-1-processing-n:127.0.0.1:61079_) [n:127.0.0.1:61079_ c:control_collection s:shard1 r:core_node1 x:collection1] o.a.s.r.ManagedResourceStorage Configured ZooKeeperStorageIO with znodeBase: /configs/conf1
   [junit4]   2> 1822253 INFO  (coreLoadExecutor-6442-thread-1-processing-n:127.0.0.1:61079_) [n:127.0.0.1:61079_ c:control_collection s:shard1 r:core_node1 x:collection1] o.a.s.r.RestManager Initializing RestManager with initArgs: {}
   [junit4]   2> 1822253 INFO  (coreLoadExecutor-6442-thread-1-processing-n:127.0.0.1:61079_) [n:127.0.0.1:61079_ c:control_collection s:shard1 r:core_node1 x:collection1] o.a.s.r.ManagedResourceStorage Reading _rest_managed.json using ZooKeeperStorageIO:path=/configs/conf1
   [junit4]   2> 1822253 INFO  (coreLoadExecutor-6442-thread-1-processing-n:127.0.0.1:61079_) [n:127.0.0.1:61079_ c:control_collection s:shard1 r:core_node1 x:collection1] o.a.s.r.ManagedResourceStorage No data found for znode /configs/conf1/_rest_managed.json
   [junit4]   2> 1822254 INFO  (coreLoadExecutor-6442-thread-1-processing-n:127.0.0.1:61079_) [n:127.0.0.1:61079_ c:control_collection s:shard1 r:core_node1 x:collection1] o.a.s.r.ManagedResourceStorage Loaded null at path _rest_managed.json using ZooKeeperStorageIO:path=/configs/conf1
   [junit4]   2> 1822254 INFO  (coreLoadExecutor-6442-thread-1-processing-n:127.0.0.1:61079_) [n:127.0.0.1:61079_ c:control_collection s:shard1 r:core_node1 x:collection1] o.a.s.r.RestManager Initializing 0 registered ManagedResources
   [junit4]   2> 1822254 INFO  (coreLoadExecutor-6442-thread-1-processing-n:127.0.0.1:61079_) [n:127.0.0.1:61079_ c:control_collection s:shard1 r:core_node1 x:collection1] o.a.s.h.ReplicationHandler Commits will be reserved for  10000
   [junit4]   2> 1822254 INFO  (searcherExecutor-6443-thread-1-processing-n:127.0.0.1:61079_ x:collection1 s:shard1 c:control_collection r:core_node1) [n:127.0.0.1:61079_ c:control_collection s:shard1 r:core_node1 x:collection1] o.a.s.c.SolrCore [collection1] Registered new searcher Searcher@3eae9280[collection1] main{ExitableDirectoryReader(UninvertingDirectoryReader())}
   [junit4]   2> 1822254 INFO  (coreLoadExecutor-6442-thread-1-processing-n:127.0.0.1:61079_) [n:127.0.0.1:61079_ c:control_collection s:shard1 r:core_node1 x:collection1] o.a.s.u.UpdateLog Looking up max value of version field to seed version buckets
   [junit4]   2> 1822254 INFO  (coreLoadExecutor-6442-thread-1-processing-n:127.0.0.1:61079_) [n:127.0.0.1:61079_ c:control_collection s:shard1 r:core_node1 x:collection1] o.a.s.u.VersionInfo Refreshing highest value of _version_ for 65536 version buckets from index
   [junit4]   2> 1822254 INFO  (coreLoadExecutor-6442-thread-1-processing-n:127.0.0.1:61079_) [n:127.0.0.1:61079_ c:control_collection s:shard1 r:core_node1 x:collection1] o.a.s.u.VersionInfo No terms found for _version_, cannot seed version bucket highest value from index
   [junit4]   2> 1822255 INFO  (coreLoadExecutor-6442-thread-1-processing-n:127.0.0.1:61079_) [n:127.0.0.1:61079_ c:control_collection s:shard1 r:core_node1 x:collection1] o.a.s.u.UpdateLog Could not find max version in index or recent updates, using new clock 1533756620948897792
   [junit4]   2> 1822256 INFO  (coreLoadExecutor-6442-thread-1-processing-n:127.0.0.1:61079_) [n:127.0.0.1:61079_ c:control_collection s:shard1 r:core_node1 x:collection1] o.a.s.u.UpdateLog Took 1.0ms to seed version buckets with highest version 1533756620948897792
   [junit4]   2> 1822256 INFO  (coreLoadExecutor-6442-thread-1-processing-n:127.0.0.1:61079_) [n:127.0.0.1:61079_ c:control_collection s:shard1 r:core_node1 x:collection1] o.a.s.c.ZkController watch zkdir /configs/conf1
   [junit4]   2> 1822258 INFO  (coreLoadExecutor-6442-thread-1-processing-n:127.0.0.1:61079_) [n:127.0.0.1:61079_ c:control_collection s:shard1 r:core_node1 x:collection1] o.a.s.c.CoreContainer registering core: collection1
   [junit4]   2> 1822258 INFO  (coreZkRegister-6436-thread-1-processing-n:127.0.0.1:61079_ x:collection1 s:shard1 c:control_collection r:core_node1) [n:127.0.0.1:61079_ c:control_collection s:shard1 r:core_node1 x:collection1] o.a.s.c.ZkController Register replica - core:collection1 address:http://127.0.0.1:61079 collection:control_collection shard:shard1
   [junit4]   2> 1822260 INFO  (coreZkRegister-6436-thread-1-processing-n:127.0.0.1:61079_ x:collection1 s:shard1 c:control_collection r:core_node1) [n:127.0.0.1:61079_ c:control_collection s:shard1 r:core_node1 x:collection1] o.a.s.c.c.SolrZkClient makePath: /collections/control_collection/leader_elect/shard1/election
   [junit4]   2> 1822265 INFO  (coreZkRegister-6436-thread-1-processing-n:127.0.0.1:61079_ x:collection1 s:shard1 c:control_collection r:core_node1) [n:127.0.0.1:61079_ c:control_collection s:shard1 r:core_node1 x:collection1] o.a.s.c.LeaderElector Joined leadership election with path: /collections/control_collection/leader_elect/shard1/election/95859788691537924-core_node1-n_0000000000
   [junit4]   2> 1822266 INFO  (coreZkRegister-6436-thread-1-processing-n:127.0.0.1:61079_ x:collection1 s:shard1 c:control_collection r:core_node1) [n:127.0.0.1:61079_ c:control_collection s:shard1 r:core_node1 x:collection1] o.a.s.c.ShardLeaderElectionContext Running the leader process for shard=shard1 and weAreReplacement=false and leaderVoteWait=180000
   [junit4]   2> 1822268 INFO  (coreZkRegister-6436-thread-1-processing-n:127.0.0.1:61079_ x:collection1 s:shard1 c:control_collection r:core_node1) [n:127.0.0.1:61079_ c:control_collection s:shard1 r:core_node1 x:collection1] o.a.s.c.ShardLeaderElectionContext Enough replicas found to continue.
   [junit4]   2> 1822268 INFO  (coreZkRegister-6436-thread-1-processing-n:127.0.0.1:61079_ x:collection1 s:shard1 c:control_collection r:core_node1) [n:127.0.0.1:61079_ c:control_collection s:shard1 r:core_node1 x:collection1] o.a.s.c.ShardLeaderElectionContext I may be the new leader - try and sync
   [junit4]   2> 1822268 INFO  (OverseerStateUpdate-95859788691537924-127.0.0.1:61079_-n_0000000000) [n:127.0.0.1:61079_    ] o.a.s.c.Overseer processMessage: queueSize: 1, message = {
   [junit4]   2>   "operation":"leader",
   [junit4]   2>   "shard":"shard1",
   [junit4]   2>   "collection":"control_collection"} current state version: 1
   [junit4]   2> 1822268 INFO  (coreZkRegister-6436-thread-1-processing-n:127.0.0.1:61079_ x:collection1 s:shard1 c:control_collection r:core_node1) [n:127.0.0.1:61079_ c:control_collection s:shard1 r:core_node1 x:collection1] o.a.s.c.SyncStrategy Sync replicas to http://127.0.0.1:61079/collection1/
   [junit4]   2> 1822268 INFO  (coreZkRegister-6436-thread-1-processing-n:127.0.0.1:61079_ x:collection1 s:shard1 c:control_collection r:core_node1) [n:127.0.0.1:61079_ c:control_collection s:shard1 r:core_node1 x:collection1] o.a.s.c.SyncStrategy Sync Success - now sync replicas to me
   [junit4]   2> 1822268 INFO  (coreZkRegister-6436-thread-1-processing-n:127.0.0.1:61079_ x:collection1 s:shard1 c:control_collection r:core_node1) [n:127.0.0.1:61079_ c:control_collection s:shard1 r:core_node1 x:collection1] o.a.s.c.SyncStrategy http://127.0.0.1:61079/collection1/ has no replicas
   [junit4]   2> 1822271 INFO  (coreZkRegister-6436-thread-1-processing-n:127.0.0.1:61079_ x:collection1 s:shard1 c:control_collection r:core_node1) [n:127.0.0.1:61079_ c:control_collection s:shard1 r:core_node1 x:collection1] o.a.s.c.c.SolrZkClient makePath: /collections/control_collection/leaders/shard1
   [junit4]   2> 1822274 INFO  (coreZkRegister-6436-thread-1-processing-n:127.0.0.1:61079_ x:collection1 s:shard1 c:control_collection r:core_node1) [n:127.0.0.1:61079_ c:control_collection s:shard1 r:core_node1 x:collection1] o.a.s.c.ShardLeaderElectionContextBase Creating leader registration node /collections/control_collection/leaders/shard1/leader after winning as /collections/control_collection/leader_elect/shard1/election/95859788691537924-core_node1-n_0000000000
   [junit4]   2> 1822277 INFO  (coreZkRegister-6436-thread-1-processing-n:127.0.0.1:61079_ x:collection1 s:shard1 c:control_collection r:core_node1) [n:127.0.0.1:61079_ c:control_collection s:shard1 r:core_node1 x:collection1] o.a.s.c.ShardLeaderElectionContext I am the new leader: http://127.0.0.1:61079/collection1/ shard1
   [junit4]   2> 1822278 INFO  (OverseerStateUpdate-95859788691537924-127.0.0.1:61079_-n_0000000000) [n:127.0.0.1:61079_    ] o.a.s.c.Overseer processMessage: queueSize: 1, message = {
   [junit4]   2>   "operation":"leader",
   [junit4]   2>   "shard":"shard1",
   [junit4]   2>   "collection":"control_collection",
   [junit4]   2>   "base_url":"http://127.0.0.1:61079",
   [junit4]   2>   "core":"collection1",
   [junit4]   2>   "state":"active"} current state version: 1
   [junit4]   2> 1822382 INFO  (zkCallback-2101-thread-1-processing-n:127.0.0.1:61079_) [n:127.0.0.1:61079_    ] o.a.s.c.c.ZkStateReader A cluster state change: [WatchedEvent state:SyncConnected type:NodeDataChanged path:/clusterstate.json], has occurred - updating... (live nodes size: [1])
   [junit4]   2> 1822428 INFO  (coreZkRegister-6436-thread-1-processing-n:127.0.0.1:61079_ x:collection1 s:shard1 c:control_collection r:core_node1) [n:127.0.0.1:61079_ c:control_collection s:shard1 r:core_node1 x:collection1] o.a.s.c.ZkController We are http://127.0.0.1:61079/collection1/ and leader is http://127.0.0.1:61079/collection1/
   [junit4]   2> 1822428 INFO  (coreZkRegister-6436-thread-1-processing-n:127.0.0.1:61079_ x:collection1 s:shard1 c:control_collection r:core_node1) [n:127.0.0.1:61079_ c:control_collection s:shard1 r:core_node1 x:collection1] o.a.s.c.ZkController No LogReplay needed for core=collection1 baseURL=http://127.0.0.1:61079
   [junit4]   2> 1822428 INFO  (coreZkRegister-6436-thread-1-processing-n:127.0.0.1:61079_ x:collection1 s:shard1 c:control_collection r:core_node1) [n:127.0.0.1:61079_ c:control_collection s:shard1 r:core_node1 x:collection1] o.a.s.c.ZkController I am the leader, no recovery necessary
   [junit4]   2> 1822428 INFO  (coreZkRegister-6436-thread-1-processing-n:127.0.0.1:61079_ x:collection1 s:shard1 c:control_collection r:core_node1) [n:127.0.0.1:61079_ c:control_collection s:shard1 r:core_node1 x:collection1] o.a.s.c.ZkController publishing state=active
   [junit4]   2> 1822428 INFO  (coreZkRegister-6436-thread-1-processing-n:127.0.0.1:61079_ x:collection1 s:shard1 c:control_collection r:core_node1) [n:127.0.0.1:61079_ c:control_collection s:shard1 r:core_node1 x:collection1] o.a.s.c.ZkController numShards not found on descriptor - reading it from system property
   [junit4]   2> 1822431 INFO  (OverseerStateUpdate-95859788691537924-127.0.0.1:61079_-n_0000000000) [n:127.0.0.1:61079_    ] o.a.s.c.Overseer processMessage: queueSize: 1, message = {
   [junit4]   2>   "core":"collection1",
   [junit4]   2>   "core_node_name":"core_node1",
   [junit4]   2>   "roles":null,
   [junit4]   2>   "base_url":"http://127.0.0.1:61079",
   [junit4]   2>   "node_name":"127.0.0.1:61079_",
   [junit4]   2>   "numShards":"1",
   [junit4]   2>   "state":"active",
   [junit4]   2>   "shard":"shard1",
   [junit4]   2>   "collection":"control_collection",
   [junit4]   2>   "operation":"state"} current state version: 2
   [junit4]   2> 1822432 INFO  (OverseerStateUpdate-95859788691537924-127.0.0.1:61079_-n_0000000000) [n:127.0.0.1:61079_    ] o.a.s.c.o.ReplicaMutator Update state numShards=1 message={
   [junit4]   2>   "core":"collection1",
   [junit4]   2>   "core_node_name":"core_node1",
   [junit4]   2>   "roles":null,
   [junit4]   2>   "base_url":"http://127.0.0.1:61079",
   [junit4]   2>   "node_name":"127.0.0.1:61079_",
   [junit4]   2>   "numShards":"1",
   [junit4]   2>   "state":"active",
   [junit4]   2>   "shard":"shard1",
   [junit4]   2>   "collection":"control_collection",
   [junit4]   2>   "operation":"state"}
   [junit4]   2> 1822535 INFO  (zkCallback-2101-thread-1-processing-n:127.0.0.1:61079_) [n:127.0.0.1:61079_    ] o.a.s.c.c.ZkStateReader A cluster state change: [WatchedEvent state:SyncConnected type:NodeDataChanged path:/clusterstate.json], has occurred - updating... (live nodes size: [1])
   [junit4]   2> 1822581 INFO  (TEST-DeleteReplicaTest.deleteReplicaAndVerifyDirectoryCleanup-seed#[42DCC7B1106DFB94]) [    ] o.a.s.c.c.SolrZkClient Using default ZkCredentialsProvider
   [junit4]   2> 1822582 INFO  (TEST-DeleteReplicaTest.deleteReplicaAndVerifyDirectoryCleanup-seed#[42DCC7B1106DFB94]) [    ] o.a.s.c.c.ConnectionManager Waiting for client to connect to ZooKeeper
   [junit4]   2> 1822583 INFO  (zkCallback-2103-thread-1) [    ] o.a.s.c.c.ConnectionManager Watcher org.apache.solr.common.cloud.ConnectionManager@94cf5cf name:ZooKeeperConnection Watcher:127.0.0.1:53631/solr got event WatchedEvent state:SyncConnected type:None path:null path:null type:None
   [junit4]   2> 1822583 INFO  (TEST-DeleteReplicaTest.deleteReplicaAndVerifyDirectoryCleanup-seed#[42DCC7B1106DFB94]) [    ] o.a.s.c.c.ConnectionManager Client is connected to ZooKeeper
   [junit4]   2> 1822583 INFO  (TEST-DeleteReplicaTest.deleteReplicaAndVerifyDirectoryCleanup-seed#[42DCC7B1106DFB94]) [    ] o.a.s.c.c.SolrZkClient Using default ZkACLProvider
   [junit4]   2> 1822583 INFO  (TEST-DeleteReplicaTest.deleteReplicaAndVerifyDirectoryCleanup-seed#[42DCC7B1106DFB94]) [    ] o.a.s.c.c.ZkStateReader Updating cluster state from ZooKeeper... 
   [junit4]   2> 1822585 INFO  (TEST-DeleteReplicaTest.deleteReplicaAndVerifyDirectoryCleanup-seed#[42DCC7B1106DFB94]) [    ] o.a.s.c.c.ZkStateReader Updated live nodes from ZooKeeper... (0) -> (1)
   [junit4]   2> 1822586 INFO  (TEST-DeleteReplicaTest.deleteReplicaAndVerifyDirectoryCleanup-seed#[42DCC7B1106DFB94]) [    ] o.a.s.c.ChaosMonkey monkey: init - expire sessions:false cause connection loss:false
   [junit4]   2> 1822742 INFO  (TEST-DeleteReplicaTest.deleteReplicaAndVerifyDirectoryCleanup-seed#[42DCC7B1106DFB94]) [    ] o.a.s.SolrTestCaseJ4 Writing core.properties file to /export/home/jenkins/workspace/Lucene-Solr-master-Solaris/solr/build/solr-core/test/J1/temp/solr.cloud.DeleteReplicaTest_42DCC7B1106DFB94-001/shard-1-001/cores/collection1
   [junit4]   2> 1822742 INFO  (TEST-DeleteReplicaTest.deleteReplicaAndVerifyDirectoryCleanup-seed#[42DCC7B1106DFB94]) [    ] o.a.s.c.AbstractFullDistribZkTestBase create jetty 1 in directory /export/home/jenkins/workspace/Lucene-Solr-master-Solaris/solr/build/solr-core/test/J1/temp/solr.cloud.DeleteReplicaTest_42DCC7B1106DFB94-001/shard-1-001
   [junit4]   2> 1822743 INFO  (TEST-DeleteReplicaTest.deleteReplicaAndVerifyDirectoryCleanup-seed#[42DCC7B1106DFB94]) [    ] o.e.j.s.Server jetty-9.3.8.v20160314
   [junit4]   2> 1822745 INFO  (TEST-DeleteReplicaTest.deleteReplicaAndVerifyDirectoryCleanup-seed#[42DCC7B1106DFB94]) [    ] o.e.j.s.h.ContextHandler Started o.e.j.s.ServletContextHandler@6f4e0d7b{/,null,AVAILABLE}
   [junit4]   2> 1822746 INFO  (TEST-DeleteReplicaTest.deleteReplicaAndVerifyDirectoryCleanup-seed#[42DCC7B1106DFB94]) [    ] o.e.j.s.ServerConnector Started ServerConnector@67af5be4{HTTP/1.1,[http/1.1]}{127.0.0.1:48732}
   [junit4]   2> 1822746 INFO  (TEST-DeleteReplicaTest.deleteReplicaAndVerifyDirectoryCleanup-seed#[42DCC7B1106DFB94]) [    ] o.e.j.s.Server Started @1827734ms
   [junit4]   2> 1822746 INFO  (TEST-DeleteReplicaTest.deleteReplicaAndVerifyDirectoryCleanup-seed#[42DCC7B1106DFB94]) [    ] o.a.s.c.s.e.JettySolrRunner Jetty properties: {solr.data.dir=/export/home/jenkins/workspace/Lucene-Solr-master-Solaris/solr/build/solr-core/test/J1/temp/solr.cloud.DeleteReplicaTest_42DCC7B1106DFB94-001/tempDir-001/jetty1, solrconfig=solrconfig.xml, hostContext=/, hostPort=48732, coreRootDirectory=/export/home/jenkins/workspace/Lucene-Solr-master-Solaris/solr/build/solr-core/test/J1/temp/solr.cloud.DeleteReplicaTest_42DCC7B1106DFB94-001/shard-1-001/cores}
   [junit4]   2> 1822746 INFO  (TEST-DeleteReplicaTest.deleteReplicaAndVerifyDirectoryCleanup-seed#[42DCC7B1106DFB94]) [    ] o.a.s.s.SolrDispatchFilter SolrDispatchFilter.init(): sun.misc.Launcher$AppClassLoader@6d06d69c
   [junit4]   2> 1822746 INFO  (TEST-DeleteReplicaTest.deleteReplicaAndVerifyDirectoryCleanup-seed#[42DCC7B1106DFB94]) [    ] o.a.s.c.SolrResourceLoader new SolrResourceLoader for directory: '/export/home/jenkins/workspace/Lucene-Solr-master-Solaris/solr/build/solr-core/test/J1/temp/solr.cloud.DeleteReplicaTest_42DCC7B1106DFB94-001/shard-1-001'
   [junit4]   2> 1822746 INFO  (TEST-DeleteReplicaTest.deleteReplicaAndVerifyDirectoryCleanup-seed#[42DCC7B1106DFB94]) [    ] o.a.s.c.SolrResourceLoader JNDI not configured for solr (NoInitialContextEx)
   [junit4]   2> 1822746 INFO  (TEST-DeleteReplicaTest.deleteReplicaAndVerifyDirectoryCleanup-seed#[42DCC7B1106DFB94]) [    ] o.a.s.c.SolrResourceLoader solr home defaulted to 'solr/' (could not find system property or JNDI)
   [junit4]   2> 1822748 INFO  (TEST-DeleteReplicaTest.deleteReplicaAndVerifyDirectoryCleanup-seed#[42DCC7B1106DFB94]) [    ] o.a.s.c.c.SolrZkClient Using default ZkCredentialsProvider
   [junit4]   2> 1822748 INFO  (TEST-DeleteReplicaTest.deleteReplicaAndVerifyDirectoryCleanup-seed#[42DCC7B1106DFB94]) [    ] o.a.s.c.c.ConnectionManager Waiting for client to connect to ZooKeeper
   [junit4]   2> 1822750 INFO  (zkCallback-2104-thread-1) [    ] o.a.s.c.c.ConnectionManager Watcher org.apache.solr.common.cloud.ConnectionManager@64c51151 name:ZooKeeperConnection Watcher:127.0.0.1:53631/solr got event WatchedEvent state:SyncConnected type:None path:null path:null type:None
   [junit4]   2> 1822750 INFO  (TEST-DeleteReplicaTest.deleteReplicaAndVerifyDirectoryCleanup-seed#[42DCC7B1106DFB94]) [    ] o.a.s.c.c.ConnectionManager Client is connected to ZooKeeper
   [junit4]   2> 1822751 INFO  (TEST-DeleteReplicaTest.deleteReplicaAndVerifyDirectoryCleanup-seed#[42DCC7B1106DFB94]) [    ] o.a.s.c.c.SolrZkClient Using default ZkACLProvider
   [junit4]   2> 1822752 INFO  (TEST-DeleteReplicaTest.deleteReplicaAndVerifyDirectoryCleanup-seed#[42DCC7B1106DFB94]) [    ] o.a.s.s.SolrDispatchFilter Loading solr.xml from SolrHome (not found in ZooKeeper)
   [junit4]   2> 1822752 INFO  (TEST-DeleteReplicaTest.deleteReplicaAndVerifyDirectoryCleanup-seed#[42DCC7B1106DFB94]) [    ] o.a.s.c.SolrXmlConfig Loading container configuration from /export/home/jenkins/workspace/Lucene-Solr-master-Solaris/solr/build/solr-core/test/J1/temp/solr.cloud.DeleteReplicaTest_42DCC7B1106DFB94-001/shard-1-001/solr.xml
   [junit4]   2> 1822758 INFO  (TEST-DeleteReplicaTest.deleteReplicaAndVerifyDirectoryCleanup-seed#[42DCC7B1106DFB94]) [    ] o.a.s.c.CorePropertiesLocator Config-defined core root directory: /export/home/jenkins/workspace/Lucene-Solr-master-Solaris/solr/build/solr-core/test/J1/temp/solr.cloud.DeleteReplicaTest_42DCC7B1106DFB94-001/shard-1-001/cores
   [junit4]   2> 1822758 INFO  (TEST-DeleteReplicaTest.deleteReplicaAndVerifyDirectoryCleanup-seed#[42DCC7B1106DFB94]) [    ] o.a.s.c.CoreContainer New CoreContainer 1705512411
   [junit4]   2> 1822758 INFO  (TEST-DeleteReplicaTest.deleteReplicaAndVerifyDirectoryCleanup-seed#[42DCC7B1106DFB94]) [    ] o.a.s.c.CoreContainer Loading cores into CoreContainer [instanceDir=/export/home/jenkins/workspace/Lucene-Solr-master-Solaris/solr/build/solr-core/test/J1/temp/solr.cloud.DeleteReplicaTest_42DCC7B1106DFB94-001/shard-1-001]
   [junit4]   2> 1822758 WARN  (TEST-DeleteReplicaTest.deleteReplicaAndVerifyDirectoryCleanup-seed#[42DCC7B1106DFB94]) [    ] o.a.s.c.CoreContainer Couldn't add files from /export/home/jenkins/workspace/Lucene-Solr-master-Solaris/solr/build/solr-core/test/J1/temp/solr.cloud.DeleteReplicaTest_42DCC7B1106DFB94-001/shard-1-001/lib to classpath: /export/home/jenkins/workspace/Lucene-Solr-master-Solaris/solr/build/solr-core/test/J1/temp/solr.cloud.DeleteReplicaTest_42DCC7B1106DFB94-001/shard-1-001/lib
   [junit4]   2> 1822759 INFO  (TEST-DeleteReplicaTest.deleteReplicaAndVerifyDirectoryCleanup-seed#[42DCC7B1106DFB94]) [    ] o.a.s.h.c.HttpShardHandlerFactory created with socketTimeout : 90000,urlScheme : ,connTimeout : 15000,maxConnectionsPerHost : 20,maxConnections : 10000,corePoolSize : 0,maximumPoolSize : 2147483647,maxThreadIdleTime : 5,sizeOfQueue : -1,fairnessPolicy : false,
   [junit4]   2> 1822760 INFO  (TEST-DeleteReplicaTest.deleteReplicaAndVerifyDirectoryCleanup-seed#[42DCC7B1106DFB94]) [    ] o.a.s.u.UpdateShardHandler Creating UpdateShardHandler HTTP client with params: 
   [junit4]   2> 1822761 INFO  (TEST-DeleteReplicaTest.deleteReplicaAndVerifyDirectoryCleanup-seed#[42DCC7B1106DFB94]) [    ] o.a.s.l.LogWatcher SLF4J impl is org.slf4j.impl.Log4jLoggerFactory
   [junit4]   2> 1822761 INFO  (TEST-DeleteReplicaTest.deleteReplicaAndVerifyDirectoryCleanup-seed#[42DCC7B1106DFB94]) [    ] o.a.s.l.LogWatcher Registering Log Listener [Log4j (org.slf4j.impl.Log4jLoggerFactory)]
   [junit4]   2> 1822761 INFO  (TEST-DeleteReplicaTest.deleteReplicaAndVerifyDirectoryCleanup-seed#[42DCC7B1106DFB94]) [    ] o.a.s.c.ZkContainer Zookeeper client=127.0.0.1:53631/solr
   [junit4]   2> 1822761 INFO  (TEST-DeleteReplicaTest.deleteReplicaAndVerifyDirectoryCleanup-seed#[42DCC7B1106DFB94]) [    ] o.a.s.c.ZkController zkHost includes chroot
   [junit4]   2> 1822761 INFO  (TEST-DeleteReplicaTest.deleteReplicaAndVerifyDirectoryCleanup-seed#[42DCC7B1106DFB94]) [    ] o.a.s.c.c.SolrZkClient Using default ZkCredentialsProvider
   [junit4]   2> 1822762 INFO  (TEST-DeleteReplicaTest.deleteReplicaAndVerifyDirectoryCleanup-seed#[42DCC7B1106DFB94]) [    ] o.a.s.c.c.ConnectionManager Waiting for client to connect to ZooKeeper
   [junit4]   2> 1822763 INFO  (zkCallback-2107-thread-1) [    ] o.a.s.c.c.ConnectionManager Watcher org.apache.solr.common.cloud.ConnectionManager@1fd83684 name:ZooKeeperConnection Watcher:127.0.0.1:53631 got event WatchedEvent state:SyncConnected type:None path:null path:null type:None
   [junit4]   2> 1822763 INFO  (TEST-DeleteReplicaTest.deleteReplicaAndVerifyDirectoryCleanup-seed#[42DCC7B1106DFB94]) [    ] o.a.s.c.c.ConnectionManager Client is connected to ZooKeeper
   [junit4]   2> 1822764 INFO  (TEST-DeleteReplicaTest.deleteReplicaAndVerifyDirectoryCleanup-seed#[42DCC7B1106DFB94]) [    ] o.a.s.c.c.SolrZkClient Using default ZkACLProvider
   [junit4]   2> 1822765 INFO  (TEST-DeleteReplicaTest.deleteReplicaAndVerifyDirectoryCleanup-seed#[42DCC7B1106DFB94]) [n:127.0.0.1:48732_    ] o.a.s.c.ZkController Added new OnReconnect listener org.apache.solr.cloud.ZkController$$Lambda$37/974443017@4a9c647c
   [junit4]   2> 1822765 INFO  (TEST-DeleteReplicaTest.deleteReplicaAndVerifyDirectoryCleanup-seed#[42DCC7B1106DFB94]) [n:127.0.0.1:48732_    ] o.a.s.c.c.ConnectionManager Waiting for client to connect to ZooKeeper
   [junit4]   2> 1822766 INFO  (zkCallback-2108-thread-1-processing-n:127.0.0.1:48732_) [n:127.0.0.1:48732_    ] o.a.s.c.c.ConnectionManager Watcher org.apache.solr.common.cloud.ConnectionManager@5c779e88 name:ZooKeeperConnection Watcher:127.0.0.1:53631/solr got event WatchedEvent state:SyncConnected type:None path:null path:null type:None
   [junit4]   2> 1822767 INFO  (TEST-DeleteReplicaTest.deleteReplicaAndVerifyDirectoryCleanup-seed#[42DCC7B1106DFB94]) [n:127.0.0.1:48732_    ] o.a.s.c.c.ConnectionManager Client is connected to ZooKeeper
   [junit4]   2> 1822776 INFO  (TEST-DeleteReplicaTest.deleteReplicaAndVerifyDirectoryCleanup-seed#[42DCC7B1106DFB94]) [n:127.0.0.1:48732_    ] o.a.s.c.c.ZkStateReader Updating cluster state from ZooKeeper... 
   [junit4]   2> 1822778 INFO  (TEST-DeleteReplicaTest.deleteReplicaAndVerifyDirectoryCleanup-seed#[42DCC7B1106DFB94]) [n:127.0.0.1:48732_    ] o.a.s.c.c.ZkStateReader Updated live nodes from ZooKeeper... (0) -> (1)
   [junit4]   2> 1822780 INFO  (TEST-DeleteReplicaTest.deleteReplicaAndVerifyDirectoryCleanup-seed#[42DCC7B1106DFB94]) [n:127.0.0.1:48732_    ] o.a.s.c.Overseer Overseer (id=null) closing
   [junit4]   2> 1822781 INFO  (TEST-DeleteReplicaTest.deleteReplicaAndVerifyDirectoryCleanup-seed#[42DCC7B1106DFB94]) [n:127.0.0.1:48732_    ] o.a.s.c.LeaderElector Joined leadership election with path: /overseer_elect/election/95859788691537928-127.0.0.1:48732_-n_0000000001
   [junit4]   2> 1822782 INFO  (TEST-DeleteReplicaTest.deleteReplicaAndVerifyDirectoryCleanup-seed#[42DCC7B1106DFB94]) [n:127.0.0.1:48732_    ] o.a.s.c.LeaderElector Watching path /overseer_elect/election/95859788691537924-127.0.0.1:61079_-n_0000000000 to know if I could be the leader
   [junit4]   2> 1822783 INFO  (TEST-DeleteReplicaTest.deleteReplicaAndVerifyDirectoryCleanup-seed#[42DCC7B1106DFB94]) [n:127.0.0.1:48732_    ] o.a.s.c.ZkController Publish node=127.0.0.1:48732_ as DOWN
   [junit4]   2> 1822785 INFO  (OverseerStateUpdate-95859788691537924-127.0.0.1:61079_-n_0000000000) [n:127.0.0.1:61079_    ] o.a.s.c.Overseer processMessage: queueSize: 1, message = {
   [junit4]   2>   "operation":"downnode",
   [junit4]   2>   "node_name":"127.0.0.1:48732_"} current state version: 3
   [junit4]   2> 1822786 INFO  (OverseerStateUpdate-95859788691537924-127.0.0.1:61079_-n_0000000000) [n:127.0.0.1:61079_    ] o.a.s.c.o.NodeMutator DownNode state invoked for node: 127.0.0.1:48732_
   [junit4]   2> 1822894 INFO  (zkCallback-2101-thread-1-processing-n:127.0.0.1:61079_) [n:127.0.0.1:61079_    ] o.a.s.c.c.ZkStateReader A cluster state change: [WatchedEvent state:SyncConnected type:NodeDataChanged path:/clusterstate.json], has occurred - updating... (live nodes size: [1])
   [junit4]   2> 1822894 INFO  (zkCallback-2103-thread-1) [    ] o.a.s.c.c.ZkStateReader A cluster state change: [WatchedEvent state:SyncConnected type:NodeDataChanged path:/clusterstate.json], has occurred - updating... (live nodes size: [1])
   [junit4]   2> 1822894 INFO  (zkCallback-2108-thread-1-processing-n:127.0.0.1:48732_) [n:127.0.0.1:48732_    ] o.a.s.c.c.ZkStateReader A cluster state change: [WatchedEvent state:SyncConnected type:NodeDataChanged path:/clusterstate.json], has occurred - updating... (live nodes size: [1])
   [junit4]   2> 1823788 INFO  (TEST-DeleteReplicaTest.deleteReplicaAndVerifyDirectoryCleanup-seed#[42DCC7B1106DFB94]) [n:127.0.0.1:48732_    ] o.a.s.c.ZkController Register node as live in ZooKeeper:/live_nodes/127.0.0.1:48732_
   [junit4]   2> 1823790 INFO  (TEST-DeleteReplicaTest.deleteReplicaAndVerifyDirectoryCleanup-seed#[42DCC7B1106DFB94]) [n:127.0.0.1:48732_    ] o.a.s.c.c.SolrZkClient makePath: /live_nodes/127.0.0.1:48732_
   [junit4]   2> 1823791 INFO  (zkCallback-2103-thread-1) [    ] o.a.s.c.c.ZkStateReader A live node change: [WatchedEvent state:SyncConnected type:NodeChildrenChanged path:/live_nodes], has occurred - updating... (live nodes size: [1])
   [junit4]   2> 1823791 INFO  (zkCallback-2101-thread-1-processing-n:127.0.0.1:61079_) [n:127.0.0.1:61079_    ] o.a.s.c.c.ZkStateReader A live node change: [WatchedEvent state:SyncConnected type:NodeChildrenChanged path:/live_nodes], has occurred - updating... (live nodes size: [1])
   [junit4]   2> 1823792 INFO  (zkCallback-2103-thread-1) [    ] o.a.s.c.c.ZkStateReader Updated live nodes from ZooKeeper... (1) -> (2)
   [junit4]   2> 1823792 INFO  (zkCallback-2101-thread-1-processing-n:127.0.0.1:61079_) [n:127.0.0.1:61079_    ] o.a.s.c.c.ZkStateReader Updated live nodes from ZooKeeper... (1) -> (2)
   [junit4]   2> 1823792 INFO  (zkCallback-2108-thread-1-processing-n:127.0.0.1:48732_) [n:127.0.0.1:48732_    ] o.a.s.c.c.ZkStateReader A live node change: [WatchedEvent state:SyncConnected type:NodeChildrenChanged path:/live_nodes], has occurred - updating... (live nodes size: [1])
   [junit4]   2> 1823793 INFO  (zkCallback-2108-thread-1-processing-n:127.0.0.1:48732_) [n:127.0.0.1:48732_    ] o.a.s.c.c.ZkStateReader Updated live nodes from ZooKeeper... (1) -> (2)
   [junit4]   2> 1823811 INFO  (TEST-DeleteReplicaTest.deleteReplicaAndVerifyDirectoryCleanup-seed#[42DCC7B1106DFB94]) [n:127.0.0.1:48732_    ] o.a.s.c.CoreContainer Security conf doesn't exist. Skipping setup for authorization module.
   [junit4]   2> 1823811 INFO  (TEST-DeleteReplicaTest.deleteReplicaAndVerifyDirectoryCleanup-seed#[42DCC7B1106DFB94]) [n:127.0.0.1:48732_    ] o.a.s.c.CoreContainer No authentication plugin used.
   [junit4]   2> 1823814 INFO  (TEST-DeleteReplicaTest.deleteReplicaAndVerifyDirectoryCleanup-seed#[42DCC7B1106DFB94]) [n:127.0.0.1:48732_    ] o.a.s.c.CorePropertiesLocator Looking for core definitions underneath /export/home/jenkins/workspace/Lucene-Solr-master-Solaris/solr/build/solr-core/test/J1/temp/solr.cloud.DeleteReplicaTest_42DCC7B1106DFB94-001/shard-1-001/cores
   [junit4]   2> 1823814 INFO  (TEST-DeleteReplicaTest.deleteReplicaAndVerifyDirectoryCleanup-seed#[42DCC7B1106DFB94]) [n:127.0.0.1:48732_    ] o.a.s.c.CoreDescriptor Created CoreDescriptor: {name=collection1, config=solrconfig.xml, transient=false, schema=schema.xml, loadOnStartup=true, configSetProperties=configsetprops.json, collection=collection1, coreNodeName=, dataDir=data/, shard=}
   [junit4]   2> 1823814 INFO  (TEST-DeleteReplicaTest.deleteReplicaAndVerifyDirectoryCleanup-seed#[42DCC7B1106DFB94]) [n:127.0.0.1:48732_    ] o.a.s.c.CorePropertiesLocator Found core collection1 in /export/home/jenkins/workspace/Lucene-Solr-master-Solaris/solr/build/solr-core/test/J1/temp/solr.cloud.DeleteReplicaTest_42DCC7B1106DFB94-001/shard-1-001/cores/collection1
   [junit4]   2> 1823815 INFO  (TEST-DeleteReplicaTest.deleteReplicaAndVerifyDirectoryCleanup-seed#[42DCC7B1106DFB94]) [n:127.0.0.1:48732_    ] o.a.s.c.CorePropertiesLocator Found 1 core definitions
   [junit4]   2> 1823816 INFO  (TEST-DeleteReplicaTest.deleteReplicaAndVerifyDirectoryCleanup-seed#[42DCC7B1106DFB94]) [n:127.0.0.1:48732_    ] o.a.s.s.SolrDispatchFilter user.dir=/export/home/jenkins/workspace/Lucene-Solr-master-Solaris/solr/build/solr-core/test/J1
   [junit4]   2> 1823816 INFO  (TEST-DeleteReplicaTest.deleteReplicaAndVerifyDirectoryCleanup-seed#[42DCC7B1106DFB94]) [n:127.0.0.1:48732_    ] o.a.s.s.SolrDispatchFilter SolrDispatchFilter.init() done
   [junit4]   2> 1823816 INFO  (coreLoadExecutor-6453-thread-1-processing-n:127.0.0.1:48732_) [n:127.0.0.1:48732_ c:collection1   x:collection1] o.a.s.c.ZkController publishing state=down
   [junit4]   2> 1823816 INFO  (coreLoadExecutor-6453-thread-1-processing-n:127.0.0.1:48732_) [n:127.0.0.1:48732_ c:collection1   x:collection1] o.a.s.c.ZkController numShards not found on descriptor - reading it from system property
   [junit4]   2> 1823818 INFO  (coreLoadExecutor-6453-thread-1-processing-n:127.0.0.1:48732_) [n:127.0.0.1:48732_ c:collection1   x:collection1] o.a.s.c.ZkController Collection collection1 not visible yet, but flagging it so a watch is registered when it becomes visible
   [junit4]   2> 1823818 INFO  (coreLoadExecutor-6453-thread-1-processing-n:127.0.0.1:48732_) [n:127.0.0.1:48732_ c:collection1   x:collection1] o.a.s.c.c.ZkStateReader addZkWatch [collection1]
   [junit4]   2> 1823818 INFO  (OverseerStateUpdate-95859788691537924-127.0.0.1:61079_-n_0000000000) [n:127.0.0.1:61079_    ] o.a.s.c.Overseer processMessage: queueSize: 1, message = {
   [junit4]   2>   "core":"collection1",
   [junit4]   2>   "roles":null,
   [junit4]   2>   "base_url":"http://127.0.0.1:48732",
   [junit4]   2>   "node_name":"127.0.0.1:48732_",
   [junit4]   2>   "numShards":"2",
   [junit4]   2>   "state":"down",
   [junit4]   2>   "shard":null,
   [junit4]   2>   "collection":"collection1",
   [junit4]   2>   "operation":"state"} current state version: 4
   [

[...truncated too long message...]

 Registered new searcher Searcher@348f435a[collection1] main{ExitableDirectoryReader(UninvertingDirectoryReader())}
   [junit4]   2> 2129995 INFO  (TEST-SpellCheckComponentTest.testRebuildOnCommit-seed#[42DCC7B1106DFB94]) [    ] o.a.s.u.p.LogUpdateProcessorFactory [collection1]  webapp=null path=null params={}{commit=} 0 449
   [junit4]   2> 2129996 INFO  (SUITE-SpellCheckComponentTest-seed#[42DCC7B1106DFB94]-worker) [    ] o.a.s.SolrTestCaseJ4 ###deleteCore
   [junit4]   2> 2129996 INFO  (SUITE-SpellCheckComponentTest-seed#[42DCC7B1106DFB94]-worker) [    ] o.a.s.c.CoreContainer Shutting down CoreContainer instance=161332328
   [junit4]   2> 2129996 INFO  (coreCloseExecutor-8559-thread-1) [    x:collection1] o.a.s.c.SolrCore [collection1]  CLOSING SolrCore org.apache.solr.core.SolrCore@693948ae
   [junit4]   2> 2129997 INFO  (coreCloseExecutor-8559-thread-1) [    x:collection1] o.a.s.u.DirectUpdateHandler2 closing DirectUpdateHandler2{commits=24,autocommits=0,soft autocommits=0,optimizes=0,rollbacks=0,expungeDeletes=0,docsPending=0,adds=0,deletesById=0,deletesByQuery=0,errors=0,cumulative_adds=112,cumulative_deletesById=0,cumulative_deletesByQuery=11,cumulative_errors=0}
   [junit4]   2> 2129997 INFO  (coreCloseExecutor-8559-thread-1) [    x:collection1] o.a.s.u.SolrCoreState Closing SolrCoreState
   [junit4]   2> 2129997 INFO  (coreCloseExecutor-8559-thread-1) [    x:collection1] o.a.s.u.DefaultSolrCoreState SolrCoreState ref count has reached 0 - closing IndexWriter
   [junit4]   2> 2129997 INFO  (coreCloseExecutor-8559-thread-1) [    x:collection1] o.a.s.u.DefaultSolrCoreState closing IndexWriter with IndexWriterCloser
   [junit4]   2> 2129998 INFO  (coreCloseExecutor-8559-thread-1) [    x:collection1] o.a.s.c.SolrCore [collection1] Closing main searcher on request.
   [junit4]   2> 2129998 INFO  (coreCloseExecutor-8559-thread-1) [    x:collection1] o.a.s.c.CachingDirectoryFactory Closing MockDirectoryFactory - 2 directories currently being tracked
   [junit4]   2> 2129998 INFO  (coreCloseExecutor-8559-thread-1) [    x:collection1] o.a.s.c.CachingDirectoryFactory looking to close /export/home/jenkins/workspace/Lucene-Solr-master-Solaris/solr/build/solr-core/test/J0/temp/solr.handler.component.SpellCheckComponentTest_42DCC7B1106DFB94-001/init-core-data-001/index [CachedDir<<refCount=0;path=/export/home/jenkins/workspace/Lucene-Solr-master-Solaris/solr/build/solr-core/test/J0/temp/solr.handler.component.SpellCheckComponentTest_42DCC7B1106DFB94-001/init-core-data-001/index;done=false>>]
   [junit4]   2> 2129998 INFO  (coreCloseExecutor-8559-thread-1) [    x:collection1] o.a.s.c.CachingDirectoryFactory Closing directory, CoreContainer#isShutdown=true
   [junit4]   2> 2129998 INFO  (coreCloseExecutor-8559-thread-1) [    x:collection1] o.a.s.c.CachingDirectoryFactory Closing directory: /export/home/jenkins/workspace/Lucene-Solr-master-Solaris/solr/build/solr-core/test/J0/temp/solr.handler.component.SpellCheckComponentTest_42DCC7B1106DFB94-001/init-core-data-001/index
   [junit4]   2> 2129999 INFO  (coreCloseExecutor-8559-thread-1) [    x:collection1] o.a.s.c.CachingDirectoryFactory looking to close /export/home/jenkins/workspace/Lucene-Solr-master-Solaris/solr/build/solr-core/test/J0/temp/solr.handler.component.SpellCheckComponentTest_42DCC7B1106DFB94-001/init-core-data-001 [CachedDir<<refCount=0;path=/export/home/jenkins/workspace/Lucene-Solr-master-Solaris/solr/build/solr-core/test/J0/temp/solr.handler.component.SpellCheckComponentTest_42DCC7B1106DFB94-001/init-core-data-001;done=false>>]
   [junit4]   2> 2129999 INFO  (coreCloseExecutor-8559-thread-1) [    x:collection1] o.a.s.c.CachingDirectoryFactory Closing directory, CoreContainer#isShutdown=true
   [junit4]   2> 2129999 INFO  (coreCloseExecutor-8559-thread-1) [    x:collection1] o.a.s.c.CachingDirectoryFactory Closing directory: /export/home/jenkins/workspace/Lucene-Solr-master-Solaris/solr/build/solr-core/test/J0/temp/solr.handler.component.SpellCheckComponentTest_42DCC7B1106DFB94-001/init-core-data-001
   [junit4]   2> NOTE: leaving temporary files on disk at: /export/home/jenkins/workspace/Lucene-Solr-master-Solaris/solr/build/solr-core/test/J0/temp/solr.handler.component.SpellCheckComponentTest_42DCC7B1106DFB94-001
   [junit4]   2> NOTE: test params are: codec=Lucene60, sim=RandomSimilarity(queryNorm=true,coord=crazy): {}, locale=el-GR, timezone=America/Boa_Vista
   [junit4]   2> NOTE: SunOS 5.11 amd64/Oracle Corporation 1.8.0_92 (64-bit)/cpus=3,threads=1,free=126165136,total=536870912
   [junit4]   2> NOTE: All tests run in this JVM: [ScriptEngineTest, TestAnalyzedSuggestions, SuggesterFSTTest, TestRawTransformer, TestGraphMLResponseWriter, TestFilteredDocIdSet, TestXIncludeConfig, TestJsonRequest, TestShardHandlerFactory, PrimitiveFieldTypeTest, DocumentAnalysisRequestHandlerTest, RecoveryZkTest, TestConfig, CursorMarkTest, CollectionStateFormat2Test, TestCSVLoader, TestSolrDeletionPolicy1, TestFieldCollectionResource, TestElisionMultitermQuery, TestLMDirichletSimilarityFactory, PKIAuthenticationIntegrationTest, TestFunctionQuery, SuggestComponentTest, ChaosMonkeyNothingIsSafeTest, TestLeaderElectionZkExpiry, TestNoOpRegenerator, BlockJoinFacetSimpleTest, OverseerTest, TestComponentsName, SmileWriterTest, TestTolerantUpdateProcessorRandomCloud, TestConfigReload, TestPerFieldSimilarityWithDefaultOverride, TestMergePolicyConfig, HardAutoCommitTest, SparseHLLTest, PreAnalyzedFieldTest, StandardRequestHandlerTest, TestCustomSort, ZkCLITest, CustomCollectionTest, TestSchemaSimilarityResource, JSONWriterTest, RequiredFieldsTest, AtomicUpdatesTest, TestIBSimilarityFactory, BufferStoreTest, HdfsChaosMonkeyNothingIsSafeTest, ExplicitHLLTest, ZkStateReaderTest, SpatialHeatmapFacetsTest, PingRequestHandlerTest, TestCursorMarkWithoutUniqueKey, TestSmileRequest, TestSolrFieldCacheMBean, TestLRUStatsCache, DocValuesTest, DirectUpdateHandlerTest, TestEmbeddedSolrServerConstructors, HLLSerializationTest, BlockCacheTest, SchemaVersionSpecificBehaviorTest, TestArbitraryIndexDir, TestBulkSchemaConcurrent, TolerantUpdateProcessorTest, TestExtendedDismaxParser, TestManagedResourceStorage, URLClassifyProcessorTest, SliceStateTest, SolrIndexConfigTest, TestLazyCores, TestCopyFieldCollectionResource, MigrateRouteKeyTest, TestFieldTypeCollectionResource, SegmentsInfoRequestHandlerTest, CursorPagingTest, ActionThrottleTest, SolrRequestParserTest, FastVectorHighlighterTest, DistributedVersionInfoTest, DirectSolrSpellCheckerTest, TestRandomDVFaceting, TestExpandComponent, TestQueryWrapperFilter, TestMinMaxOnMultiValuedField, DistributedSuggestComponentTest, DocumentBuilderTest, TestTestInjection, TestLuceneMatchVersion, TestSha256AuthenticationProvider, TestHighlightDedupGrouping, UpdateParamsTest, CheckHdfsIndexTest, TestCoreContainer, TestSearcherReuse, TestCodecSupport, TestOnReconnectListenerSupport, TestUseDocValuesAsStored, SimpleCollectionCreateDeleteTest, TestJmxMonitoredMap, TestCollectionAPI, TestStressLiveNodes, HighlighterMaxOffsetTest, TestGroupingSearch, SolrTestCaseJ4Test, PathHierarchyTokenizerFactoryTest, TestDocSet, ClusterStateTest, DistributedExpandComponentTest, HttpPartitionTest, IgnoreCommitOptimizeUpdateProcessorFactoryTest, TestSizeLimitedDistributedMap, DistribCursorPagingTest, TestRequestForwarding, IndexBasedSpellCheckerTest, SimplePostToolTest, CoreAdminRequestStatusTest, BigEndianAscendingWordSerializerTest, TestScoreJoinQPNoScore, ConjunctionSolrSpellCheckerTest, ReplicationFactorTest, ConnectionManagerTest, TestConfigOverlay, HdfsThreadLeakTest, SyncSliceTest, DistributedQueryComponentCustomSortTest, TestReqParamsAPI, AnalyticsMergeStrategyTest, ShardRoutingTest, SystemInfoHandlerTest, AnalysisErrorHandlingTest, CurrencyFieldXmlFileTest, TestAddFieldRealTimeGet, TestDFISimilarityFactory, TestPostingsSolrHighlighter, DistribJoinFromCollectionTest, TestStressVersions, TestDynamicFieldCollectionResource, BadComponentTest, TermsComponentTest, AnalysisAfterCoreReloadTest, TestSSLRandomization, TestBlendedInfixSuggestions, OverseerCollectionConfigSetProcessorTest, TestRebalanceLeaders, TestSortByMinMaxFunction, BadCopyFieldTest, BasicDistributedZkTest, ChaosMonkeySafeLeaderTest, UnloadDistributedZkTest, OpenCloseCoreStressTest, LeaderElectionIntegrationTest, BasicZkTest, TestReplicationHandler, ClusterStateUpdateTest, TestRandomFaceting, LeaderElectionTest, AutoCommitTest, TestFaceting, TestRecovery, DistributedSpellCheckComponentTest, ZkControllerTest, TestRealTimeGet, TestReload, TestRangeQuery, SimpleFacetsTest, SolrCoreTest, SpellCheckComponentTest]
   [junit4] Completed [327/594 (2!)] on J0 in 11.89s, 11 tests, 1 error <<< FAILURES!

[...truncated 859 lines...]
BUILD FAILED
/export/home/jenkins/workspace/Lucene-Solr-master-Solaris/build.xml:740: The following error occurred while executing this line:
/export/home/jenkins/workspace/Lucene-Solr-master-Solaris/build.xml:684: The following error occurred while executing this line:
/export/home/jenkins/workspace/Lucene-Solr-master-Solaris/build.xml:59: The following error occurred while executing this line:
/export/home/jenkins/workspace/Lucene-Solr-master-Solaris/solr/build.xml:233: The following error occurred while executing this line:
/export/home/jenkins/workspace/Lucene-Solr-master-Solaris/solr/common-build.xml:529: The following error occurred while executing this line:
/export/home/jenkins/workspace/Lucene-Solr-master-Solaris/lucene/common-build.xml:1457: The following error occurred while executing this line:
/export/home/jenkins/workspace/Lucene-Solr-master-Solaris/lucene/common-build.xml:1014: There were test failures: 594 suites (10 ignored), 2397 tests, 1 error, 1 failure, 87 ignored (72 assumptions) [seed: 42DCC7B1106DFB94]

Total time: 83 minutes 33 seconds
Build step 'Invoke Ant' marked build as failure
Archiving artifacts
[WARNINGS] Skipping publisher since build result is FAILURE
Recording test results
Email was triggered for: Failure - Any
Sending email for trigger: Failure - Any



Mime
View raw message