lucene-dev mailing list archives

Site index · List index
Message view « Date » · « Thread »
Top « Date » · « Thread »
From Apache Jenkins Server <jenk...@builds.apache.org>
Subject [JENKINS] Lucene-Solr-Tests-6.x - Build # 139 - Failure
Date Thu, 14 Apr 2016 03:19:58 GMT
Build: https://builds.apache.org/job/Lucene-Solr-Tests-6.x/139/

2 tests failed.
FAILED:  org.apache.solr.client.solrj.ConnectionReuseTest.test

Error Message:
We expected all communication via streaming client to use one connection! expected=77 got=74

Stack Trace:
java.lang.AssertionError: We expected all communication via streaming client to use one connection! expected=77 got=74
	at __randomizedtesting.SeedInfo.seed([FA13C6377C897E63:7247F9EDD275139B]:0)
	at org.junit.Assert.fail(Assert.java:93)
	at org.junit.Assert.assertTrue(Assert.java:43)
	at org.apache.solr.client.solrj.ConnectionReuseTest.test(ConnectionReuseTest.java:150)
	at sun.reflect.NativeMethodAccessorImpl.invoke0(Native Method)
	at sun.reflect.NativeMethodAccessorImpl.invoke(NativeMethodAccessorImpl.java:62)
	at sun.reflect.DelegatingMethodAccessorImpl.invoke(DelegatingMethodAccessorImpl.java:43)
	at java.lang.reflect.Method.invoke(Method.java:498)
	at com.carrotsearch.randomizedtesting.RandomizedRunner.invoke(RandomizedRunner.java:1764)
	at com.carrotsearch.randomizedtesting.RandomizedRunner$8.evaluate(RandomizedRunner.java:871)
	at com.carrotsearch.randomizedtesting.RandomizedRunner$9.evaluate(RandomizedRunner.java:907)
	at com.carrotsearch.randomizedtesting.RandomizedRunner$10.evaluate(RandomizedRunner.java:921)
	at org.apache.solr.BaseDistributedSearchTestCase$ShardsRepeatRule$ShardsFixedStatement.callStatement(BaseDistributedSearchTestCase.java:992)
	at org.apache.solr.BaseDistributedSearchTestCase$ShardsRepeatRule$ShardsStatement.evaluate(BaseDistributedSearchTestCase.java:967)
	at com.carrotsearch.randomizedtesting.rules.SystemPropertiesRestoreRule$1.evaluate(SystemPropertiesRestoreRule.java:57)
	at org.apache.lucene.util.TestRuleSetupTeardownChained$1.evaluate(TestRuleSetupTeardownChained.java:49)
	at org.apache.lucene.util.AbstractBeforeAfterRule$1.evaluate(AbstractBeforeAfterRule.java:45)
	at org.apache.lucene.util.TestRuleThreadAndTestName$1.evaluate(TestRuleThreadAndTestName.java:48)
	at org.apache.lucene.util.TestRuleIgnoreAfterMaxFailures$1.evaluate(TestRuleIgnoreAfterMaxFailures.java:64)
	at org.apache.lucene.util.TestRuleMarkFailure$1.evaluate(TestRuleMarkFailure.java:47)
	at com.carrotsearch.randomizedtesting.rules.StatementAdapter.evaluate(StatementAdapter.java:36)
	at com.carrotsearch.randomizedtesting.ThreadLeakControl$StatementRunner.run(ThreadLeakControl.java:367)
	at com.carrotsearch.randomizedtesting.ThreadLeakControl.forkTimeoutingTask(ThreadLeakControl.java:809)
	at com.carrotsearch.randomizedtesting.ThreadLeakControl$3.evaluate(ThreadLeakControl.java:460)
	at com.carrotsearch.randomizedtesting.RandomizedRunner.runSingleTest(RandomizedRunner.java:880)
	at com.carrotsearch.randomizedtesting.RandomizedRunner$5.evaluate(RandomizedRunner.java:781)
	at com.carrotsearch.randomizedtesting.RandomizedRunner$6.evaluate(RandomizedRunner.java:816)
	at com.carrotsearch.randomizedtesting.RandomizedRunner$7.evaluate(RandomizedRunner.java:827)
	at com.carrotsearch.randomizedtesting.rules.StatementAdapter.evaluate(StatementAdapter.java:36)
	at com.carrotsearch.randomizedtesting.rules.SystemPropertiesRestoreRule$1.evaluate(SystemPropertiesRestoreRule.java:57)
	at org.apache.lucene.util.AbstractBeforeAfterRule$1.evaluate(AbstractBeforeAfterRule.java:45)
	at com.carrotsearch.randomizedtesting.rules.StatementAdapter.evaluate(StatementAdapter.java:36)
	at org.apache.lucene.util.TestRuleStoreClassName$1.evaluate(TestRuleStoreClassName.java:41)
	at com.carrotsearch.randomizedtesting.rules.NoShadowingOrOverridesOnMethodsRule$1.evaluate(NoShadowingOrOverridesOnMethodsRule.java:40)
	at com.carrotsearch.randomizedtesting.rules.NoShadowingOrOverridesOnMethodsRule$1.evaluate(NoShadowingOrOverridesOnMethodsRule.java:40)
	at com.carrotsearch.randomizedtesting.rules.StatementAdapter.evaluate(StatementAdapter.java:36)
	at com.carrotsearch.randomizedtesting.rules.StatementAdapter.evaluate(StatementAdapter.java:36)
	at com.carrotsearch.randomizedtesting.rules.StatementAdapter.evaluate(StatementAdapter.java:36)
	at org.apache.lucene.util.TestRuleAssertionsRequired$1.evaluate(TestRuleAssertionsRequired.java:53)
	at org.apache.lucene.util.TestRuleMarkFailure$1.evaluate(TestRuleMarkFailure.java:47)
	at org.apache.lucene.util.TestRuleIgnoreAfterMaxFailures$1.evaluate(TestRuleIgnoreAfterMaxFailures.java:64)
	at org.apache.lucene.util.TestRuleIgnoreTestSuites$1.evaluate(TestRuleIgnoreTestSuites.java:54)
	at com.carrotsearch.randomizedtesting.rules.StatementAdapter.evaluate(StatementAdapter.java:36)
	at com.carrotsearch.randomizedtesting.ThreadLeakControl$StatementRunner.run(ThreadLeakControl.java:367)
	at java.lang.Thread.run(Thread.java:745)


FAILED:  org.apache.solr.cloud.overseer.ZkStateReaderTest.testStateFormatUpdateWithExplicitRefreshLazy

Error Message:
Could not find collection : c1

Stack Trace:
org.apache.solr.common.SolrException: Could not find collection : c1
	at __randomizedtesting.SeedInfo.seed([FA13C6377C897E63:915C664A0586A359]:0)
	at org.apache.solr.common.cloud.ClusterState.getCollection(ClusterState.java:170)
	at org.apache.solr.cloud.overseer.ZkStateReaderTest.testStateFormatUpdate(ZkStateReaderTest.java:135)
	at org.apache.solr.cloud.overseer.ZkStateReaderTest.testStateFormatUpdateWithExplicitRefreshLazy(ZkStateReaderTest.java:46)
	at sun.reflect.NativeMethodAccessorImpl.invoke0(Native Method)
	at sun.reflect.NativeMethodAccessorImpl.invoke(NativeMethodAccessorImpl.java:62)
	at sun.reflect.DelegatingMethodAccessorImpl.invoke(DelegatingMethodAccessorImpl.java:43)
	at java.lang.reflect.Method.invoke(Method.java:498)
	at com.carrotsearch.randomizedtesting.RandomizedRunner.invoke(RandomizedRunner.java:1764)
	at com.carrotsearch.randomizedtesting.RandomizedRunner$8.evaluate(RandomizedRunner.java:871)
	at com.carrotsearch.randomizedtesting.RandomizedRunner$9.evaluate(RandomizedRunner.java:907)
	at com.carrotsearch.randomizedtesting.RandomizedRunner$10.evaluate(RandomizedRunner.java:921)
	at com.carrotsearch.randomizedtesting.rules.SystemPropertiesRestoreRule$1.evaluate(SystemPropertiesRestoreRule.java:57)
	at org.apache.lucene.util.TestRuleSetupTeardownChained$1.evaluate(TestRuleSetupTeardownChained.java:49)
	at org.apache.lucene.util.AbstractBeforeAfterRule$1.evaluate(AbstractBeforeAfterRule.java:45)
	at org.apache.lucene.util.TestRuleThreadAndTestName$1.evaluate(TestRuleThreadAndTestName.java:48)
	at org.apache.lucene.util.TestRuleIgnoreAfterMaxFailures$1.evaluate(TestRuleIgnoreAfterMaxFailures.java:64)
	at org.apache.lucene.util.TestRuleMarkFailure$1.evaluate(TestRuleMarkFailure.java:47)
	at com.carrotsearch.randomizedtesting.rules.StatementAdapter.evaluate(StatementAdapter.java:36)
	at com.carrotsearch.randomizedtesting.ThreadLeakControl$StatementRunner.run(ThreadLeakControl.java:367)
	at com.carrotsearch.randomizedtesting.ThreadLeakControl.forkTimeoutingTask(ThreadLeakControl.java:809)
	at com.carrotsearch.randomizedtesting.ThreadLeakControl$3.evaluate(ThreadLeakControl.java:460)
	at com.carrotsearch.randomizedtesting.RandomizedRunner.runSingleTest(RandomizedRunner.java:880)
	at com.carrotsearch.randomizedtesting.RandomizedRunner$5.evaluate(RandomizedRunner.java:781)
	at com.carrotsearch.randomizedtesting.RandomizedRunner$6.evaluate(RandomizedRunner.java:816)
	at com.carrotsearch.randomizedtesting.RandomizedRunner$7.evaluate(RandomizedRunner.java:827)
	at com.carrotsearch.randomizedtesting.rules.StatementAdapter.evaluate(StatementAdapter.java:36)
	at com.carrotsearch.randomizedtesting.rules.SystemPropertiesRestoreRule$1.evaluate(SystemPropertiesRestoreRule.java:57)
	at org.apache.lucene.util.AbstractBeforeAfterRule$1.evaluate(AbstractBeforeAfterRule.java:45)
	at com.carrotsearch.randomizedtesting.rules.StatementAdapter.evaluate(StatementAdapter.java:36)
	at org.apache.lucene.util.TestRuleStoreClassName$1.evaluate(TestRuleStoreClassName.java:41)
	at com.carrotsearch.randomizedtesting.rules.NoShadowingOrOverridesOnMethodsRule$1.evaluate(NoShadowingOrOverridesOnMethodsRule.java:40)
	at com.carrotsearch.randomizedtesting.rules.NoShadowingOrOverridesOnMethodsRule$1.evaluate(NoShadowingOrOverridesOnMethodsRule.java:40)
	at com.carrotsearch.randomizedtesting.rules.StatementAdapter.evaluate(StatementAdapter.java:36)
	at com.carrotsearch.randomizedtesting.rules.StatementAdapter.evaluate(StatementAdapter.java:36)
	at com.carrotsearch.randomizedtesting.rules.StatementAdapter.evaluate(StatementAdapter.java:36)
	at org.apache.lucene.util.TestRuleAssertionsRequired$1.evaluate(TestRuleAssertionsRequired.java:53)
	at org.apache.lucene.util.TestRuleMarkFailure$1.evaluate(TestRuleMarkFailure.java:47)
	at org.apache.lucene.util.TestRuleIgnoreAfterMaxFailures$1.evaluate(TestRuleIgnoreAfterMaxFailures.java:64)
	at org.apache.lucene.util.TestRuleIgnoreTestSuites$1.evaluate(TestRuleIgnoreTestSuites.java:54)
	at com.carrotsearch.randomizedtesting.rules.StatementAdapter.evaluate(StatementAdapter.java:36)
	at com.carrotsearch.randomizedtesting.ThreadLeakControl$StatementRunner.run(ThreadLeakControl.java:367)
	at java.lang.Thread.run(Thread.java:745)




Build Log:
[...truncated 11969 lines...]
   [junit4] Suite: org.apache.solr.client.solrj.ConnectionReuseTest
   [junit4]   2> Creating dataDir: /x1/jenkins/jenkins-slave/workspace/Lucene-Solr-Tests-6.x/solr/build/solr-core/test/J0/temp/solr.client.solrj.ConnectionReuseTest_FA13C6377C897E63-001/init-core-data-001
   [junit4]   2> 2040616 INFO  (SUITE-ConnectionReuseTest-seed#[FA13C6377C897E63]-worker) [    ] o.a.s.BaseDistributedSearchTestCase Setting hostContext system property: /e_/dx
   [junit4]   2> 2040626 INFO  (TEST-ConnectionReuseTest.test-seed#[FA13C6377C897E63]) [    ] o.a.s.c.ZkTestServer STARTING ZK TEST SERVER
   [junit4]   2> 2040633 INFO  (Thread-3963) [    ] o.a.s.c.ZkTestServer client port:0.0.0.0/0.0.0.0:0
   [junit4]   2> 2040633 INFO  (Thread-3963) [    ] o.a.s.c.ZkTestServer Starting server
   [junit4]   2> 2040729 INFO  (TEST-ConnectionReuseTest.test-seed#[FA13C6377C897E63]) [    ] o.a.s.c.ZkTestServer start zk server on port:46264
   [junit4]   2> 2040730 INFO  (TEST-ConnectionReuseTest.test-seed#[FA13C6377C897E63]) [    ] o.a.s.c.c.SolrZkClient Using default ZkCredentialsProvider
   [junit4]   2> 2040730 INFO  (TEST-ConnectionReuseTest.test-seed#[FA13C6377C897E63]) [    ] o.a.s.c.c.ConnectionManager Waiting for client to connect to ZooKeeper
   [junit4]   2> 2040733 INFO  (zkCallback-17667-thread-1) [    ] o.a.s.c.c.ConnectionManager Watcher org.apache.solr.common.cloud.ConnectionManager@7ddf1e12 name:ZooKeeperConnection Watcher:127.0.0.1:46264 got event WatchedEvent state:SyncConnected type:None path:null path:null type:None
   [junit4]   2> 2040741 INFO  (TEST-ConnectionReuseTest.test-seed#[FA13C6377C897E63]) [    ] o.a.s.c.c.ConnectionManager Client is connected to ZooKeeper
   [junit4]   2> 2040741 INFO  (TEST-ConnectionReuseTest.test-seed#[FA13C6377C897E63]) [    ] o.a.s.c.c.SolrZkClient Using default ZkACLProvider
   [junit4]   2> 2040741 INFO  (TEST-ConnectionReuseTest.test-seed#[FA13C6377C897E63]) [    ] o.a.s.c.c.SolrZkClient makePath: /solr
   [junit4]   2> 2040744 INFO  (TEST-ConnectionReuseTest.test-seed#[FA13C6377C897E63]) [    ] o.a.s.c.c.SolrZkClient Using default ZkCredentialsProvider
   [junit4]   2> 2040745 INFO  (TEST-ConnectionReuseTest.test-seed#[FA13C6377C897E63]) [    ] o.a.s.c.c.ConnectionManager Waiting for client to connect to ZooKeeper
   [junit4]   2> 2040753 INFO  (zkCallback-17668-thread-1) [    ] o.a.s.c.c.ConnectionManager Watcher org.apache.solr.common.cloud.ConnectionManager@7ba8a13c name:ZooKeeperConnection Watcher:127.0.0.1:46264/solr got event WatchedEvent state:SyncConnected type:None path:null path:null type:None
   [junit4]   2> 2040753 INFO  (TEST-ConnectionReuseTest.test-seed#[FA13C6377C897E63]) [    ] o.a.s.c.c.ConnectionManager Client is connected to ZooKeeper
   [junit4]   2> 2040754 INFO  (TEST-ConnectionReuseTest.test-seed#[FA13C6377C897E63]) [    ] o.a.s.c.c.SolrZkClient Using default ZkACLProvider
   [junit4]   2> 2040754 INFO  (TEST-ConnectionReuseTest.test-seed#[FA13C6377C897E63]) [    ] o.a.s.c.c.SolrZkClient makePath: /collections/collection1
   [junit4]   2> 2040754 INFO  (TEST-ConnectionReuseTest.test-seed#[FA13C6377C897E63]) [    ] o.a.s.c.c.SolrZkClient makePath: /collections/collection1/shards
   [junit4]   2> 2040755 INFO  (TEST-ConnectionReuseTest.test-seed#[FA13C6377C897E63]) [    ] o.a.s.c.c.SolrZkClient makePath: /collections/control_collection
   [junit4]   2> 2040755 INFO  (TEST-ConnectionReuseTest.test-seed#[FA13C6377C897E63]) [    ] o.a.s.c.c.SolrZkClient makePath: /collections/control_collection/shards
   [junit4]   2> 2040756 INFO  (TEST-ConnectionReuseTest.test-seed#[FA13C6377C897E63]) [    ] o.a.s.c.AbstractZkTestCase put /x1/jenkins/jenkins-slave/workspace/Lucene-Solr-Tests-6.x/solr/core/src/test-files/solr/collection1/conf/solrconfig-tlog.xml to /configs/conf1/solrconfig.xml
   [junit4]   2> 2040756 INFO  (TEST-ConnectionReuseTest.test-seed#[FA13C6377C897E63]) [    ] o.a.s.c.c.SolrZkClient makePath: /configs/conf1/solrconfig.xml
   [junit4]   2> 2040757 INFO  (TEST-ConnectionReuseTest.test-seed#[FA13C6377C897E63]) [    ] o.a.s.c.AbstractZkTestCase put /x1/jenkins/jenkins-slave/workspace/Lucene-Solr-Tests-6.x/solr/core/src/test-files/solr/collection1/conf/schema.xml to /configs/conf1/schema.xml
   [junit4]   2> 2040757 INFO  (TEST-ConnectionReuseTest.test-seed#[FA13C6377C897E63]) [    ] o.a.s.c.c.SolrZkClient makePath: /configs/conf1/schema.xml
   [junit4]   2> 2040758 INFO  (TEST-ConnectionReuseTest.test-seed#[FA13C6377C897E63]) [    ] o.a.s.c.AbstractZkTestCase put /x1/jenkins/jenkins-slave/workspace/Lucene-Solr-Tests-6.x/solr/core/src/test-files/solr/collection1/conf/solrconfig.snippet.randomindexconfig.xml to /configs/conf1/solrconfig.snippet.randomindexconfig.xml
   [junit4]   2> 2040758 INFO  (TEST-ConnectionReuseTest.test-seed#[FA13C6377C897E63]) [    ] o.a.s.c.c.SolrZkClient makePath: /configs/conf1/solrconfig.snippet.randomindexconfig.xml
   [junit4]   2> 2040759 INFO  (TEST-ConnectionReuseTest.test-seed#[FA13C6377C897E63]) [    ] o.a.s.c.AbstractZkTestCase put /x1/jenkins/jenkins-slave/workspace/Lucene-Solr-Tests-6.x/solr/core/src/test-files/solr/collection1/conf/stopwords.txt to /configs/conf1/stopwords.txt
   [junit4]   2> 2040759 INFO  (TEST-ConnectionReuseTest.test-seed#[FA13C6377C897E63]) [    ] o.a.s.c.c.SolrZkClient makePath: /configs/conf1/stopwords.txt
   [junit4]   2> 2040759 INFO  (TEST-ConnectionReuseTest.test-seed#[FA13C6377C897E63]) [    ] o.a.s.c.AbstractZkTestCase put /x1/jenkins/jenkins-slave/workspace/Lucene-Solr-Tests-6.x/solr/core/src/test-files/solr/collection1/conf/protwords.txt to /configs/conf1/protwords.txt
   [junit4]   2> 2040759 INFO  (TEST-ConnectionReuseTest.test-seed#[FA13C6377C897E63]) [    ] o.a.s.c.c.SolrZkClient makePath: /configs/conf1/protwords.txt
   [junit4]   2> 2040760 INFO  (TEST-ConnectionReuseTest.test-seed#[FA13C6377C897E63]) [    ] o.a.s.c.AbstractZkTestCase put /x1/jenkins/jenkins-slave/workspace/Lucene-Solr-Tests-6.x/solr/core/src/test-files/solr/collection1/conf/currency.xml to /configs/conf1/currency.xml
   [junit4]   2> 2040760 INFO  (TEST-ConnectionReuseTest.test-seed#[FA13C6377C897E63]) [    ] o.a.s.c.c.SolrZkClient makePath: /configs/conf1/currency.xml
   [junit4]   2> 2040761 INFO  (TEST-ConnectionReuseTest.test-seed#[FA13C6377C897E63]) [    ] o.a.s.c.AbstractZkTestCase put /x1/jenkins/jenkins-slave/workspace/Lucene-Solr-Tests-6.x/solr/core/src/test-files/solr/collection1/conf/enumsConfig.xml to /configs/conf1/enumsConfig.xml
   [junit4]   2> 2040761 INFO  (TEST-ConnectionReuseTest.test-seed#[FA13C6377C897E63]) [    ] o.a.s.c.c.SolrZkClient makePath: /configs/conf1/enumsConfig.xml
   [junit4]   2> 2040762 INFO  (TEST-ConnectionReuseTest.test-seed#[FA13C6377C897E63]) [    ] o.a.s.c.AbstractZkTestCase put /x1/jenkins/jenkins-slave/workspace/Lucene-Solr-Tests-6.x/solr/core/src/test-files/solr/collection1/conf/open-exchange-rates.json to /configs/conf1/open-exchange-rates.json
   [junit4]   2> 2040762 INFO  (TEST-ConnectionReuseTest.test-seed#[FA13C6377C897E63]) [    ] o.a.s.c.c.SolrZkClient makePath: /configs/conf1/open-exchange-rates.json
   [junit4]   2> 2040762 INFO  (TEST-ConnectionReuseTest.test-seed#[FA13C6377C897E63]) [    ] o.a.s.c.AbstractZkTestCase put /x1/jenkins/jenkins-slave/workspace/Lucene-Solr-Tests-6.x/solr/core/src/test-files/solr/collection1/conf/mapping-ISOLatin1Accent.txt to /configs/conf1/mapping-ISOLatin1Accent.txt
   [junit4]   2> 2040763 INFO  (TEST-ConnectionReuseTest.test-seed#[FA13C6377C897E63]) [    ] o.a.s.c.c.SolrZkClient makePath: /configs/conf1/mapping-ISOLatin1Accent.txt
   [junit4]   2> 2040763 INFO  (TEST-ConnectionReuseTest.test-seed#[FA13C6377C897E63]) [    ] o.a.s.c.AbstractZkTestCase put /x1/jenkins/jenkins-slave/workspace/Lucene-Solr-Tests-6.x/solr/core/src/test-files/solr/collection1/conf/old_synonyms.txt to /configs/conf1/old_synonyms.txt
   [junit4]   2> 2040763 INFO  (TEST-ConnectionReuseTest.test-seed#[FA13C6377C897E63]) [    ] o.a.s.c.c.SolrZkClient makePath: /configs/conf1/old_synonyms.txt
   [junit4]   2> 2040764 INFO  (TEST-ConnectionReuseTest.test-seed#[FA13C6377C897E63]) [    ] o.a.s.c.AbstractZkTestCase put /x1/jenkins/jenkins-slave/workspace/Lucene-Solr-Tests-6.x/solr/core/src/test-files/solr/collection1/conf/synonyms.txt to /configs/conf1/synonyms.txt
   [junit4]   2> 2040764 INFO  (TEST-ConnectionReuseTest.test-seed#[FA13C6377C897E63]) [    ] o.a.s.c.c.SolrZkClient makePath: /configs/conf1/synonyms.txt
   [junit4]   2> 2041078 INFO  (TEST-ConnectionReuseTest.test-seed#[FA13C6377C897E63]) [    ] o.a.s.SolrTestCaseJ4 Writing core.properties file to /x1/jenkins/jenkins-slave/workspace/Lucene-Solr-Tests-6.x/solr/build/solr-core/test/J0/temp/solr.client.solrj.ConnectionReuseTest_FA13C6377C897E63-001/control-001/cores/collection1
   [junit4]   2> 2041079 INFO  (TEST-ConnectionReuseTest.test-seed#[FA13C6377C897E63]) [    ] o.e.j.s.Server jetty-9.3.8.v20160314
   [junit4]   2> 2041080 INFO  (TEST-ConnectionReuseTest.test-seed#[FA13C6377C897E63]) [    ] o.e.j.s.h.ContextHandler Started o.e.j.s.ServletContextHandler@3a114fb{/e_/dx,null,AVAILABLE}
   [junit4]   2> 2041082 INFO  (TEST-ConnectionReuseTest.test-seed#[FA13C6377C897E63]) [    ] o.e.j.s.ServerConnector Started ServerConnector@2cd3231c{HTTP/1.1,[http/1.1]}{127.0.0.1:55292}
   [junit4]   2> 2041082 INFO  (TEST-ConnectionReuseTest.test-seed#[FA13C6377C897E63]) [    ] o.e.j.s.Server Started @2045639ms
   [junit4]   2> 2041082 INFO  (TEST-ConnectionReuseTest.test-seed#[FA13C6377C897E63]) [    ] o.a.s.c.s.e.JettySolrRunner Jetty properties: {solr.data.dir=/x1/jenkins/jenkins-slave/workspace/Lucene-Solr-Tests-6.x/solr/build/solr-core/test/J0/temp/solr.client.solrj.ConnectionReuseTest_FA13C6377C897E63-001/tempDir-001/control/data, hostContext=/e_/dx, hostPort=55292, coreRootDirectory=/x1/jenkins/jenkins-slave/workspace/Lucene-Solr-Tests-6.x/solr/build/solr-core/test/J0/temp/solr.client.solrj.ConnectionReuseTest_FA13C6377C897E63-001/control-001/cores}
   [junit4]   2> 2041082 INFO  (TEST-ConnectionReuseTest.test-seed#[FA13C6377C897E63]) [    ] o.a.s.s.SolrDispatchFilter SolrDispatchFilter.init(): sun.misc.Launcher$AppClassLoader@73d16e93
   [junit4]   2> 2041082 INFO  (TEST-ConnectionReuseTest.test-seed#[FA13C6377C897E63]) [    ] o.a.s.c.SolrResourceLoader new SolrResourceLoader for directory: '/x1/jenkins/jenkins-slave/workspace/Lucene-Solr-Tests-6.x/solr/build/solr-core/test/J0/temp/solr.client.solrj.ConnectionReuseTest_FA13C6377C897E63-001/control-001'
   [junit4]   2> 2041082 INFO  (TEST-ConnectionReuseTest.test-seed#[FA13C6377C897E63]) [    ] o.a.s.c.SolrResourceLoader JNDI not configured for solr (NoInitialContextEx)
   [junit4]   2> 2041082 INFO  (TEST-ConnectionReuseTest.test-seed#[FA13C6377C897E63]) [    ] o.a.s.c.SolrResourceLoader solr home defaulted to 'solr/' (could not find system property or JNDI)
   [junit4]   2> 2041082 INFO  (TEST-ConnectionReuseTest.test-seed#[FA13C6377C897E63]) [    ] o.a.s.c.c.SolrZkClient Using default ZkCredentialsProvider
   [junit4]   2> 2041118 INFO  (TEST-ConnectionReuseTest.test-seed#[FA13C6377C897E63]) [    ] o.a.s.c.c.ConnectionManager Waiting for client to connect to ZooKeeper
   [junit4]   2> 2041121 INFO  (zkCallback-17669-thread-1) [    ] o.a.s.c.c.ConnectionManager Watcher org.apache.solr.common.cloud.ConnectionManager@4c5d921e name:ZooKeeperConnection Watcher:127.0.0.1:46264/solr got event WatchedEvent state:SyncConnected type:None path:null path:null type:None
   [junit4]   2> 2041121 INFO  (TEST-ConnectionReuseTest.test-seed#[FA13C6377C897E63]) [    ] o.a.s.c.c.ConnectionManager Client is connected to ZooKeeper
   [junit4]   2> 2041122 INFO  (TEST-ConnectionReuseTest.test-seed#[FA13C6377C897E63]) [    ] o.a.s.c.c.SolrZkClient Using default ZkACLProvider
   [junit4]   2> 2041139 INFO  (TEST-ConnectionReuseTest.test-seed#[FA13C6377C897E63]) [    ] o.a.s.s.SolrDispatchFilter Loading solr.xml from SolrHome (not found in ZooKeeper)
   [junit4]   2> 2041139 INFO  (TEST-ConnectionReuseTest.test-seed#[FA13C6377C897E63]) [    ] o.a.s.c.SolrXmlConfig Loading container configuration from /x1/jenkins/jenkins-slave/workspace/Lucene-Solr-Tests-6.x/solr/build/solr-core/test/J0/temp/solr.client.solrj.ConnectionReuseTest_FA13C6377C897E63-001/control-001/solr.xml
   [junit4]   2> 2041143 INFO  (TEST-ConnectionReuseTest.test-seed#[FA13C6377C897E63]) [    ] o.a.s.c.CorePropertiesLocator Config-defined core root directory: /x1/jenkins/jenkins-slave/workspace/Lucene-Solr-Tests-6.x/solr/build/solr-core/test/J0/temp/solr.client.solrj.ConnectionReuseTest_FA13C6377C897E63-001/control-001/cores
   [junit4]   2> 2041143 INFO  (TEST-ConnectionReuseTest.test-seed#[FA13C6377C897E63]) [    ] o.a.s.c.CoreContainer New CoreContainer 146209875
   [junit4]   2> 2041143 INFO  (TEST-ConnectionReuseTest.test-seed#[FA13C6377C897E63]) [    ] o.a.s.c.CoreContainer Loading cores into CoreContainer [instanceDir=/x1/jenkins/jenkins-slave/workspace/Lucene-Solr-Tests-6.x/solr/build/solr-core/test/J0/temp/solr.client.solrj.ConnectionReuseTest_FA13C6377C897E63-001/control-001]
   [junit4]   2> 2041143 WARN  (TEST-ConnectionReuseTest.test-seed#[FA13C6377C897E63]) [    ] o.a.s.c.CoreContainer Couldn't add files from /x1/jenkins/jenkins-slave/workspace/Lucene-Solr-Tests-6.x/solr/build/solr-core/test/J0/temp/solr.client.solrj.ConnectionReuseTest_FA13C6377C897E63-001/control-001/lib to classpath: /x1/jenkins/jenkins-slave/workspace/Lucene-Solr-Tests-6.x/solr/build/solr-core/test/J0/temp/solr.client.solrj.ConnectionReuseTest_FA13C6377C897E63-001/control-001/lib
   [junit4]   2> 2041143 INFO  (TEST-ConnectionReuseTest.test-seed#[FA13C6377C897E63]) [    ] o.a.s.h.c.HttpShardHandlerFactory created with socketTimeout : 90000,urlScheme : ,connTimeout : 15000,maxConnectionsPerHost : 20,maxConnections : 10000,corePoolSize : 0,maximumPoolSize : 2147483647,maxThreadIdleTime : 5,sizeOfQueue : -1,fairnessPolicy : false,useRetries : false,
   [junit4]   2> 2041144 INFO  (TEST-ConnectionReuseTest.test-seed#[FA13C6377C897E63]) [    ] o.a.s.u.UpdateShardHandler Creating UpdateShardHandler HTTP client with params: socketTimeout=340000&connTimeout=45000&retry=true
   [junit4]   2> 2041144 INFO  (TEST-ConnectionReuseTest.test-seed#[FA13C6377C897E63]) [    ] o.a.s.l.LogWatcher SLF4J impl is org.slf4j.impl.Log4jLoggerFactory
   [junit4]   2> 2041144 INFO  (TEST-ConnectionReuseTest.test-seed#[FA13C6377C897E63]) [    ] o.a.s.l.LogWatcher Registering Log Listener [Log4j (org.slf4j.impl.Log4jLoggerFactory)]
   [junit4]   2> 2041144 INFO  (TEST-ConnectionReuseTest.test-seed#[FA13C6377C897E63]) [    ] o.a.s.c.ZkContainer Zookeeper client=127.0.0.1:46264/solr
   [junit4]   2> 2041144 INFO  (TEST-ConnectionReuseTest.test-seed#[FA13C6377C897E63]) [    ] o.a.s.c.ZkController zkHost includes chroot
   [junit4]   2> 2041144 INFO  (TEST-ConnectionReuseTest.test-seed#[FA13C6377C897E63]) [    ] o.a.s.c.c.SolrZkClient Using default ZkCredentialsProvider
   [junit4]   2> 2041149 INFO  (TEST-ConnectionReuseTest.test-seed#[FA13C6377C897E63]) [    ] o.a.s.c.c.ConnectionManager Waiting for client to connect to ZooKeeper
   [junit4]   2> 2041160 INFO  (zkCallback-17672-thread-1) [    ] o.a.s.c.c.ConnectionManager Watcher org.apache.solr.common.cloud.ConnectionManager@44dd3085 name:ZooKeeperConnection Watcher:127.0.0.1:46264 got event WatchedEvent state:SyncConnected type:None path:null path:null type:None
   [junit4]   2> 2041161 INFO  (TEST-ConnectionReuseTest.test-seed#[FA13C6377C897E63]) [    ] o.a.s.c.c.ConnectionManager Client is connected to ZooKeeper
   [junit4]   2> 2041161 INFO  (TEST-ConnectionReuseTest.test-seed#[FA13C6377C897E63]) [    ] o.a.s.c.c.SolrZkClient Using default ZkACLProvider
   [junit4]   2> 2041193 INFO  (TEST-ConnectionReuseTest.test-seed#[FA13C6377C897E63]) [n:127.0.0.1:55292_e_%2Fdx    ] o.a.s.c.c.ConnectionManager Waiting for client to connect to ZooKeeper
   [junit4]   2> 2041209 INFO  (zkCallback-17673-thread-1-processing-n:127.0.0.1:55292_e_%2Fdx) [n:127.0.0.1:55292_e_%2Fdx    ] o.a.s.c.c.ConnectionManager Watcher org.apache.solr.common.cloud.ConnectionManager@4f8f8c3 name:ZooKeeperConnection Watcher:127.0.0.1:46264/solr got event WatchedEvent state:SyncConnected type:None path:null path:null type:None
   [junit4]   2> 2041213 INFO  (TEST-ConnectionReuseTest.test-seed#[FA13C6377C897E63]) [n:127.0.0.1:55292_e_%2Fdx    ] o.a.s.c.c.ConnectionManager Client is connected to ZooKeeper
   [junit4]   2> 2041237 INFO  (TEST-ConnectionReuseTest.test-seed#[FA13C6377C897E63]) [n:127.0.0.1:55292_e_%2Fdx    ] o.a.s.c.c.SolrZkClient makePath: /overseer/queue
   [junit4]   2> 2041313 INFO  (TEST-ConnectionReuseTest.test-seed#[FA13C6377C897E63]) [n:127.0.0.1:55292_e_%2Fdx    ] o.a.s.c.c.SolrZkClient makePath: /overseer/collection-queue-work
   [junit4]   2> 2041335 INFO  (TEST-ConnectionReuseTest.test-seed#[FA13C6377C897E63]) [n:127.0.0.1:55292_e_%2Fdx    ] o.a.s.c.c.SolrZkClient makePath: /overseer/collection-map-running
   [junit4]   2> 2041336 INFO  (TEST-ConnectionReuseTest.test-seed#[FA13C6377C897E63]) [n:127.0.0.1:55292_e_%2Fdx    ] o.a.s.c.c.SolrZkClient makePath: /overseer/collection-map-completed
   [junit4]   2> 2041337 INFO  (TEST-ConnectionReuseTest.test-seed#[FA13C6377C897E63]) [n:127.0.0.1:55292_e_%2Fdx    ] o.a.s.c.c.SolrZkClient makePath: /overseer/collection-map-failure
   [junit4]   2> 2041338 INFO  (TEST-ConnectionReuseTest.test-seed#[FA13C6377C897E63]) [n:127.0.0.1:55292_e_%2Fdx    ] o.a.s.c.c.SolrZkClient makePath: /live_nodes
   [junit4]   2> 2041339 INFO  (TEST-ConnectionReuseTest.test-seed#[FA13C6377C897E63]) [n:127.0.0.1:55292_e_%2Fdx    ] o.a.s.c.c.SolrZkClient makePath: /aliases.json
   [junit4]   2> 2041339 INFO  (TEST-ConnectionReuseTest.test-seed#[FA13C6377C897E63]) [n:127.0.0.1:55292_e_%2Fdx    ] o.a.s.c.c.SolrZkClient makePath: /clusterstate.json
   [junit4]   2> 2041340 INFO  (TEST-ConnectionReuseTest.test-seed#[FA13C6377C897E63]) [n:127.0.0.1:55292_e_%2Fdx    ] o.a.s.c.c.SolrZkClient makePath: /security.json
   [junit4]   2> 2041429 INFO  (TEST-ConnectionReuseTest.test-seed#[FA13C6377C897E63]) [n:127.0.0.1:55292_e_%2Fdx    ] o.a.s.c.c.ZkStateReader Updating cluster state from ZooKeeper... 
   [junit4]   2> 2041434 INFO  (TEST-ConnectionReuseTest.test-seed#[FA13C6377C897E63]) [n:127.0.0.1:55292_e_%2Fdx    ] o.a.s.c.c.ZkStateReader Updated live nodes from ZooKeeper... (0) -> (0)
   [junit4]   2> 2041435 INFO  (TEST-ConnectionReuseTest.test-seed#[FA13C6377C897E63]) [n:127.0.0.1:55292_e_%2Fdx    ] o.a.s.c.c.SolrZkClient makePath: /overseer_elect
   [junit4]   2> 2041436 INFO  (TEST-ConnectionReuseTest.test-seed#[FA13C6377C897E63]) [n:127.0.0.1:55292_e_%2Fdx    ] o.a.s.c.c.SolrZkClient makePath: /overseer_elect/election
   [junit4]   2> 2041437 INFO  (TEST-ConnectionReuseTest.test-seed#[FA13C6377C897E63]) [n:127.0.0.1:55292_e_%2Fdx    ] o.a.s.c.Overseer Overseer (id=null) closing
   [junit4]   2> 2041441 INFO  (TEST-ConnectionReuseTest.test-seed#[FA13C6377C897E63]) [n:127.0.0.1:55292_e_%2Fdx    ] o.a.s.c.LeaderElector Joined leadership election with path: /overseer_elect/election/95722071216291844-127.0.0.1:55292_e_%2Fdx-n_0000000000
   [junit4]   2> 2041441 INFO  (TEST-ConnectionReuseTest.test-seed#[FA13C6377C897E63]) [n:127.0.0.1:55292_e_%2Fdx    ] o.a.s.c.OverseerElectionContext I am going to be the leader 127.0.0.1:55292_e_%2Fdx
   [junit4]   2> 2041441 INFO  (TEST-ConnectionReuseTest.test-seed#[FA13C6377C897E63]) [n:127.0.0.1:55292_e_%2Fdx    ] o.a.s.c.c.SolrZkClient makePath: /overseer_elect/leader
   [junit4]   2> 2041442 INFO  (TEST-ConnectionReuseTest.test-seed#[FA13C6377C897E63]) [n:127.0.0.1:55292_e_%2Fdx    ] o.a.s.c.Overseer Overseer (id=95722071216291844-127.0.0.1:55292_e_%2Fdx-n_0000000000) starting
   [junit4]   2> 2041443 INFO  (TEST-ConnectionReuseTest.test-seed#[FA13C6377C897E63]) [n:127.0.0.1:55292_e_%2Fdx    ] o.a.s.c.c.SolrZkClient makePath: /overseer/queue-work
   [junit4]   2> 2041446 INFO  (TEST-ConnectionReuseTest.test-seed#[FA13C6377C897E63]) [n:127.0.0.1:55292_e_%2Fdx    ] o.a.s.c.OverseerAutoReplicaFailoverThread Starting OverseerAutoReplicaFailoverThread autoReplicaFailoverWorkLoopDelay=10000 autoReplicaFailoverWaitAfterExpiration=30000 autoReplicaFailoverBadNodeExpiration=60000
   [junit4]   2> 2041446 INFO  (OverseerCollectionConfigSetProcessor-95722071216291844-127.0.0.1:55292_e_%2Fdx-n_0000000000) [n:127.0.0.1:55292_e_%2Fdx    ] o.a.s.c.OverseerTaskProcessor Process current queue of overseer operations
   [junit4]   2> 2041448 INFO  (OverseerStateUpdate-95722071216291844-127.0.0.1:55292_e_%2Fdx-n_0000000000) [n:127.0.0.1:55292_e_%2Fdx    ] o.a.s.c.Overseer Starting to work on the main queue
   [junit4]   2> 2041448 INFO  (TEST-ConnectionReuseTest.test-seed#[FA13C6377C897E63]) [n:127.0.0.1:55292_e_%2Fdx    ] o.a.s.c.ZkController Register node as live in ZooKeeper:/live_nodes/127.0.0.1:55292_e_%2Fdx
   [junit4]   2> 2041452 INFO  (TEST-ConnectionReuseTest.test-seed#[FA13C6377C897E63]) [n:127.0.0.1:55292_e_%2Fdx    ] o.a.s.c.c.SolrZkClient makePath: /live_nodes/127.0.0.1:55292_e_%2Fdx
   [junit4]   2> 2041452 INFO  (OverseerStateUpdate-95722071216291844-127.0.0.1:55292_e_%2Fdx-n_0000000000) [n:127.0.0.1:55292_e_%2Fdx    ] o.a.s.c.c.ZkStateReader Updated live nodes from ZooKeeper... (0) -> (0)
   [junit4]   2> 2041452 INFO  (zkCallback-17673-thread-1-processing-n:127.0.0.1:55292_e_%2Fdx) [n:127.0.0.1:55292_e_%2Fdx    ] o.a.s.c.c.ZkStateReader A live node change: [WatchedEvent state:SyncConnected type:NodeChildrenChanged path:/live_nodes], has occurred - updating... (live nodes size: [0])
   [junit4]   2> 2041453 INFO  (zkCallback-17673-thread-1-processing-n:127.0.0.1:55292_e_%2Fdx) [n:127.0.0.1:55292_e_%2Fdx    ] o.a.s.c.c.ZkStateReader Updated live nodes from ZooKeeper... (0) -> (1)
   [junit4]   2> 2041469 INFO  (TEST-ConnectionReuseTest.test-seed#[FA13C6377C897E63]) [n:127.0.0.1:55292_e_%2Fdx    ] o.a.s.c.CoreContainer Security conf doesn't exist. Skipping setup for authorization module.
   [junit4]   2> 2041469 INFO  (TEST-ConnectionReuseTest.test-seed#[FA13C6377C897E63]) [n:127.0.0.1:55292_e_%2Fdx    ] o.a.s.c.CoreContainer No authentication plugin used.
   [junit4]   2> 2041470 INFO  (TEST-ConnectionReuseTest.test-seed#[FA13C6377C897E63]) [n:127.0.0.1:55292_e_%2Fdx    ] o.a.s.c.CorePropertiesLocator Looking for core definitions underneath /x1/jenkins/jenkins-slave/workspace/Lucene-Solr-Tests-6.x/solr/build/solr-core/test/J0/temp/solr.client.solrj.ConnectionReuseTest_FA13C6377C897E63-001/control-001/cores
   [junit4]   2> 2041470 INFO  (TEST-ConnectionReuseTest.test-seed#[FA13C6377C897E63]) [n:127.0.0.1:55292_e_%2Fdx    ] o.a.s.c.CoreDescriptor Created CoreDescriptor: {name=collection1, config=solrconfig.xml, transient=false, schema=schema.xml, loadOnStartup=true, configSetProperties=configsetprops.json, collection=control_collection, coreNodeName=, dataDir=data/, shard=}
   [junit4]   2> 2041470 INFO  (TEST-ConnectionReuseTest.test-seed#[FA13C6377C897E63]) [n:127.0.0.1:55292_e_%2Fdx    ] o.a.s.c.CorePropertiesLocator Found core collection1 in /x1/jenkins/jenkins-slave/workspace/Lucene-Solr-Tests-6.x/solr/build/solr-core/test/J0/temp/solr.client.solrj.ConnectionReuseTest_FA13C6377C897E63-001/control-001/cores/collection1
   [junit4]   2> 2041470 INFO  (TEST-ConnectionReuseTest.test-seed#[FA13C6377C897E63]) [n:127.0.0.1:55292_e_%2Fdx    ] o.a.s.c.CorePropertiesLocator Found 1 core definitions
   [junit4]   2> 2041471 INFO  (TEST-ConnectionReuseTest.test-seed#[FA13C6377C897E63]) [n:127.0.0.1:55292_e_%2Fdx    ] o.a.s.s.SolrDispatchFilter user.dir=/x1/jenkins/jenkins-slave/workspace/Lucene-Solr-Tests-6.x/solr/build/solr-core/test/J0
   [junit4]   2> 2041471 INFO  (TEST-ConnectionReuseTest.test-seed#[FA13C6377C897E63]) [n:127.0.0.1:55292_e_%2Fdx    ] o.a.s.s.SolrDispatchFilter SolrDispatchFilter.init() done
   [junit4]   2> 2041472 INFO  (coreLoadExecutor-7763-thread-1-processing-n:127.0.0.1:55292_e_%2Fdx) [n:127.0.0.1:55292_e_%2Fdx c:control_collection   x:collection1] o.a.s.c.ZkController publishing state=down
   [junit4]   2> 2041472 INFO  (coreLoadExecutor-7763-thread-1-processing-n:127.0.0.1:55292_e_%2Fdx) [n:127.0.0.1:55292_e_%2Fdx c:control_collection   x:collection1] o.a.s.c.ZkController numShards not found on descriptor - reading it from system property
   [junit4]   2> 2041473 INFO  (OverseerStateUpdate-95722071216291844-127.0.0.1:55292_e_%2Fdx-n_0000000000) [n:127.0.0.1:55292_e_%2Fdx    ] o.a.s.c.Overseer processMessage: queueSize: 1, message = {
   [junit4]   2>   "core":"collection1",
   [junit4]   2>   "roles":null,
   [junit4]   2>   "base_url":"http://127.0.0.1:55292/e_/dx",
   [junit4]   2>   "node_name":"127.0.0.1:55292_e_%2Fdx",
   [junit4]   2>   "numShards":"1",
   [junit4]   2>   "state":"down",
   [junit4]   2>   "shard":null,
   [junit4]   2>   "collection":"control_collection",
   [junit4]   2>   "operation":"state"} current state version: 0
   [junit4]   2> 2041474 INFO  (coreLoadExecutor-7763-thread-1-processing-n:127.0.0.1:55292_e_%2Fdx) [n:127.0.0.1:55292_e_%2Fdx c:control_collection   x:collection1] o.a.s.c.ZkController look for our core node name
   [junit4]   2> 2041474 INFO  (OverseerStateUpdate-95722071216291844-127.0.0.1:55292_e_%2Fdx-n_0000000000) [n:127.0.0.1:55292_e_%2Fdx    ] o.a.s.c.o.ReplicaMutator Update state numShards=1 message={
   [junit4]   2>   "core":"collection1",
   [junit4]   2>   "roles":null,
   [junit4]   2>   "base_url":"http://127.0.0.1:55292/e_/dx",
   [junit4]   2>   "node_name":"127.0.0.1:55292_e_%2Fdx",
   [junit4]   2>   "numShards":"1",
   [junit4]   2>   "state":"down",
   [junit4]   2>   "shard":null,
   [junit4]   2>   "collection":"control_collection",
   [junit4]   2>   "operation":"state"}
   [junit4]   2> 2041474 INFO  (OverseerStateUpdate-95722071216291844-127.0.0.1:55292_e_%2Fdx-n_0000000000) [n:127.0.0.1:55292_e_%2Fdx    ] o.a.s.c.o.ClusterStateMutator building a new cName: control_collection
   [junit4]   2> 2041475 INFO  (OverseerStateUpdate-95722071216291844-127.0.0.1:55292_e_%2Fdx-n_0000000000) [n:127.0.0.1:55292_e_%2Fdx    ] o.a.s.c.o.ReplicaMutator Assigning new node to shard shard=shard1
   [junit4]   2> 2041476 INFO  (zkCallback-17673-thread-1-processing-n:127.0.0.1:55292_e_%2Fdx) [n:127.0.0.1:55292_e_%2Fdx    ] o.a.s.c.c.ZkStateReader A cluster state change: [WatchedEvent state:SyncConnected type:NodeDataChanged path:/clusterstate.json], has occurred - updating... (live nodes size: [1])
   [junit4]   2> 2042474 INFO  (coreLoadExecutor-7763-thread-1-processing-n:127.0.0.1:55292_e_%2Fdx) [n:127.0.0.1:55292_e_%2Fdx c:control_collection   x:collection1] o.a.s.c.ZkController waiting to find shard id in clusterstate for collection1
   [junit4]   2> 2042474 INFO  (coreLoadExecutor-7763-thread-1-processing-n:127.0.0.1:55292_e_%2Fdx) [n:127.0.0.1:55292_e_%2Fdx c:control_collection   x:collection1] o.a.s.c.ZkController Check for collection zkNode:control_collection
   [junit4]   2> 2042475 INFO  (coreLoadExecutor-7763-thread-1-processing-n:127.0.0.1:55292_e_%2Fdx) [n:127.0.0.1:55292_e_%2Fdx c:control_collection   x:collection1] o.a.s.c.ZkController Collection zkNode exists
   [junit4]   2> 2042475 INFO  (coreLoadExecutor-7763-thread-1-processing-n:127.0.0.1:55292_e_%2Fdx) [n:127.0.0.1:55292_e_%2Fdx c:control_collection   x:collection1] o.a.s.c.c.ZkStateReader Load collection config from: [/collections/control_collection]
   [junit4]   2> 2042475 INFO  (coreLoadExecutor-7763-thread-1-processing-n:127.0.0.1:55292_e_%2Fdx) [n:127.0.0.1:55292_e_%2Fdx c:control_collection   x:collection1] o.a.s.c.c.ZkStateReader path=[/collections/control_collection] [configName]=[conf1] specified config exists in ZooKeeper
   [junit4]   2> 2042475 INFO  (coreLoadExecutor-7763-thread-1-processing-n:127.0.0.1:55292_e_%2Fdx) [n:127.0.0.1:55292_e_%2Fdx c:control_collection   x:collection1] o.a.s.c.SolrResourceLoader new SolrResourceLoader for directory: '/x1/jenkins/jenkins-slave/workspace/Lucene-Solr-Tests-6.x/solr/build/solr-core/test/J0/temp/solr.client.solrj.ConnectionReuseTest_FA13C6377C897E63-001/control-001/cores/collection1'
   [junit4]   2> 2042475 INFO  (coreLoadExecutor-7763-thread-1-processing-n:127.0.0.1:55292_e_%2Fdx) [n:127.0.0.1:55292_e_%2Fdx c:control_collection   x:collection1] o.a.s.c.SolrResourceLoader JNDI not configured for solr (NoInitialContextEx)
   [junit4]   2> 2042475 INFO  (coreLoadExecutor-7763-thread-1-processing-n:127.0.0.1:55292_e_%2Fdx) [n:127.0.0.1:55292_e_%2Fdx c:control_collection   x:collection1] o.a.s.c.SolrResourceLoader solr home defaulted to 'solr/' (could not find system property or JNDI)
   [junit4]   2> 2042476 INFO  (coreLoadExecutor-7763-thread-1-processing-n:127.0.0.1:55292_e_%2Fdx) [n:127.0.0.1:55292_e_%2Fdx c:control_collection   x:collection1] o.a.s.c.Config loaded config solrconfig.xml with version 0 
   [junit4]   2> 2042485 INFO  (coreLoadExecutor-7763-thread-1-processing-n:127.0.0.1:55292_e_%2Fdx) [n:127.0.0.1:55292_e_%2Fdx c:control_collection   x:collection1] o.a.s.c.SolrConfig current version of requestparams : -1
   [junit4]   2> 2042503 WARN  (coreLoadExecutor-7763-thread-1-processing-n:127.0.0.1:55292_e_%2Fdx) [n:127.0.0.1:55292_e_%2Fdx c:control_collection   x:collection1] o.a.s.c.Config Beginning with Solr 5.5, <mergePolicy> is deprecated, use <mergePolicyFactory> instead.
   [junit4]   2> 2042504 INFO  (coreLoadExecutor-7763-thread-1-processing-n:127.0.0.1:55292_e_%2Fdx) [n:127.0.0.1:55292_e_%2Fdx c:control_collection   x:collection1] o.a.s.c.SolrConfig Using Lucene MatchVersion: 6.1.0
   [junit4]   2> 2042512 INFO  (coreLoadExecutor-7763-thread-1-processing-n:127.0.0.1:55292_e_%2Fdx) [n:127.0.0.1:55292_e_%2Fdx c:control_collection   x:collection1] o.a.s.c.SolrConfig Loaded SolrConfig: solrconfig.xml
   [junit4]   2> 2042516 INFO  (coreLoadExecutor-7763-thread-1-processing-n:127.0.0.1:55292_e_%2Fdx) [n:127.0.0.1:55292_e_%2Fdx c:control_collection   x:collection1] o.a.s.s.IndexSchema [collection1] Schema name=test
   [junit4]   2> 2042634 INFO  (coreLoadExecutor-7763-thread-1-processing-n:127.0.0.1:55292_e_%2Fdx) [n:127.0.0.1:55292_e_%2Fdx c:control_collection   x:collection1] o.a.s.s.OpenExchangeRatesOrgProvider Initialized with rates=open-exchange-rates.json, refreshInterval=1440.
   [junit4]   2> 2042649 INFO  (coreLoadExecutor-7763-thread-1-processing-n:127.0.0.1:55292_e_%2Fdx) [n:127.0.0.1:55292_e_%2Fdx c:control_collection   x:collection1] o.a.s.s.IndexSchema default search field in schema is text
   [junit4]   2> 2042649 INFO  (coreLoadExecutor-7763-thread-1-processing-n:127.0.0.1:55292_e_%2Fdx) [n:127.0.0.1:55292_e_%2Fdx c:control_collection   x:collection1] o.a.s.s.IndexSchema unique key field: id
   [junit4]   2> 2042677 INFO  (coreLoadExecutor-7763-thread-1-processing-n:127.0.0.1:55292_e_%2Fdx) [n:127.0.0.1:55292_e_%2Fdx c:control_collection   x:collection1] o.a.s.s.FileExchangeRateProvider Reloading exchange rates from file currency.xml
   [junit4]   2> 2042679 INFO  (coreLoadExecutor-7763-thread-1-processing-n:127.0.0.1:55292_e_%2Fdx) [n:127.0.0.1:55292_e_%2Fdx c:control_collection   x:collection1] o.a.s.s.FileExchangeRateProvider Reloading exchange rates from file currency.xml
   [junit4]   2> 2042680 INFO  (coreLoadExecutor-7763-thread-1-processing-n:127.0.0.1:55292_e_%2Fdx) [n:127.0.0.1:55292_e_%2Fdx c:control_collection   x:collection1] o.a.s.s.OpenExchangeRatesOrgProvider Reloading exchange rates from open-exchange-rates.json
   [junit4]   2> 2042680 INFO  (coreLoadExecutor-7763-thread-1-processing-n:127.0.0.1:55292_e_%2Fdx) [n:127.0.0.1:55292_e_%2Fdx c:control_collection   x:collection1] o.a.s.s.OpenExchangeRatesOrgProvider Reloading exchange rates from open-exchange-rates.json
   [junit4]   2> 2042681 INFO  (coreLoadExecutor-7763-thread-1-processing-n:127.0.0.1:55292_e_%2Fdx) [n:127.0.0.1:55292_e_%2Fdx c:control_collection   x:collection1] o.a.s.c.ConfigSetProperties Did not find ConfigSet properties, assuming default properties: Can't find resource 'configsetprops.json' in classpath or '/configs/conf1', cwd=/x1/jenkins/jenkins-slave/workspace/Lucene-Solr-Tests-6.x/solr/build/solr-core/test/J0
   [junit4]   2> 2042681 INFO  (coreLoadExecutor-7763-thread-1-processing-n:127.0.0.1:55292_e_%2Fdx) [n:127.0.0.1:55292_e_%2Fdx c:control_collection   x:collection1] o.a.s.c.CoreContainer Creating SolrCore 'collection1' using configuration from collection control_collection
   [junit4]   2> 2042684 INFO  (coreLoadExecutor-7763-thread-1-processing-n:127.0.0.1:55292_e_%2Fdx) [n:127.0.0.1:55292_e_%2Fdx c:control_collection s:shard1 r:core_node1 x:collection1] o.a.s.c.SolrCore org.apache.solr.core.MockDirectoryFactory
   [junit4]   2> 2042684 INFO  (coreLoadExecutor-7763-thread-1-processing-n:127.0.0.1:55292_e_%2Fdx) [n:127.0.0.1:55292_e_%2Fdx c:control_collection s:shard1 r:core_node1 x:collection1] o.a.s.c.SolrCore [[collection1] ] Opening new SolrCore at [/x1/jenkins/jenkins-slave/workspace/Lucene-Solr-Tests-6.x/solr/build/solr-core/test/J0/temp/solr.client.solrj.ConnectionReuseTest_FA13C6377C897E63-001/control-001/cores/collection1], dataDir=[/x1/jenkins/jenkins-slave/workspace/Lucene-Solr-Tests-6.x/solr/build/solr-core/test/J0/temp/solr.client.solrj.ConnectionReuseTest_FA13C6377C897E63-001/control-001/cores/collection1/data/]
   [junit4]   2> 2042685 INFO  (coreLoadExecutor-7763-thread-1-processing-n:127.0.0.1:55292_e_%2Fdx) [n:127.0.0.1:55292_e_%2Fdx c:control_collection s:shard1 r:core_node1 x:collection1] o.a.s.c.JmxMonitoredMap JMX monitoring is enabled. Adding Solr mbeans to JMX Server: com.sun.jmx.mbeanserver.JmxMBeanServer@64bd95c0
   [junit4]   2> 2042685 INFO  (coreLoadExecutor-7763-thread-1-processing-n:127.0.0.1:55292_e_%2Fdx) [n:127.0.0.1:55292_e_%2Fdx c:control_collection s:shard1 r:core_node1 x:collection1] o.a.s.c.CachingDirectoryFactory return new directory for /x1/jenkins/jenkins-slave/workspace/Lucene-Solr-Tests-6.x/solr/build/solr-core/test/J0/temp/solr.client.solrj.ConnectionReuseTest_FA13C6377C897E63-001/control-001/cores/collection1/data
   [junit4]   2> 2042685 INFO  (coreLoadExecutor-7763-thread-1-processing-n:127.0.0.1:55292_e_%2Fdx) [n:127.0.0.1:55292_e_%2Fdx c:control_collection s:shard1 r:core_node1 x:collection1] o.a.s.c.SolrCore New index directory detected: old=null new=/x1/jenkins/jenkins-slave/workspace/Lucene-Solr-Tests-6.x/solr/build/solr-core/test/J0/temp/solr.client.solrj.ConnectionReuseTest_FA13C6377C897E63-001/control-001/cores/collection1/data/index/
   [junit4]   2> 2042685 WARN  (coreLoadExecutor-7763-thread-1-processing-n:127.0.0.1:55292_e_%2Fdx) [n:127.0.0.1:55292_e_%2Fdx c:control_collection s:shard1 r:core_node1 x:collection1] o.a.s.c.SolrCore [collection1] Solr index directory '/x1/jenkins/jenkins-slave/workspace/Lucene-Solr-Tests-6.x/solr/build/solr-core/test/J0/temp/solr.client.solrj.ConnectionReuseTest_FA13C6377C897E63-001/control-001/cores/collection1/data/index' doesn't exist. Creating new index...
   [junit4]   2> 2042685 INFO  (coreLoadExecutor-7763-thread-1-processing-n:127.0.0.1:55292_e_%2Fdx) [n:127.0.0.1:55292_e_%2Fdx c:control_collection s:shard1 r:core_node1 x:collection1] o.a.s.c.CachingDirectoryFactory return new directory for /x1/jenkins/jenkins-slave/workspace/Lucene-Solr-Tests-6.x/solr/build/solr-core/test/J0/temp/solr.client.solrj.ConnectionReuseTest_FA13C6377C897E63-001/control-001/cores/collection1/data/index
   [junit4]   2> 2042686 INFO  (coreLoadExecutor-7763-thread-1-processing-n:127.0.0.1:55292_e_%2Fdx) [n:127.0.0.1:55292_e_%2Fdx c:control_collection s:shard1 r:core_node1 x:collection1] o.a.s.u.RandomMergePolicy RandomMergePolicy wrapping class org.apache.lucene.index.TieredMergePolicy: [TieredMergePolicy: maxMergeAtOnce=15, maxMergeAtOnceExplicit=42, maxMergedSegmentMB=75.1923828125, floorSegmentMB=2.083984375, forceMergeDeletesPctAllowed=18.00845297462436, segmentsPerTier=27.0, maxCFSSegmentSizeMB=8.796093022207999E12, noCFSRatio=0.20569394412793135
   [junit4]   2> 2042686 INFO  (coreLoadExecutor-7763-thread-1-processing-n:127.0.0.1:55292_e_%2Fdx) [n:127.0.0.1:55292_e_%2Fdx c:control_collection s:shard1 r:core_node1 x:collection1] o.a.s.c.SolrDeletionPolicy SolrDeletionPolicy.onCommit: commits: num=1
   [junit4]   2> 	commit{dir=MockDirectoryWrapper(RAMDirectory@29ca68fe lockFactory=org.apache.lucene.store.SingleInstanceLockFactory@7886614),segFN=segments_1,generation=1}
   [junit4]   2> 2042686 INFO  (coreLoadExecutor-7763-thread-1-processing-n:127.0.0.1:55292_e_%2Fdx) [n:127.0.0.1:55292_e_%2Fdx c:control_collection s:shard1 r:core_node1 x:collection1] o.a.s.c.SolrDeletionPolicy newest commit generation = 1
   [junit4]   2> 2042687 INFO  (OldIndexDirectoryCleanupThreadForCore-collection1) [n:127.0.0.1:55292_e_%2Fdx c:control_collection s:shard1 r:core_node1 x:collection1] o.a.s.c.SolrCore Looking for old index directories to cleanup for core collection1 in /x1/jenkins/jenkins-slave/workspace/Lucene-Solr-Tests-6.x/solr/build/solr-core/test/J0/temp/solr.client.solrj.ConnectionReuseTest_FA13C6377C897E63-001/control-001/cores/collection1/data/
   [junit4]   2> 2042687 WARN  (OldIndexDirectoryCleanupThreadForCore-collection1) [n:127.0.0.1:55292_e_%2Fdx c:control_collection s:shard1 r:core_node1 x:collection1] o.a.s.c.DirectoryFactory /x1/jenkins/jenkins-slave/workspace/Lucene-Solr-Tests-6.x/solr/build/solr-core/test/J0/temp/solr.client.solrj.ConnectionReuseTest_FA13C6377C897E63-001/control-001/cores/collection1/data/ does not point to a valid data directory; skipping clean-up of old index directories.
   [junit4]   2> 2042688 INFO  (coreLoadExecutor-7763-thread-1-processing-n:127.0.0.1:55292_e_%2Fdx) [n:127.0.0.1:55292_e_%2Fdx c:control_collection s:shard1 r:core_node1 x:collection1] o.a.s.u.p.UpdateRequestProcessorChain creating updateRequestProcessorChain "nodistrib"
   [junit4]   2> 2042689 INFO  (coreLoadExecutor-7763-thread-1-processing-n:127.0.0.1:55292_e_%2Fdx) [n:127.0.0.1:55292_e_%2Fdx c:control_collection s:shard1 r:core_node1 x:collection1] o.a.s.u.p.UpdateRequestProcessorChain creating updateRequestProcessorChain "dedupe"
   [junit4]   2> 2042689 INFO  (coreLoadExecutor-7763-thread-1-processing-n:127.0.0.1:55292_e_%2Fdx) [n:127.0.0.1:55292_e_%2Fdx c:control_collection s:shard1 r:core_node1 x:collection1] o.a.s.u.p.UpdateRequestProcessorChain inserting DistributedUpdateProcessorFactory into updateRequestProcessorChain "dedupe"
   [junit4]   2> 2042689 INFO  (coreLoadExecutor-7763-thread-1-processing-n:127.0.0.1:55292_e_%2Fdx) [n:127.0.0.1:55292_e_%2Fdx c:control_collection s:shard1 r:core_node1 x:collection1] o.a.s.u.p.UpdateRequestProcessorChain creating updateRequestProcessorChain "stored_sig"
   [junit4]   2> 2042689 INFO  (coreLoadExecutor-7763-thread-1-processing-n:127.0.0.1:55292_e_%2Fdx) [n:127.0.0.1:55292_e_%2Fdx c:control_collection s:shard1 r:core_node1 x:collection1] o.a.s.u.p.UpdateRequestProcessorChain inserting DistributedUpdateProcessorFactory into updateRequestProcessorChain "stored_sig"
   [junit4]   2> 2042689 INFO  (coreLoadExecutor-7763-thread-1-processing-n:127.0.0.1:55292_e_%2Fdx) [n:127.0.0.1:55292_e_%2Fdx c:control_collection s:shard1 r:core_node1 x:collection1] o.a.s.u.p.UpdateRequestProcessorChain creating updateRequestProcessorChain "distrib-dup-test-chain-explicit"
   [junit4]   2> 2042689 INFO  (coreLoadExecutor-7763-thread-1-processing-n:127.0.0.1:55292_e_%2Fdx) [n:127.0.0.1:55292_e_%2Fdx c:control_collection s:shard1 r:core_node1 x:collection1] o.a.s.u.p.UpdateRequestProcessorChain creating updateRequestProcessorChain "distrib-dup-test-chain-implicit"
   [junit4]   2> 2042689 INFO  (coreLoadExecutor-7763-thread-1-processing-n:127.0.0.1:55292_e_%2Fdx) [n:127.0.0.1:55292_e_%2Fdx c:control_collection s:shard1 r:core_node1 x:collection1] o.a.s.u.p.UpdateRequestProcessorChain inserting DistributedUpdateProcessorFactory into updateRequestProcessorChain "distrib-dup-test-chain-implicit"
   [junit4]   2> 2042689 INFO  (coreLoadExecutor-7763-thread-1-processing-n:127.0.0.1:55292_e_%2Fdx) [n:127.0.0.1:55292_e_%2Fdx c:control_collection s:shard1 r:core_node1 x:collection1] o.a.s.c.SolrCore no updateRequestProcessorChain defined as default, creating implicit default
   [junit4]   2> 2042689 WARN  (coreLoadExecutor-7763-thread-1-processing-n:127.0.0.1:55292_e_%2Fdx) [n:127.0.0.1:55292_e_%2Fdx c:control_collection s:shard1 r:core_node1 x:collection1] o.a.s.c.RequestHandlers INVALID paramSet a in requestHandler {type = requestHandler,name = /dump,class = DumpRequestHandler,args = {defaults={a=A,b=B}}}
   [junit4]   2> 2042690 INFO  (coreLoadExecutor-7763-thread-1-processing-n:127.0.0.1:55292_e_%2Fdx) [n:127.0.0.1:55292_e_%2Fdx c:control_collection s:shard1 r:core_node1 x:collection1] o.a.s.h.l.XMLLoader xsltCacheLifetimeSeconds=60
   [junit4]   2> 2042691 INFO  (coreLoadExecutor-7763-thread-1-processing-n:127.0.0.1:55292_e_%2Fdx) [n:127.0.0.1:55292_e_%2Fdx c:control_collection s:shard1 r:core_node1 x:collection1] o.a.s.h.l.XMLLoader xsltCacheLifetimeSeconds=60
   [junit4]   2> 2042691 INFO  (coreLoadExecutor-7763-thread-1-processing-n:127.0.0.1:55292_e_%2Fdx) [n:127.0.0.1:55292_e_%2Fdx c:control_collection s:shard1 r:core_node1 x:collection1] o.a.s.h.l.XMLLoader xsltCacheLifetimeSeconds=60
   [junit4]   2> 2042692 INFO  (coreLoadExecutor-7763-thread-1-processing-n:127.0.0.1:55292_e_%2Fdx) [n:127.0.0.1:55292_e_%2Fdx c:control_collection s:shard1 r:core_node1 x:collection1] o.a.s.h.l.XMLLoader xsltCacheLifetimeSeconds=60
   [junit4]   2> 2042696 INFO  (coreLoadExecutor-7763-thread-1-processing-n:127.0.0.1:55292_e_%2Fdx) [n:127.0.0.1:55292_e_%2Fdx c:control_collection s:shard1 r:core_node1 x:collection1] o.a.s.c.RequestHandlers Registered paths: /admin/mbeans,standard,/dump,/update/csv,/sql,/update/json/docs,/admin/luke,/export,/admin/segments,/get,/admin/system,/replication,/admin/properties,/config,/stream,/schema,/admin/plugins,/admin/logging,/update/json,/admin/ping,/admin/threads,/update,/admin/file
   [junit4]   2> 2042696 INFO  (coreLoadExecutor-7763-thread-1-processing-n:127.0.0.1:55292_e_%2Fdx) [n:127.0.0.1:55292_e_%2Fdx c:control_collection s:shard1 r:core_node1 x:collection1] o.a.s.c.SolrCore Using default statsCache cache: org.apache.solr.search.stats.LocalStatsCache
   [junit4]   2> 2042696 INFO  (coreLoadExecutor-7763-thread-1-processing-n:127.0.0.1:55292_e_%2Fdx) [n:127.0.0.1:55292_e_%2Fdx c:control_collection s:shard1 r:core_node1 x:collection1] o.a.s.u.UpdateHandler Using UpdateLog implementation: org.apache.solr.update.UpdateLog
   [junit4]   2> 2042697 INFO  (coreLoadExecutor-7763-thread-1-processing-n:127.0.0.1:55292_e_%2Fdx) [n:127.0.0.1:55292_e_%2Fdx c:control_collection s:shard1 r:core_node1 x:collection1] o.a.s.u.UpdateLog Initializing UpdateLog: dataDir= defaultSyncLevel=FLUSH numRecordsToKeep=100 maxNumLogsToKeep=10 numVersionBuckets=65536
   [junit4]   2> 2042697 INFO  (coreLoadExecutor-7763-thread-1-processing-n:127.0.0.1:55292_e_%2Fdx) [n:127.0.0.1:55292_e_%2Fdx c:control_collection s:shard1 r:core_node1 x:collection1] o.a.s.u.CommitTracker Hard AutoCommit: disabled
   [junit4]   2> 2042697 INFO  (coreLoadExecutor-7763-thread-1-processing-n:127.0.0.1:55292_e_%2Fdx) [n:127.0.0.1:55292_e_%2Fdx c:control_collection s:shard1 r:core_node1 x:collection1] o.a.s.u.CommitTracker Soft AutoCommit: disabled
   [junit4]   2> 2042697 INFO  (coreLoadExecutor-7763-thread-1-processing-n:127.0.0.1:55292_e_%2Fdx) [n:127.0.0.1:55292_e_%2Fdx c:control_collection s:shard1 r:core_node1 x:collection1] o.a.s.u.RandomMergePolicy RandomMergePolicy wrapping class org.apache.lucene.index.TieredMergePolicy: [TieredMergePolicy: maxMergeAtOnce=29, maxMergeAtOnceExplicit=34, maxMergedSegmentMB=5.927734375, floorSegmentMB=0.89453125, forceMergeDeletesPctAllowed=3.715389505221154, segmentsPerTier=34.0, maxCFSSegmentSizeMB=8.796093022207999E12, noCFSRatio=1.0
   [junit4]   2> 2042697 INFO  (coreLoadExecutor-7763-thread-1-processing-n:127.0.0.1:55292_e_%2Fdx) [n:127.0.0.1:55292_e_%2Fdx c:control_collection s:shard1 r:core_node1 x:collection1] o.a.s.c.SolrDeletionPolicy SolrDeletionPolicy.onInit: commits: num=1
   [junit4]   2> 	commit{dir=MockDirectoryWrapper(RAMDirectory@29ca68fe lockFactory=org.apache.lucene.store.SingleInstanceLockFactory@7886614),segFN=segments_1,generation=1}
   [junit4]   2> 2042698 INFO  (coreLoadExecutor-7763-thread-1-processing-n:127.0.0.1:55292_e_%2Fdx) [n:127.0.0.1:55292_e_%2Fdx c:control_collection s:shard1 r:core_node1 x:collection1] o.a.s.c.SolrDeletionPolicy newest commit generation = 1
   [junit4]   2> 2042698 INFO  (coreLoadExecutor-7763-thread-1-processing-n:127.0.0.1:55292_e_%2Fdx) [n:127.0.0.1:55292_e_%2Fdx c:control_collection s:shard1 r:core_node1 x:collection1] o.a.s.s.SolrIndexSearcher Opening [Searcher@394e1896[collection1] main]
   [junit4]   2> 2042698 INFO  (coreLoadExecutor-7763-thread-1-processing-n:127.0.0.1:55292_e_%2Fdx) [n:127.0.0.1:55292_e_%2Fdx c:control_collection s:shard1 r:core_node1 x:collection1] o.a.s.c.c.ZkStateReader Load collection config from: [/collections/control_collection]
   [junit4]   2> 2042701 INFO  (coreLoadExecutor-7763-thread-1-processing-n:127.0.0.1:55292_e_%2Fdx) [n:127.0.0.1:55292_e_%2Fdx c:control_collection s:shard1 r:core_node1 x:collection1] o.a.s.c.c.ZkStateReader path=[/collections/control_collection] [configName]=[conf1] specified config exists in ZooKeeper
   [junit4]   2> 2042701 INFO  (coreLoadExecutor-7763-thread-1-processing-n:127.0.0.1:55292_e_%2Fdx) [n:127.0.0.1:55292_e_%2Fdx c:control_collection s:shard1 r:core_node1 x:collection1] o.a.s.r.ManagedResourceStorage Setting up ZooKeeper-based storage for the RestManager with znodeBase: /configs/conf1
   [junit4]   2> 2042702 INFO  (coreLoadExecutor-7763-thread-1-processing-n:127.0.0.1:55292_e_%2Fdx) [n:127.0.0.1:55292_e_%2Fdx c:control_collection s:shard1 r:core_node1 x:collection1] o.a.s.r.ManagedResourceStorage Configured ZooKeeperStorageIO with znodeBase: /configs/conf1
   [junit4]   2> 2042702 INFO  (coreLoadExecutor-7763-thread-1-processing-n:127.0.0.1:55292_e_%2Fdx) [n:127.0.0.1:55292_e_%2Fdx c:control_collection s:shard1 r:core_node1 x:collection1] o.a.s.r.RestManager Initializing RestManager with initArgs: {}
   [junit4]   2> 2042702 INFO  (coreLoadExecutor-7763-thread-1-processing-n:127.0.0.1:55292_e_%2Fdx) [n:127.0.0.1:55292_e_%2Fdx c:control_collection s:shard1 r:core_node1 x:collection1] o.a.s.r.ManagedResourceStorage Reading _rest_managed.json using ZooKeeperStorageIO:path=/configs/conf1
   [junit4]   2> 2042705 INFO  (coreLoadExecutor-7763-thread-1-processing-n:127.0.0.1:55292_e_%2Fdx) [n:127.0.0.1:55292_e_%2Fdx c:control_collection s:shard1 r:core_node1 x:collection1] o.a.s.r.ManagedResourceStorage No data found for znode /configs/conf1/_rest_managed.json
   [junit4]   2> 2042705 INFO  (coreLoadExecutor-7763-thread-1-processing-n:127.0.0.1:55292_e_%2Fdx) [n:127.0.0.1:55292_e_%2Fdx c:control_collection s:shard1 r:core_node1 x:collection1] o.a.s.r.ManagedResourceStorage Loaded null at path _rest_managed.json using ZooKeeperStorageIO:path=/configs/conf1
   [junit4]   2> 2042705 INFO  (coreLoadExecutor-7763-thread-1-processing-n:127.0.0.1:55292_e_%2Fdx) [n:127.0.0.1:55292_e_%2Fdx c:control_collection s:shard1 r:core_node1 x:collection1] o.a.s.r.RestManager Initializing 0 registered ManagedResources
   [junit4]   2> 2042705 INFO  (coreLoadExecutor-7763-thread-1-processing-n:127.0.0.1:55292_e_%2Fdx) [n:127.0.0.1:55292_e_%2Fdx c:control_collection s:shard1 r:core_node1 x:collection1] o.a.s.h.ReplicationHandler Commits will be reserved for  10000
   [junit4]   2> 2042706 INFO  (searcherExecutor-7764-thread-1-processing-n:127.0.0.1:55292_e_%2Fdx x:collection1 s:shard1 c:control_collection r:core_node1) [n:127.0.0.1:55292_e_%2Fdx c:control_collection s:shard1 r:core_node1 x:collection1] o.a.s.c.SolrCore [collection1] Registered new searcher Searcher@394e1896[collection1] main{ExitableDirectoryReader(UninvertingDirectoryReader())}
   [junit4]   2> 2042706 INFO  (coreLoadExecutor-7763-thread-1-processing-n:127.0.0.1:55292_e_%2Fdx) [n:127.0.0.1:55292_e_%2Fdx c:control_collection s:shard1 r:core_node1 x:collection1] o.a.s.u.UpdateLog Looking up max value of version field to seed version buckets
   [junit4]   2> 2042706 INFO  (coreLoadExecutor-7763-thread-1-processing-n:127.0.0.1:55292_e_%2Fdx) [n:127.0.0.1:55292_e_%2Fdx c:control_collection s:shard1 r:core_node1 x:collection1] o.a.s.u.VersionInfo Refreshing highest value of _version_ for 65536 version buckets from index
   [junit4]   2> 2042706 INFO  (coreLoadExecutor-7763-thread-1-processing-n:127.0.0.1:55292_e_%2Fdx) [n:127.0.0.1:55292_e_%2Fdx c:control_collection s:shard1 r:core_node1 x:collection1] o.a.s.u.VersionInfo No terms found for _version_, cannot seed version bucket highest value from index
   [junit4]   2> 2042706 INFO  (coreLoadExecutor-7763-thread-1-processing-n:127.0.0.1:55292_e_%2Fdx) [n:127.0.0.1:55292_e_%2Fdx c:control_collection s:shard1 r:core_node1 x:collection1] o.a.s.u.UpdateLog Could not find max version in index or recent updates, using new clock 1531553141625978880
   [junit4]   2> 2042707 INFO  (coreLoadExecutor-7763-thread-1-processing-n:127.0.0.1:55292_e_%2Fdx) [n:127.0.0.1:55292_e_%2Fdx c:control_collection s:shard1 r:core_node1 x:collection1] o.a.s.u.UpdateLog Took 1.0ms to seed version buckets with highest version 1531553141625978880
   [junit4]   2> 2042708 INFO  (coreLoadExecutor-7763-thread-1-processing-n:127.0.0.1:55292_e_%2Fdx) [n:127.0.0.1:55292_e_%2Fdx c:control_collection s:shard1 r:core_node1 x:collection1] o.a.s.c.ZkController watch zkdir /configs/conf1
   [junit4]   2> 2042708 INFO  (coreLoadExecutor-7763-thread-1-processing-n:127.0.0.1:55292_e_%2Fdx) [n:127.0.0.1:55292_e_%2Fdx c:control_collection s:shard1 r:core_node1 x:collection1] o.a.s.c.CoreContainer registering core: collection1
   [junit4]   2> 2042708 INFO  (coreZkRegister-7757-thread-1-processing-n:127.0.0.1:55292_e_%2Fdx x:collection1 s:shard1 c:control_collection r:core_node1) [n:127.0.0.1:55292_e_%2Fdx c:control_collection s:shard1 r:core_node1 x:collection1] o.a.s.c.ZkController Register replica - core:collection1 address:http://127.0.0.1:55292/e_/dx collection:control_collection shard:shard1
   [junit4]   2> 2042709 INFO  (coreZkRegister-7757-thread-1-processing-n:127.0.0.1:55292_e_%2Fdx x:collection1 s:shard1 c:control_collection r:core_node1) [n:127.0.0.1:55292_e_%2Fdx c:control_collection s:shard1 r:core_node1 x:collection1] o.a.s.c.c.SolrZkClient makePath: /collections/control_collection/leader_elect/shard1/election
   [junit4]   2> 2042710 INFO  (coreZkRegister-7757-thread-1-processing-n:127.0.0.1:55292_e_%2Fdx x:collection1 s:shard1 c:control_collection r:core_node1) [n:127.0.0.1:55292_e_%2Fdx c:control_collection s:shard1 r:core_node1 x:collection1] o.a.s.c.LeaderElector Joined leadership election with path: /collections/control_collection/leader_elect/shard1/election/95722071216291844-core_node1-n_0000000000
   [junit4]   2> 2042710 INFO  (coreZkRegister-7757-thread-1-processing-n:127.0.0.1:55292_e_%2Fdx x:collection1 s:shard1 c:control_collection r:core_node1) [n:127.0.0.1:55292_e_%2Fdx c:control_collection s:shard1 r:core_node1 x:collection1] o.a.s.c.ShardLeaderElectionContext Running the leader process for shard=shard1 and weAreReplacement=false and leaderVoteWait=10000
   [junit4]   2> 2042717 INFO  (coreZkRegister-7757-thread-1-processing-n:127.0.0.1:55292_e_%2Fdx x:collection1 s:shard1 c:control_collection r:core_node1) [n:127.0.0.1:55292_e_%2Fdx c:control_collection s:shard1 r:core_node1 x:collection1] o.a.s.c.ShardLeaderElectionContext Enough replicas found to continue.
   [junit4]   2> 2042717 INFO  (coreZkRegister-7757-thread-1-processing-n:127.0.0.1:55292_e_%2Fdx x:collection1 s:shard1 c:control_collection r:core_node1) [n:127.0.0.1:55292_e_%2Fdx c:control_collection s:shard1 r:core_node1 x:collection1] o.a.s.c.ShardLeaderElectionContext I may be the new leader - try and sync
   [junit4]   2> 2042717 INFO  (coreZkRegister-7757-thread-1-processing-n:127.0.0.1:55292_e_%2Fdx x:collection1 s:shard1 c:control_collection r:core_node1) [n:127.0.0.1:55292_e_%2Fdx c:control_collection s:shard1 r:core_node1 x:collection1] o.a.s.c.SyncStrategy Sync replicas to http://127.0.0.1:55292/e_/dx/collection1/
   [junit4]   2> 2042717 INFO  (coreZkRegister-7757-thread-1-processing-n:127.0.0.1:55292_e_%2Fdx x:collection1 s:shard1 c:control_collection r:core_node1) [n:127.0.0.1:55292_e_%2Fdx c:control_collection s:shard1 r:core_node1 x:collection1] o.a.s.c.SyncStrategy Sync Success - now sync replicas to me
   [junit4]   2> 2042717 INFO  (coreZkRegister-7757-thread-1-processing-n:127.0.0.1:55292_e_%2Fdx x:collection1 s:shard1 c:control_collection r:core_node1) [n:127.0.0.1:55292_e_%2Fdx c:control_collection s:shard1 r:core_node1 x:collection1] o.a.s.c.SyncStrategy http://127.0.0.1:55292/e_/dx/collection1/ has no replicas
   [junit4]   2> 2042718 INFO  (OverseerStateUpdate-95722071216291844-127.0.0.1:55292_e_%2Fdx-n_0000000000) [n:127.0.0.1:55292_e_%2Fdx    ] o.a.s.c.Overseer processMessage: queueSize: 1, message = {
   [junit4]   2>   "operation":"leader",
   [junit4]   2>   "shard":"shard1",
   [junit4]   2>   "collection":"control_collection"} current state version: 1
   [junit4]   2> 2042719 INFO  (coreZkRegister-7757-thread-1-processing-n:127.0.0.1:55292_e_%2Fdx x:collection1 s:shard1 c:control_collection r:core_node1) [n:127.0.0.1:55292_e_%2Fdx c:control_collection s:shard1 r:core_node1 x:collection1] o.a.s.c.c.SolrZkClient makePath: /collections/control_collection/leaders/shard1
   [junit4]   2> 2042719 INFO  (coreZkRegister-7757-thread-1-processing-n:127.0.0.1:55292_e_%2Fdx x:collection1 s:shard1 c:control_collection r:core_node1) [n:127.0.0.1:55292_e_%2Fdx c:control_collection s:shard1 r:core_node1 x:collection1] o.a.s.c.ShardLeaderElectionContextBase Creating leader registration node /collections/control_collection/leaders/shard1/leader after winning as /collections/control_collection/leader_elect/shard1/election/95722071216291844-core_node1-n_0000000000
   [junit4]   2> 2042720 INFO  (coreZkRegister-7757-thread-1-processing-n:127.0.0.1:55292_e_%2Fdx x:collection1 s:shard1 c:control_collection r:core_node1) [n:127.0.0.1:55292_e_%2Fdx c:control_collection s:shard1 r:core_node1 x:collection1] o.a.s.c.ShardLeaderElectionContext I am the new leader: http://127.0.0.1:55292/e_/dx/collection1/ shard1
   [junit4]   2> 2042721 INFO  (OverseerStateUpdate-95722071216291844-127.0.0.1:55292_e_%2Fdx-n_0000000000) [n:127.0.0.1:55292_e_%2Fdx    ] o.a.s.c.Overseer processMessage: queueSize: 1, message = {
   [junit4]   2>   "operation":"leader",
   [junit4]   2>   "shard":"shard1",
   [junit4]   2>   "collection":"control_collection",
   [junit4]   2>   "base_url":"http://127.0.0.1:55292/e_/dx",
   [junit4]   2>   "core":"collection1",
   [junit4]   2>   "state":"active"} current state version: 1
   [junit4]   2> 2042823 INFO  (zkCallback-17673-thread-3-processing-n:127.0.0.1:55292_e_%2Fdx) [n:127.0.0.1:55292_e_%2Fdx    ] o.a.s.c.c.ZkStateReader A cluster state change: [WatchedEvent state:SyncConnected type:NodeDataChanged path:/clusterstate.json], has occurred - updating... (live nodes size: [1])
   [junit4]   2> 2042877 INFO  (coreZkRegister-7757-thread-1-processing-n:127.0.0.1:55292_e_%2Fdx x:collection1 s:shard1 c:control_collection r:core_node1) [n:127.0.0.1:55292_e_%2Fdx c:control_collection s:shard1 r:core_node1 x:collection1] o.a.s.c.ZkController We are http://127.0.0.1:55292/e_/dx/collection1/ and leader is http://127.0.0.1:55292/e_/dx/collection1/
   [junit4]   2> 2042877 INFO  (coreZkRegister-7757-thread-1-processing-n:127.0.0.1:55292_e_%2Fdx x:collection1 s:shard1 c:control_collection r:core_node1) [n:127.0.0.1:55292_e_%2Fdx c:control_collection s:shard1 r:core_node1 x:collection1] o.a.s.c.ZkController No LogReplay needed for core=collection1 baseURL=http://127.0.0.1:55292/e_/dx
   [junit4]   2> 2042877 INFO  (coreZkRegister-7757-thread-1-processing-n:127.0.0.1:55292_e_%2Fdx x:collection1 s:shard1 c:control_collection r:core_node1) [n:127.0.0.1:55292_e_%2Fdx c:control_collection s:shard1 r:core_node1 x:collection1] o.a.s.c.ZkController I am the leader, no recovery necessary
   [junit4]   2> 2042877 INFO  (coreZkRegister-7757-thread-1-processing-n:127.0.0.1:55292_e_%2Fdx x:collection1 s:shard1 c:control_collection r:core_node1) [n:127.0.0.1:55292_e_%2Fdx c:control_collection s:shard1 r:core_node1 x:collection1] o.a.s.c.ZkController publishing state=active
   [junit4]   2> 2042877 INFO  (coreZkRegister-7757-thread-1-processing-n:127.0.0.1:55292_e_%2Fdx x:collection1 s:shard1 c:control_collection r:core_node1) [n:127.0.0.1:55292_e_%2Fdx c:control_collection s:shard1 r:core_node1 x:collection1] o.a.s.c.ZkController numShards not found on descriptor - reading it from system property
   [junit4]   2> 2042879 INFO  (OverseerStateUpdate-95722071216291844-127.0.0.1:55292_e_%2Fdx-n_0000000000) [n:127.0.0.1:55292_e_%2Fdx    ] o.a.s.c.Overseer processMessage: queueSize: 1, message = {
   [junit4]   2>   "core":"collection1",
   [junit4]   2>   "core_node_name":"core_node1",
   [junit4]   2>   "roles":null,
   [junit4]   2>   "base_url":"http://127.0.0.1:55292/e_/dx",
   [junit4]   2>   "node_name":"127.0.0.1:55292_e_%2Fdx",
   [junit4]   2>   "numShards":"1",
   [junit4]   2>   "state":"active",
   [junit4]   2>   "shard":"shard1",
   [junit4]   2>   "collection":"control_collection",
   [junit4]   2>   "operation":"state"} current state version: 2
   [junit4]   2> 2042879 INFO  (OverseerStateUpdate-95722071216291844-127.0.0.1:55292_e_%2Fdx-n_0000000000) [n:127.0.0.1:55292_e_%2Fdx    ] o.a.s.c.o.ReplicaMutator Update state numShards=1 message={
   [junit4]   2>   "core":"collection1",
   [junit4]   2>   "core_node_name":"core_node1",
   [junit4]   2>   "roles":null,
   [junit4]   2>   "base_url":"http://127.0.0.1:55292/e_/dx",
   [junit4]   2>   "node_name":"127.0.0.1:55292_e_%2Fdx",
   [junit4]   2>   "numShards":"1",
   [junit4]   2>   "state":"active",
   [junit4]   2>   "shard":"shard1",
   [junit4]   2>   "collection":"control_collection",
   [junit4]   2>   "operation":"state"}
   [junit4]   2> 2043028 INFO  (TEST-ConnectionReuseTest.test-seed#[FA13C6377C897E63]) [    ] o.a.s.c.s.i.CloudSolrClient Final constructed zkHost string: 127.0.0.1:46264/solr
   [junit4]   2> 2043029 INFO  (TEST-ConnectionReuseTest.test-seed#[FA13C6377C897E63]) [    ] o.a.s.c.c.SolrZkClient Using default ZkCredentialsProvider
   [junit4]   2> 2043031 INFO  (zkCallback-17673-thread-3-processing-n:127.0.0.1:55292_e_%2Fdx) [n:127.0.0.1:55292_e_%2Fdx    ] o.a.s.c.c.ZkStateReader A cluster state change: [WatchedEvent state:SyncConnected type:NodeDataChanged path:/clusterstate.json], has occurred - updating... (live nodes size: [1])
   [junit4]   2> 2043037 INFO  (TEST-ConnectionReuseTest.test-seed#[FA13C6377C897E63]) [    ] o.a.s.c.c.ConnectionManager Waiting for client to connect to ZooKeeper
   [junit4]   2> 2043050 INFO  (zkCallback-17675-thread-1) [    ] o.a.s.c.c.ConnectionManager Watcher org.apache.solr.common.cloud.ConnectionManager@5974965b name:ZooKeeperConnection Watcher:127.0.0.1:46264/solr got event WatchedEvent state:SyncConnected type:None path:null path:null type:None
   [junit4]   2> 2043050 INFO  (TEST-ConnectionReuseTest.test-seed#[FA13C6377C897E63]) [    ] o.a.s.c.c.ConnectionManager Client is connected to ZooKeeper
   [junit4]   2> 2043050 INFO  (TEST-ConnectionReuseTest.test-seed#[FA13C6377C897E63]) [    ] o.a.s.c.c.SolrZkClient Using default ZkACLProvider
   [junit4]   2> 2043050 INFO  (TEST-ConnectionReuseTest.test-seed#[FA13C6377C897E63]) [    ] o.a.s.c.c.ZkStateReader Updating cluster state from ZooKeeper... 
   [junit4]   2> 2043051 INFO  (TEST-ConnectionReuseTest.test-seed#[FA13C6377C897E63]) [    ] o.a.s.c.c.ZkStateReader Updated live nodes from ZooKeeper... (0) -> (1)
   [junit4]   2> 2043052 INFO  (TEST-ConnectionReuseTest.test-seed#[FA13C6377C897E63]) [    ] o.a.s.c.ChaosMonkey monkey: init - expire sessions:false cause connection loss:false
   [junit4]   2> 2043052 INFO  (TEST-ConnectionReuseTest.test-seed#[FA13C6377C897E63]) [    ] o.a.s.c.AbstractFullDistribZkTestBase Creating collection1 with stateFormat=2
   [junit4]   2> 2043052 INFO  (TEST-ConnectionReuseTest.test-seed#[FA13C6377C897E63]) [    ] o.a.s.c.c.SolrZkClient Using default ZkCredentialsProvider
   [junit4]   2> 2043052 INFO  (TEST-ConnectionReuseTest.test-seed#[FA13C6377C897E63]) [    ] o.a.s.c.c.ConnectionManager Waiting for client to connect to ZooKeeper
   [junit4]   2> 2043053 INFO  (zkCallback-17676-thread-1) [    ] o.a.s.c.c.ConnectionManager Watcher org.apache.solr.common.cloud.ConnectionManager@11780c86 name:ZooKeeperConnection Watcher:127.0.0.1:46264/solr got event WatchedEvent state:SyncConnected type:None path:null path:null type:None
   [junit4]   2> 2043054 INFO  (TEST-ConnectionReuseTest.test-seed#[FA13C6377C897E63]) [    ] o.a.s.c.c.ConnectionManager Client is connected to ZooKeeper
   [junit4]   2> 2043054 INFO  (TEST-ConnectionReuseTest.test-seed#[FA13C6377C897E63]) [    ] o.a.s.c.c.SolrZkClient Using default ZkACLProvider
   [junit4]   2> 2043061 INFO  (OverseerStateUpdate-95722071216291844-127.0.0.1:55292_e_%2Fdx-n_0000000000) [n:127.0.0.1:55292_e_%2Fdx    ] o.a.s.c.Overseer processMessage: queueSize: 1, message = {
   [junit4]   2>   "operation":"create",
   [junit4]   2>   "name":"collection1",
   [junit4]   2>   "numShards":"1",
   [junit4]   2>   "stateFormat":"2"} current state version: 3
   [junit4]   2> 2043061 INFO  (OverseerStateUpdate-95722071216291844-127.0.0.1:55292_e_%2Fdx-n_0000000000) [n:127.0.0.1:55292_e_%2Fdx    ] o.a.s.c.o.ClusterStateMutator building a new cName: collection1
   [junit4]   2> 2043116 INFO  (TEST-ConnectionReuseTest.test-seed#[FA13C6377C897E63]) [    ] o.a.s.SolrTestCaseJ4 Writing core.properties file to /x1/jenkins/jenkins-slave/workspace/Lucene-Solr-Tests-6.x/solr/build/solr-core/test/J0/temp/solr.client.solrj.ConnectionReuseTest_FA13C6377C897E63-001/shard-1-001/cores/collection1
   [junit4]   2> 2043116 INFO  (TEST-ConnectionReuseTest.test-seed#[FA13C6377C897E63]) [    ] o.a.s.c.AbstractFullDistribZkTestBase create jetty 1 in directory /x1/jenkins/jenkins-slave/workspace/Lucene-Solr-Tests-6.x/solr/build/solr-core/test/J0/temp/solr.client.solrj.ConnectionReuseTest_FA13C6377C897E63-001/shard-1-001
   [junit4]   2> 2043117 INFO  (TEST-ConnectionReuseTest.test-seed#[FA13C6377C897E63]) [    ] o.e.j.s.Server jetty-9.3.8.v20160314
   [junit4]   2> 2043118 INFO  (TEST-ConnectionReuseTest.test-seed#[FA13C6377C897E63]) [    ] o.e.j.s.h.ContextHandler Started o.e.j.s.ServletContextHandler@461220e8{/e_/dx,null,AVAILABLE}
   [junit4]   2> 2043119 INFO  (TEST-ConnectionReuseTest.test-seed#[FA13C6377C897E63]) [    ] o.e.j.s.ServerConnector Started ServerConnector@77b49a06{HTTP/1.1,[http/1.1]}{127.0.0.1:55169}
   [junit4]   2> 2043119 INFO  (TEST-ConnectionReuseTest.test-seed#[FA13C6377C897E63]) [    ] o.e.j.s.Server Started @2047676ms
   [junit4]   2> 2043119 INFO  (TEST-ConnectionReuseTest.test-seed#[FA13C6377C897E63]) [    ] o.a.s.c.s.e.JettySolrRunner Jetty properties: {solr.data.dir=/x1/jenkins/jenkins-slave/workspace/Lucene-Solr-Tests-6.x/solr/build/solr-core/test/J0/temp/solr.client.solrj.ConnectionReuseTest_FA13C6377C897E63-001/tempDir-001/jetty1, solrconfig=solrconfig.xml, hostContext=/e_/dx, hostPort=55169, coreRootDirectory=/x1/jenkins/jenkins-slave/workspace/Lucene-Solr-Tests-6.x/solr/build/solr-core/test/J0/../../../../../../../../../../x1/jenkins/jenkins-slave/workspace/Lucene-Solr-Tests-6.x/solr/build/solr-core/test/J0/temp/solr.client.solrj.ConnectionReuseTest_FA13C6377C897E63-001/shard-1-001/cores}
   [junit4]   2> 2043119 INFO  (TEST-ConnectionReuseTest.test-seed#[FA13C6377C897E63]) [    ] o.a.s.s.SolrDispatchFilter SolrDispatchFilter.init(): sun.misc.Launcher$AppClassLoader@73d16e93
   [junit4]   2> 2043119 INFO  (TEST-ConnectionReuseTest.test-seed#[FA13C6377C897E63]) [    ] o.a.s.c.SolrResourceLoader new SolrResourceLoader for directory: '/x1/jenkins/jenkins-slave/workspace/Lucene-Solr-Tests-6.x/solr/build/solr-core/test/J0/temp/solr.client.solrj.ConnectionReuseTest_FA13C6377C897E63-001/shard-1-001'
   [junit4]   2> 2043120 INFO  (TEST-ConnectionReuseTest.test-seed#[FA13C6377C897E63]) [    ] o.a.s.c.SolrResourceLoader JNDI not configured for solr (NoInitialContextEx)
   [junit4]   2> 2043120 INFO  (TEST-ConnectionReuseTest.test-seed#[FA13C6377C897E63]) [    ] o.a.s.c.SolrResourceLoader solr home defaulted to 'solr/' (could not find system property or JNDI)
   [junit4]   2> 2043120 INFO  (TEST-ConnectionReuseTest.test-seed#[FA13C6377C897E63]) [    ] o.a.s.c.c.SolrZkClient Using default ZkCredentialsProvider
   [junit4]   2> 2043120 INFO  (TEST-ConnectionReuseTest.test-seed#[FA13C6377C897E63]) [    ] o.a.s.c.c.ConnectionManager Waiting for client to connect to ZooKeeper
   [junit4]   2> 2043122 INFO  (zkCallback-17677-thread-1) [    ] o.a.s.c.c.ConnectionManager Watcher org.apache.solr.common.cloud.ConnectionManager@675f5ba7 name:ZooKeeperConnection Watcher:127.0.0.1:46264/solr got event WatchedEvent state:SyncConnected type:None path:null path:null type:None
   [junit4]   2> 2043122 INFO  (TEST-ConnectionReuseTest.test-seed#[FA13C6377C897E63]) [    ] o.a.s.c.c.ConnectionManager Client is connected to ZooKeeper
   [junit4]   2> 2043122 INFO  (TEST-ConnectionReuseTest.test-seed#[FA13C6377C897E63]) [    ] o.a.s.c.c.SolrZkClient Using default ZkACLProvider
   [junit4]   2> 2043123 INFO  (TEST-ConnectionReuseTest.test-seed#[FA13C6377C897E63]) [    ] o.a.s.s.SolrDispatchFilter Loading solr.xml from SolrHome (not found in ZooKeeper)
   [junit4]   2> 2043123 INFO  (TEST-ConnectionReuseTest.test-seed#[FA13C6377C897E63]) [    ] o.a.s.c.SolrXmlConfig Loading container configuration from /x1/jenkins/jenkins-slave/workspace/Lucene-Solr-Tests-6.x/solr/build/solr-core/test/J0/temp/solr.client.solrj.ConnectionReuseTest_FA13C6377C897E63-001/shard-1-001/solr.xml
   [junit4]   2> 2043129 INFO  (TEST-ConnectionReuseTest.test-seed#[FA13C6377C897E63]) [    ] o.a.s.c.CorePropertiesLocator Config-defined core root directory: /x1/jenkins/jenkins-slave/workspace/Lucene-Solr-Tests-6.x/solr/build/solr-core/test/J0/../../../../../../../../../../x1/jenkins/jenkins-slave/workspace/Lucene-Solr-Tests-6.x/solr/build/solr-core/test/J0/temp/solr.client.solrj.ConnectionReuseTest_FA13C6377C897E63-001/shard-1-001/cores
   [junit4]   2> 2043129 INFO  (TEST-ConnectionReuseTest.test-seed#[FA13C6377C897E63]) [    ] o.a.s.c.CoreContainer New CoreContainer 1439597964
   [junit4]   2> 2043129 INFO  (TEST-ConnectionReuseTest.test-seed#[FA13C6377C897E63]) [    ] o.a.s.c.CoreContainer Loading cores into CoreContainer [instanceDir=/x1/jenkins/jenkins-slave/workspace/Lucene-Solr-Tests-6.x/solr/build/solr-core/test/J0/temp/solr.client.solrj.ConnectionReuseTest_FA13C6377C897E63-001/shard-1-001]
   [junit4]   2> 2043130 WARN  (TEST-ConnectionReuseTest.test-seed#[FA13C6377C897E63]) [    ] o.a.s.c.CoreContainer Couldn't add files from /x1/jenkins/jenkins-slave/workspace/Lucene-Solr-Tests-6.x/solr/build/solr-core/test/J0/temp/solr.client.solrj.ConnectionReuseTest_FA13C6377C897E63-001/shard-1-001/lib to classpath: /x1/jenkins/jenkins-slave/workspace/Lucene-Solr-Tests-6.x/solr/build/solr-core/test/J0/temp/solr.client.solrj.ConnectionReuseTest_FA13C6377C897E63-001/shard-1-001/lib
   [junit4]   2> 2043130 INFO  (TEST-ConnectionReuseTest.test-seed#[FA13C6377C897E63]) [    ] o.a.s.h.c.HttpShardHandlerFactory created with socketTimeout : 90000,urlScheme : ,connTimeout : 15000,maxConnectionsPerHost : 20,maxConnections : 10000,corePoolSize : 0,maximumPoolSize : 2147483647,maxThreadIdleTime : 5,sizeOfQueue : -1,fairnessPolicy : false,useRetries : false,
   [junit4]   2> 2043131 INFO  (TEST-ConnectionReuseTest.test-seed#[FA13C6377C897E63]) [    ] o.a.s.u.UpdateShardHandler Creating UpdateShardHandler HTTP client with params: socketTimeout=340000&connTimeout=45000&retry=true
   [junit4]   2> 2043132 INFO  (TEST-ConnectionReuseTest.test-seed#[FA13C6377C897E63]) [    ] o.a.s.l.LogWatcher SLF4J impl is org.slf4j.impl.Log4jLoggerFactory
   [junit4]   2> 2043132 INFO  (TEST-ConnectionReuseTest.test-seed#[FA13C6377C897E63]) [    ] o.a.s.l.LogWatcher Registering Log Listener [Log4j (org.slf4j.impl.Log4jLoggerFactory)]
   [junit4]   2> 2043132 INFO  (TEST-ConnectionReuseTest.test-seed#[FA13C6377C897E63]) [    ] o.a.s.c.ZkContainer Zookeeper client=127.0.0.1:46264/solr
   [junit4]   2> 2043132 INFO  (TEST-ConnectionReuseTest.test-seed#[FA13C6377C897E63]) [    ] o.a.s.c.ZkController zkHost includes chroot
   [junit4]   2> 2043132 INFO  (TEST-ConnectionReuseTest.test-seed#[FA13C6377C897E63]) [    ] o.a.s.c.c.SolrZkClient Using default ZkCredentialsProvider
   [junit4]   2> 2043133 INFO  (TEST-ConnectionReuseTest.test-seed#[FA13C6377C897E63]) [    ] o.a.s.c.c.ConnectionManager Waiting for client to connect to ZooKeeper
   [junit4]   2> 2043134 INFO  (zkCallback-17680-thread-1) [    ] o.a.s.c.c.ConnectionManager Watcher org.apache.solr.common.cloud.ConnectionManager@66f51cd6 name:ZooKeeperConnection Watcher:127.0.0.1:46264 got event WatchedEvent state:SyncConnected type:None path:null path:null type:None
   [junit4]   2> 2043134 INFO  (TEST-ConnectionReuseTest.test-seed#[FA13C6377C897E63]) [    ] o.a.s.c.c.ConnectionManager Client is connected to ZooKeeper
   [junit4]   2> 2043134 INFO  (TEST-ConnectionReuseTest.test-seed#[FA13C6377C897E63]) [    ] o.a.s.c.c.SolrZkClient Using default ZkACLProvider
   [junit4]   2> 2043169 INFO  (TEST-ConnectionReuseTest.test-seed#[FA13C6377C897E63]) [n:127.0.0.1:55169_e_%2Fdx    ] o.a.s.c.c.ConnectionManager Waiting for client to connect to ZooKeeper
   [junit4]   2> 2043173 INFO  (OverseerStateUpdate-95722071216291844-127.0.0.1:55292_e_%2Fdx-n_0000000000) [n:127.0.0.1:55292_e_%2Fdx    ] o.a.s.c.o.ZkStateWriter going to create_collection /collections/collection1/state.json
   [junit4]   2> 2043185 INFO  (zkCallback-17681-thread-1-processing-n:127.0.0.1:55169_e_%2Fdx) [n:127.0.0.1:55169_e_%2Fdx    ] o.a.s.c.c.ConnectionManager Watcher org.apache.solr.common.cloud.ConnectionManager@78b08a70 name:ZooKeeperConnection Watcher:127.0.0.1:46264/solr got event WatchedEvent state:SyncConnected type:None path:null path:null type:None
   [junit4]   2> 2043188 INFO  (TEST-ConnectionReuseTest.test-seed#[FA13C6377C897E63]) [n:127.0.0.1:55169_e_%2Fdx    ] o.a.s.c.c.ConnectionManager Client is connected to ZooKeeper
   [junit4]   2> 2043256 INFO  (TEST-ConnectionReuseTest.test-seed#[FA13C6377C897E63]) [n:127.0.0.1:55169_e_%2Fdx    ] o.a.s.c.c.ZkStateReader Updating cluster state from ZooKeeper... 
   [junit4]   2> 2043257 INFO  (TEST-ConnectionReuseTest.test-seed#[FA13C6377C897E63]) [n:127.0.0.1:55169_e_%2Fdx    ] o.a.s.c.c.ZkStateReader Updated live nodes from ZooKeeper... (0) -> (1)
   [junit4]   2> 2043258 INFO  (TEST-ConnectionReuseTest.test-seed#[FA13C6377C897E63]) [n:127.0.0.1:55169_e_%2Fdx    ] o.a.s.c.Overseer Overseer (id=null) closing
   [junit4]   2> 2043259 INFO  (TEST-ConnectionReuseTest.test-seed#[FA13C6377C897E63]) [n:127.0.0.1:55169_e_%2Fdx    ] o.a.s.c.LeaderElector Joined leadership election with path: /overseer_elect/election/95722071216291849-127.0.0.1:55169_e_%2Fdx-n_0000000001
   [junit4]   2> 2043259 INFO  (TEST-ConnectionReuseTest.test-seed#[FA13C6377C897E63]) [n:127.0.0.1:55169_e_%2Fdx    ] o.a.s.c.LeaderElector Watching path /overseer_elect/election/95722071216291844-127.0.0.1:55292_e_%2Fdx-n_0000000000 to know if I could be the leader
   [junit4]   2> 2043259 INFO  (TEST-ConnectionReuseTest.test-seed#[FA13C6377C897E63]) [n:127.0.0.1:55169_e_%2Fdx    ] o.a.s.c.ZkController Publish node=127.0.0.1:55169_e_%2Fdx as DOWN
   [junit4]   2> 2043260 INFO  (OverseerStateUpdate-95722071216291844-127.0.0.1:55292_e_%2Fdx-n_0000000000) [n:127.0.0.1:55292_e_%2Fdx    ] o.a.s.c.Overseer processMessage: queueSize: 1, message = {
   [junit4]   2>   "operation":"downnode",
   [junit4]   2>   "node_name":"127.0.0.1:55169_e_%2Fdx"} current state version: 3
   [junit4]   2> 2043260 INFO  (OverseerStateUpdate-95722071216291844-127.0.0.1:55292_e_%2Fdx-n_0000000000) [n:127.0.0.1:55292_e_%2Fdx    ] o.a.s.c.o.NodeMutator DownNode state invoked for node: 127.0.0.1:55169_e_%2Fdx
   [junit4]   2> 2043261 INFO  (OverseerStateUpdate-95722071216291844-127.0.0.1:55292_e_%2Fdx-n_0000000000) [n:127.0.0.1:55292_e_%2Fdx    ] o.a.s.c.o.ZkStateWriter going to update_collection /collections/collection1/state.json version: 0
   [junit4]   2> 2043378 INFO  (zkCallback-17675-thread-1) [    ] o.a.s.c.c.ZkStateReader A cluster state change: [WatchedEvent state:SyncConnected type:NodeDataChanged path:/clusterstate.json], has occurred - updating... (live nodes size: [1])
   [junit4]   2> 2043379 INFO  (zkCallback-17681-thread-1-processing-n:127.0.0.1:55169_e_%2Fdx) [n:127.0.0.1:55169_e_%2Fdx    ] o.a.s.c.c.ZkStateReader A cluster state change: [WatchedEvent state:SyncConnected type:NodeDataChanged path:/clusterstate.json], has occurred - updating... (live nodes size: [1])
   [junit4]   2> 2043380 INFO  (zkCallback-17673-thread-3-processing-n:127.0.0.1:55292_e_%2Fdx) [n:127.0.0.1:55292_e_%2Fdx    ] o.a.s.c.c.ZkStateReader A cluster state change: [WatchedEvent state:SyncConnected type:NodeDataChanged path:/clusterstate.json], has occurred - updating... (live nodes size: [1])
   [junit4]   2> 2044260 INFO  (TEST-ConnectionReuseTest.test-seed#[FA13C6377C897E63]) [n:127.0.0.1:55169_e_%2Fdx    ] o.a.s.c.ZkController Register node as live in ZooKeeper:/live_nodes/127.0.0.1:55169_e_%2Fdx
   [junit4]   2> 2044265 INFO  (TEST-ConnectionReuseTest.test-seed#[FA13C6377C897E63]) [n:127.0.0.1:55169_e_%2Fdx    ] o.a.s.c.c.SolrZkClient makePath: /live_nodes/127.0.0.1:55169_e_%2Fdx
   [junit4]   2> 2044282 INFO  (zkCallback-17673-thread-3-processing-n:127.0.0.1:55292_e_%2Fdx) [n:127.0.0.1:55292_e_%2Fdx    ] o.a.s.c.c.ZkStateReader A live node change: [WatchedEvent state:SyncConnected type:NodeChildrenChanged path:/live_nodes], has occurred - updating... (live nodes size: [1])
   [junit4]   2> 2044282 INFO  (zkCallback-17673-thread-3-processing-n:127.0.0.1:55292_e_%2Fdx) [n:127.0.0.1:55292_e_%2Fdx    ] o.a.s.c.c.ZkStateReader Updated live nodes from ZooKeeper... (1) -> (2)
   [junit4]   2> 2044285 INFO  (zkCallback-17675-thread-1) [    ] o.a.s.c.c.ZkStateReader A live node change: [WatchedEvent state:SyncConnected type:NodeChildrenChanged path:/live_nodes], has occurred - updating... (live nodes size: [1])
   [junit4]   2> 2044285 INFO  (zkCallback-17681-thread-1-processing-n:127.0.0.1:55169_e_%2Fdx) [n:127.0.0.1:55169_e_%2Fdx    ] o.a.s.c.c.ZkStateReader A live node change: [WatchedEvent state:SyncConnected type:NodeChildrenChanged path:/live_nodes], has occurred - updating... (live nodes size: [1])
   [junit4]   2> 2044289 INFO  (zkCallback-17675-thread-1) [    ] o.a.s.c.c.ZkStateReader Updated live nodes from ZooKeeper... (1) -> (2)
   [junit4]   2> 2044289 INFO  (zkCallback-17681-thread-1-processing-n:127.0.0.1:55169_e_%2Fdx) [n:127.0.0.1:55169_e_%2Fdx    ] o.a.s.c.c.ZkStateReader Updated live nodes from ZooKeeper... (1) -> (2)
   [junit4]   2> 2044297 INFO  (TEST-ConnectionReuseTest.test-seed#[FA13C6377C897E63]) [n:127.0.0.1:55169_e_%2Fdx    ] o.a.s.c.CoreContainer Security conf doesn't exist. Skipping setup for authorization module.
   [junit4]   2> 2044297 INFO  (TEST-ConnectionReuseTest.test-seed#[FA13C6377C897E63]) [n:127.0.0.1:55169_e_%2Fdx    ] o.a.s.c.CoreContainer No authentication plugin used.
   [junit4]   2> 2044298 INFO  (TEST-ConnectionReuseTest.test-seed#[FA13C6377C897E63]) [n:127.0.0.1:55169_e_%2Fdx    ] o.a.s.c.CorePropertiesLocator Looking for core definitions underneath /x1/jenkins/jenkins-slave/workspace/Lucene-Solr-Tests-6.x/solr/build/solr-core/test/J0/../../../../../../../../../../x1/jenkins/jenkins-slave/workspace/Lucene-Solr-Tests-6.x/solr/build/solr-core/test/J0/temp/solr.client.solrj.ConnectionReuseTest_FA13C6377C897E63-001/shard-1-001/cores
   [junit4]   2> 2044299 INFO  (TEST-ConnectionReuseTest.test-seed#[FA13C6377C897E63]) [n:127.0.0.1:55169_e_%2Fdx    ] o.a.s.c.CoreDescriptor Created CoreDescriptor: {name=collection1, config=solrconfig.xml, transient=false, schema=schema.xml, loadOnStartup=true, configSetProperties=configsetprops.json, collection=collection1, coreNodeName=, dataDir=data/, shard=}
   [junit4]   2> 2044299 INFO  (TEST-ConnectionReuseTest.test-seed#[FA13C6377C897E63]) [n:127.0.0.1:55169_e_%2Fdx    ] o.a.s.c.CorePropertiesLocator Found core collection1 in /x1/jenkins/jenkins-slave/workspace/Lucene-Solr-Tests-6.x/solr/build/solr-core/test/J0/../../../../../../../../../../x1/jenkins/jenkins-slave/workspace/Lucene-Solr-Tests-6.x/solr/build/solr-core/test/J0/temp/solr.client.solrj.ConnectionReuseTest_FA13C6377C897E63-001/shard-1-001/cores/collection1
   [junit4]   2> 2044299 INFO  (TEST-ConnectionReuseTest.test-seed#[FA13C6377C897E63]) [n:127.0.0.1:55169_e_%2Fdx    ] o.a.s.c.CorePropertiesLocator Found 1 core definitions
   [junit4]   2> 2044309 INFO  (TEST-ConnectionReuseTest.test-seed#[FA13C6377C897E63]) [n:127.0.0.1:55169_e_%2Fdx    ] o.a.s.s.SolrDispatchFilter user.dir=/x1/jenkins/jenkins-slave/workspace/Lucene-Solr-Tests-6.x/solr/build/solr-core/test/J0
   [junit4]   2> 2044309 INFO  (TEST-ConnectionReuseTest.test-seed#[FA13C6377C897E63]) [n:127.0.0.1:55169_e_%2Fdx    ] o.a.s.s.SolrDispatchFilter SolrDispatchFilter.init() done
   [junit4]   2> 2044313 INFO  (coreLoadExecutor-7774-thread-1-processing-n:127.0.0.1:55169_e_%2Fdx) [n:127.0.0.1:55169_e_%2Fdx c:collection1   x:collection1] o.a.s.c.ZkController publishing state=down
   [junit4]   2> 2044313 INFO  (coreLoadExecutor-7774-thread-1-processing-n:127.0.0.1:55169_e_%2Fdx) [n:127.0.0.1:55169_e_%2Fdx c:collection1   x:collection1] o.a.s.c.ZkController numShards not found on descriptor - reading it from system property
   [junit4]   2> 2044318 INFO  (coreLoadExecutor-7774-thread-1-processing-n:127.0.0.1:55169_e_%2Fdx) [n:127.0.0.1:55169_e_%2Fdx c:collection1   x:collection1] o.a.s.c.ZkController Registering watch for collection collection1
   [junit4]   2> 2044318 INFO  (coreLoadExecutor-7774-thread-1-processing-n:127.0.0.1:55169_e_%2Fdx) [n:127.0.0.1:55169_e_%2Fdx c:collection1   x:collection1] o.a.s.c.c.ZkStateReader addZkWatch [collection1]
   [junit4]   2> 2044319 INFO  (OverseerStateUpdate-95722071216291844-127.0.0.1:55292_e_%2Fdx-n_0000000000) [n:127.0.0.1:55292_e_%2Fdx    ] o.a.s.c.Overseer processMessage: queueSize: 1, message = {
   [junit4]   2>   "core":"collection1",
   [junit4]   2>   "roles":null,
   [junit4]   2>   "base_url":"http://127.0.0.1:55169/e_/dx",
   [junit4]   2>   "node_name":"127.0.0.1:55169_e_%2Fdx",
   [junit4]   2>   "numShards":"1",
   [junit4]   2>   "state":"down",
   [junit4]   2>   "shard":null,
   [junit4]   2>   "collection":"collection1",
   [junit4]   2>   "operation":"state"} current state version: 4
   [junit4]   2> 2044319 INFO  (OverseerStateUpdate-95722071216291844-127.0.0.1:55292_e_%2Fdx-n_0000000000) [n:127.0.0.1:55292_e_%2Fdx    ] o.a.s.c.o.ReplicaMutator Update state numShards=1 message={
   [junit4]   2>   "core":"collection1",
   [junit4]   2>   "roles":null,
   [junit4]   2>   "base_url":"http://127.0.0.1:55169/e_/dx",
   [junit4]   2>   "node_name":"127.0.0.1:55169_e_%2Fdx",
   [junit4]   2>   "numShards":"1",
   [junit4]   2>   "state":"down",
   [junit4]   2>   "shard":null,
   [junit4]   2>   "collection":"collection1",
   [junit4]   2>   "operation":"state"}
   [junit4]   2> 2044319 INFO  (OverseerStateUpdate-95722071216291844-127.0.0.1:55292_e_%2Fdx-n_0000000000) [n:127.0.0.1:55292_e_%2Fdx    ] o.a.s.c.o.ReplicaMutator Collection already exists with numShards=1
   [junit4]   2> 2044319 INFO  (OverseerStateUpdate-95722071216291844-127.0.0.1:55292_e_%2Fdx-n_0000000000) [n:127.0.0.1:55292_e_%2Fdx    ] o.a.s.c.o.ReplicaMutator Assigning new node to shard shard=shard1
   [junit4]   2> 2044319 INFO  (coreLoadExecutor-7774-thread-1-processing-n:127.0.0.1:55169_e_%2Fdx) [n:127.0.0.1:55169_e_%2Fdx c:collection1   x:collection1] o.a.s.c.c.ZkStateReader Add data for [collection1] ver [1]
   [junit4]   2> 2044319 INFO  (coreLoadExecutor-7774-thread-1-processing-n:127.0.0.1:55169_e_%2Fdx) [n:127.0.0.1:55169_e_%2Fdx c:collection1   x:collection1] o.a.s.c.ZkController look for our core node name
   [junit4]   2> 2044429 INFO  (OverseerStateUpdate-95722071216291844-127.0.0.1:55292_e_%2Fdx-n_0000000000) [n:127.0.0.1:55292_e_%2Fdx    ] o.a.s.c.o.ZkStateWriter going to update_collection /collections/collection1/state.json version: 1
   [junit4]   2> 2044431 INFO  (zkCallback-17681-thread-1-processing-n:127.0.0.1:55169_e_%2Fdx) [n:127.0.0.1:55169_e_%2Fdx    ] o.a.s.c.c.ZkStateReader A cluster state change: [WatchedEvent state:SyncConnected type:NodeDataChanged path:/collections/collection1/state.json] for collection [collection1] has occurred - updating... (live nodes size: [2])
   [junit4]   2> 2044441 INFO  (z

[...truncated too long message...]

[junit4]   2> 2452915 INFO  (TEST-ZkStateReaderTest.testStateFormatUpdateWithExplicitRefreshLazy-seed#[FA13C6377C897E63]) [    ] o.a.s.c.c.SolrZkClient makePath: /collections/c1
   [junit4]   2> 2452916 INFO  (TEST-ZkStateReaderTest.testStateFormatUpdateWithExplicitRefreshLazy-seed#[FA13C6377C897E63]) [    ] o.a.s.c.o.ZkStateWriter going to create_collection /collections/c1/state.json
   [junit4]   2> 2452917 ERROR (TEST-ZkStateReaderTest.testStateFormatUpdateWithExplicitRefreshLazy-seed#[FA13C6377C897E63]-EventThread) [    ] o.a.z.ClientCnxn Error while calling watcher 
   [junit4]   2> java.util.concurrent.RejectedExecutionException: Task org.apache.solr.common.util.ExecutorUtil$MDCAwareThreadPoolExecutor$$Lambda$7/1680699851@70e92bb rejected from org.apache.solr.common.util.ExecutorUtil$MDCAwareThreadPoolExecutor@420c1c3e[Shutting down, pool size = 1, active threads = 1, queued tasks = 0, completed tasks = 1]
   [junit4]   2> 	at java.util.concurrent.ThreadPoolExecutor$AbortPolicy.rejectedExecution(ThreadPoolExecutor.java:2047)
   [junit4]   2> 	at java.util.concurrent.ThreadPoolExecutor.reject(ThreadPoolExecutor.java:823)
   [junit4]   2> 	at java.util.concurrent.ThreadPoolExecutor.execute(ThreadPoolExecutor.java:1369)
   [junit4]   2> 	at org.apache.solr.common.util.ExecutorUtil$MDCAwareThreadPoolExecutor.execute(ExecutorUtil.java:214)
   [junit4]   2> 	at java.util.concurrent.AbstractExecutorService.submit(AbstractExecutorService.java:112)
   [junit4]   2> 	at org.apache.solr.common.cloud.SolrZkClient$3.process(SolrZkClient.java:266)
   [junit4]   2> 	at org.apache.zookeeper.ClientCnxn$EventThread.processEvent(ClientCnxn.java:522)
   [junit4]   2> 	at org.apache.zookeeper.ClientCnxn$EventThread.run(ClientCnxn.java:498)
   [junit4]   2> 2452918 INFO  (zkCallback-1945-thread-2) [    ] o.a.s.c.c.ZkStateReader A collections change: [WatchedEvent state:SyncConnected type:NodeChildrenChanged path:/collections], has occurred - updating...
   [junit4]   2> 2452918 WARN  (zkCallback-1945-thread-2) [    ] o.a.s.c.c.ZkStateReader ZooKeeper watch triggered, but Solr cannot talk to ZK: [KeeperErrorCode = Session expired for /collections]
   [junit4]   2> 2452919 INFO  (TEST-ZkStateReaderTest.testStateFormatUpdateWithExplicitRefreshLazy-seed#[FA13C6377C897E63]) [    ] o.a.s.c.ZkTestServer connecting to 127.0.0.1:57512 57512
   [junit4]   2> 2453136 INFO  (Thread-4146) [    ] o.a.s.c.ZkTestServer connecting to 127.0.0.1:57512 57512
   [junit4]   2> 2453139 INFO  (TEST-ZkStateReaderTest.testStateFormatUpdateWithExplicitRefreshLazy-seed#[FA13C6377C897E63]) [    ] o.a.s.SolrTestCaseJ4 ###Ending testStateFormatUpdateWithExplicitRefreshLazy
   [junit4]   2> NOTE: reproduce with: ant test  -Dtestcase=ZkStateReaderTest -Dtests.method=testStateFormatUpdateWithExplicitRefreshLazy -Dtests.seed=FA13C6377C897E63 -Dtests.multiplier=2 -Dtests.slow=true -Dtests.locale=he -Dtests.timezone=America/Fortaleza -Dtests.asserts=true -Dtests.file.encoding=US-ASCII
   [junit4] ERROR   0.46s J2 | ZkStateReaderTest.testStateFormatUpdateWithExplicitRefreshLazy <<<
   [junit4]    > Throwable #1: org.apache.solr.common.SolrException: Could not find collection : c1
   [junit4]    > 	at __randomizedtesting.SeedInfo.seed([FA13C6377C897E63:915C664A0586A359]:0)
   [junit4]    > 	at org.apache.solr.common.cloud.ClusterState.getCollection(ClusterState.java:170)
   [junit4]    > 	at org.apache.solr.cloud.overseer.ZkStateReaderTest.testStateFormatUpdate(ZkStateReaderTest.java:135)
   [junit4]    > 	at org.apache.solr.cloud.overseer.ZkStateReaderTest.testStateFormatUpdateWithExplicitRefreshLazy(ZkStateReaderTest.java:46)
   [junit4]    > 	at java.lang.Thread.run(Thread.java:745)
   [junit4]   2> 2453142 INFO  (SUITE-ZkStateReaderTest-seed#[FA13C6377C897E63]-worker) [    ] o.a.s.SolrTestCaseJ4 ###deleteCore
   [junit4]   2> NOTE: leaving temporary files on disk at: /x1/jenkins/jenkins-slave/workspace/Lucene-Solr-Tests-6.x/solr/build/solr-core/test/J2/temp/solr.cloud.overseer.ZkStateReaderTest_FA13C6377C897E63-001
   [junit4]   2> NOTE: test params are: codec=Asserting(Lucene60), sim=ClassicSimilarity, locale=he, timezone=America/Fortaleza
   [junit4]   2> NOTE: Linux 3.13.0-52-generic amd64/Oracle Corporation 1.8.0_74 (64-bit)/cpus=4,threads=1,free=97343728,total=528482304
   [junit4]   2> NOTE: All tests run in this JVM: [TestPHPSerializedResponseWriter, BaseCdcrDistributedZkTest, ReplicationFactorTest, DeleteLastCustomShardedReplicaTest, TestManagedResourceStorage, UnloadDistributedZkTest, TestIndexingPerformance, TestWriterPerf, ResponseHeaderTest, AtomicUpdatesTest, DistribJoinFromCollectionTest, TestCloudDeleteByQuery, TestSuggestSpellingConverter, TestSimpleQParserPlugin, TestCharFilters, TestInfoStreamLogging, TestFieldSortValues, StatsComponentTest, TestConfigSets, CursorMarkTest, TestDistributedMissingSort, DocExpirationUpdateProcessorFactoryTest, TestStressReorder, HLLUtilTest, TestNonDefinedSimilarityFactory, CoreAdminHandlerTest, TestFieldResource, TestMinMaxOnMultiValuedField, FacetPivotSmallTest, TestTolerantSearch, TestSolrCloudWithKerberosAlt, TestPerFieldSimilarity, OverseerCollectionConfigSetProcessorTest, TestRTimerTree, XmlUpdateRequestHandlerTest, TestBlobHandler, DateMathParserTest, ConnectionManagerTest, SimpleMLTQParserTest, TestRecovery, ZkStateWriterTest, DirectUpdateHandlerOptimizeTest, TestReversedWildcardFilterFactory, ForceLeaderTest, QueryParsingTest, TermVectorComponentDistributedTest, LeaderElectionTest, TestScoreJoinQPScore, TestBlendedInfixSuggestions, PluginInfoTest, DebugComponentTest, BinaryUpdateRequestHandlerTest, TestCollationField, TestCSVResponseWriter, TestRebalanceLeaders, TestSolrDynamicMBean, TestGroupingSearch, AssignTest, TestManagedSchema, MultiThreadedOCPTest, TestStressRecovery, SampleTest, CoreAdminRequestStatusTest, BJQParserTest, LeaderInitiatedRecoveryOnCommitTest, OverseerTaskQueueTest, TestUtils, TestSolrQueryResponse, TestPKIAuthenticationPlugin, TestZkChroot, BadIndexSchemaTest, TestJettySolrRunner, BufferStoreTest, FieldMutatingUpdateProcessorTest, TestReqParamsAPI, StressHdfsTest, HdfsNNFailoverTest, SharedFSAutoReplicaFailoverTest, RequestHandlersTest, DirectSolrConnectionTest, DistributedExpandComponentTest, TestSchemaNameResource, LukeRequestHandlerTest, TestSolrJ, TestSolrQueryParserResource, TestPivotHelperCode, RecoveryZkTest, SolrCloudExampleTest, TestSearchPerf, ExitableDirectoryReaderTest, SpatialRPTFieldTypeTest, TestInitQParser, ScriptEngineTest, PrimitiveFieldTypeTest, BasicDistributedZk2Test, SyncSliceTest, OverseerTest, ShardRoutingTest, FullSolrCloudDistribCmdsTest, AutoCommitTest, HardAutoCommitTest, TestRangeQuery, SimpleFacetsTest, SolrCoreTest, ConvertedLegacyTest, TestFunctionQuery, DirectUpdateHandlerTest, TestIndexSearcher, SoftAutoCommitTest, SolrIndexSplitterTest, AnalysisAfterCoreReloadTest, SignatureUpdateProcessorFactoryTest, SuggesterFSTTest, TestFoldingMultitermQuery, SuggesterTSTTest, TestStressLucene, SpatialFilterTest, TestCSVLoader, NoCacheHeaderTest, SchemaVersionSpecificBehaviorTest, QueryEqualityTest, StatelessScriptUpdateProcessorFactoryTest, XsltUpdateRequestHandlerTest, IndexBasedSpellCheckerTest, StandardRequestHandlerTest, DocumentBuilderTest, PathHierarchyTokenizerFactoryTest, RequiredFieldsTest, TestSolrQueryParser, FastVectorHighlighterTest, RegexBoostProcessorTest, JSONWriterTest, MBeansHandlerTest, UniqFieldsUpdateProcessorFactoryTest, PingRequestHandlerTest, HighlighterConfigTest, TestQuerySenderListener, AlternateDirectoryTest, ResponseLogComponentTest, SolrIndexConfigTest, TestElisionMultitermQuery, TestFuzzyAnalyzedSuggestions, TestPostingsSolrHighlighter, TestXIncludeConfig, TestSweetSpotSimilarityFactory, TestFastWriter, TimeZoneUtilsTest, ResourceLoaderTest, TestFastLRUCache, DOMUtilTest, SystemInfoHandlerTest, FileUtilsTest, DistributedMLTComponentTest, AliasIntegrationTest, CdcrReplicationHandlerTest, CdcrRequestHandlerTest, CleanupOldIndexTest, CloudExitableDirectoryReaderTest, CollectionTooManyReplicasTest, ConcurrentDeleteAndCreateCollectionTest, DeleteStatusTest, DistribCursorPagingTest, OutOfBoxZkACLAndCredentialsProvidersTest, OverriddenZkACLAndCredentialsProvidersTest, OverseerRolesTest, RecoveryAfterSoftCommitTest, RestartWhileUpdatingTest, SSLMigrationTest, ShardSplitTest, TestReplicaProperties, TestSizeLimitedDistributedMap, VMParamsZkACLAndCredentialsProvidersTest, HdfsBasicDistributedZk2Test, HdfsBasicDistributedZkTest, HdfsChaosMonkeyNothingIsSafeTest, HdfsRestartWhileUpdatingTest, HdfsSyncSliceTest, HdfsTlogReplayBufferedWhileIndexingTest, HdfsWriteToMultipleCollectionsTest, ZkStateReaderTest]
   [junit4] Completed [472/586 (2!)] on J2 in 2.75s, 5 tests, 1 error <<< FAILURES!

[...truncated 375 lines...]
BUILD FAILED
/x1/jenkins/jenkins-slave/workspace/Lucene-Solr-Tests-6.x/build.xml:740: The following error occurred while executing this line:
/x1/jenkins/jenkins-slave/workspace/Lucene-Solr-Tests-6.x/build.xml:684: The following error occurred while executing this line:
/x1/jenkins/jenkins-slave/workspace/Lucene-Solr-Tests-6.x/build.xml:59: The following error occurred while executing this line:
/x1/jenkins/jenkins-slave/workspace/Lucene-Solr-Tests-6.x/solr/build.xml:233: The following error occurred while executing this line:
/x1/jenkins/jenkins-slave/workspace/Lucene-Solr-Tests-6.x/solr/common-build.xml:529: The following error occurred while executing this line:
/x1/jenkins/jenkins-slave/workspace/Lucene-Solr-Tests-6.x/lucene/common-build.xml:1457: The following error occurred while executing this line:
/x1/jenkins/jenkins-slave/workspace/Lucene-Solr-Tests-6.x/lucene/common-build.xml:1014: There were test failures: 586 suites (10 ignored), 2364 tests, 1 error, 1 failure, 85 ignored (70 assumptions) [seed: FA13C6377C897E63]

Total time: 88 minutes 1 second
Build step 'Invoke Ant' marked build as failure
Archiving artifacts
Recording test results
Email was triggered for: Failure - Any
Sending email for trigger: Failure - Any




Mime
View raw message