lucene-dev mailing list archives

Site index · List index
Message view « Date » · « Thread »
Top « Date » · « Thread »
From Policeman Jenkins Server <jenk...@thetaphi.de>
Subject [JENKINS] Lucene-Solr-6.x-Solaris (64bit/jdk1.8.0) - Build # 74 - Still Failing!
Date Thu, 14 Apr 2016 18:00:44 GMT
Build: http://jenkins.thetaphi.de/job/Lucene-Solr-6.x-Solaris/74/
Java: 64bit/jdk1.8.0 -XX:+UseCompressedOops -XX:+UseConcMarkSweepGC

1 tests failed.
FAILED:  org.apache.solr.cloud.SolrCloudExampleTest.testLoadDocsIntoGettingStartedCollection

Error Message:
Collection 'gettingstarted' doesn't exist after trying to create it!

Stack Trace:
java.lang.AssertionError: Collection 'gettingstarted' doesn't exist after trying to create it!
	at __randomizedtesting.SeedInfo.seed([B26F37E1B2CC2C57:A10C058E83A395F1]:0)
	at org.junit.Assert.fail(Assert.java:93)
	at org.junit.Assert.assertTrue(Assert.java:43)
	at org.apache.solr.cloud.SolrCloudExampleTest.testLoadDocsIntoGettingStartedCollection(SolrCloudExampleTest.java:88)
	at sun.reflect.NativeMethodAccessorImpl.invoke0(Native Method)
	at sun.reflect.NativeMethodAccessorImpl.invoke(NativeMethodAccessorImpl.java:62)
	at sun.reflect.DelegatingMethodAccessorImpl.invoke(DelegatingMethodAccessorImpl.java:43)
	at java.lang.reflect.Method.invoke(Method.java:498)
	at com.carrotsearch.randomizedtesting.RandomizedRunner.invoke(RandomizedRunner.java:1764)
	at com.carrotsearch.randomizedtesting.RandomizedRunner$8.evaluate(RandomizedRunner.java:871)
	at com.carrotsearch.randomizedtesting.RandomizedRunner$9.evaluate(RandomizedRunner.java:907)
	at com.carrotsearch.randomizedtesting.RandomizedRunner$10.evaluate(RandomizedRunner.java:921)
	at org.apache.solr.BaseDistributedSearchTestCase$ShardsRepeatRule$ShardsFixedStatement.callStatement(BaseDistributedSearchTestCase.java:992)
	at org.apache.solr.BaseDistributedSearchTestCase$ShardsRepeatRule$ShardsStatement.evaluate(BaseDistributedSearchTestCase.java:967)
	at com.carrotsearch.randomizedtesting.rules.SystemPropertiesRestoreRule$1.evaluate(SystemPropertiesRestoreRule.java:57)
	at org.apache.lucene.util.TestRuleSetupTeardownChained$1.evaluate(TestRuleSetupTeardownChained.java:49)
	at org.apache.lucene.util.AbstractBeforeAfterRule$1.evaluate(AbstractBeforeAfterRule.java:45)
	at org.apache.lucene.util.TestRuleThreadAndTestName$1.evaluate(TestRuleThreadAndTestName.java:48)
	at org.apache.lucene.util.TestRuleIgnoreAfterMaxFailures$1.evaluate(TestRuleIgnoreAfterMaxFailures.java:64)
	at org.apache.lucene.util.TestRuleMarkFailure$1.evaluate(TestRuleMarkFailure.java:47)
	at com.carrotsearch.randomizedtesting.rules.StatementAdapter.evaluate(StatementAdapter.java:36)
	at com.carrotsearch.randomizedtesting.ThreadLeakControl$StatementRunner.run(ThreadLeakControl.java:367)
	at com.carrotsearch.randomizedtesting.ThreadLeakControl.forkTimeoutingTask(ThreadLeakControl.java:809)
	at com.carrotsearch.randomizedtesting.ThreadLeakControl$3.evaluate(ThreadLeakControl.java:460)
	at com.carrotsearch.randomizedtesting.RandomizedRunner.runSingleTest(RandomizedRunner.java:880)
	at com.carrotsearch.randomizedtesting.RandomizedRunner$5.evaluate(RandomizedRunner.java:781)
	at com.carrotsearch.randomizedtesting.RandomizedRunner$6.evaluate(RandomizedRunner.java:816)
	at com.carrotsearch.randomizedtesting.RandomizedRunner$7.evaluate(RandomizedRunner.java:827)
	at com.carrotsearch.randomizedtesting.rules.StatementAdapter.evaluate(StatementAdapter.java:36)
	at com.carrotsearch.randomizedtesting.rules.SystemPropertiesRestoreRule$1.evaluate(SystemPropertiesRestoreRule.java:57)
	at org.apache.lucene.util.AbstractBeforeAfterRule$1.evaluate(AbstractBeforeAfterRule.java:45)
	at com.carrotsearch.randomizedtesting.rules.StatementAdapter.evaluate(StatementAdapter.java:36)
	at org.apache.lucene.util.TestRuleStoreClassName$1.evaluate(TestRuleStoreClassName.java:41)
	at com.carrotsearch.randomizedtesting.rules.NoShadowingOrOverridesOnMethodsRule$1.evaluate(NoShadowingOrOverridesOnMethodsRule.java:40)
	at com.carrotsearch.randomizedtesting.rules.NoShadowingOrOverridesOnMethodsRule$1.evaluate(NoShadowingOrOverridesOnMethodsRule.java:40)
	at com.carrotsearch.randomizedtesting.rules.StatementAdapter.evaluate(StatementAdapter.java:36)
	at com.carrotsearch.randomizedtesting.rules.StatementAdapter.evaluate(StatementAdapter.java:36)
	at com.carrotsearch.randomizedtesting.rules.StatementAdapter.evaluate(StatementAdapter.java:36)
	at org.apache.lucene.util.TestRuleAssertionsRequired$1.evaluate(TestRuleAssertionsRequired.java:53)
	at org.apache.lucene.util.TestRuleMarkFailure$1.evaluate(TestRuleMarkFailure.java:47)
	at org.apache.lucene.util.TestRuleIgnoreAfterMaxFailures$1.evaluate(TestRuleIgnoreAfterMaxFailures.java:64)
	at org.apache.lucene.util.TestRuleIgnoreTestSuites$1.evaluate(TestRuleIgnoreTestSuites.java:54)
	at com.carrotsearch.randomizedtesting.rules.StatementAdapter.evaluate(StatementAdapter.java:36)
	at com.carrotsearch.randomizedtesting.ThreadLeakControl$StatementRunner.run(ThreadLeakControl.java:367)
	at java.lang.Thread.run(Thread.java:745)




Build Log:
[...truncated 12006 lines...]
   [junit4] Suite: org.apache.solr.cloud.SolrCloudExampleTest
   [junit4]   2> Creating dataDir: /export/home/jenkins/workspace/Lucene-Solr-6.x-Solaris/solr/build/solr-core/test/J0/temp/solr.cloud.SolrCloudExampleTest_B26F37E1B2CC2C57-001/init-core-data-001
   [junit4]   2> 2803367 INFO  (SUITE-SolrCloudExampleTest-seed#[B26F37E1B2CC2C57]-worker) [    ] o.a.s.SolrTestCaseJ4 Randomized ssl (false) and clientAuth (true)
   [junit4]   2> 2803367 INFO  (SUITE-SolrCloudExampleTest-seed#[B26F37E1B2CC2C57]-worker) [    ] o.a.s.BaseDistributedSearchTestCase Setting hostContext system property: /ds_jh/sr
   [junit4]   2> 2803370 INFO  (TEST-SolrCloudExampleTest.testLoadDocsIntoGettingStartedCollection-seed#[B26F37E1B2CC2C57]) [    ] o.a.s.c.ZkTestServer STARTING ZK TEST SERVER
   [junit4]   2> 2803370 INFO  (Thread-5985) [    ] o.a.s.c.ZkTestServer client port:0.0.0.0/0.0.0.0:0
   [junit4]   2> 2803370 INFO  (Thread-5985) [    ] o.a.s.c.ZkTestServer Starting server
   [junit4]   2> 2803470 INFO  (TEST-SolrCloudExampleTest.testLoadDocsIntoGettingStartedCollection-seed#[B26F37E1B2CC2C57]) [    ] o.a.s.c.ZkTestServer start zk server on port:32868
   [junit4]   2> 2803470 INFO  (TEST-SolrCloudExampleTest.testLoadDocsIntoGettingStartedCollection-seed#[B26F37E1B2CC2C57]) [    ] o.a.s.c.c.SolrZkClient Using default ZkCredentialsProvider
   [junit4]   2> 2803471 INFO  (TEST-SolrCloudExampleTest.testLoadDocsIntoGettingStartedCollection-seed#[B26F37E1B2CC2C57]) [    ] o.a.s.c.c.ConnectionManager Waiting for client to connect to ZooKeeper
   [junit4]   2> 2803474 INFO  (zkCallback-10116-thread-1) [    ] o.a.s.c.c.ConnectionManager Watcher org.apache.solr.common.cloud.ConnectionManager@6c691633 name:ZooKeeperConnection Watcher:127.0.0.1:32868 got event WatchedEvent state:SyncConnected type:None path:null path:null type:None
   [junit4]   2> 2803474 INFO  (TEST-SolrCloudExampleTest.testLoadDocsIntoGettingStartedCollection-seed#[B26F37E1B2CC2C57]) [    ] o.a.s.c.c.ConnectionManager Client is connected to ZooKeeper
   [junit4]   2> 2803474 INFO  (TEST-SolrCloudExampleTest.testLoadDocsIntoGettingStartedCollection-seed#[B26F37E1B2CC2C57]) [    ] o.a.s.c.c.SolrZkClient Using default ZkACLProvider
   [junit4]   2> 2803474 INFO  (TEST-SolrCloudExampleTest.testLoadDocsIntoGettingStartedCollection-seed#[B26F37E1B2CC2C57]) [    ] o.a.s.c.c.SolrZkClient makePath: /solr
   [junit4]   2> 2803478 INFO  (TEST-SolrCloudExampleTest.testLoadDocsIntoGettingStartedCollection-seed#[B26F37E1B2CC2C57]) [    ] o.a.s.c.c.SolrZkClient Using default ZkCredentialsProvider
   [junit4]   2> 2803478 INFO  (TEST-SolrCloudExampleTest.testLoadDocsIntoGettingStartedCollection-seed#[B26F37E1B2CC2C57]) [    ] o.a.s.c.c.ConnectionManager Waiting for client to connect to ZooKeeper
   [junit4]   2> 2803480 INFO  (zkCallback-10117-thread-1) [    ] o.a.s.c.c.ConnectionManager Watcher org.apache.solr.common.cloud.ConnectionManager@48bd47a1 name:ZooKeeperConnection Watcher:127.0.0.1:32868/solr got event WatchedEvent state:SyncConnected type:None path:null path:null type:None
   [junit4]   2> 2803481 INFO  (TEST-SolrCloudExampleTest.testLoadDocsIntoGettingStartedCollection-seed#[B26F37E1B2CC2C57]) [    ] o.a.s.c.c.ConnectionManager Client is connected to ZooKeeper
   [junit4]   2> 2803485 INFO  (TEST-SolrCloudExampleTest.testLoadDocsIntoGettingStartedCollection-seed#[B26F37E1B2CC2C57]) [    ] o.a.s.c.c.SolrZkClient Using default ZkACLProvider
   [junit4]   2> 2803485 INFO  (TEST-SolrCloudExampleTest.testLoadDocsIntoGettingStartedCollection-seed#[B26F37E1B2CC2C57]) [    ] o.a.s.c.c.SolrZkClient makePath: /collections/collection1
   [junit4]   2> 2803488 INFO  (TEST-SolrCloudExampleTest.testLoadDocsIntoGettingStartedCollection-seed#[B26F37E1B2CC2C57]) [    ] o.a.s.c.c.SolrZkClient makePath: /collections/collection1/shards
   [junit4]   2> 2803491 INFO  (TEST-SolrCloudExampleTest.testLoadDocsIntoGettingStartedCollection-seed#[B26F37E1B2CC2C57]) [    ] o.a.s.c.c.SolrZkClient makePath: /collections/control_collection
   [junit4]   2> 2803492 INFO  (TEST-SolrCloudExampleTest.testLoadDocsIntoGettingStartedCollection-seed#[B26F37E1B2CC2C57]) [    ] o.a.s.c.c.SolrZkClient makePath: /collections/control_collection/shards
   [junit4]   2> 2803495 INFO  (TEST-SolrCloudExampleTest.testLoadDocsIntoGettingStartedCollection-seed#[B26F37E1B2CC2C57]) [    ] o.a.s.c.AbstractZkTestCase put /export/home/jenkins/workspace/Lucene-Solr-6.x-Solaris/solr/core/src/test-files/solr/collection1/conf/solrconfig-tlog.xml to /configs/conf1/solrconfig.xml
   [junit4]   2> 2803495 INFO  (TEST-SolrCloudExampleTest.testLoadDocsIntoGettingStartedCollection-seed#[B26F37E1B2CC2C57]) [    ] o.a.s.c.c.SolrZkClient makePath: /configs/conf1/solrconfig.xml
   [junit4]   2> 2803499 INFO  (TEST-SolrCloudExampleTest.testLoadDocsIntoGettingStartedCollection-seed#[B26F37E1B2CC2C57]) [    ] o.a.s.c.AbstractZkTestCase put /export/home/jenkins/workspace/Lucene-Solr-6.x-Solaris/solr/core/src/test-files/solr/collection1/conf/schema.xml to /configs/conf1/schema.xml
   [junit4]   2> 2803500 INFO  (TEST-SolrCloudExampleTest.testLoadDocsIntoGettingStartedCollection-seed#[B26F37E1B2CC2C57]) [    ] o.a.s.c.c.SolrZkClient makePath: /configs/conf1/schema.xml
   [junit4]   2> 2803503 INFO  (TEST-SolrCloudExampleTest.testLoadDocsIntoGettingStartedCollection-seed#[B26F37E1B2CC2C57]) [    ] o.a.s.c.AbstractZkTestCase put /export/home/jenkins/workspace/Lucene-Solr-6.x-Solaris/solr/core/src/test-files/solr/collection1/conf/solrconfig.snippet.randomindexconfig.xml to /configs/conf1/solrconfig.snippet.randomindexconfig.xml
   [junit4]   2> 2803503 INFO  (TEST-SolrCloudExampleTest.testLoadDocsIntoGettingStartedCollection-seed#[B26F37E1B2CC2C57]) [    ] o.a.s.c.c.SolrZkClient makePath: /configs/conf1/solrconfig.snippet.randomindexconfig.xml
   [junit4]   2> 2803506 INFO  (TEST-SolrCloudExampleTest.testLoadDocsIntoGettingStartedCollection-seed#[B26F37E1B2CC2C57]) [    ] o.a.s.c.AbstractZkTestCase put /export/home/jenkins/workspace/Lucene-Solr-6.x-Solaris/solr/core/src/test-files/solr/collection1/conf/stopwords.txt to /configs/conf1/stopwords.txt
   [junit4]   2> 2803506 INFO  (TEST-SolrCloudExampleTest.testLoadDocsIntoGettingStartedCollection-seed#[B26F37E1B2CC2C57]) [    ] o.a.s.c.c.SolrZkClient makePath: /configs/conf1/stopwords.txt
   [junit4]   2> 2803508 INFO  (TEST-SolrCloudExampleTest.testLoadDocsIntoGettingStartedCollection-seed#[B26F37E1B2CC2C57]) [    ] o.a.s.c.AbstractZkTestCase put /export/home/jenkins/workspace/Lucene-Solr-6.x-Solaris/solr/core/src/test-files/solr/collection1/conf/protwords.txt to /configs/conf1/protwords.txt
   [junit4]   2> 2803509 INFO  (TEST-SolrCloudExampleTest.testLoadDocsIntoGettingStartedCollection-seed#[B26F37E1B2CC2C57]) [    ] o.a.s.c.c.SolrZkClient makePath: /configs/conf1/protwords.txt
   [junit4]   2> 2803512 INFO  (TEST-SolrCloudExampleTest.testLoadDocsIntoGettingStartedCollection-seed#[B26F37E1B2CC2C57]) [    ] o.a.s.c.AbstractZkTestCase put /export/home/jenkins/workspace/Lucene-Solr-6.x-Solaris/solr/core/src/test-files/solr/collection1/conf/currency.xml to /configs/conf1/currency.xml
   [junit4]   2> 2803512 INFO  (TEST-SolrCloudExampleTest.testLoadDocsIntoGettingStartedCollection-seed#[B26F37E1B2CC2C57]) [    ] o.a.s.c.c.SolrZkClient makePath: /configs/conf1/currency.xml
   [junit4]   2> 2803515 INFO  (TEST-SolrCloudExampleTest.testLoadDocsIntoGettingStartedCollection-seed#[B26F37E1B2CC2C57]) [    ] o.a.s.c.AbstractZkTestCase put /export/home/jenkins/workspace/Lucene-Solr-6.x-Solaris/solr/core/src/test-files/solr/collection1/conf/enumsConfig.xml to /configs/conf1/enumsConfig.xml
   [junit4]   2> 2803515 INFO  (TEST-SolrCloudExampleTest.testLoadDocsIntoGettingStartedCollection-seed#[B26F37E1B2CC2C57]) [    ] o.a.s.c.c.SolrZkClient makePath: /configs/conf1/enumsConfig.xml
   [junit4]   2> 2803518 INFO  (TEST-SolrCloudExampleTest.testLoadDocsIntoGettingStartedCollection-seed#[B26F37E1B2CC2C57]) [    ] o.a.s.c.AbstractZkTestCase put /export/home/jenkins/workspace/Lucene-Solr-6.x-Solaris/solr/core/src/test-files/solr/collection1/conf/open-exchange-rates.json to /configs/conf1/open-exchange-rates.json
   [junit4]   2> 2803518 INFO  (TEST-SolrCloudExampleTest.testLoadDocsIntoGettingStartedCollection-seed#[B26F37E1B2CC2C57]) [    ] o.a.s.c.c.SolrZkClient makePath: /configs/conf1/open-exchange-rates.json
   [junit4]   2> 2803521 INFO  (TEST-SolrCloudExampleTest.testLoadDocsIntoGettingStartedCollection-seed#[B26F37E1B2CC2C57]) [    ] o.a.s.c.AbstractZkTestCase put /export/home/jenkins/workspace/Lucene-Solr-6.x-Solaris/solr/core/src/test-files/solr/collection1/conf/mapping-ISOLatin1Accent.txt to /configs/conf1/mapping-ISOLatin1Accent.txt
   [junit4]   2> 2803521 INFO  (TEST-SolrCloudExampleTest.testLoadDocsIntoGettingStartedCollection-seed#[B26F37E1B2CC2C57]) [    ] o.a.s.c.c.SolrZkClient makePath: /configs/conf1/mapping-ISOLatin1Accent.txt
   [junit4]   2> 2803524 INFO  (TEST-SolrCloudExampleTest.testLoadDocsIntoGettingStartedCollection-seed#[B26F37E1B2CC2C57]) [    ] o.a.s.c.AbstractZkTestCase put /export/home/jenkins/workspace/Lucene-Solr-6.x-Solaris/solr/core/src/test-files/solr/collection1/conf/old_synonyms.txt to /configs/conf1/old_synonyms.txt
   [junit4]   2> 2803524 INFO  (TEST-SolrCloudExampleTest.testLoadDocsIntoGettingStartedCollection-seed#[B26F37E1B2CC2C57]) [    ] o.a.s.c.c.SolrZkClient makePath: /configs/conf1/old_synonyms.txt
   [junit4]   2> 2803528 INFO  (TEST-SolrCloudExampleTest.testLoadDocsIntoGettingStartedCollection-seed#[B26F37E1B2CC2C57]) [    ] o.a.s.c.AbstractZkTestCase put /export/home/jenkins/workspace/Lucene-Solr-6.x-Solaris/solr/core/src/test-files/solr/collection1/conf/synonyms.txt to /configs/conf1/synonyms.txt
   [junit4]   2> 2803528 INFO  (TEST-SolrCloudExampleTest.testLoadDocsIntoGettingStartedCollection-seed#[B26F37E1B2CC2C57]) [    ] o.a.s.c.c.SolrZkClient makePath: /configs/conf1/synonyms.txt
   [junit4]   2> 2803729 INFO  (TEST-SolrCloudExampleTest.testLoadDocsIntoGettingStartedCollection-seed#[B26F37E1B2CC2C57]) [    ] o.a.s.SolrTestCaseJ4 Writing core.properties file to /export/home/jenkins/workspace/Lucene-Solr-6.x-Solaris/solr/build/solr-core/test/J0/temp/solr.cloud.SolrCloudExampleTest_B26F37E1B2CC2C57-001/control-001/cores/collection1
   [junit4]   2> 2803768 INFO  (TEST-SolrCloudExampleTest.testLoadDocsIntoGettingStartedCollection-seed#[B26F37E1B2CC2C57]) [    ] o.e.j.s.Server jetty-9.3.8.v20160314
   [junit4]   2> 2803769 INFO  (TEST-SolrCloudExampleTest.testLoadDocsIntoGettingStartedCollection-seed#[B26F37E1B2CC2C57]) [    ] o.e.j.s.h.ContextHandler Started o.e.j.s.ServletContextHandler@cc9becd{/ds_jh/sr,null,AVAILABLE}
   [junit4]   2> 2803770 INFO  (TEST-SolrCloudExampleTest.testLoadDocsIntoGettingStartedCollection-seed#[B26F37E1B2CC2C57]) [    ] o.e.j.s.ServerConnector Started ServerConnector@217f3f94{HTTP/1.1,[http/1.1]}{127.0.0.1:65207}
   [junit4]   2> 2803770 INFO  (TEST-SolrCloudExampleTest.testLoadDocsIntoGettingStartedCollection-seed#[B26F37E1B2CC2C57]) [    ] o.e.j.s.Server Started @2807712ms
   [junit4]   2> 2803771 INFO  (TEST-SolrCloudExampleTest.testLoadDocsIntoGettingStartedCollection-seed#[B26F37E1B2CC2C57]) [    ] o.a.s.c.s.e.JettySolrRunner Jetty properties: {solr.data.dir=/export/home/jenkins/workspace/Lucene-Solr-6.x-Solaris/solr/build/solr-core/test/J0/temp/solr.cloud.SolrCloudExampleTest_B26F37E1B2CC2C57-001/tempDir-001/control/data, hostContext=/ds_jh/sr, hostPort=65207, coreRootDirectory=/export/home/jenkins/workspace/Lucene-Solr-6.x-Solaris/solr/build/solr-core/test/J0/../../../../../../../../../../export/home/jenkins/workspace/Lucene-Solr-6.x-Solaris/solr/build/solr-core/test/J0/temp/solr.cloud.SolrCloudExampleTest_B26F37E1B2CC2C57-001/control-001/cores}
   [junit4]   2> 2803771 INFO  (TEST-SolrCloudExampleTest.testLoadDocsIntoGettingStartedCollection-seed#[B26F37E1B2CC2C57]) [    ] o.a.s.s.SolrDispatchFilter SolrDispatchFilter.init(): sun.misc.Launcher$AppClassLoader@6d06d69c
   [junit4]   2> 2803771 INFO  (TEST-SolrCloudExampleTest.testLoadDocsIntoGettingStartedCollection-seed#[B26F37E1B2CC2C57]) [    ] o.a.s.c.SolrResourceLoader new SolrResourceLoader for directory: '/export/home/jenkins/workspace/Lucene-Solr-6.x-Solaris/solr/build/solr-core/test/J0/temp/solr.cloud.SolrCloudExampleTest_B26F37E1B2CC2C57-001/control-001'
   [junit4]   2> 2803771 INFO  (TEST-SolrCloudExampleTest.testLoadDocsIntoGettingStartedCollection-seed#[B26F37E1B2CC2C57]) [    ] o.a.s.c.SolrResourceLoader JNDI not configured for solr (NoInitialContextEx)
   [junit4]   2> 2803771 INFO  (TEST-SolrCloudExampleTest.testLoadDocsIntoGettingStartedCollection-seed#[B26F37E1B2CC2C57]) [    ] o.a.s.c.SolrResourceLoader solr home defaulted to 'solr/' (could not find system property or JNDI)
   [junit4]   2> 2803772 INFO  (TEST-SolrCloudExampleTest.testLoadDocsIntoGettingStartedCollection-seed#[B26F37E1B2CC2C57]) [    ] o.a.s.c.c.SolrZkClient Using default ZkCredentialsProvider
   [junit4]   2> 2803772 INFO  (TEST-SolrCloudExampleTest.testLoadDocsIntoGettingStartedCollection-seed#[B26F37E1B2CC2C57]) [    ] o.a.s.c.c.ConnectionManager Waiting for client to connect to ZooKeeper
   [junit4]   2> 2803776 INFO  (zkCallback-10118-thread-1) [    ] o.a.s.c.c.ConnectionManager Watcher org.apache.solr.common.cloud.ConnectionManager@3d4c03fb name:ZooKeeperConnection Watcher:127.0.0.1:32868/solr got event WatchedEvent state:SyncConnected type:None path:null path:null type:None
   [junit4]   2> 2803776 INFO  (TEST-SolrCloudExampleTest.testLoadDocsIntoGettingStartedCollection-seed#[B26F37E1B2CC2C57]) [    ] o.a.s.c.c.ConnectionManager Client is connected to ZooKeeper
   [junit4]   2> 2803777 INFO  (TEST-SolrCloudExampleTest.testLoadDocsIntoGettingStartedCollection-seed#[B26F37E1B2CC2C57]) [    ] o.a.s.c.c.SolrZkClient Using default ZkACLProvider
   [junit4]   2> 2803779 INFO  (TEST-SolrCloudExampleTest.testLoadDocsIntoGettingStartedCollection-seed#[B26F37E1B2CC2C57]) [    ] o.a.s.s.SolrDispatchFilter Loading solr.xml from SolrHome (not found in ZooKeeper)
   [junit4]   2> 2803779 INFO  (TEST-SolrCloudExampleTest.testLoadDocsIntoGettingStartedCollection-seed#[B26F37E1B2CC2C57]) [    ] o.a.s.c.SolrXmlConfig Loading container configuration from /export/home/jenkins/workspace/Lucene-Solr-6.x-Solaris/solr/build/solr-core/test/J0/temp/solr.cloud.SolrCloudExampleTest_B26F37E1B2CC2C57-001/control-001/solr.xml
   [junit4]   2> 2803786 INFO  (TEST-SolrCloudExampleTest.testLoadDocsIntoGettingStartedCollection-seed#[B26F37E1B2CC2C57]) [    ] o.a.s.c.CorePropertiesLocator Config-defined core root directory: /export/home/jenkins/workspace/Lucene-Solr-6.x-Solaris/solr/build/solr-core/test/J0/../../../../../../../../../../export/home/jenkins/workspace/Lucene-Solr-6.x-Solaris/solr/build/solr-core/test/J0/temp/solr.cloud.SolrCloudExampleTest_B26F37E1B2CC2C57-001/control-001/cores
   [junit4]   2> 2803786 INFO  (TEST-SolrCloudExampleTest.testLoadDocsIntoGettingStartedCollection-seed#[B26F37E1B2CC2C57]) [    ] o.a.s.c.CoreContainer New CoreContainer 340381246
   [junit4]   2> 2803787 INFO  (TEST-SolrCloudExampleTest.testLoadDocsIntoGettingStartedCollection-seed#[B26F37E1B2CC2C57]) [    ] o.a.s.c.CoreContainer Loading cores into CoreContainer [instanceDir=/export/home/jenkins/workspace/Lucene-Solr-6.x-Solaris/solr/build/solr-core/test/J0/temp/solr.cloud.SolrCloudExampleTest_B26F37E1B2CC2C57-001/control-001]
   [junit4]   2> 2803787 WARN  (TEST-SolrCloudExampleTest.testLoadDocsIntoGettingStartedCollection-seed#[B26F37E1B2CC2C57]) [    ] o.a.s.c.CoreContainer Couldn't add files from /export/home/jenkins/workspace/Lucene-Solr-6.x-Solaris/solr/build/solr-core/test/J0/temp/solr.cloud.SolrCloudExampleTest_B26F37E1B2CC2C57-001/control-001/lib to classpath: /export/home/jenkins/workspace/Lucene-Solr-6.x-Solaris/solr/build/solr-core/test/J0/temp/solr.cloud.SolrCloudExampleTest_B26F37E1B2CC2C57-001/control-001/lib
   [junit4]   2> 2803787 INFO  (TEST-SolrCloudExampleTest.testLoadDocsIntoGettingStartedCollection-seed#[B26F37E1B2CC2C57]) [    ] o.a.s.h.c.HttpShardHandlerFactory created with socketTimeout : 90000,urlScheme : ,connTimeout : 15000,maxConnectionsPerHost : 20,maxConnections : 10000,corePoolSize : 0,maximumPoolSize : 2147483647,maxThreadIdleTime : 5,sizeOfQueue : -1,fairnessPolicy : false,useRetries : false,
   [junit4]   2> 2803789 INFO  (TEST-SolrCloudExampleTest.testLoadDocsIntoGettingStartedCollection-seed#[B26F37E1B2CC2C57]) [    ] o.a.s.u.UpdateShardHandler Creating UpdateShardHandler HTTP client with params: socketTimeout=340000&connTimeout=45000&retry=true
   [junit4]   2> 2803790 INFO  (TEST-SolrCloudExampleTest.testLoadDocsIntoGettingStartedCollection-seed#[B26F37E1B2CC2C57]) [    ] o.a.s.l.LogWatcher SLF4J impl is org.slf4j.impl.Log4jLoggerFactory
   [junit4]   2> 2803790 INFO  (TEST-SolrCloudExampleTest.testLoadDocsIntoGettingStartedCollection-seed#[B26F37E1B2CC2C57]) [    ] o.a.s.l.LogWatcher Registering Log Listener [Log4j (org.slf4j.impl.Log4jLoggerFactory)]
   [junit4]   2> 2803790 INFO  (TEST-SolrCloudExampleTest.testLoadDocsIntoGettingStartedCollection-seed#[B26F37E1B2CC2C57]) [    ] o.a.s.c.ZkContainer Zookeeper client=127.0.0.1:32868/solr
   [junit4]   2> 2803790 INFO  (TEST-SolrCloudExampleTest.testLoadDocsIntoGettingStartedCollection-seed#[B26F37E1B2CC2C57]) [    ] o.a.s.c.ZkController zkHost includes chroot
   [junit4]   2> 2803790 INFO  (TEST-SolrCloudExampleTest.testLoadDocsIntoGettingStartedCollection-seed#[B26F37E1B2CC2C57]) [    ] o.a.s.c.c.SolrZkClient Using default ZkCredentialsProvider
   [junit4]   2> 2803791 INFO  (TEST-SolrCloudExampleTest.testLoadDocsIntoGettingStartedCollection-seed#[B26F37E1B2CC2C57]) [    ] o.a.s.c.c.ConnectionManager Waiting for client to connect to ZooKeeper
   [junit4]   2> 2803795 INFO  (zkCallback-10121-thread-1) [    ] o.a.s.c.c.ConnectionManager Watcher org.apache.solr.common.cloud.ConnectionManager@744c61b6 name:ZooKeeperConnection Watcher:127.0.0.1:32868 got event WatchedEvent state:SyncConnected type:None path:null path:null type:None
   [junit4]   2> 2803795 INFO  (TEST-SolrCloudExampleTest.testLoadDocsIntoGettingStartedCollection-seed#[B26F37E1B2CC2C57]) [    ] o.a.s.c.c.ConnectionManager Client is connected to ZooKeeper
   [junit4]   2> 2803796 INFO  (TEST-SolrCloudExampleTest.testLoadDocsIntoGettingStartedCollection-seed#[B26F37E1B2CC2C57]) [    ] o.a.s.c.c.SolrZkClient Using default ZkACLProvider
   [junit4]   2> 2803800 INFO  (TEST-SolrCloudExampleTest.testLoadDocsIntoGettingStartedCollection-seed#[B26F37E1B2CC2C57]) [n:127.0.0.1:65207_ds_jh%2Fsr    ] o.a.s.c.c.ConnectionManager Waiting for client to connect to ZooKeeper
   [junit4]   2> 2803804 INFO  (zkCallback-10122-thread-1-processing-n:127.0.0.1:65207_ds_jh%2Fsr) [n:127.0.0.1:65207_ds_jh%2Fsr    ] o.a.s.c.c.ConnectionManager Watcher org.apache.solr.common.cloud.ConnectionManager@43eebef3 name:ZooKeeperConnection Watcher:127.0.0.1:32868/solr got event WatchedEvent state:SyncConnected type:None path:null path:null type:None
   [junit4]   2> 2803804 INFO  (TEST-SolrCloudExampleTest.testLoadDocsIntoGettingStartedCollection-seed#[B26F37E1B2CC2C57]) [n:127.0.0.1:65207_ds_jh%2Fsr    ] o.a.s.c.c.ConnectionManager Client is connected to ZooKeeper
   [junit4]   2> 2803806 INFO  (TEST-SolrCloudExampleTest.testLoadDocsIntoGettingStartedCollection-seed#[B26F37E1B2CC2C57]) [n:127.0.0.1:65207_ds_jh%2Fsr    ] o.a.s.c.c.SolrZkClient makePath: /overseer/queue
   [junit4]   2> 2803810 INFO  (TEST-SolrCloudExampleTest.testLoadDocsIntoGettingStartedCollection-seed#[B26F37E1B2CC2C57]) [n:127.0.0.1:65207_ds_jh%2Fsr    ] o.a.s.c.c.SolrZkClient makePath: /overseer/collection-queue-work
   [junit4]   2> 2803814 INFO  (TEST-SolrCloudExampleTest.testLoadDocsIntoGettingStartedCollection-seed#[B26F37E1B2CC2C57]) [n:127.0.0.1:65207_ds_jh%2Fsr    ] o.a.s.c.c.SolrZkClient makePath: /overseer/collection-map-running
   [junit4]   2> 2803818 INFO  (TEST-SolrCloudExampleTest.testLoadDocsIntoGettingStartedCollection-seed#[B26F37E1B2CC2C57]) [n:127.0.0.1:65207_ds_jh%2Fsr    ] o.a.s.c.c.SolrZkClient makePath: /overseer/collection-map-completed
   [junit4]   2> 2803821 INFO  (TEST-SolrCloudExampleTest.testLoadDocsIntoGettingStartedCollection-seed#[B26F37E1B2CC2C57]) [n:127.0.0.1:65207_ds_jh%2Fsr    ] o.a.s.c.c.SolrZkClient makePath: /overseer/collection-map-failure
   [junit4]   2> 2803824 INFO  (TEST-SolrCloudExampleTest.testLoadDocsIntoGettingStartedCollection-seed#[B26F37E1B2CC2C57]) [n:127.0.0.1:65207_ds_jh%2Fsr    ] o.a.s.c.c.SolrZkClient makePath: /live_nodes
   [junit4]   2> 2803827 INFO  (TEST-SolrCloudExampleTest.testLoadDocsIntoGettingStartedCollection-seed#[B26F37E1B2CC2C57]) [n:127.0.0.1:65207_ds_jh%2Fsr    ] o.a.s.c.c.SolrZkClient makePath: /aliases.json
   [junit4]   2> 2803829 INFO  (TEST-SolrCloudExampleTest.testLoadDocsIntoGettingStartedCollection-seed#[B26F37E1B2CC2C57]) [n:127.0.0.1:65207_ds_jh%2Fsr    ] o.a.s.c.c.SolrZkClient makePath: /clusterstate.json
   [junit4]   2> 2803830 INFO  (TEST-SolrCloudExampleTest.testLoadDocsIntoGettingStartedCollection-seed#[B26F37E1B2CC2C57]) [n:127.0.0.1:65207_ds_jh%2Fsr    ] o.a.s.c.c.SolrZkClient makePath: /security.json
   [junit4]   2> 2803832 INFO  (TEST-SolrCloudExampleTest.testLoadDocsIntoGettingStartedCollection-seed#[B26F37E1B2CC2C57]) [n:127.0.0.1:65207_ds_jh%2Fsr    ] o.a.s.c.c.ZkStateReader Updating cluster state from ZooKeeper... 
   [junit4]   2> 2803834 INFO  (TEST-SolrCloudExampleTest.testLoadDocsIntoGettingStartedCollection-seed#[B26F37E1B2CC2C57]) [n:127.0.0.1:65207_ds_jh%2Fsr    ] o.a.s.c.c.ZkStateReader Updated live nodes from ZooKeeper... (0) -> (0)
   [junit4]   2> 2803837 INFO  (TEST-SolrCloudExampleTest.testLoadDocsIntoGettingStartedCollection-seed#[B26F37E1B2CC2C57]) [n:127.0.0.1:65207_ds_jh%2Fsr    ] o.a.s.c.c.SolrZkClient makePath: /overseer_elect
   [junit4]   2> 2803839 INFO  (TEST-SolrCloudExampleTest.testLoadDocsIntoGettingStartedCollection-seed#[B26F37E1B2CC2C57]) [n:127.0.0.1:65207_ds_jh%2Fsr    ] o.a.s.c.c.SolrZkClient makePath: /overseer_elect/election
   [junit4]   2> 2803842 INFO  (TEST-SolrCloudExampleTest.testLoadDocsIntoGettingStartedCollection-seed#[B26F37E1B2CC2C57]) [n:127.0.0.1:65207_ds_jh%2Fsr    ] o.a.s.c.Overseer Overseer (id=null) closing
   [junit4]   2> 2803843 INFO  (TEST-SolrCloudExampleTest.testLoadDocsIntoGettingStartedCollection-seed#[B26F37E1B2CC2C57]) [n:127.0.0.1:65207_ds_jh%2Fsr    ] o.a.s.c.LeaderElector Joined leadership election with path: /overseer_elect/election/95725554321063940-127.0.0.1:65207_ds_jh%2Fsr-n_0000000000
   [junit4]   2> 2803843 INFO  (TEST-SolrCloudExampleTest.testLoadDocsIntoGettingStartedCollection-seed#[B26F37E1B2CC2C57]) [n:127.0.0.1:65207_ds_jh%2Fsr    ] o.a.s.c.OverseerElectionContext I am going to be the leader 127.0.0.1:65207_ds_jh%2Fsr
   [junit4]   2> 2803843 INFO  (TEST-SolrCloudExampleTest.testLoadDocsIntoGettingStartedCollection-seed#[B26F37E1B2CC2C57]) [n:127.0.0.1:65207_ds_jh%2Fsr    ] o.a.s.c.c.SolrZkClient makePath: /overseer_elect/leader
   [junit4]   2> 2803846 INFO  (TEST-SolrCloudExampleTest.testLoadDocsIntoGettingStartedCollection-seed#[B26F37E1B2CC2C57]) [n:127.0.0.1:65207_ds_jh%2Fsr    ] o.a.s.c.Overseer Overseer (id=95725554321063940-127.0.0.1:65207_ds_jh%2Fsr-n_0000000000) starting
   [junit4]   2> 2803849 INFO  (TEST-SolrCloudExampleTest.testLoadDocsIntoGettingStartedCollection-seed#[B26F37E1B2CC2C57]) [n:127.0.0.1:65207_ds_jh%2Fsr    ] o.a.s.c.c.SolrZkClient makePath: /overseer/queue-work
   [junit4]   2> 2803858 INFO  (TEST-SolrCloudExampleTest.testLoadDocsIntoGettingStartedCollection-seed#[B26F37E1B2CC2C57]) [n:127.0.0.1:65207_ds_jh%2Fsr    ] o.a.s.c.OverseerAutoReplicaFailoverThread Starting OverseerAutoReplicaFailoverThread autoReplicaFailoverWorkLoopDelay=10000 autoReplicaFailoverWaitAfterExpiration=30000 autoReplicaFailoverBadNodeExpiration=60000
   [junit4]   2> 2803859 INFO  (TEST-SolrCloudExampleTest.testLoadDocsIntoGettingStartedCollection-seed#[B26F37E1B2CC2C57]) [n:127.0.0.1:65207_ds_jh%2Fsr    ] o.a.s.c.ZkController Register node as live in ZooKeeper:/live_nodes/127.0.0.1:65207_ds_jh%2Fsr
   [junit4]   2> 2803860 INFO  (TEST-SolrCloudExampleTest.testLoadDocsIntoGettingStartedCollection-seed#[B26F37E1B2CC2C57]) [n:127.0.0.1:65207_ds_jh%2Fsr    ] o.a.s.c.c.SolrZkClient makePath: /live_nodes/127.0.0.1:65207_ds_jh%2Fsr
   [junit4]   2> 2803893 INFO  (TEST-SolrCloudExampleTest.testLoadDocsIntoGettingStartedCollection-seed#[B26F37E1B2CC2C57]) [n:127.0.0.1:65207_ds_jh%2Fsr    ] o.a.s.c.CoreContainer Security conf doesn't exist. Skipping setup for authorization module.
   [junit4]   2> 2803893 INFO  (TEST-SolrCloudExampleTest.testLoadDocsIntoGettingStartedCollection-seed#[B26F37E1B2CC2C57]) [n:127.0.0.1:65207_ds_jh%2Fsr    ] o.a.s.c.CoreContainer No authentication plugin used.
   [junit4]   2> 2803894 INFO  (TEST-SolrCloudExampleTest.testLoadDocsIntoGettingStartedCollection-seed#[B26F37E1B2CC2C57]) [n:127.0.0.1:65207_ds_jh%2Fsr    ] o.a.s.c.CorePropertiesLocator Looking for core definitions underneath /export/home/jenkins/workspace/Lucene-Solr-6.x-Solaris/solr/build/solr-core/test/J0/../../../../../../../../../../export/home/jenkins/workspace/Lucene-Solr-6.x-Solaris/solr/build/solr-core/test/J0/temp/solr.cloud.SolrCloudExampleTest_B26F37E1B2CC2C57-001/control-001/cores
   [junit4]   2> 2803895 INFO  (TEST-SolrCloudExampleTest.testLoadDocsIntoGettingStartedCollection-seed#[B26F37E1B2CC2C57]) [n:127.0.0.1:65207_ds_jh%2Fsr    ] o.a.s.c.CoreDescriptor Created CoreDescriptor: {name=collection1, config=solrconfig.xml, transient=false, schema=schema.xml, loadOnStartup=true, configSetProperties=configsetprops.json, collection=control_collection, coreNodeName=, dataDir=data/, shard=}
   [junit4]   2> 2803895 INFO  (TEST-SolrCloudExampleTest.testLoadDocsIntoGettingStartedCollection-seed#[B26F37E1B2CC2C57]) [n:127.0.0.1:65207_ds_jh%2Fsr    ] o.a.s.c.CorePropertiesLocator Found core collection1 in /export/home/jenkins/workspace/Lucene-Solr-6.x-Solaris/solr/build/solr-core/test/J0/../../../../../../../../../../export/home/jenkins/workspace/Lucene-Solr-6.x-Solaris/solr/build/solr-core/test/J0/temp/solr.cloud.SolrCloudExampleTest_B26F37E1B2CC2C57-001/control-001/cores/collection1
   [junit4]   2> 2803896 INFO  (TEST-SolrCloudExampleTest.testLoadDocsIntoGettingStartedCollection-seed#[B26F37E1B2CC2C57]) [n:127.0.0.1:65207_ds_jh%2Fsr    ] o.a.s.c.CorePropertiesLocator Found 1 core definitions
   [junit4]   2> 2803901 INFO  (OverseerCollectionConfigSetProcessor-95725554321063940-127.0.0.1:65207_ds_jh%2Fsr-n_0000000000) [n:127.0.0.1:65207_ds_jh%2Fsr    ] o.a.s.c.OverseerTaskProcessor Process current queue of overseer operations
   [junit4]   2> 2803903 INFO  (zkCallback-10122-thread-1-processing-n:127.0.0.1:65207_ds_jh%2Fsr) [n:127.0.0.1:65207_ds_jh%2Fsr    ] o.a.s.c.c.ZkStateReader A live node change: [WatchedEvent state:SyncConnected type:NodeChildrenChanged path:/live_nodes], has occurred - updating... (live nodes size: [0])
   [junit4]   2> 2803905 INFO  (OverseerStateUpdate-95725554321063940-127.0.0.1:65207_ds_jh%2Fsr-n_0000000000) [n:127.0.0.1:65207_ds_jh%2Fsr    ] o.a.s.c.Overseer Starting to work on the main queue
   [junit4]   2> 2803906 INFO  (TEST-SolrCloudExampleTest.testLoadDocsIntoGettingStartedCollection-seed#[B26F37E1B2CC2C57]) [n:127.0.0.1:65207_ds_jh%2Fsr    ] o.a.s.s.SolrDispatchFilter user.dir=/export/home/jenkins/workspace/Lucene-Solr-6.x-Solaris/solr/build/solr-core/test/J0
   [junit4]   2> 2803906 INFO  (TEST-SolrCloudExampleTest.testLoadDocsIntoGettingStartedCollection-seed#[B26F37E1B2CC2C57]) [n:127.0.0.1:65207_ds_jh%2Fsr    ] o.a.s.s.SolrDispatchFilter SolrDispatchFilter.init() done
   [junit4]   2> 2803908 INFO  (coreLoadExecutor-9020-thread-1-processing-n:127.0.0.1:65207_ds_jh%2Fsr) [n:127.0.0.1:65207_ds_jh%2Fsr c:control_collection   x:collection1] o.a.s.c.ZkController publishing state=down
   [junit4]   2> 2803909 INFO  (coreLoadExecutor-9020-thread-1-processing-n:127.0.0.1:65207_ds_jh%2Fsr) [n:127.0.0.1:65207_ds_jh%2Fsr c:control_collection   x:collection1] o.a.s.c.ZkController numShards not found on descriptor - reading it from system property
   [junit4]   2> 2803912 INFO  (OverseerStateUpdate-95725554321063940-127.0.0.1:65207_ds_jh%2Fsr-n_0000000000) [n:127.0.0.1:65207_ds_jh%2Fsr    ] o.a.s.c.c.ZkStateReader Updated live nodes from ZooKeeper... (0) -> (1)
   [junit4]   2> 2803918 INFO  (OverseerStateUpdate-95725554321063940-127.0.0.1:65207_ds_jh%2Fsr-n_0000000000) [n:127.0.0.1:65207_ds_jh%2Fsr    ] o.a.s.c.Overseer processMessage: queueSize: 1, message = {
   [junit4]   2>   "core":"collection1",
   [junit4]   2>   "roles":null,
   [junit4]   2>   "base_url":"http://127.0.0.1:65207/ds_jh/sr",
   [junit4]   2>   "node_name":"127.0.0.1:65207_ds_jh%2Fsr",
   [junit4]   2>   "numShards":"1",
   [junit4]   2>   "state":"down",
   [junit4]   2>   "shard":null,
   [junit4]   2>   "collection":"control_collection",
   [junit4]   2>   "operation":"state"} current state version: 0
   [junit4]   2> 2803919 INFO  (OverseerStateUpdate-95725554321063940-127.0.0.1:65207_ds_jh%2Fsr-n_0000000000) [n:127.0.0.1:65207_ds_jh%2Fsr    ] o.a.s.c.o.ReplicaMutator Update state numShards=1 message={
   [junit4]   2>   "core":"collection1",
   [junit4]   2>   "roles":null,
   [junit4]   2>   "base_url":"http://127.0.0.1:65207/ds_jh/sr",
   [junit4]   2>   "node_name":"127.0.0.1:65207_ds_jh%2Fsr",
   [junit4]   2>   "numShards":"1",
   [junit4]   2>   "state":"down",
   [junit4]   2>   "shard":null,
   [junit4]   2>   "collection":"control_collection",
   [junit4]   2>   "operation":"state"}
   [junit4]   2> 2803920 INFO  (coreLoadExecutor-9020-thread-1-processing-n:127.0.0.1:65207_ds_jh%2Fsr) [n:127.0.0.1:65207_ds_jh%2Fsr c:control_collection   x:collection1] o.a.s.c.ZkController look for our core node name
   [junit4]   2> 2803920 INFO  (OverseerStateUpdate-95725554321063940-127.0.0.1:65207_ds_jh%2Fsr-n_0000000000) [n:127.0.0.1:65207_ds_jh%2Fsr    ] o.a.s.c.o.ClusterStateMutator building a new cName: control_collection
   [junit4]   2> 2803937 INFO  (OverseerStateUpdate-95725554321063940-127.0.0.1:65207_ds_jh%2Fsr-n_0000000000) [n:127.0.0.1:65207_ds_jh%2Fsr    ] o.a.s.c.o.ReplicaMutator Assigning new node to shard shard=shard1
   [junit4]   2> 2803954 INFO  (zkCallback-10122-thread-1-processing-n:127.0.0.1:65207_ds_jh%2Fsr) [n:127.0.0.1:65207_ds_jh%2Fsr    ] o.a.s.c.c.ZkStateReader A cluster state change: [WatchedEvent state:SyncConnected type:NodeDataChanged path:/clusterstate.json], has occurred - updating... (live nodes size: [1])
   [junit4]   2> 2804922 INFO  (coreLoadExecutor-9020-thread-1-processing-n:127.0.0.1:65207_ds_jh%2Fsr) [n:127.0.0.1:65207_ds_jh%2Fsr c:control_collection   x:collection1] o.a.s.c.ZkController waiting to find shard id in clusterstate for collection1
   [junit4]   2> 2804922 INFO  (coreLoadExecutor-9020-thread-1-processing-n:127.0.0.1:65207_ds_jh%2Fsr) [n:127.0.0.1:65207_ds_jh%2Fsr c:control_collection   x:collection1] o.a.s.c.ZkController Check for collection zkNode:control_collection
   [junit4]   2> 2804923 INFO  (coreLoadExecutor-9020-thread-1-processing-n:127.0.0.1:65207_ds_jh%2Fsr) [n:127.0.0.1:65207_ds_jh%2Fsr c:control_collection   x:collection1] o.a.s.c.ZkController Collection zkNode exists
   [junit4]   2> 2804923 INFO  (coreLoadExecutor-9020-thread-1-processing-n:127.0.0.1:65207_ds_jh%2Fsr) [n:127.0.0.1:65207_ds_jh%2Fsr c:control_collection   x:collection1] o.a.s.c.c.ZkStateReader Load collection config from: [/collections/control_collection]
   [junit4]   2> 2804924 INFO  (coreLoadExecutor-9020-thread-1-processing-n:127.0.0.1:65207_ds_jh%2Fsr) [n:127.0.0.1:65207_ds_jh%2Fsr c:control_collection   x:collection1] o.a.s.c.c.ZkStateReader path=[/collections/control_collection] [configName]=[conf1] specified config exists in ZooKeeper
   [junit4]   2> 2804924 INFO  (coreLoadExecutor-9020-thread-1-processing-n:127.0.0.1:65207_ds_jh%2Fsr) [n:127.0.0.1:65207_ds_jh%2Fsr c:control_collection   x:collection1] o.a.s.c.SolrResourceLoader new SolrResourceLoader for directory: '/export/home/jenkins/workspace/Lucene-Solr-6.x-Solaris/solr/build/solr-core/test/J0/temp/solr.cloud.SolrCloudExampleTest_B26F37E1B2CC2C57-001/control-001/cores/collection1'
   [junit4]   2> 2804924 INFO  (coreLoadExecutor-9020-thread-1-processing-n:127.0.0.1:65207_ds_jh%2Fsr) [n:127.0.0.1:65207_ds_jh%2Fsr c:control_collection   x:collection1] o.a.s.c.SolrResourceLoader JNDI not configured for solr (NoInitialContextEx)
   [junit4]   2> 2804924 INFO  (coreLoadExecutor-9020-thread-1-processing-n:127.0.0.1:65207_ds_jh%2Fsr) [n:127.0.0.1:65207_ds_jh%2Fsr c:control_collection   x:collection1] o.a.s.c.SolrResourceLoader solr home defaulted to 'solr/' (could not find system property or JNDI)
   [junit4]   2> 2804926 INFO  (coreLoadExecutor-9020-thread-1-processing-n:127.0.0.1:65207_ds_jh%2Fsr) [n:127.0.0.1:65207_ds_jh%2Fsr c:control_collection   x:collection1] o.a.s.c.Config loaded config solrconfig.xml with version 0 
   [junit4]   2> 2804931 INFO  (coreLoadExecutor-9020-thread-1-processing-n:127.0.0.1:65207_ds_jh%2Fsr) [n:127.0.0.1:65207_ds_jh%2Fsr c:control_collection   x:collection1] o.a.s.c.SolrConfig current version of requestparams : -1
   [junit4]   2> 2804940 INFO  (coreLoadExecutor-9020-thread-1-processing-n:127.0.0.1:65207_ds_jh%2Fsr) [n:127.0.0.1:65207_ds_jh%2Fsr c:control_collection   x:collection1] o.a.s.c.SolrConfig Using Lucene MatchVersion: 6.1.0
   [junit4]   2> 2804951 INFO  (coreLoadExecutor-9020-thread-1-processing-n:127.0.0.1:65207_ds_jh%2Fsr) [n:127.0.0.1:65207_ds_jh%2Fsr c:control_collection   x:collection1] o.a.s.c.SolrConfig Loaded SolrConfig: solrconfig.xml
   [junit4]   2> 2804957 INFO  (coreLoadExecutor-9020-thread-1-processing-n:127.0.0.1:65207_ds_jh%2Fsr) [n:127.0.0.1:65207_ds_jh%2Fsr c:control_collection   x:collection1] o.a.s.s.IndexSchema [collection1] Schema name=test
   [junit4]   2> 2805137 INFO  (coreLoadExecutor-9020-thread-1-processing-n:127.0.0.1:65207_ds_jh%2Fsr) [n:127.0.0.1:65207_ds_jh%2Fsr c:control_collection   x:collection1] o.a.s.s.OpenExchangeRatesOrgProvider Initialized with rates=open-exchange-rates.json, refreshInterval=1440.
   [junit4]   2> 2805149 INFO  (coreLoadExecutor-9020-thread-1-processing-n:127.0.0.1:65207_ds_jh%2Fsr) [n:127.0.0.1:65207_ds_jh%2Fsr c:control_collection   x:collection1] o.a.s.s.IndexSchema default search field in schema is text
   [junit4]   2> 2805150 INFO  (coreLoadExecutor-9020-thread-1-processing-n:127.0.0.1:65207_ds_jh%2Fsr) [n:127.0.0.1:65207_ds_jh%2Fsr c:control_collection   x:collection1] o.a.s.s.IndexSchema unique key field: id
   [junit4]   2> 2805162 INFO  (coreLoadExecutor-9020-thread-1-processing-n:127.0.0.1:65207_ds_jh%2Fsr) [n:127.0.0.1:65207_ds_jh%2Fsr c:control_collection   x:collection1] o.a.s.s.FileExchangeRateProvider Reloading exchange rates from file currency.xml
   [junit4]   2> 2805164 INFO  (coreLoadExecutor-9020-thread-1-processing-n:127.0.0.1:65207_ds_jh%2Fsr) [n:127.0.0.1:65207_ds_jh%2Fsr c:control_collection   x:collection1] o.a.s.s.FileExchangeRateProvider Reloading exchange rates from file currency.xml
   [junit4]   2> 2805166 INFO  (coreLoadExecutor-9020-thread-1-processing-n:127.0.0.1:65207_ds_jh%2Fsr) [n:127.0.0.1:65207_ds_jh%2Fsr c:control_collection   x:collection1] o.a.s.s.OpenExchangeRatesOrgProvider Reloading exchange rates from open-exchange-rates.json
   [junit4]   2> 2805167 INFO  (coreLoadExecutor-9020-thread-1-processing-n:127.0.0.1:65207_ds_jh%2Fsr) [n:127.0.0.1:65207_ds_jh%2Fsr c:control_collection   x:collection1] o.a.s.s.OpenExchangeRatesOrgProvider Reloading exchange rates from open-exchange-rates.json
   [junit4]   2> 2805169 INFO  (coreLoadExecutor-9020-thread-1-processing-n:127.0.0.1:65207_ds_jh%2Fsr) [n:127.0.0.1:65207_ds_jh%2Fsr c:control_collection   x:collection1] o.a.s.c.ConfigSetProperties Did not find ConfigSet properties, assuming default properties: Can't find resource 'configsetprops.json' in classpath or '/configs/conf1', cwd=/export/home/jenkins/workspace/Lucene-Solr-6.x-Solaris/solr/build/solr-core/test/J0
   [junit4]   2> 2805169 INFO  (coreLoadExecutor-9020-thread-1-processing-n:127.0.0.1:65207_ds_jh%2Fsr) [n:127.0.0.1:65207_ds_jh%2Fsr c:control_collection   x:collection1] o.a.s.c.CoreContainer Creating SolrCore 'collection1' using configuration from collection control_collection
   [junit4]   2> 2805170 INFO  (coreLoadExecutor-9020-thread-1-processing-n:127.0.0.1:65207_ds_jh%2Fsr) [n:127.0.0.1:65207_ds_jh%2Fsr c:control_collection s:shard1 r:core_node1 x:collection1] o.a.s.c.SolrCore org.apache.solr.core.MockDirectoryFactory
   [junit4]   2> 2805170 INFO  (coreLoadExecutor-9020-thread-1-processing-n:127.0.0.1:65207_ds_jh%2Fsr) [n:127.0.0.1:65207_ds_jh%2Fsr c:control_collection s:shard1 r:core_node1 x:collection1] o.a.s.c.SolrCore [[collection1] ] Opening new SolrCore at [/export/home/jenkins/workspace/Lucene-Solr-6.x-Solaris/solr/build/solr-core/test/J0/temp/solr.cloud.SolrCloudExampleTest_B26F37E1B2CC2C57-001/control-001/cores/collection1], dataDir=[/export/home/jenkins/workspace/Lucene-Solr-6.x-Solaris/solr/build/solr-core/test/J0/../../../../../../../../../../export/home/jenkins/workspace/Lucene-Solr-6.x-Solaris/solr/build/solr-core/test/J0/temp/solr.cloud.SolrCloudExampleTest_B26F37E1B2CC2C57-001/control-001/cores/collection1/data/]
   [junit4]   2> 2805170 INFO  (coreLoadExecutor-9020-thread-1-processing-n:127.0.0.1:65207_ds_jh%2Fsr) [n:127.0.0.1:65207_ds_jh%2Fsr c:control_collection s:shard1 r:core_node1 x:collection1] o.a.s.c.JmxMonitoredMap JMX monitoring is enabled. Adding Solr mbeans to JMX Server: com.sun.jmx.mbeanserver.JmxMBeanServer@56e7b7f6
   [junit4]   2> 2805170 INFO  (coreLoadExecutor-9020-thread-1-processing-n:127.0.0.1:65207_ds_jh%2Fsr) [n:127.0.0.1:65207_ds_jh%2Fsr c:control_collection s:shard1 r:core_node1 x:collection1] o.a.s.c.CachingDirectoryFactory return new directory for /export/home/jenkins/workspace/Lucene-Solr-6.x-Solaris/solr/build/solr-core/test/J0/../../../../../../../../../../export/home/jenkins/workspace/Lucene-Solr-6.x-Solaris/solr/build/solr-core/test/J0/temp/solr.cloud.SolrCloudExampleTest_B26F37E1B2CC2C57-001/control-001/cores/collection1/data
   [junit4]   2> 2805170 INFO  (coreLoadExecutor-9020-thread-1-processing-n:127.0.0.1:65207_ds_jh%2Fsr) [n:127.0.0.1:65207_ds_jh%2Fsr c:control_collection s:shard1 r:core_node1 x:collection1] o.a.s.c.SolrCore New index directory detected: old=null new=/export/home/jenkins/workspace/Lucene-Solr-6.x-Solaris/solr/build/solr-core/test/J0/../../../../../../../../../../export/home/jenkins/workspace/Lucene-Solr-6.x-Solaris/solr/build/solr-core/test/J0/temp/solr.cloud.SolrCloudExampleTest_B26F37E1B2CC2C57-001/control-001/cores/collection1/data/index/
   [junit4]   2> 2805171 WARN  (coreLoadExecutor-9020-thread-1-processing-n:127.0.0.1:65207_ds_jh%2Fsr) [n:127.0.0.1:65207_ds_jh%2Fsr c:control_collection s:shard1 r:core_node1 x:collection1] o.a.s.c.SolrCore [collection1] Solr index directory '/export/home/jenkins/workspace/Lucene-Solr-6.x-Solaris/solr/build/solr-core/test/J0/../../../../../../../../../../export/home/jenkins/workspace/Lucene-Solr-6.x-Solaris/solr/build/solr-core/test/J0/temp/solr.cloud.SolrCloudExampleTest_B26F37E1B2CC2C57-001/control-001/cores/collection1/data/index' doesn't exist. Creating new index...
   [junit4]   2> 2805171 INFO  (coreLoadExecutor-9020-thread-1-processing-n:127.0.0.1:65207_ds_jh%2Fsr) [n:127.0.0.1:65207_ds_jh%2Fsr c:control_collection s:shard1 r:core_node1 x:collection1] o.a.s.c.CachingDirectoryFactory return new directory for /export/home/jenkins/workspace/Lucene-Solr-6.x-Solaris/solr/build/solr-core/test/J0/../../../../../../../../../../export/home/jenkins/workspace/Lucene-Solr-6.x-Solaris/solr/build/solr-core/test/J0/temp/solr.cloud.SolrCloudExampleTest_B26F37E1B2CC2C57-001/control-001/cores/collection1/data/index
   [junit4]   2> 2805171 INFO  (coreLoadExecutor-9020-thread-1-processing-n:127.0.0.1:65207_ds_jh%2Fsr) [n:127.0.0.1:65207_ds_jh%2Fsr c:control_collection s:shard1 r:core_node1 x:collection1] o.a.s.u.RandomMergePolicy RandomMergePolicy wrapping class org.apache.lucene.index.TieredMergePolicy: [TieredMergePolicy: maxMergeAtOnce=45, maxMergeAtOnceExplicit=30, maxMergedSegmentMB=12.94140625, floorSegmentMB=0.484375, forceMergeDeletesPctAllowed=26.525349622355378, segmentsPerTier=44.0, maxCFSSegmentSizeMB=8.796093022207999E12, noCFSRatio=0.5691206094243987
   [junit4]   2> 2805171 INFO  (coreLoadExecutor-9020-thread-1-processing-n:127.0.0.1:65207_ds_jh%2Fsr) [n:127.0.0.1:65207_ds_jh%2Fsr c:control_collection s:shard1 r:core_node1 x:collection1] o.a.s.c.SolrDeletionPolicy SolrDeletionPolicy.onCommit: commits: num=1
   [junit4]   2> 	commit{dir=MockDirectoryWrapper(RAMDirectory@296dcafd lockFactory=org.apache.lucene.store.SingleInstanceLockFactory@2d7e7bef),segFN=segments_1,generation=1}
   [junit4]   2> 2805171 INFO  (coreLoadExecutor-9020-thread-1-processing-n:127.0.0.1:65207_ds_jh%2Fsr) [n:127.0.0.1:65207_ds_jh%2Fsr c:control_collection s:shard1 r:core_node1 x:collection1] o.a.s.c.SolrDeletionPolicy newest commit generation = 1
   [junit4]   2> 2805172 INFO  (OldIndexDirectoryCleanupThreadForCore-collection1) [n:127.0.0.1:65207_ds_jh%2Fsr c:control_collection s:shard1 r:core_node1 x:collection1] o.a.s.c.SolrCore Looking for old index directories to cleanup for core collection1 in /export/home/jenkins/workspace/Lucene-Solr-6.x-Solaris/solr/build/solr-core/test/J0/../../../../../../../../../../export/home/jenkins/workspace/Lucene-Solr-6.x-Solaris/solr/build/solr-core/test/J0/temp/solr.cloud.SolrCloudExampleTest_B26F37E1B2CC2C57-001/control-001/cores/collection1/data/
   [junit4]   2> 2805172 WARN  (OldIndexDirectoryCleanupThreadForCore-collection1) [n:127.0.0.1:65207_ds_jh%2Fsr c:control_collection s:shard1 r:core_node1 x:collection1] o.a.s.c.DirectoryFactory /export/home/jenkins/workspace/Lucene-Solr-6.x-Solaris/solr/build/solr-core/test/J0/../../../../../../../../../../export/home/jenkins/workspace/Lucene-Solr-6.x-Solaris/solr/build/solr-core/test/J0/temp/solr.cloud.SolrCloudExampleTest_B26F37E1B2CC2C57-001/control-001/cores/collection1/data/ does not point to a valid data directory; skipping clean-up of old index directories.
   [junit4]   2> 2805174 INFO  (coreLoadExecutor-9020-thread-1-processing-n:127.0.0.1:65207_ds_jh%2Fsr) [n:127.0.0.1:65207_ds_jh%2Fsr c:control_collection s:shard1 r:core_node1 x:collection1] o.a.s.u.p.UpdateRequestProcessorChain creating updateRequestProcessorChain "nodistrib"
   [junit4]   2> 2805174 INFO  (coreLoadExecutor-9020-thread-1-processing-n:127.0.0.1:65207_ds_jh%2Fsr) [n:127.0.0.1:65207_ds_jh%2Fsr c:control_collection s:shard1 r:core_node1 x:collection1] o.a.s.u.p.UpdateRequestProcessorChain creating updateRequestProcessorChain "dedupe"
   [junit4]   2> 2805174 INFO  (coreLoadExecutor-9020-thread-1-processing-n:127.0.0.1:65207_ds_jh%2Fsr) [n:127.0.0.1:65207_ds_jh%2Fsr c:control_collection s:shard1 r:core_node1 x:collection1] o.a.s.u.p.UpdateRequestProcessorChain inserting DistributedUpdateProcessorFactory into updateRequestProcessorChain "dedupe"
   [junit4]   2> 2805174 INFO  (coreLoadExecutor-9020-thread-1-processing-n:127.0.0.1:65207_ds_jh%2Fsr) [n:127.0.0.1:65207_ds_jh%2Fsr c:control_collection s:shard1 r:core_node1 x:collection1] o.a.s.u.p.UpdateRequestProcessorChain creating updateRequestProcessorChain "stored_sig"
   [junit4]   2> 2805174 INFO  (coreLoadExecutor-9020-thread-1-processing-n:127.0.0.1:65207_ds_jh%2Fsr) [n:127.0.0.1:65207_ds_jh%2Fsr c:control_collection s:shard1 r:core_node1 x:collection1] o.a.s.u.p.UpdateRequestProcessorChain inserting DistributedUpdateProcessorFactory into updateRequestProcessorChain "stored_sig"
   [junit4]   2> 2805174 INFO  (coreLoadExecutor-9020-thread-1-processing-n:127.0.0.1:65207_ds_jh%2Fsr) [n:127.0.0.1:65207_ds_jh%2Fsr c:control_collection s:shard1 r:core_node1 x:collection1] o.a.s.u.p.UpdateRequestProcessorChain creating updateRequestProcessorChain "distrib-dup-test-chain-explicit"
   [junit4]   2> 2805175 INFO  (coreLoadExecutor-9020-thread-1-processing-n:127.0.0.1:65207_ds_jh%2Fsr) [n:127.0.0.1:65207_ds_jh%2Fsr c:control_collection s:shard1 r:core_node1 x:collection1] o.a.s.u.p.UpdateRequestProcessorChain creating updateRequestProcessorChain "distrib-dup-test-chain-implicit"
   [junit4]   2> 2805175 INFO  (coreLoadExecutor-9020-thread-1-processing-n:127.0.0.1:65207_ds_jh%2Fsr) [n:127.0.0.1:65207_ds_jh%2Fsr c:control_collection s:shard1 r:core_node1 x:collection1] o.a.s.u.p.UpdateRequestProcessorChain inserting DistributedUpdateProcessorFactory into updateRequestProcessorChain "distrib-dup-test-chain-implicit"
   [junit4]   2> 2805175 INFO  (coreLoadExecutor-9020-thread-1-processing-n:127.0.0.1:65207_ds_jh%2Fsr) [n:127.0.0.1:65207_ds_jh%2Fsr c:control_collection s:shard1 r:core_node1 x:collection1] o.a.s.c.SolrCore no updateRequestProcessorChain defined as default, creating implicit default
   [junit4]   2> 2805175 WARN  (coreLoadExecutor-9020-thread-1-processing-n:127.0.0.1:65207_ds_jh%2Fsr) [n:127.0.0.1:65207_ds_jh%2Fsr c:control_collection s:shard1 r:core_node1 x:collection1] o.a.s.c.RequestHandlers INVALID paramSet a in requestHandler {type = requestHandler,name = /dump,class = DumpRequestHandler,args = {defaults={a=A,b=B}}}
   [junit4]   2> 2805177 INFO  (coreLoadExecutor-9020-thread-1-processing-n:127.0.0.1:65207_ds_jh%2Fsr) [n:127.0.0.1:65207_ds_jh%2Fsr c:control_collection s:shard1 r:core_node1 x:collection1] o.a.s.h.l.XMLLoader xsltCacheLifetimeSeconds=60
   [junit4]   2> 2805178 INFO  (coreLoadExecutor-9020-thread-1-processing-n:127.0.0.1:65207_ds_jh%2Fsr) [n:127.0.0.1:65207_ds_jh%2Fsr c:control_collection s:shard1 r:core_node1 x:collection1] o.a.s.h.l.XMLLoader xsltCacheLifetimeSeconds=60
   [junit4]   2> 2805179 INFO  (coreLoadExecutor-9020-thread-1-processing-n:127.0.0.1:65207_ds_jh%2Fsr) [n:127.0.0.1:65207_ds_jh%2Fsr c:control_collection s:shard1 r:core_node1 x:collection1] o.a.s.h.l.XMLLoader xsltCacheLifetimeSeconds=60
   [junit4]   2> 2805180 INFO  (coreLoadExecutor-9020-thread-1-processing-n:127.0.0.1:65207_ds_jh%2Fsr) [n:127.0.0.1:65207_ds_jh%2Fsr c:control_collection s:shard1 r:core_node1 x:collection1] o.a.s.h.l.XMLLoader xsltCacheLifetimeSeconds=60
   [junit4]   2> 2805183 INFO  (coreLoadExecutor-9020-thread-1-processing-n:127.0.0.1:65207_ds_jh%2Fsr) [n:127.0.0.1:65207_ds_jh%2Fsr c:control_collection s:shard1 r:core_node1 x:collection1] o.a.s.c.RequestHandlers Registered paths: /admin/mbeans,standard,/dump,/update/csv,/sql,/update/json/docs,/admin/luke,/export,/admin/segments,/get,/admin/system,/replication,/admin/properties,/config,/stream,/schema,/admin/plugins,/admin/logging,/update/json,/admin/ping,/admin/threads,/update,/admin/file
   [junit4]   2> 2805183 INFO  (coreLoadExecutor-9020-thread-1-processing-n:127.0.0.1:65207_ds_jh%2Fsr) [n:127.0.0.1:65207_ds_jh%2Fsr c:control_collection s:shard1 r:core_node1 x:collection1] o.a.s.c.SolrCore Using default statsCache cache: org.apache.solr.search.stats.LocalStatsCache
   [junit4]   2> 2805184 INFO  (coreLoadExecutor-9020-thread-1-processing-n:127.0.0.1:65207_ds_jh%2Fsr) [n:127.0.0.1:65207_ds_jh%2Fsr c:control_collection s:shard1 r:core_node1 x:collection1] o.a.s.u.UpdateHandler Using UpdateLog implementation: org.apache.solr.update.UpdateLog
   [junit4]   2> 2805184 INFO  (coreLoadExecutor-9020-thread-1-processing-n:127.0.0.1:65207_ds_jh%2Fsr) [n:127.0.0.1:65207_ds_jh%2Fsr c:control_collection s:shard1 r:core_node1 x:collection1] o.a.s.u.UpdateLog Initializing UpdateLog: dataDir= defaultSyncLevel=FLUSH numRecordsToKeep=100 maxNumLogsToKeep=10 numVersionBuckets=65536
   [junit4]   2> 2805184 INFO  (coreLoadExecutor-9020-thread-1-processing-n:127.0.0.1:65207_ds_jh%2Fsr) [n:127.0.0.1:65207_ds_jh%2Fsr c:control_collection s:shard1 r:core_node1 x:collection1] o.a.s.u.CommitTracker Hard AutoCommit: disabled
   [junit4]   2> 2805184 INFO  (coreLoadExecutor-9020-thread-1-processing-n:127.0.0.1:65207_ds_jh%2Fsr) [n:127.0.0.1:65207_ds_jh%2Fsr c:control_collection s:shard1 r:core_node1 x:collection1] o.a.s.u.CommitTracker Soft AutoCommit: disabled
   [junit4]   2> 2805185 INFO  (coreLoadExecutor-9020-thread-1-processing-n:127.0.0.1:65207_ds_jh%2Fsr) [n:127.0.0.1:65207_ds_jh%2Fsr c:control_collection s:shard1 r:core_node1 x:collection1] o.a.s.u.RandomMergePolicy RandomMergePolicy wrapping class org.apache.lucene.index.LogByteSizeMergePolicy: [LogByteSizeMergePolicy: minMergeSize=1677721, mergeFactor=12, maxMergeSize=2147483648, maxMergeSizeForForcedMerge=9223372036854775807, calibrateSizeByDeletes=true, maxMergeDocs=2147483647, maxCFSSegmentSizeMB=8.796093022207999E12, noCFSRatio=0.0]
   [junit4]   2> 2805185 INFO  (coreLoadExecutor-9020-thread-1-processing-n:127.0.0.1:65207_ds_jh%2Fsr) [n:127.0.0.1:65207_ds_jh%2Fsr c:control_collection s:shard1 r:core_node1 x:collection1] o.a.s.c.SolrDeletionPolicy SolrDeletionPolicy.onInit: commits: num=1
   [junit4]   2> 	commit{dir=MockDirectoryWrapper(RAMDirectory@296dcafd lockFactory=org.apache.lucene.store.SingleInstanceLockFactory@2d7e7bef),segFN=segments_1,generation=1}
   [junit4]   2> 2805185 INFO  (coreLoadExecutor-9020-thread-1-processing-n:127.0.0.1:65207_ds_jh%2Fsr) [n:127.0.0.1:65207_ds_jh%2Fsr c:control_collection s:shard1 r:core_node1 x:collection1] o.a.s.c.SolrDeletionPolicy newest commit generation = 1
   [junit4]   2> 2805185 INFO  (coreLoadExecutor-9020-thread-1-processing-n:127.0.0.1:65207_ds_jh%2Fsr) [n:127.0.0.1:65207_ds_jh%2Fsr c:control_collection s:shard1 r:core_node1 x:collection1] o.a.s.s.SolrIndexSearcher Opening [Searcher@5cbdaac1[collection1] main]
   [junit4]   2> 2805185 INFO  (coreLoadExecutor-9020-thread-1-processing-n:127.0.0.1:65207_ds_jh%2Fsr) [n:127.0.0.1:65207_ds_jh%2Fsr c:control_collection s:shard1 r:core_node1 x:collection1] o.a.s.c.c.ZkStateReader Load collection config from: [/collections/control_collection]
   [junit4]   2> 2805187 INFO  (coreLoadExecutor-9020-thread-1-processing-n:127.0.0.1:65207_ds_jh%2Fsr) [n:127.0.0.1:65207_ds_jh%2Fsr c:control_collection s:shard1 r:core_node1 x:collection1] o.a.s.c.c.ZkStateReader path=[/collections/control_collection] [configName]=[conf1] specified config exists in ZooKeeper
   [junit4]   2> 2805187 INFO  (coreLoadExecutor-9020-thread-1-processing-n:127.0.0.1:65207_ds_jh%2Fsr) [n:127.0.0.1:65207_ds_jh%2Fsr c:control_collection s:shard1 r:core_node1 x:collection1] o.a.s.r.ManagedResourceStorage Setting up ZooKeeper-based storage for the RestManager with znodeBase: /configs/conf1
   [junit4]   2> 2805187 INFO  (coreLoadExecutor-9020-thread-1-processing-n:127.0.0.1:65207_ds_jh%2Fsr) [n:127.0.0.1:65207_ds_jh%2Fsr c:control_collection s:shard1 r:core_node1 x:collection1] o.a.s.r.ManagedResourceStorage Configured ZooKeeperStorageIO with znodeBase: /configs/conf1
   [junit4]   2> 2805187 INFO  (coreLoadExecutor-9020-thread-1-processing-n:127.0.0.1:65207_ds_jh%2Fsr) [n:127.0.0.1:65207_ds_jh%2Fsr c:control_collection s:shard1 r:core_node1 x:collection1] o.a.s.r.RestManager Initializing RestManager with initArgs: {}
   [junit4]   2> 2805187 INFO  (coreLoadExecutor-9020-thread-1-processing-n:127.0.0.1:65207_ds_jh%2Fsr) [n:127.0.0.1:65207_ds_jh%2Fsr c:control_collection s:shard1 r:core_node1 x:collection1] o.a.s.r.ManagedResourceStorage Reading _rest_managed.json using ZooKeeperStorageIO:path=/configs/conf1
   [junit4]   2> 2805188 INFO  (coreLoadExecutor-9020-thread-1-processing-n:127.0.0.1:65207_ds_jh%2Fsr) [n:127.0.0.1:65207_ds_jh%2Fsr c:control_collection s:shard1 r:core_node1 x:collection1] o.a.s.r.ManagedResourceStorage No data found for znode /configs/conf1/_rest_managed.json
   [junit4]   2> 2805188 INFO  (coreLoadExecutor-9020-thread-1-processing-n:127.0.0.1:65207_ds_jh%2Fsr) [n:127.0.0.1:65207_ds_jh%2Fsr c:control_collection s:shard1 r:core_node1 x:collection1] o.a.s.r.ManagedResourceStorage Loaded null at path _rest_managed.json using ZooKeeperStorageIO:path=/configs/conf1
   [junit4]   2> 2805188 INFO  (coreLoadExecutor-9020-thread-1-processing-n:127.0.0.1:65207_ds_jh%2Fsr) [n:127.0.0.1:65207_ds_jh%2Fsr c:control_collection s:shard1 r:core_node1 x:collection1] o.a.s.r.RestManager Initializing 0 registered ManagedResources
   [junit4]   2> 2805188 INFO  (coreLoadExecutor-9020-thread-1-processing-n:127.0.0.1:65207_ds_jh%2Fsr) [n:127.0.0.1:65207_ds_jh%2Fsr c:control_collection s:shard1 r:core_node1 x:collection1] o.a.s.h.ReplicationHandler Commits will be reserved for  10000
   [junit4]   2> 2805189 INFO  (searcherExecutor-9022-thread-1-processing-n:127.0.0.1:65207_ds_jh%2Fsr x:collection1 s:shard1 c:control_collection r:core_node1) [n:127.0.0.1:65207_ds_jh%2Fsr c:control_collection s:shard1 r:core_node1 x:collection1] o.a.s.c.SolrCore [collection1] Registered new searcher Searcher@5cbdaac1[collection1] main{ExitableDirectoryReader(UninvertingDirectoryReader())}
   [junit4]   2> 2805189 INFO  (coreLoadExecutor-9020-thread-1-processing-n:127.0.0.1:65207_ds_jh%2Fsr) [n:127.0.0.1:65207_ds_jh%2Fsr c:control_collection s:shard1 r:core_node1 x:collection1] o.a.s.u.UpdateLog Looking up max value of version field to seed version buckets
   [junit4]   2> 2805189 INFO  (coreLoadExecutor-9020-thread-1-processing-n:127.0.0.1:65207_ds_jh%2Fsr) [n:127.0.0.1:65207_ds_jh%2Fsr c:control_collection s:shard1 r:core_node1 x:collection1] o.a.s.u.VersionInfo Refreshing highest value of _version_ for 65536 version buckets from index
   [junit4]   2> 2805190 INFO  (coreLoadExecutor-9020-thread-1-processing-n:127.0.0.1:65207_ds_jh%2Fsr) [n:127.0.0.1:65207_ds_jh%2Fsr c:control_collection s:shard1 r:core_node1 x:collection1] o.a.s.u.VersionInfo No terms found for _version_, cannot seed version bucket highest value from index
   [junit4]   2> 2805190 INFO  (coreLoadExecutor-9020-thread-1-processing-n:127.0.0.1:65207_ds_jh%2Fsr) [n:127.0.0.1:65207_ds_jh%2Fsr c:control_collection s:shard1 r:core_node1 x:collection1] o.a.s.u.UpdateLog Could not find max version in index or recent updates, using new clock 1531608871043334144
   [junit4]   2> 2805191 INFO  (coreLoadExecutor-9020-thread-1-processing-n:127.0.0.1:65207_ds_jh%2Fsr) [n:127.0.0.1:65207_ds_jh%2Fsr c:control_collection s:shard1 r:core_node1 x:collection1] o.a.s.u.UpdateLog Took 1.0ms to seed version buckets with highest version 1531608871043334144
   [junit4]   2> 2805191 INFO  (coreLoadExecutor-9020-thread-1-processing-n:127.0.0.1:65207_ds_jh%2Fsr) [n:127.0.0.1:65207_ds_jh%2Fsr c:control_collection s:shard1 r:core_node1 x:collection1] o.a.s.c.ZkController watch zkdir /configs/conf1
   [junit4]   2> 2805192 INFO  (coreLoadExecutor-9020-thread-1-processing-n:127.0.0.1:65207_ds_jh%2Fsr) [n:127.0.0.1:65207_ds_jh%2Fsr c:control_collection s:shard1 r:core_node1 x:collection1] o.a.s.c.CoreContainer registering core: collection1
   [junit4]   2> 2805192 INFO  (coreZkRegister-9015-thread-1-processing-n:127.0.0.1:65207_ds_jh%2Fsr x:collection1 s:shard1 c:control_collection r:core_node1) [n:127.0.0.1:65207_ds_jh%2Fsr c:control_collection s:shard1 r:core_node1 x:collection1] o.a.s.c.ZkController Register replica - core:collection1 address:http://127.0.0.1:65207/ds_jh/sr collection:control_collection shard:shard1
   [junit4]   2> 2805194 INFO  (coreZkRegister-9015-thread-1-processing-n:127.0.0.1:65207_ds_jh%2Fsr x:collection1 s:shard1 c:control_collection r:core_node1) [n:127.0.0.1:65207_ds_jh%2Fsr c:control_collection s:shard1 r:core_node1 x:collection1] o.a.s.c.c.SolrZkClient makePath: /collections/control_collection/leader_elect/shard1/election
   [junit4]   2> 2805199 INFO  (coreZkRegister-9015-thread-1-processing-n:127.0.0.1:65207_ds_jh%2Fsr x:collection1 s:shard1 c:control_collection r:core_node1) [n:127.0.0.1:65207_ds_jh%2Fsr c:control_collection s:shard1 r:core_node1 x:collection1] o.a.s.c.LeaderElector Joined leadership election with path: /collections/control_collection/leader_elect/shard1/election/95725554321063940-core_node1-n_0000000000
   [junit4]   2> 2805200 INFO  (coreZkRegister-9015-thread-1-processing-n:127.0.0.1:65207_ds_jh%2Fsr x:collection1 s:shard1 c:control_collection r:core_node1) [n:127.0.0.1:65207_ds_jh%2Fsr c:control_collection s:shard1 r:core_node1 x:collection1] o.a.s.c.ShardLeaderElectionContext Running the leader process for shard=shard1 and weAreReplacement=false and leaderVoteWait=10000
   [junit4]   2> 2805202 INFO  (coreZkRegister-9015-thread-1-processing-n:127.0.0.1:65207_ds_jh%2Fsr x:collection1 s:shard1 c:control_collection r:core_node1) [n:127.0.0.1:65207_ds_jh%2Fsr c:control_collection s:shard1 r:core_node1 x:collection1] o.a.s.c.ShardLeaderElectionContext Enough replicas found to continue.
   [junit4]   2> 2805202 INFO  (coreZkRegister-9015-thread-1-processing-n:127.0.0.1:65207_ds_jh%2Fsr x:collection1 s:shard1 c:control_collection r:core_node1) [n:127.0.0.1:65207_ds_jh%2Fsr c:control_collection s:shard1 r:core_node1 x:collection1] o.a.s.c.ShardLeaderElectionContext I may be the new leader - try and sync
   [junit4]   2> 2805202 INFO  (coreZkRegister-9015-thread-1-processing-n:127.0.0.1:65207_ds_jh%2Fsr x:collection1 s:shard1 c:control_collection r:core_node1) [n:127.0.0.1:65207_ds_jh%2Fsr c:control_collection s:shard1 r:core_node1 x:collection1] o.a.s.c.SyncStrategy Sync replicas to http://127.0.0.1:65207/ds_jh/sr/collection1/
   [junit4]   2> 2805202 INFO  (coreZkRegister-9015-thread-1-processing-n:127.0.0.1:65207_ds_jh%2Fsr x:collection1 s:shard1 c:control_collection r:core_node1) [n:127.0.0.1:65207_ds_jh%2Fsr c:control_collection s:shard1 r:core_node1 x:collection1] o.a.s.c.SyncStrategy Sync Success - now sync replicas to me
   [junit4]   2> 2805202 INFO  (coreZkRegister-9015-thread-1-processing-n:127.0.0.1:65207_ds_jh%2Fsr x:collection1 s:shard1 c:control_collection r:core_node1) [n:127.0.0.1:65207_ds_jh%2Fsr c:control_collection s:shard1 r:core_node1 x:collection1] o.a.s.c.SyncStrategy http://127.0.0.1:65207/ds_jh/sr/collection1/ has no replicas
   [junit4]   2> 2805203 INFO  (OverseerStateUpdate-95725554321063940-127.0.0.1:65207_ds_jh%2Fsr-n_0000000000) [n:127.0.0.1:65207_ds_jh%2Fsr    ] o.a.s.c.Overseer processMessage: queueSize: 1, message = {
   [junit4]   2>   "operation":"leader",
   [junit4]   2>   "shard":"shard1",
   [junit4]   2>   "collection":"control_collection"} current state version: 1
   [junit4]   2> 2805203 INFO  (coreZkRegister-9015-thread-1-processing-n:127.0.0.1:65207_ds_jh%2Fsr x:collection1 s:shard1 c:control_collection r:core_node1) [n:127.0.0.1:65207_ds_jh%2Fsr c:control_collection s:shard1 r:core_node1 x:collection1] o.a.s.c.c.SolrZkClient makePath: /collections/control_collection/leaders/shard1
   [junit4]   2> 2805208 INFO  (coreZkRegister-9015-thread-1-processing-n:127.0.0.1:65207_ds_jh%2Fsr x:collection1 s:shard1 c:control_collection r:core_node1) [n:127.0.0.1:65207_ds_jh%2Fsr c:control_collection s:shard1 r:core_node1 x:collection1] o.a.s.c.ShardLeaderElectionContextBase Creating leader registration node /collections/control_collection/leaders/shard1/leader after winning as /collections/control_collection/leader_elect/shard1/election/95725554321063940-core_node1-n_0000000000
   [junit4]   2> 2805211 INFO  (coreZkRegister-9015-thread-1-processing-n:127.0.0.1:65207_ds_jh%2Fsr x:collection1 s:shard1 c:control_collection r:core_node1) [n:127.0.0.1:65207_ds_jh%2Fsr c:control_collection s:shard1 r:core_node1 x:collection1] o.a.s.c.ShardLeaderElectionContext I am the new leader: http://127.0.0.1:65207/ds_jh/sr/collection1/ shard1
   [junit4]   2> 2805212 INFO  (OverseerStateUpdate-95725554321063940-127.0.0.1:65207_ds_jh%2Fsr-n_0000000000) [n:127.0.0.1:65207_ds_jh%2Fsr    ] o.a.s.c.Overseer processMessage: queueSize: 1, message = {
   [junit4]   2>   "operation":"leader",
   [junit4]   2>   "shard":"shard1",
   [junit4]   2>   "collection":"control_collection",
   [junit4]   2>   "base_url":"http://127.0.0.1:65207/ds_jh/sr",
   [junit4]   2>   "core":"collection1",
   [junit4]   2>   "state":"active"} current state version: 1
   [junit4]   2> 2805315 INFO  (zkCallback-10122-thread-1-processing-n:127.0.0.1:65207_ds_jh%2Fsr) [n:127.0.0.1:65207_ds_jh%2Fsr    ] o.a.s.c.c.ZkStateReader A cluster state change: [WatchedEvent state:SyncConnected type:NodeDataChanged path:/clusterstate.json], has occurred - updating... (live nodes size: [1])
   [junit4]   2> 2805362 INFO  (coreZkRegister-9015-thread-1-processing-n:127.0.0.1:65207_ds_jh%2Fsr x:collection1 s:shard1 c:control_collection r:core_node1) [n:127.0.0.1:65207_ds_jh%2Fsr c:control_collection s:shard1 r:core_node1 x:collection1] o.a.s.c.ZkController We are http://127.0.0.1:65207/ds_jh/sr/collection1/ and leader is http://127.0.0.1:65207/ds_jh/sr/collection1/
   [junit4]   2> 2805362 INFO  (coreZkRegister-9015-thread-1-processing-n:127.0.0.1:65207_ds_jh%2Fsr x:collection1 s:shard1 c:control_collection r:core_node1) [n:127.0.0.1:65207_ds_jh%2Fsr c:control_collection s:shard1 r:core_node1 x:collection1] o.a.s.c.ZkController No LogReplay needed for core=collection1 baseURL=http://127.0.0.1:65207/ds_jh/sr
   [junit4]   2> 2805362 INFO  (coreZkRegister-9015-thread-1-processing-n:127.0.0.1:65207_ds_jh%2Fsr x:collection1 s:shard1 c:control_collection r:core_node1) [n:127.0.0.1:65207_ds_jh%2Fsr c:control_collection s:shard1 r:core_node1 x:collection1] o.a.s.c.ZkController I am the leader, no recovery necessary
   [junit4]   2> 2805363 INFO  (coreZkRegister-9015-thread-1-processing-n:127.0.0.1:65207_ds_jh%2Fsr x:collection1 s:shard1 c:control_collection r:core_node1) [n:127.0.0.1:65207_ds_jh%2Fsr c:control_collection s:shard1 r:core_node1 x:collection1] o.a.s.c.ZkController publishing state=active
   [junit4]   2> 2805363 INFO  (coreZkRegister-9015-thread-1-processing-n:127.0.0.1:65207_ds_jh%2Fsr x:collection1 s:shard1 c:control_collection r:core_node1) [n:127.0.0.1:65207_ds_jh%2Fsr c:control_collection s:shard1 r:core_node1 x:collection1] o.a.s.c.ZkController numShards not found on descriptor - reading it from system property
   [junit4]   2> 2805366 INFO  (OverseerStateUpdate-95725554321063940-127.0.0.1:65207_ds_jh%2Fsr-n_0000000000) [n:127.0.0.1:65207_ds_jh%2Fsr    ] o.a.s.c.Overseer processMessage: queueSize: 1, message = {
   [junit4]   2>   "core":"collection1",
   [junit4]   2>   "core_node_name":"core_node1",
   [junit4]   2>   "roles":null,
   [junit4]   2>   "base_url":"http://127.0.0.1:65207/ds_jh/sr",
   [junit4]   2>   "node_name":"127.0.0.1:65207_ds_jh%2Fsr",
   [junit4]   2>   "numShards":"1",
   [junit4]   2>   "state":"active",
   [junit4]   2>   "shard":"shard1",
   [junit4]   2>   "collection":"control_collection",
   [junit4]   2>   "operation":"state"} current state version: 2
   [junit4]   2> 2805366 INFO  (OverseerStateUpdate-95725554321063940-127.0.0.1:65207_ds_jh%2Fsr-n_0000000000) [n:127.0.0.1:65207_ds_jh%2Fsr    ] o.a.s.c.o.ReplicaMutator Update state numShards=1 message={
   [junit4]   2>   "core":"collection1",
   [junit4]   2>   "core_node_name":"core_node1",
   [junit4]   2>   "roles":null,
   [junit4]   2>   "base_url":"http://127.0.0.1:65207/ds_jh/sr",
   [junit4]   2>   "node_name":"127.0.0.1:65207_ds_jh%2Fsr",
   [junit4]   2>   "numShards":"1",
   [junit4]   2>   "state":"active",
   [junit4]   2>   "shard":"shard1",
   [junit4]   2>   "collection":"control_collection",
   [junit4]   2>   "operation":"state"}
   [junit4]   2> 2805410 INFO  (TEST-SolrCloudExampleTest.testLoadDocsIntoGettingStartedCollection-seed#[B26F37E1B2CC2C57]) [    ] o.a.s.c.s.i.CloudSolrClient Final constructed zkHost string: 127.0.0.1:32868/solr
   [junit4]   2> 2805411 INFO  (TEST-SolrCloudExampleTest.testLoadDocsIntoGettingStartedCollection-seed#[B26F37E1B2CC2C57]) [    ] o.a.s.c.c.SolrZkClient Using default ZkCredentialsProvider
   [junit4]   2> 2805412 INFO  (TEST-SolrCloudExampleTest.testLoadDocsIntoGettingStartedCollection-seed#[B26F37E1B2CC2C57]) [    ] o.a.s.c.c.ConnectionManager Waiting for client to connect to ZooKeeper
   [junit4]   2> 2805414 INFO  (zkCallback-10124-thread-1) [    ] o.a.s.c.c.ConnectionManager Watcher org.apache.solr.common.cloud.ConnectionManager@50e986d6 name:ZooKeeperConnection Watcher:127.0.0.1:32868/solr got event WatchedEvent state:SyncConnected type:None path:null path:null type:None
   [junit4]   2> 2805414 INFO  (TEST-SolrCloudExampleTest.testLoadDocsIntoGettingStartedCollection-seed#[B26F37E1B2CC2C57]) [    ] o.a.s.c.c.ConnectionManager Client is connected to ZooKeeper
   [junit4]   2> 2805414 INFO  (TEST-SolrCloudExampleTest.testLoadDocsIntoGettingStartedCollection-seed#[B26F37E1B2CC2C57]) [    ] o.a.s.c.c.SolrZkClient Using default ZkACLProvider
   [junit4]   2> 2805414 INFO  (TEST-SolrCloudExampleTest.testLoadDocsIntoGettingStartedCollection-seed#[B26F37E1B2CC2C57]) [    ] o.a.s.c.c.ZkStateReader Updating cluster state from ZooKeeper... 
   [junit4]   2> 2805416 INFO  (TEST-SolrCloudExampleTest.testLoadDocsIntoGettingStartedCollection-seed#[B26F37E1B2CC2C57]) [    ] o.a.s.c.c.ZkStateReader Updated live nodes from ZooKeeper... (0) -> (1)
   [junit4]   2> 2805418 INFO  (TEST-SolrCloudExampleTest.testLoadDocsIntoGettingStartedCollection-seed#[B26F37E1B2CC2C57]) [    ] o.a.s.c.ChaosMonkey monkey: init - expire sessions:false cause connection loss:false
   [junit4]   2> 2805418 INFO  (TEST-SolrCloudExampleTest.testLoadDocsIntoGettingStartedCollection-seed#[B26F37E1B2CC2C57]) [    ] o.a.s.c.AbstractFullDistribZkTestBase Creating collection1 with stateFormat=2
   [junit4]   2> 2805418 INFO  (TEST-SolrCloudExampleTest.testLoadDocsIntoGettingStartedCollection-seed#[B26F37E1B2CC2C57]) [    ] o.a.s.c.c.SolrZkClient Using default ZkCredentialsProvider
   [junit4]   2> 2805419 INFO  (TEST-SolrCloudExampleTest.testLoadDocsIntoGettingStartedCollection-seed#[B26F37E1B2CC2C57]) [    ] o.a.s.c.c.ConnectionManager Waiting for client to connect to ZooKeeper
   [junit4]   2> 2805421 INFO  (zkCallback-10125-thread-1) [    ] o.a.s.c.c.ConnectionManager Watcher org.apache.solr.common.cloud.ConnectionManager@25813065 name:ZooKeeperConnection Watcher:127.0.0.1:32868/solr got event WatchedEvent state:SyncConnected type:None path:null path:null type:None
   [junit4]   2> 2805421 INFO  (TEST-SolrCloudExampleTest.testLoadDocsIntoGettingStartedCollection-seed#[B26F37E1B2CC2C57]) [    ] o.a.s.c.c.ConnectionManager Client is connected to ZooKeeper
   [junit4]   2> 2805421 INFO  (TEST-SolrCloudExampleTest.testLoadDocsIntoGettingStartedCollection-seed#[B26F37E1B2CC2C57]) [    ] o.a.s.c.c.SolrZkClient Using default ZkACLProvider
   [junit4]   2> 2805424 INFO  (OverseerStateUpdate-95725554321063940-127.0.0.1:65207_ds_jh%2Fsr-n_0000000000) [n:127.0.0.1:65207_ds_jh%2Fsr    ] o.a.s.c.Overseer processMessage: queueSize: 1, message = {
   [junit4]   2>   "operation":"create",
   [junit4]   2>   "name":"collection1",
   [junit4]   2>   "numShards":"2",
   [junit4]   2>   "stateFormat":"2"} current state version: 2
   [junit4]   2> 2805425 INFO  (OverseerStateUpdate-95725554321063940-127.0.0.1:65207_ds_jh%2Fsr-n_0000000000) [n:127.0.0.1:65207_ds_jh%2Fsr    ] o.a.s.c.o.ClusterStateMutator building a new cName: collection1
   [junit4]   2> 2805426 INFO  (zkCallback-10122-thread-1-processing-n:127.0.0.1:65207_ds_jh%2Fsr) [n:127.0.0.1:65207_ds_jh%2Fsr    ] o.a.s.c.c.ZkStateReader A cluster state change: [WatchedEvent state:SyncConnected type:NodeDataChanged path:/clusterstate.json], has occurred - updating... (live nodes size: [1])
   [junit4]   2> 2805426 INFO  (zkCallback-10124-thread-1) [    ] o.a.s.c.c.ZkStateReader A cluster state change: [WatchedEvent state:SyncConnected type:NodeDataChanged path:/clusterstate.json], has occurred - updating... (live nodes size: [1])
   [junit4]   2> 2805532 INFO  (OverseerStateUpdate-95725554321063940-127.0.0.1:65207_ds_jh%2Fsr-n_0000000000) [n:127.0.0.1:65207_ds_jh%2Fsr    ] o.a.s.c.o.ZkStateWriter going to create_collection /collections/collection1/state.json
   [junit4]   2> 2805663 INFO  (TEST-SolrCloudExampleTest.testLoadDocsIntoGettingStartedCollection-seed#[B26F37E1B2CC2C57]) [    ] o.a.s.SolrTestCaseJ4 Writing core.properties file to /export/home/jenkins/workspace/Lucene-Solr-6.x-Solaris/solr/build/solr-core/test/J0/temp/solr.cloud.SolrCloudExampleTest_B26F37E1B2CC2C57-001/shard-1-001/cores/collection1
   [junit4]   2> 2805664 INFO  (TEST-SolrCloudExampleTest.testLoadDocsIntoGettingStartedCollection-seed#[B26F37E1B2CC2C57]) [    ] o.a.s.c.AbstractFullDistribZkTestBase create jetty 1 in directory /export/home/jenkins/workspace/Lucene-Solr-6.x-Solaris/solr/build/solr-core/test/J0/temp/solr.cloud.SolrCloudExampleTest_B26F37E1B2CC2C57-001/shard-1-001
   [junit4]   2> 2805664 INFO  (TEST-SolrCloudExampleTest.testLoadDocsIntoGettingStartedCollection-seed#[B26F37E1B2CC2C57]) [    ] o.e.j.s.Server jetty-9.3.8.v20160314
   [junit4]   2> 2805666 INFO  (TEST-SolrCloudExampleTest.testLoadDocsIntoGettingStartedCollection-seed#[B26F37E1B2CC2C57]) [    ] o.e.j.s.h.ContextHandler Started o.e.j.s.ServletContextHandler@17f46699{/ds_jh/sr,null,AVAILABLE}
   [junit4]   2> 2805666 INFO  (TEST-SolrCloudExampleTest.testLoadDocsIntoGettingStartedCollection-seed#[B26F37E1B2CC2C57]) [    ] o.e.j.s.ServerConnector Started ServerConnector@4398396b{HTTP/1.1,[http/1.1]}{127.0.0.1:48528}
   [junit4]   2> 2805666 INFO  (TEST-SolrCloudExampleTest.testLoadDocsIntoGettingStartedCollection-seed#[B26F37E1B2CC2C57]) [    ] o.e.j.s.Server Started @2809608ms
   [junit4]   2> 2805666 INFO  (TEST-SolrCloudExampleTest.testLoadDocsIntoGettingStartedCollection-seed#[B26F37E1B2CC2C57]) [    ] o.a.s.c.s.e.JettySolrRunner Jetty properties: {solr.data.dir=/export/home/jenkins/workspace/Lucene-Solr-6.x-Solaris/solr/build/solr-core/test/J0/temp/solr.cloud.SolrCloudExampleTest_B26F37E1B2CC2C57-001/tempDir-001/jetty1, solrconfig=solrconfig.xml, hostContext=/ds_jh/sr, hostPort=48528, coreRootDirectory=/export/home/jenkins/workspace/Lucene-Solr-6.x-Solaris/solr/build/solr-core/test/J0/../../../../../../../../../../export/home/jenkins/workspace/Lucene-Solr-6.x-Solaris/solr/build/solr-core/test/J0/temp/solr.cloud.SolrCloudExampleTest_B26F37E1B2CC2C57-001/shard-1-001/cores}
   [junit4]   2> 2805666 INFO  (TEST-SolrCloudExampleTest.testLoadDocsIntoGettingStartedCollection-seed#[B26F37E1B2CC2C57]) [    ] o.a.s.s.SolrDispatchFilter SolrDispatchFilter.init(): sun.misc.Launcher$AppClassLoader@6d06d69c
   [junit4]   2> 2805667 INFO  (TEST-SolrCloudExampleTest.testLoadDocsIntoGettingStartedCollection-seed#[B26F37E1B2CC2C57]) [    ] o.a.s.c.SolrResourceLoader new SolrResourceLoader for directory: '/export/home/jenkins/workspace/Lucene-Solr-6.x-Solaris/solr/build/solr-core/test/J0/temp/solr.cloud.SolrCloudExampleTest_B26F37E1B2CC2C57-001/shard-1-001'
   [junit4]   2> 2805667 INFO  (TEST-SolrCloudExampleTest.testLoadDocsIntoGettingStartedCollection-seed#[B26F37E1B2CC2C57]) [    ] o.a.s.c.SolrResourceLoader JNDI not configured for solr (NoInitialContextEx)
   [junit4]   2> 2805667 INFO  (TEST-SolrCloudExampleTest.testLoadDocsIntoGettingStartedCollection-seed#[B26F37E1B2CC2C57]) [    ] o.a.s.c.SolrResourceLoader solr home defaulted to 'solr/' (could not find system property or JNDI)
   [junit4]   2> 2805667 INFO  (TEST-SolrCloudExampleTest.testLoadDocsIntoGettingStartedCollection-seed#[B26F37E1B2CC2C57]) [    ] o.a.s.c.c.SolrZkClient Using default ZkCredentialsProvider
   [junit4]   2> 2805668 INFO  (TEST-SolrCloudExampleTest.testLoadDocsIntoGettingStartedCollection-seed#[B26F37E1B2CC2C57]) [    ] o.a.s.c.c.ConnectionManager Waiting for client to connect to ZooKeeper
   [junit4]   2> 2805671 INFO  (zkCallback-10126-thread-1) [    ] o.a.s.c.c.ConnectionManager Watcher org.apache.solr.common.cloud.ConnectionManager@43606989 name:ZooKeeperConnection Watcher:127.0.0.1:32868/solr got event WatchedEvent state:SyncConnected type:None path:null path:null type:None
   [junit4]   2> 2805671 INFO  (TEST-SolrCloudExampleTest.testLoadDocsIntoGettingStartedCollection-seed#[B26F37E1B2CC2C57]) [    ] o.a.s.c.c.ConnectionManager Client is connected to ZooKeeper
   [junit4]   2> 2805671 INFO  (TEST-SolrCloudExampleTest.testLoadDocsIntoGettingStartedCollection-seed#[B26F37E1B2CC2C57]) [    ] o.a.s.c.c.SolrZkClient Using default ZkACLProvider
   [junit4]   2> 2805673 INFO  (TEST-SolrCloudExampleTest.testLoadDocsIntoGettingStartedCollection-seed#[B26F37E1B2CC2C57]) [    ] o.a.s.s.SolrDispatchFilter Loading solr.xml from SolrHome (not found in ZooKeeper)
   [junit4]   2> 2805673 INFO  (TEST-SolrCloudExampleTest.testLoadDocsIntoGettingStartedCollection-seed#[B26F37E1B2CC2C57]) [    ] o.a.s.c.SolrXmlConfig Loading container configuration from /export/home/jenkins/workspace/Lucene-Solr-6.x-Solaris/solr/build/solr-core/test/J0/temp/solr.cloud.SolrCloudExampleTest_B26F37E1B2CC2C57-001/shard-1-001/solr.xml
   [junit4]   2> 2805679 INFO  (TEST-SolrCloudExampleTest.testLoadDocsIntoGettingStartedCollection-seed#[B26F37E1B2CC2C57]) [    ] o.a.s.c.CorePropertiesLocator Config-defined core root directory: /export/home/jenkins/workspace/Lucene-Solr-6.x-Solaris/solr/build/solr-core/test/J0/../../../../../../../../../../export/home/jenkins/workspace/Lucene-Solr-6.x-Solaris/solr/build/solr-core/test/J0/temp/solr.cloud.SolrCloudExampleTest_B26F37E1B2CC2C57-001/shard-1-001/cores
   [junit4]   2> 2805679 INFO  (TEST-SolrCloudExampleTest.testLoadDocsIntoGettingStartedCollection-seed#[B26F37E1B2CC2C57]) [    ] o.a.s.c.CoreContainer New CoreContainer 1830044543
   [junit4]   2> 2805679 INFO  (TEST-SolrCloudExampleTest.testLoadDocsIntoGettingStartedCollection-seed#[B26F37E1B2CC2C57]) [    ] o.a.s.c.CoreContainer Loading cores into CoreContainer [instanceDir=/export/home/jenkins/workspace/Lucene-Solr-6.x-Solaris/solr/build/solr-core/test/J0/temp/solr.cloud.SolrCloudExampleTest_B26F37E1B2CC2C57-001/shard-1-001]
   [junit4]   2> 2805679 WARN  (TEST-SolrCloudExampleTest.testLoadDocsIntoGettingStartedCollection-seed#[B26F37E1B2CC2C57]) [    ] o.a.s.c.CoreContainer Couldn't add files from /export/home/jenkins/workspace/Lucene-Solr-6.x-Solaris/solr/build/solr-core/test/J0/temp/solr.cloud.SolrCloudExampleTest_B26F37E1B2CC2C57-001/shard-1-001/lib to classpath: /export/home/jenkins/workspace/Lucene-Solr-6.x-Solaris/solr/build/solr-core/test/J0/temp/solr.cloud.SolrCloudExampleTest_B26F37E1B2CC2C57-001/shard-1-001/lib
   [junit4]   2> 2805680 INFO  (TEST-SolrCloudExampleTest.testLoadDocsIntoGettingStartedCollection-seed#[B26F37E1B2CC2C57]) [    ] o.a.s.h.c.HttpShardHandlerFactory created with socketTimeout : 90000,urlScheme : ,connTimeout : 15000,maxConnectionsPerHost : 20,maxConnections : 10000,corePoolSize : 0,maximumPoolSize : 2147483647,maxThreadIdleTime : 5,sizeOfQueue : -1,fairnessPolicy : false,useRetries : false,
   [junit4]   2> 2805682 INFO  (TEST-SolrCloudExampleTest.testLoadDocsIntoGettingStartedCollection-seed#[B26F37E1B2CC2C57]) [    ] o.a.s.u.UpdateShardHandler Creating UpdateShardHandler HTTP client with params: socketTimeout=340000&connTimeout=45000&retry=true
   [junit4]   2> 2805683 INFO  (TEST-SolrCloudExampleTest.testLoadDocsIntoGettingStartedCollection-seed#[B26F37E1B2CC2C57]) [    ] o.a.s.l.LogWatcher SLF4J impl is org.slf4j.impl.Log4jLoggerFactory
   [junit4]   2> 2805683 INFO  (TEST-SolrCloudExampleTest.testLoadDocsIntoGettingStartedCollection-seed#[B26F37E1B2CC2C57]) [    ] o.a.s.l.LogWatcher Registering Log Listener [Log4j (org.slf4j.impl.Log4jLoggerFactory)]
   [junit4]   2> 2805683 INFO  (TEST-SolrCloudExampleTest.testLoadDocsIntoGettingStartedCollection-seed#[B26F37E1B2CC2C57]) [    ] o.a.s.c.ZkContainer Zookeeper client=127.0.0.1:32868/solr
   [junit4]   2> 2805683 INFO  (TEST-SolrCloudExampleTest.testLoadDocsIntoGettingStartedCollection-seed#[B26F37E1B2CC2C57]) [    ] o.a.s.c.ZkController zkHost includes chroot
   [junit4]   2> 2805683 INFO  (TEST-SolrCloudExampleTest.testLoadDocsIntoGettingStartedCollection-seed#[B26F37E1B2CC2C57]) [    ] o.a.s.c.c.SolrZkClient Using default ZkCredentialsProvider
   [junit4]   2> 2805684 INFO  (TEST-SolrCloudExampleTest.testLoadDocsIntoGettingStartedCollection-seed#[B26F37E1B2CC2C57]) [    ] o.a.s.c.c.ConnectionManager Waiting for client to connect to ZooKeeper
   [junit4]   2> 2805686 INFO  (zkCallback-10129-thread-1) [    ] o.a.s.c.c.ConnectionManager Watcher org.apache.solr.common.cloud.ConnectionManager@75adf7ab name:ZooKeeperConnection Watcher:127.0.0.1:32868 got event WatchedEvent state:SyncConnected type:None path:null path:null type:None
   [junit4]   2> 2805686 INFO  (TEST-SolrCloudExampleTest.testLoadDocsIntoGettingStartedCollection-seed#[B26F37E1B2CC2C57]) [    ] o.a.s.c.c.ConnectionManager Client is connected to ZooKeeper
   [junit4]   2> 2805687 INFO  (TEST-SolrCloudExampleTest.testLoadDocsIntoGettingStartedCollection-seed#[B26F37E1B2CC2C57]) [    ] o.a.s.c.c.SolrZkClient Using default ZkACLProvider
   [junit4]   2> 2805689 INFO  (TEST-SolrCloudExampleTest.testLoadDocsIntoGettingStartedCollection-seed#[B26F37E1B2CC2C57]) [n:127.0.0.1:48528_ds_jh%2Fsr    ] o.a.s.c.c.ConnectionManager Waiting for client to connect to ZooKeeper
   [junit4]   2> 2805691 INFO  (zkCallback-10130-thread-1-processing-n:127.0.0.1:48528_ds_jh%2Fsr) [n:127.0.0.1:48528_ds_jh%2Fsr    ] o.a.s.c.c.ConnectionManager Watcher org.apache.solr.common.cloud.ConnectionManager@4a59ac1a name:ZooKeeperConnection Watcher:127.0.0.1:32868/solr got event WatchedEvent state:SyncConnected type:None path:null path:null type:None
   [junit4]   2> 2805691 INFO  (TEST-SolrCloudExampleTest.testLoadDocsIntoGettingStartedCollection-seed#[B26F37E1B2CC2C57]) [n:127.0.0.1:48528_ds_jh%2Fsr    ] o.a.s.c.c.ConnectionManager Client is connected to ZooKeeper
   [junit4]   2> 2805701 INFO  (TEST-SolrCloudExampleTest.testLoadDocsIntoGettingStartedCollection-seed#[B26F37E1B2CC2C57]) [n:127.0.0.1:48528_ds_jh%2Fsr    ] o.a.s.c.c.ZkStateReader Updating cluster state from ZooKeeper... 
   [junit4]   2> 2805703 INFO  (TEST-SolrCloudExampleTest.testLoadDocsIntoGettingStartedCollection-seed#[B26F37E1B2CC2C57]) [n:127.0.0.1:48528_ds_jh%2Fsr    ] o.a.s.c.c.ZkStateReader Updated live nodes from ZooKeeper... (0) -> (1)
   [junit4]   2> 2805707 INFO  (TEST-SolrCloudExampleTest.testLoadDocsIntoGettingStartedCollection-seed#[B26F37E1B2CC2C57]) [n:127.0.0.1:48528_ds_jh%2Fsr    ] o.a.s.c.Overseer Overseer (id=null) closing
   [junit4]   2> 2805708 INFO  (TEST-SolrCloudExampleTest.testLoadDocsIntoGettingStartedCollection-seed#[B26F37E1B2CC2C57]) [n:127.0.0.1:48528_ds_jh%2Fsr    ] o.a.s.c.LeaderElector Joined leadership election with path: /overseer_elect/election/95725554321063945-127.0.0.1:48528_ds_jh%2Fsr-n_0000000001
   [junit4]   2> 2805709 INFO  (TEST-SolrCloudExampleTest.testLoadDocsIntoGettingStartedCollection-seed#[B26F37E1B2CC2C57]) [n:127.0.0.1:48528_ds_jh%2Fsr    ] o.a.s.c.LeaderElector Watching path /overseer_elect/election/95725554321063940-127.0.0.1:65207_ds_jh%2Fsr-n_0000000000 to know if I could be the leader
   [junit4]   2> 2805710 INFO  (TEST-SolrCloudExampleTest.testLoadDocsIntoGettingStartedCollection-seed#[B26F37E1B2CC2C57]) [n:127.0.0.1:48528_ds_jh%2Fsr    ] o.a.s.c.ZkController Publish node=127.0.0.1:48528_ds_jh%2Fsr as DOWN
   [junit4]   2> 2805712 INFO  (OverseerStateUpdate-95725554321063940-127.0.0.1:65207_ds_jh%2Fsr-n_0000000000) [n:127.0.0.1:65207_ds_jh%2Fsr    ] o.a.s.c.Overseer processMessage: queueSize: 1, message = {
   [junit4]   2>   "operation":"downnode",
   [junit4]   2>   "node_name":"127.0.0.1:48528_ds_jh%2Fsr"} current state version: 3
   [junit4]   2> 2805712 INFO  (OverseerStateUpdate-95725554321063940-127.0.0.1:65207_ds_jh%2Fsr-n_0000000000) [n:127.0.0.1:65207_ds_jh%2Fsr    ] o.a.s.c.o.NodeMutator DownNode state invoked for node: 127.0.0.1:48528_ds_jh%2Fsr
   [junit4]   2> 2805713 INFO  (OverseerStateUpdate-95725554321063940-127.0.0.1:65207_ds_jh%2Fsr-n_0000000000) [n:127.0.0.1:65207_ds_jh%2Fsr    ] o.a.s.c.o.ZkStateWriter going to update_collection /collections/collection1/state.json version: 0
   [junit4]   2> 2805819 INFO  (zkCallback-10122-thread-1-processing-n:127.0.0.1:65207_ds_jh%2Fsr) [n:127.0.0.1:65207_ds_jh%2Fsr    ] o.a.s.c.c.ZkStateReader A cluster state change: [WatchedEvent state:SyncConnected type:NodeDataChanged path:/clusterstate.json], has occurred - updating... (live nodes size: [1])
   [junit4]   2> 2805819 INFO  (zkCallback-10124-thread-1) [    ] o.a.s.c.c.ZkStateReader A cluster state change: [WatchedEvent state:SyncConnected type:NodeDataChanged path:/clusterstate.json], has occurred - updating... (live nodes size: [1])
   [junit4]   2> 2805819 INFO  (zkCallback-10130-thread-1-processing-n:127.0.0.1:48528_ds_jh%2Fsr) [n:127.0.0.1:48528_ds_jh%2Fsr    ] o.a.s.c.c.ZkStateReader A cluster state change: [WatchedEvent state:SyncConnected type:NodeDataChanged path:/clusterstate.json], has occurred - updating... (live nodes size: [1])
   [junit4]   2> 2806715 INFO  (TEST-SolrCloudExampleTest.testLoadDocsIntoGettingStartedCollection-seed#[B26F37E1B2CC2C57]) [n:127.0.0.1:48528_ds_jh%2Fsr    ] o.a.s.c.ZkController Register node as live in ZooKeeper:/live_nodes/127.0.0.1:48528_ds_jh%2Fsr
   [junit4]   2> 2806716 INFO  (TEST-SolrCloudExampleTest.testLoadDocsIntoGettingStartedCollection-seed#[B26F37E1B2CC2C57]) [n:127.0.0.1:48528_ds_jh%2Fsr    ] o.a.s.c.c.SolrZkClient makePath: /live_nodes/127.0.0.1:48528_ds_jh%2Fsr
   [junit4]   2> 2806718 INFO  (zkCallback-10124-thread-1) [    ] o.a.s.c.c.ZkStateReader A live node change: [WatchedEvent state:SyncConnected type:NodeChildrenChanged path:/live_nodes], has occurred - updating... (live nodes size: [1])
   [junit4]   2> 2806718 INFO  (zkCallback-10122-thread-1-processing-n:127.0.0.1:65207_ds_jh%2Fsr) [n:127.0.0.1:65207_ds_jh%2Fsr    ] o.a.s.c.c.ZkStateReader A live node change: [WatchedEvent state:SyncConnected type:NodeChildrenChanged path:/live_nodes], has occurred - updating... (live nodes size: [1])
   [junit4]   2> 2806718 INFO  (zkCallback-10130-thread-1-processing-n:127.0.0.1:48528_ds_jh%2Fsr) [n:127.0.0.1:48528_ds_jh%2Fsr    ] o.a.s.c.c.ZkStateReader A live node change: [WatchedEvent state:SyncConnected type:NodeChildrenChanged path:/live_nodes], has occurred - updating... (live nodes size: [1])
   [junit4]   2> 2806718 INFO  (zkCallback-10124-thread-1) [    ] o.a.s.c.c.ZkStateReader Updated live nodes from ZooKeeper... (1) -> (2)
   [junit4]   2> 2806718 INFO  (zkCallback-10122-thread-1-processing-n:127.0.0.1:65207_ds_jh%2Fsr) [n:127.0.0.1:65207_ds_jh%2Fsr    ] o.a.s.c.c.ZkStateReader Updated live nodes from ZooKeeper... (1) -> (2)
   [junit4]   2> 2806719 INFO  (zkCallback-10130-thread-1-processing-n:127.0.0.1:48528_ds_jh%2Fsr) [n:127.0.0.1:48528_ds_jh%2Fsr    ] o.a.s.c.c.ZkStateReader Updated live nodes from ZooKeeper... (1) -> (2)
   [junit4]   2> 2806746 INFO  (TEST-SolrCloudExampleTest.testLoadDocsIntoGettingStartedCollection-seed#[B26F37E1B2CC2C57]) [n:127.0.0.1:48528_ds_jh%2Fsr    ] o.a.s.c.CoreContainer Security conf doesn't exist. Skipping setup for authorization module.
   [junit4]   2> 2806746 INFO  (TEST-SolrCloudExampleTest.testLoadDocsIntoGettingStartedCollection-seed#[B26F37E1B2CC2C57]) [n:127.0.0.1:48528_ds_jh%2Fsr    ] o.a.s.c.CoreContainer No authentication plugin used.
   [junit4]   2> 2806747 INFO  (TEST-SolrCloudExampleTest.testLoadDocsIntoGettingStartedCollection-seed#[B26F37E1B2CC2C57]) [n:127.0.0.1:48528_ds_jh%2Fsr    ] o.a.s.c.CorePropertiesLocator Looking for core definitions underneath /export/home/jenkins/workspace/Lucene-Solr-6.x-Solaris/solr/build/solr-core/test/J0/../../../../../../../../../../export/home/jenkins/workspace/Lucene-Solr-6.x-Solaris/solr/build/solr-core/test/J0/temp/solr.cloud.SolrCloudExampleTest_B26F37E1B2CC2C57-001/shard-1-001/cores
   [junit4]   2> 2806748 INFO  (TEST-SolrCloudExampleTest.testLoadDocsIntoGettingStartedCollection-seed#[B26F37E1B2CC2C57]) [n:127.0.0.1:48528_ds_jh%2Fsr    ] o.a.s.c.CoreDescriptor Created CoreDescriptor: {name=collection1, config=solrconfig.xml, transient=false, schema=schema.xml, loadOnStartup=true, configSetProperties=configsetprops.json, collection=collection1, coreNodeName=, dataDir=data/, shard=}
   [junit4]   2> 2806748 INFO  (TEST-SolrCloudExampleTest.testLoadDocsIntoGettingStartedCollection-seed#[B26F37E1B2CC2C57]) [n:127.0.0.1:48528_ds_jh%2Fsr    ] o.a.s.c.CorePropertiesLocator Found core collection1 in /export/home/jenkins/workspace/Lucene-Solr-6.x-Solaris/solr/build/solr-core/test/J0/../../../../../../../../../../export/home/jenkins/workspace/Lucene-Solr-6.x-Solaris/solr/build/solr-core/test/J0/temp/solr.cloud.SolrCloudExampleTest_B26F37E1B2CC2C57-001/shard-1-001/cores/collection1
   [junit4]   2> 2806748 INFO  (TEST-SolrCloudExampleTest.testLoadDocsIntoGettingStartedCollection-seed#[B26F37E1B2CC2C57]) [n:127.0.0.1:48528_ds_jh%2Fsr    ] o.a.s.c.CorePropertiesLocator Found 1 core definitions
   [junit4]   2> 2806749 INFO  (TEST-SolrCloudExampleTest.testLoadDocsIntoGettingStartedCollection-seed#[B26F37E1B2CC2C57]) [n:127.0.0.1:48528_ds_jh%2Fsr    ] o.a.s.s.SolrDispatchFilter user.dir=/export/home/jenkins/workspace/Lucene-Solr-6.x-Solaris/solr/build/solr-core/test/J0
   [junit4]   2> 2806750 INFO  (TEST-SolrCloudExampleTest.testLoadDocsIntoGettingStartedCollection-seed#[B26F37E1B2CC2C57]) [n:127.0.0.1:48528_ds_jh%2Fsr    ] o.a.s.s.SolrDispatchFilter SolrDispatchFilter.init() done
   [junit4]   2> 2806750 INFO  (coreLoadExecutor-9032-thread-1-p

[...truncated too long message...]

apache.zookeeper.server.NIOServerCnxnFactory.run(NIOServerCnxnFactory.java:208)
   [junit4]   2> 	at java.lang.Thread.run(Thread.java:745)
   [junit4]   2> 2900201 INFO  (TEST-SolrCloudExampleTest.testLoadDocsIntoGettingStartedCollection-seed#[B26F37E1B2CC2C57]) [    ] o.e.j.s.ServerConnector Stopped ServerConnector@415c3174{HTTP/1.1,[http/1.1]}{127.0.0.1:0}
   [junit4]   2> 2900201 INFO  (TEST-SolrCloudExampleTest.testLoadDocsIntoGettingStartedCollection-seed#[B26F37E1B2CC2C57]) [    ] o.e.j.s.h.ContextHandler Stopped o.e.j.s.ServletContextHandler@5cba41fd{/ds_jh/sr,null,UNAVAILABLE}
   [junit4]   2> 2900206 INFO  (TEST-SolrCloudExampleTest.testLoadDocsIntoGettingStartedCollection-seed#[B26F37E1B2CC2C57]) [    ] o.a.s.c.ZkTestServer connecting to 127.0.0.1:32868 32868
   [junit4]   2> 2905232 INFO  (Thread-5985) [    ] o.a.s.c.ZkTestServer connecting to 127.0.0.1:32868 32868
   [junit4]   2> 2905234 WARN  (Thread-5985) [    ] o.a.s.c.ZkTestServer Watch limit violations: 
   [junit4]   2> Maximum concurrent create/delete watches above limit:
   [junit4]   2> 
   [junit4]   2> 	11	/solr/aliases.json
   [junit4]   2> 	10	/solr/security.json
   [junit4]   2> 	8	/solr/configs/conf1
   [junit4]   2> 
   [junit4]   2> Maximum concurrent data watches above limit:
   [junit4]   2> 
   [junit4]   2> 	11	/solr/clusterstate.json
   [junit4]   2> 	8	/solr/collections/collection1/state.json
   [junit4]   2> 	2	/solr/overseer_elect/election/95725554321063957-127.0.0.1:45368_ds_jh%2Fsr-n_0000000007
   [junit4]   2> 
   [junit4]   2> Maximum concurrent children watches above limit:
   [junit4]   2> 
   [junit4]   2> 	11	/solr/collections
   [junit4]   2> 	8	/solr/live_nodes
   [junit4]   2> 	4	/solr/overseer/collection-queue-work
   [junit4]   2> 	3	/solr/overseer/queue
   [junit4]   2> 	2	/solr/overseer/queue-work
   [junit4]   2> 
   [junit4]   2> NOTE: reproduce with: ant test  -Dtestcase=SolrCloudExampleTest -Dtests.method=testLoadDocsIntoGettingStartedCollection -Dtests.seed=B26F37E1B2CC2C57 -Dtests.slow=true -Dtests.locale=id -Dtests.timezone=America/New_York -Dtests.asserts=true -Dtests.file.encoding=UTF-8
   [junit4] FAILURE  102s J0 | SolrCloudExampleTest.testLoadDocsIntoGettingStartedCollection <<<
   [junit4]    > Throwable #1: java.lang.AssertionError: Collection 'gettingstarted' doesn't exist after trying to create it!
   [junit4]    > 	at __randomizedtesting.SeedInfo.seed([B26F37E1B2CC2C57:A10C058E83A395F1]:0)
   [junit4]    > 	at org.apache.solr.cloud.SolrCloudExampleTest.testLoadDocsIntoGettingStartedCollection(SolrCloudExampleTest.java:88)
   [junit4]    > 	at org.apache.solr.BaseDistributedSearchTestCase$ShardsRepeatRule$ShardsFixedStatement.callStatement(BaseDistributedSearchTestCase.java:992)
   [junit4]    > 	at org.apache.solr.BaseDistributedSearchTestCase$ShardsRepeatRule$ShardsStatement.evaluate(BaseDistributedSearchTestCase.java:967)
   [junit4]    > 	at java.lang.Thread.run(Thread.java:745)
   [junit4]   2> 2905243 INFO  (SUITE-SolrCloudExampleTest-seed#[B26F37E1B2CC2C57]-worker) [    ] o.a.s.SolrTestCaseJ4 ###deleteCore
   [junit4]   2> NOTE: leaving temporary files on disk at: /export/home/jenkins/workspace/Lucene-Solr-6.x-Solaris/solr/build/solr-core/test/J0/temp/solr.cloud.SolrCloudExampleTest_B26F37E1B2CC2C57-001
   [junit4]   2> NOTE: test params are: codec=CheapBastard, sim=ClassicSimilarity, locale=id, timezone=America/New_York
   [junit4]   2> NOTE: SunOS 5.11 amd64/Oracle Corporation 1.8.0_72 (64-bit)/cpus=3,threads=1,free=93769592,total=373846016
   [junit4]   2> NOTE: All tests run in this JVM: [TestConfigSetsAPIExclusivity, TestComponentsName, TestReqParamsAPI, CloneFieldUpdateProcessorFactoryTest, TestDefaultStatsCache, TestConfigSetProperties, TestFunctionQuery, TestStressVersions, TestMiniSolrCloudCluster, CdcrReplicationDistributedZkTest, DOMUtilTest, HdfsLockFactoryTest, SolrTestCaseJ4Test, TestScoreJoinQPScore, TestRandomDVFaceting, DocumentAnalysisRequestHandlerTest, TestEmbeddedSolrServerConstructors, TestConfigOverlay, HdfsRecoverLeaseTest, TestSolr4Spatial2, TestCustomDocTransformer, TestExceedMaxTermLength, RegexBoostProcessorTest, TestExtendedDismaxParser, HdfsCollectionsAPIDistributedZkTest, TermsComponentTest, TestDynamicFieldResource, DocValuesMissingTest, TestFreeTextSuggestions, TestStressLiveNodes, TestNonDefinedSimilarityFactory, TestCryptoKeys, TestConfigReload, CursorMarkTest, SchemaVersionSpecificBehaviorTest, RequestLoggingTest, OverseerTest, TestTrackingShardHandlerFactory, TestClassicSimilarityFactory, TestUpdate, ShardRoutingTest, TestCloudManagedSchema, DistributedSuggestComponentTest, TestUseDocValuesAsStored, BigEndianAscendingWordSerializerTest, ChaosMonkeyNothingIsSafeTest, TolerantUpdateProcessorTest, TestPseudoReturnFields, TestInitQParser, TestArbitraryIndexDir, DocValuesTest, IndexBasedSpellCheckerTest, InfoHandlerTest, DistributedQueryElevationComponentTest, SpatialHeatmapFacetsTest, ConjunctionSolrSpellCheckerTest, SuggestComponentTest, AssignTest, DistributedSpellCheckComponentTest, SOLR749Test, TriLevelCompositeIdRoutingTest, TestGroupingSearch, DistributedQueryComponentCustomSortTest, TestQuerySenderNoQuery, DistribDocExpirationUpdateProcessorTest, CircularListTest, MBeansHandlerTest, DirectoryFactoryTest, AnalyticsMergeStrategyTest, TestAuthenticationFramework, DistributedQueueTest, TestRestManager, TestShardHandlerFactory, TestPartialUpdateDeduplication, TestMergePolicyConfig, TestSolrDeletionPolicy1, TestRandomCollapseQParserPlugin, BlockJoinFacetRandomTest, SuggesterFSTTest, ZkCLITest, ActionThrottleTest, CloudExitableDirectoryReaderTest, CollectionStateFormat2Test, HardAutoCommitTest, TestInfoStreamLogging, TestRemoteStreaming, TestStressReorder, TestJmxIntegration, TestCustomSort, LeaderInitiatedRecoveryOnShardRestartTest, TestLuceneMatchVersion, RestartWhileUpdatingTest, DeleteStatusTest, TestSizeLimitedDistributedMap, TestWordDelimiterFilterFactory, SystemInfoHandlerTest, TestElisionMultitermQuery, TestCollectionAPI, TestJmxMonitoredMap, TestPostingsSolrHighlighter, RemoteQueryErrorTest, TestTrieFacet, PreAnalyzedUpdateProcessorTest, AlternateDirectoryTest, SoftAutoCommitTest, JsonLoaderTest, TestSimpleQParserPlugin, TestMacros, TestUniqueKeyFieldResource, QueryEqualityTest, VersionInfoTest, TestLazyCores, TestHighlightDedupGrouping, TestDocSet, TestFieldResource, ZkControllerTest, RulesTest, XsltUpdateRequestHandlerTest, HighlighterTest, SolrRequestParserTest, PreAnalyzedFieldTest, DeleteInactiveReplicaTest, TestExactSharedStatsCache, HighlighterMaxOffsetTest, RecoveryZkTest, TestStandardQParsers, TestBlendedInfixSuggestions, TestSolrDynamicMBean, TestHashPartitioner, HdfsUnloadDistributedZkTest, ScriptEngineTest, BlockCacheTest, TestCloudSchemaless, TestManagedResource, HdfsBasicDistributedZk2Test, ForceLeaderTest, XmlUpdateRequestHandlerTest, TestCodecSupport, FastVectorHighlighterTest, TestSha256AuthenticationProvider, TestRTimerTree, TestFieldTypeResource, TestDocumentBuilder, AutoCommitTest, TestRealTimeGet, SimpleFacetsTest, SpellCheckComponentTest, ConvertedLegacyTest, BasicFunctionalityTest, DirectUpdateHandlerTest, CurrencyFieldOpenExchangeTest, SolrIndexSplitterTest, TestCoreDiscovery, TestFoldingMultitermQuery, SuggesterWFSTTest, WordBreakSolrSpellCheckerTest, DefaultValueUpdateProcessorTest, DocValuesMultiTest, SolrInfoMBeanTest, TestSurroundQueryParser, DisMaxRequestHandlerTest, PrimitiveFieldTypeTest, FileBasedSpellCheckerTest, PathHierarchyTokenizerFactoryTest, RequiredFieldsTest, IndexSchemaRuntimeFieldTest, IndexSchemaTest, TestCSVResponseWriter, TestAnalyzedSuggestions, PingRequestHandlerTest, UpdateParamsTest, TestSolrIndexConfig, CopyFieldTest, ResponseLogComponentTest, SolrIndexConfigTest, BadComponentTest, TestStressRecovery, TestConfig, TestFuzzyAnalyzedSuggestions, NotRequiredUniqueKeyTest, TestXIncludeConfig, EchoParamsTest, TestDFRSimilarityFactory, TestLMJelinekMercerSimilarityFactory, TestFastWriter, TestFastOutputStream, URLClassifyProcessorTest, DateMathParserTest, PrimUtilsTest, ClusterStateTest, TestLRUCache, ZkNodePropsTest, UUIDFieldTest, DistributedIntervalFacetingTest, AsyncMigrateRouteKeyTest, CollectionReloadTest, CollectionsAPIAsyncDistributedZkTest, ConnectionManagerTest, DistribJoinFromCollectionTest, DistributedVersionInfoTest, LeaderFailoverAfterPartitionTest, LeaderInitiatedRecoveryOnCommitTest, MultiThreadedOCPTest, OverseerTaskQueueTest, ReplicationFactorTest, SSLMigrationTest, SaslZkACLProviderTest, SharedFSAutoReplicaFailoverTest, SharedFSAutoReplicaFailoverUtilsTest, SimpleCollectionCreateDeleteTest, SolrCloudExampleTest]
   [junit4] Completed [455/586 (1!)] on J0 in 101.90s, 1 test, 1 failure <<< FAILURES!

[...truncated 444 lines...]
BUILD FAILED
/export/home/jenkins/workspace/Lucene-Solr-6.x-Solaris/build.xml:740: The following error occurred while executing this line:
/export/home/jenkins/workspace/Lucene-Solr-6.x-Solaris/build.xml:684: The following error occurred while executing this line:
/export/home/jenkins/workspace/Lucene-Solr-6.x-Solaris/build.xml:59: The following error occurred while executing this line:
/export/home/jenkins/workspace/Lucene-Solr-6.x-Solaris/solr/build.xml:233: The following error occurred while executing this line:
/export/home/jenkins/workspace/Lucene-Solr-6.x-Solaris/solr/common-build.xml:529: The following error occurred while executing this line:
/export/home/jenkins/workspace/Lucene-Solr-6.x-Solaris/lucene/common-build.xml:1457: The following error occurred while executing this line:
/export/home/jenkins/workspace/Lucene-Solr-6.x-Solaris/lucene/common-build.xml:1014: There were test failures: 586 suites (10 ignored), 2364 tests, 1 failure, 85 ignored (70 assumptions) [seed: B26F37E1B2CC2C57]

Total time: 82 minutes 40 seconds
Build step 'Invoke Ant' marked build as failure
Archiving artifacts
[WARNINGS] Skipping publisher since build result is FAILURE
Recording test results
Email was triggered for: Failure - Any
Sending email for trigger: Failure - Any



Mime
View raw message