lucene-dev mailing list archives

Site index · List index
Message view « Date » · « Thread »
Top « Date » · « Thread »
From Apache Jenkins Server <jenk...@builds.apache.org>
Subject [JENKINS] Lucene-Solr-SmokeRelease-6.x - Build # 30 - Failure
Date Sat, 09 Apr 2016 08:34:35 GMT
Build: https://builds.apache.org/job/Lucene-Solr-SmokeRelease-6.x/30/

No tests ran.

Build Log:
[...truncated 40668 lines...]
prepare-release-no-sign:
    [mkdir] Created dir: /x1/jenkins/jenkins-slave/workspace/Lucene-Solr-SmokeRelease-6.x/lucene/build/smokeTestRelease/dist
     [copy] Copying 476 files to /x1/jenkins/jenkins-slave/workspace/Lucene-Solr-SmokeRelease-6.x/lucene/build/smokeTestRelease/dist/lucene
     [copy] Copying 245 files to /x1/jenkins/jenkins-slave/workspace/Lucene-Solr-SmokeRelease-6.x/lucene/build/smokeTestRelease/dist/solr
   [smoker] Java 1.8 JAVA_HOME=/home/jenkins/jenkins-slave/tools/hudson.model.JDK/latest1.8
   [smoker] NOTE: output encoding is UTF-8
   [smoker] 
   [smoker] Load release URL "file:/x1/jenkins/jenkins-slave/workspace/Lucene-Solr-SmokeRelease-6.x/lucene/build/smokeTestRelease/dist/"...
   [smoker] 
   [smoker] Test Lucene...
   [smoker]   test basics...
   [smoker]   get KEYS
   [smoker]     0.2 MB in 0.03 sec (5.9 MB/sec)
   [smoker]   check changes HTML...
   [smoker]   download lucene-6.1.0-src.tgz...
   [smoker]     28.6 MB in 0.03 sec (826.2 MB/sec)
   [smoker]     verify md5/sha1 digests
   [smoker]   download lucene-6.1.0.tgz...
   [smoker]     62.8 MB in 0.06 sec (1071.5 MB/sec)
   [smoker]     verify md5/sha1 digests
   [smoker]   download lucene-6.1.0.zip...
   [smoker]     73.4 MB in 0.08 sec (936.5 MB/sec)
   [smoker]     verify md5/sha1 digests
   [smoker]   unpack lucene-6.1.0.tgz...
   [smoker]     verify JAR metadata/identity/no javax.* or java.* classes...
   [smoker]     test demo with 1.8...
   [smoker]       got 5985 hits for query "lucene"
   [smoker]     checkindex with 1.8...
   [smoker]     check Lucene's javadoc JAR
   [smoker]   unpack lucene-6.1.0.zip...
   [smoker]     verify JAR metadata/identity/no javax.* or java.* classes...
   [smoker]     test demo with 1.8...
   [smoker]       got 5985 hits for query "lucene"
   [smoker]     checkindex with 1.8...
   [smoker]     check Lucene's javadoc JAR
   [smoker]   unpack lucene-6.1.0-src.tgz...
   [smoker]     make sure no JARs/WARs in src dist...
   [smoker]     run "ant validate"
   [smoker]     run tests w/ Java 8 and testArgs='-Dtests.slow=false'...
   [smoker] 
   [smoker] command "export JAVA_HOME="/home/jenkins/jenkins-slave/tools/hudson.model.JDK/latest1.8" PATH="/home/jenkins/jenkins-slave/tools/hudson.model.JDK/latest1.8/bin:$PATH" JAVACMD="/home/jenkins/jenkins-slave/tools/hudson.model.JDK/latest1.8/bin/java"; ant clean test -Dtests.slow=false" failed:
   [smoker] Buildfile: /x1/jenkins/jenkins-slave/workspace/Lucene-Solr-SmokeRelease-6.x/lucene/build/smokeTestRelease/tmp/unpack/lucene-6.1.0/build.xml
   [smoker] 
   [smoker] clean:
   [smoker]    [delete] Deleting directory /x1/jenkins/jenkins-slave/workspace/Lucene-Solr-SmokeRelease-6.x/lucene/build/smokeTestRelease/tmp/unpack/lucene-6.1.0/build
   [smoker] 
   [smoker] ivy-availability-check:
   [smoker] 
   [smoker] ivy-fail:
   [smoker] 
   [smoker] ivy-configure:
   [smoker] [ivy:configure] :: Apache Ivy 2.3.0 - 20130110142753 :: http://ant.apache.org/ivy/ ::
   [smoker] [ivy:configure] :: loading settings :: file = /x1/jenkins/jenkins-slave/workspace/Lucene-Solr-SmokeRelease-6.x/lucene/build/smokeTestRelease/tmp/unpack/lucene-6.1.0/ivy-settings.xml
   [smoker] 
   [smoker] -clover.load:
   [smoker] 
   [smoker] resolve-groovy:
   [smoker] [ivy:cachepath] :: resolving dependencies :: org.codehaus.groovy#groovy-all-caller;working
   [smoker] [ivy:cachepath] 	confs: [default]
   [smoker] [ivy:cachepath] 	found org.codehaus.groovy#groovy-all;2.4.6 in public
   [smoker] [ivy:cachepath] :: resolution report :: resolve 384ms :: artifacts dl 3ms
   [smoker] 	---------------------------------------------------------------------
   [smoker] 	|                  |            modules            ||   artifacts   |
   [smoker] 	|       conf       | number| search|dwnlded|evicted|| number|dwnlded|
   [smoker] 	---------------------------------------------------------------------
   [smoker] 	|      default     |   1   |   0   |   0   |   0   ||   1   |   0   |
   [smoker] 	---------------------------------------------------------------------
   [smoker] 
   [smoker] -init-totals:
   [smoker] 
   [smoker] test-core:
   [smoker] 
   [smoker] -clover.disable:
   [smoker] 
   [smoker] ivy-availability-check:
   [smoker] 
   [smoker] ivy-fail:
   [smoker] 
   [smoker] ivy-configure:
   [smoker] [ivy:configure] :: loading settings :: file = /x1/jenkins/jenkins-slave/workspace/Lucene-Solr-SmokeRelease-6.x/lucene/build/smokeTestRelease/tmp/unpack/lucene-6.1.0/ivy-settings.xml
   [smoker] 
   [smoker] -clover.load:
   [smoker] 
   [smoker] -clover.classpath:
   [smoker] 
   [smoker] -clover.setup:
   [smoker] 
   [smoker] clover:
   [smoker] 
   [smoker] -check-git-state:
   [smoker] 
   [smoker] -git-cleanroot:
   [smoker] 
   [smoker] -copy-git-state:
   [smoker] 
   [smoker] git-autoclean:
   [smoker] 
   [smoker] resolve:
   [smoker] 
   [smoker] init:
   [smoker] 
   [smoker] compile-core:
   [smoker]     [mkdir] Created dir: /x1/jenkins/jenkins-slave/workspace/Lucene-Solr-SmokeRelease-6.x/lucene/build/smokeTestRelease/tmp/unpack/lucene-6.1.0/build/core/classes/java
   [smoker]     [javac] Compiling 753 source files to /x1/jenkins/jenkins-slave/workspace/Lucene-Solr-SmokeRelease-6.x/lucene/build/smokeTestRelease/tmp/unpack/lucene-6.1.0/build/core/classes/java
   [smoker]     [javac] Note: Some input files use or override a deprecated API.
   [smoker]     [javac] Note: Recompile with -Xlint:deprecation for details.
   [smoker]     [javac] Creating empty /x1/jenkins/jenkins-slave/workspace/Lucene-Solr-SmokeRelease-6.x/lucene/build/smokeTestRelease/tmp/unpack/lucene-6.1.0/build/core/classes/java/org/apache/lucene/document/package-info.class
   [smoker]     [javac] Creating empty /x1/jenkins/jenkins-slave/workspace/Lucene-Solr-SmokeRelease-6.x/lucene/build/smokeTestRelease/tmp/unpack/lucene-6.1.0/build/core/classes/java/org/apache/lucene/package-info.class
   [smoker]     [javac] Creating empty /x1/jenkins/jenkins-slave/workspace/Lucene-Solr-SmokeRelease-6.x/lucene/build/smokeTestRelease/tmp/unpack/lucene-6.1.0/build/core/classes/java/org/apache/lucene/util/bkd/package-info.class
   [smoker]     [javac] Creating empty /x1/jenkins/jenkins-slave/workspace/Lucene-Solr-SmokeRelease-6.x/lucene/build/smokeTestRelease/tmp/unpack/lucene-6.1.0/build/core/classes/java/org/apache/lucene/util/packed/package-info.class
   [smoker]     [javac] Creating empty /x1/jenkins/jenkins-slave/workspace/Lucene-Solr-SmokeRelease-6.x/lucene/build/smokeTestRelease/tmp/unpack/lucene-6.1.0/build/core/classes/java/org/apache/lucene/util/mutable/package-info.class
   [smoker]     [javac] Creating empty /x1/jenkins/jenkins-slave/workspace/Lucene-Solr-SmokeRelease-6.x/lucene/build/smokeTestRelease/tmp/unpack/lucene-6.1.0/build/core/classes/java/org/apache/lucene/codecs/compressing/package-info.class
   [smoker]     [javac] Creating empty /x1/jenkins/jenkins-slave/workspace/Lucene-Solr-SmokeRelease-6.x/lucene/build/smokeTestRelease/tmp/unpack/lucene-6.1.0/build/core/classes/java/org/apache/lucene/codecs/lucene60/package-info.class
   [smoker]     [javac] Creating empty /x1/jenkins/jenkins-slave/workspace/Lucene-Solr-SmokeRelease-6.x/lucene/build/smokeTestRelease/tmp/unpack/lucene-6.1.0/build/core/classes/java/org/apache/lucene/codecs/package-info.class
   [smoker]     [javac] Creating empty /x1/jenkins/jenkins-slave/workspace/Lucene-Solr-SmokeRelease-6.x/lucene/build/smokeTestRelease/tmp/unpack/lucene-6.1.0/build/core/classes/java/org/apache/lucene/codecs/perfield/package-info.class
   [smoker]     [javac] Creating empty /x1/jenkins/jenkins-slave/workspace/Lucene-Solr-SmokeRelease-6.x/lucene/build/smokeTestRelease/tmp/unpack/lucene-6.1.0/build/core/classes/java/org/apache/lucene/util/package-info.class
   [smoker]     [javac] Creating empty /x1/jenkins/jenkins-slave/workspace/Lucene-Solr-SmokeRelease-6.x/lucene/build/smokeTestRelease/tmp/unpack/lucene-6.1.0/build/core/classes/java/org/apache/lucene/analysis/package-info.class
   [smoker]     [javac] Creating empty /x1/jenkins/jenkins-slave/workspace/Lucene-Solr-SmokeRelease-6.x/lucene/build/smokeTestRelease/tmp/unpack/lucene-6.1.0/build/core/classes/java/org/apache/lucene/index/package-info.class
   [smoker]     [javac] Creating empty /x1/jenkins/jenkins-slave/workspace/Lucene-Solr-SmokeRelease-6.x/lucene/build/smokeTestRelease/tmp/unpack/lucene-6.1.0/build/core/classes/java/org/apache/lucene/store/package-info.class
   [smoker]     [javac] Creating empty /x1/jenkins/jenkins-slave/workspace/Lucene-Solr-SmokeRelease-6.x/lucene/build/smokeTestRelease/tmp/unpack/lucene-6.1.0/build/core/classes/java/org/apache/lucene/codecs/blocktree/package-info.class
   [smoker]     [javac] Creating empty /x1/jenkins/jenkins-slave/workspace/Lucene-Solr-SmokeRelease-6.x/lucene/build/smokeTestRelease/tmp/unpack/lucene-6.1.0/build/core/classes/java/org/apache/lucene/util/fst/package-info.class
   [smoker]     [javac] Creating empty /x1/jenkins/jenkins-slave/workspace/Lucene-Solr-SmokeRelease-6.x/lucene/build/smokeTestRelease/tmp/unpack/lucene-6.1.0/build/core/classes/java/org/apache/lucene/search/spans/package-info.class
   [smoker]     [javac] Creating empty /x1/jenkins/jenkins-slave/workspace/Lucene-Solr-SmokeRelease-6.x/lucene/build/smokeTestRelease/tmp/unpack/lucene-6.1.0/build/core/classes/java/org/apache/lucene/analysis/tokenattributes/package-info.class
   [smoker]     [javac] Creating empty /x1/jenkins/jenkins-slave/workspace/Lucene-Solr-SmokeRelease-6.x/lucene/build/smokeTestRelease/tmp/unpack/lucene-6.1.0/build/core/classes/java/org/apache/lucene/codecs/lucene54/package-info.class
   [smoker]     [javac] Creating empty /x1/jenkins/jenkins-slave/workspace/Lucene-Solr-SmokeRelease-6.x/lucene/build/smokeTestRelease/tmp/unpack/lucene-6.1.0/build/core/classes/java/org/apache/lucene/search/package-info.class
   [smoker]     [javac] Creating empty /x1/jenkins/jenkins-slave/workspace/Lucene-Solr-SmokeRelease-6.x/lucene/build/smokeTestRelease/tmp/unpack/lucene-6.1.0/build/core/classes/java/org/apache/lucene/search/similarities/package-info.class
   [smoker]     [javac] Creating empty /x1/jenkins/jenkins-slave/workspace/Lucene-Solr-SmokeRelease-6.x/lucene/build/smokeTestRelease/tmp/unpack/lucene-6.1.0/build/core/classes/java/org/apache/lucene/util/automaton/package-info.class
   [smoker]     [javac] Creating empty /x1/jenkins/jenkins-slave/workspace/Lucene-Solr-SmokeRelease-6.x/lucene/build/smokeTestRelease/tmp/unpack/lucene-6.1.0/build/core/classes/java/org/apache/lucene/codecs/lucene53/package-info.class
   [smoker]     [javac] Creating empty /x1/jenkins/jenkins-slave/workspace/Lucene-Solr-SmokeRelease-6.x/lucene/build/smokeTestRelease/tmp/unpack/lucene-6.1.0/build/core/classes/java/org/apache/lucene/codecs/lucene50/package-info.class
   [smoker]     [javac] Creating empty /x1/jenkins/jenkins-slave/workspace/Lucene-Solr-SmokeRelease-6.x/lucene/build/smokeTestRelease/tmp/unpack/lucene-6.1.0/build/core/classes/java/org/apache/lucene/geo/package-info.class
   [smoker]      [copy] Copying 3 files to /x1/jenkins/jenkins-slave/workspace/Lucene-Solr-SmokeRelease-6.x/lucene/build/smokeTestRelease/tmp/unpack/lucene-6.1.0/build/core/classes/java
   [smoker] 
   [smoker] compile-test-framework:
   [smoker] 
   [smoker] -check-git-state:
   [smoker] 
   [smoker] -git-cleanroot:
   [smoker] 
   [smoker] -copy-git-state:
   [smoker] 
   [smoker] git-autoclean:
   [smoker] 
   [smoker] ivy-availability-check:
   [smoker] 
   [smoker] ivy-fail:
   [smoker] 
   [smoker] ivy-configure:
   [smoker] [ivy:configure] :: loading settings :: file = /x1/jenkins/jenkins-slave/workspace/Lucene-Solr-SmokeRelease-6.x/lucene/build/smokeTestRelease/tmp/unpack/lucene-6.1.0/ivy-settings.xml
   [smoker] 
   [smoker] resolve:
   [smoker] 
   [smoker] init:
   [smoker] 
   [smoker] compile-lucene-core:
   [smoker] 
   [smoker] -check-git-state:
   [smoker] 
   [smoker] -git-cleanroot:
   [smoker] 
   [smoker] -copy-git-state:
   [smoker] 
   [smoker] git-autoclean:
   [smoker] 
   [smoker] ivy-availability-check:
   [smoker] 
   [smoker] ivy-fail:
   [smoker] 
   [smoker] ivy-configure:
   [smoker] [ivy:configure] :: loading settings :: file = /x1/jenkins/jenkins-slave/workspace/Lucene-Solr-SmokeRelease-6.x/lucene/build/smokeTestRelease/tmp/unpack/lucene-6.1.0/ivy-settings.xml
   [smoker] 
   [smoker] resolve:
   [smoker] 
   [smoker] init:
   [smoker] 
   [smoker] -clover.disable:
   [smoker] 
   [smoker] -clover.load:
   [smoker] 
   [smoker] -clover.classpath:
   [smoker] 
   [smoker] -clover.setup:
   [smoker] 
   [smoker] clover:
   [smoker] 
   [smoker] compile-core:
   [smoker] 
   [smoker] compile-codecs:
   [smoker] 
   [smoker] -check-git-state:
   [smoker] 
   [smoker] -git-cleanroot:
   [smoker] 
   [smoker] -copy-git-state:
   [smoker] 
   [smoker] git-autoclean:
   [smoker] 
   [smoker] ivy-availability-check:
   [smoker] 
   [smoker] ivy-fail:
   [smoker] 
   [smoker] ivy-configure:
   [smoker] [ivy:configure] :: loading settings :: file = /x1/jenkins/jenkins-slave/workspace/Lucene-Solr-SmokeRelease-6.x/lucene/build/smokeTestRelease/tmp/unpack/lucene-6.1.0/ivy-settings.xml
   [smoker] 
   [smoker] resolve:
   [smoker] 
   [smoker] common.init:
   [smoker] 
   [smoker] compile-lucene-core:
   [smoker] 
   [smoker] init:
   [smoker] 
   [smoker] -clover.disable:
   [smoker] 
   [smoker] -clover.load:
   [smoker] 
   [smoker] -clover.classpath:
   [smoker] 
   [smoker] -clover.setup:
   [smoker] 
   [smoker] clover:
   [smoker] 
   [smoker] compile-core:
   [smoker]     [mkdir] Created dir: /x1/jenkins/jenkins-slave/workspace/Lucene-Solr-SmokeRelease-6.x/lucene/build/smokeTestRelease/tmp/unpack/lucene-6.1.0/build/codecs/classes/java
   [smoker]     [javac] Compiling 68 source files to /x1/jenkins/jenkins-slave/workspace/Lucene-Solr-SmokeRelease-6.x/lucene/build/smokeTestRelease/tmp/unpack/lucene-6.1.0/build/codecs/classes/java
   [smoker]     [javac] Creating empty /x1/jenkins/jenkins-slave/workspace/Lucene-Solr-SmokeRelease-6.x/lucene/build/smokeTestRelease/tmp/unpack/lucene-6.1.0/build/codecs/classes/java/org/apache/lucene/codecs/bloom/package-info.class
   [smoker]     [javac] Creating empty /x1/jenkins/jenkins-slave/workspace/Lucene-Solr-SmokeRelease-6.x/lucene/build/smokeTestRelease/tmp/unpack/lucene-6.1.0/build/codecs/classes/java/org/apache/lucene/codecs/memory/package-info.class
   [smoker]     [javac] Creating empty /x1/jenkins/jenkins-slave/workspace/Lucene-Solr-SmokeRelease-6.x/lucene/build/smokeTestRelease/tmp/unpack/lucene-6.1.0/build/codecs/classes/java/org/apache/lucene/codecs/simpletext/package-info.class
   [smoker]     [javac] Creating empty /x1/jenkins/jenkins-slave/workspace/Lucene-Solr-SmokeRelease-6.x/lucene/build/smokeTestRelease/tmp/unpack/lucene-6.1.0/build/codecs/classes/java/org/apache/lucene/codecs/blockterms/package-info.class
   [smoker]     [javac] Creating empty /x1/jenkins/jenkins-slave/workspace/Lucene-Solr-SmokeRelease-6.x/lucene/build/smokeTestRelease/tmp/unpack/lucene-6.1.0/build/codecs/classes/java/org/apache/lucene/codecs/blocktreeords/package-info.class
   [smoker]     [javac] Creating empty /x1/jenkins/jenkins-slave/workspace/Lucene-Solr-SmokeRelease-6.x/lucene/build/smokeTestRelease/tmp/unpack/lucene-6.1.0/build/codecs/classes/java/org/apache/lucene/codecs/autoprefix/package-info.class
   [smoker]      [copy] Copying 3 files to /x1/jenkins/jenkins-slave/workspace/Lucene-Solr-SmokeRelease-6.x/lucene/build/smokeTestRelease/tmp/unpack/lucene-6.1.0/build/codecs/classes/java
   [smoker] 
   [smoker] -clover.disable:
   [smoker] 
   [smoker] -clover.load:
   [smoker] 
   [smoker] -clover.classpath:
   [smoker] 
   [smoker] -clover.setup:
   [smoker] 
   [smoker] clover:
   [smoker] 
   [smoker] common.compile-core:
   [smoker]     [mkdir] Created dir: /x1/jenkins/jenkins-slave/workspace/Lucene-Solr-SmokeRelease-6.x/lucene/build/smokeTestRelease/tmp/unpack/lucene-6.1.0/build/test-framework/classes/java
   [smoker]     [javac] Compiling 179 source files to /x1/jenkins/jenkins-slave/workspace/Lucene-Solr-SmokeRelease-6.x/lucene/build/smokeTestRelease/tmp/unpack/lucene-6.1.0/build/test-framework/classes/java
   [smoker]     [javac] Note: Some input files use or override a deprecated API.
   [smoker]     [javac] Note: Recompile with -Xlint:deprecation for details.
   [smoker]     [javac] Creating empty /x1/jenkins/jenkins-slave/workspace/Lucene-Solr-SmokeRelease-6.x/lucene/build/smokeTestRelease/tmp/unpack/lucene-6.1.0/build/test-framework/classes/java/org/apache/lucene/codecs/asserting/package-info.class
   [smoker]     [javac] Creating empty /x1/jenkins/jenkins-slave/workspace/Lucene-Solr-SmokeRelease-6.x/lucene/build/smokeTestRelease/tmp/unpack/lucene-6.1.0/build/test-framework/classes/java/org/apache/lucene/codecs/ramonly/package-info.class
   [smoker]     [javac] Creating empty /x1/jenkins/jenkins-slave/workspace/Lucene-Solr-SmokeRelease-6.x/lucene/build/smokeTestRelease/tmp/unpack/lucene-6.1.0/build/test-framework/classes/java/org/apache/lucene/mockfile/package-info.class
   [smoker]     [javac] Creating empty /x1/jenkins/jenkins-slave/workspace/Lucene-Solr-SmokeRelease-6.x/lucene/build/smokeTestRelease/tmp/unpack/lucene-6.1.0/build/test-framework/classes/java/org/apache/lucene/codecs/cheapbastard/package-info.class
   [smoker]     [javac] Creating empty /x1/jenkins/jenkins-slave/workspace/Lucene-Solr-SmokeRelease-6.x/lucene/build/smokeTestRelease/tmp/unpack/lucene-6.1.0/build/test-framework/classes/java/org/apache/lucene/codecs/mockrandom/package-info.class
   [smoker]     [javac] Creating empty /x1/jenkins/jenkins-slave/workspace/Lucene-Solr-SmokeRelease-6.x/lucene/build/smokeTestRelease/tmp/unpack/lucene-6.1.0/build/test-framework/classes/java/org/apache/lucene/codecs/cranky/package-info.class
   [smoker]     [javac] Creating empty /x1/jenkins/jenkins-slave/workspace/Lucene-Solr-SmokeRelease-6.x/lucene/build/smokeTestRelease/tmp/unpack/lucene-6.1.0/build/test-framework/classes/java/org/apache/lucene/codecs/compressing/dummy/package-info.class
   [smoker]      [copy] Copying 4 files to /x1/jenkins/jenkins-slave/workspace/Lucene-Solr-SmokeRelease-6.x/lucene/build/smokeTestRelease/tmp/unpack/lucene-6.1.0/build/test-framework/classes/java
   [smoker] 
   [smoker] compile-core:
   [smoker] 
   [smoker] compile-test:
   [smoker]     [mkdir] Created dir: /x1/jenkins/jenkins-slave/workspace/Lucene-Solr-SmokeRelease-6.x/lucene/build/smokeTestRelease/tmp/unpack/lucene-6.1.0/build/core/classes/test
   [smoker]     [javac] Compiling 426 source files to /x1/jenkins/jenkins-slave/workspace/Lucene-Solr-SmokeRelease-6.x/lucene/build/smokeTestRelease/tmp/unpack/lucene-6.1.0/build/core/classes/test
   [smoker]     [javac] Note: Some input files use or override a deprecated API.
   [smoker]     [javac] Note: Recompile with -Xlint:deprecation for details.
   [smoker]      [copy] Copying 3 files to /x1/jenkins/jenkins-slave/workspace/Lucene-Solr-SmokeRelease-6.x/lucene/build/smokeTestRelease/tmp/unpack/lucene-6.1.0/build/core/classes/test
   [smoker] 
   [smoker] install-junit4-taskdef:
   [smoker] 
   [smoker] validate:
   [smoker] 
   [smoker] resolve-groovy:
   [smoker] 
   [smoker] -init-totals:
   [smoker] 
   [smoker] -test:
   [smoker]     [mkdir] Created dir: /x1/jenkins/jenkins-slave/workspace/Lucene-Solr-SmokeRelease-6.x/lucene/build/smokeTestRelease/tmp/unpack/lucene-6.1.0/build/core/test
   [smoker] [loadresource] Do not set property tests.explicitclass as its length is 0.
   [smoker]     [mkdir] Created dir: /x1/jenkins/jenkins-slave/workspace/Lucene-Solr-SmokeRelease-6.x/lucene/build/smokeTestRelease/tmp/unpack/lucene-6.1.0/build/core/test/temp
   [smoker]     [mkdir] Created dir: /x1/jenkins/jenkins-slave/workspace/Lucene-Solr-SmokeRelease-6.x/lucene/build/smokeTestRelease/tmp/unpack/.caches/test-stats/core
   [smoker]    [junit4] <JUnit4> says ᐊᐃ! Master seed: 4E386BAFB1194F8D
   [smoker]    [junit4] Executing 419 suites with 3 JVMs.
   [smoker]    [junit4] 
   [smoker]    [junit4] Started J1 PID(5258@localhost).
   [smoker]    [junit4] Started J2 PID(5261@localhost).
   [smoker]    [junit4] Started J0 PID(5257@localhost).
   [smoker]    [junit4] Suite: org.apache.lucene.codecs.perfield.TestPerFieldPostingsFormat2
   [smoker]    [junit4] Completed [1/419] on J1 in 7.73s, 5 tests
   [smoker]    [junit4] 
   [smoker]    [junit4] Suite: org.apache.lucene.index.TestConcurrentMergeScheduler
   [smoker]    [junit4] Completed [2/419] on J2 in 22.92s, 16 tests
   [smoker]    [junit4] 
   [smoker]    [junit4] Suite: org.apache.lucene.search.TestSort
   [smoker]    [junit4] Completed [3/419] on J2 in 1.61s, 25 tests
   [smoker]    [junit4] 
   [smoker]    [junit4] Suite: org.apache.lucene.index.TestIndexCommit
   [smoker]    [junit4] Completed [4/419] on J2 in 0.18s, 1 test
   [smoker]    [junit4] 
   [smoker]    [junit4] Suite: org.apache.lucene.util.TestDocIdSetBuilder
   [smoker]    [junit4] Completed [5/419] on J2 in 0.25s, 5 tests
   [smoker]    [junit4] 
   [smoker]    [junit4] Suite: org.apache.lucene.index.TestPrefixCodedTerms
   [smoker]    [junit4] Completed [6/419] on J2 in 1.08s, 5 tests
   [smoker]    [junit4] 
   [smoker]    [junit4] Suite: org.apache.lucene.codecs.lucene53.TestLucene53NormsFormat
   [smoker]    [junit4] IGNOR/A 0.02s J0 | TestLucene53NormsFormat.testNCommonBig
   [smoker]    [junit4]    > Assumption #1: 'nightly' test group is disabled (@Nightly())
   [smoker]    [junit4] IGNOR/A 0.21s J0 | TestLucene53NormsFormat.testRamBytesUsed
   [smoker]    [junit4]    > Assumption #1: 'slow' test group is disabled (@Slow())
   [smoker]    [junit4] IGNOR/A 0.00s J0 | TestLucene53NormsFormat.testMergeStability
   [smoker]    [junit4]    > Assumption #1: The MockRandom PF randomizes content on the fly, so we can't check it
   [smoker]    [junit4] Completed [7/419] on J0 in 29.85s, 17 tests, 3 skipped
   [smoker]    [junit4] 
   [smoker]    [junit4] Suite: org.apache.lucene.util.TestFilterIterator
   [smoker]    [junit4] Completed [8/419] on J0 in 0.64s, 8 tests
   [smoker]    [junit4] 
   [smoker]    [junit4] Suite: org.apache.lucene.util.TestPriorityQueue
   [smoker]    [junit4] Completed [9/419] on J0 in 1.09s, 9 tests
   [smoker]    [junit4] 
   [smoker]    [junit4] Suite: org.apache.lucene.util.TestCollectionUtil
   [smoker]    [junit4] Completed [10/419] on J1 in 25.05s, 4 tests
   [smoker]    [junit4] 
   [smoker]    [junit4] Suite: org.apache.lucene.index.TestCodecs
   [smoker]    [junit4] Completed [11/419] on J0 in 1.02s, 3 tests
   [smoker]    [junit4] 
   [smoker]    [junit4] Suite: org.apache.lucene.util.TestRamUsageEstimator
   [smoker]    [junit4] IGNOR/A 0.02s J1 | TestRamUsageEstimator.testPrintValues
   [smoker]    [junit4]    > Assumption #1: Specify -Dtests.verbose=true to print constants of RamUsageEstimator.
   [smoker]    [junit4] Completed [12/419] on J1 in 0.39s, 5 tests, 1 skipped
   [smoker]    [junit4] 
   [smoker]    [junit4] Suite: org.apache.lucene.search.TestMultiTermQueryRewrites
   [smoker]    [junit4] Completed [13/419] on J0 in 0.50s, 3 tests
   [smoker]    [junit4] 
   [smoker]    [junit4] Suite: org.apache.lucene.index.TestIndexWriterDeleteByQuery
   [smoker]    [junit4] Completed [14/419] on J0 in 0.29s, 1 test
   [smoker]    [junit4] 
   [smoker]    [junit4] Suite: org.apache.lucene.store.TestRateLimiter
   [smoker]    [junit4] IGNOR/A 0.49s J0 | TestRateLimiter.testThreads
   [smoker]    [junit4]    > Assumption #1: actualMBPerSec=17.276050600488187 targetMBPerSec=29.45608825733631
   [smoker]    [junit4] Completed [15/419] on J0 in 0.58s, 2 tests, 1 skipped
   [smoker]    [junit4] 
   [smoker]    [junit4] Suite: org.apache.lucene.store.TestSimpleFSLockFactory
   [smoker]    [junit4] Completed [16/419] on J2 in 13.82s, 7 tests
   [smoker]    [junit4] 
   [smoker]    [junit4] Suite: org.apache.lucene.index.TestByteSlices
   [smoker]    [junit4] Completed [17/419] on J1 in 9.59s, 1 test
   [smoker]    [junit4] 
   [smoker]    [junit4] Suite: org.apache.lucene.search.TestSloppyPhraseQuery
   [smoker]    [junit4] Completed [18/419] on J2 in 4.76s, 9 tests
   [smoker]    [junit4] 
   [smoker]    [junit4] Suite: org.apache.lucene.search.TestSortedSetSortField
   [smoker]    [junit4] Completed [19/419] on J2 in 0.53s, 7 tests
   [smoker]    [junit4] 
   [smoker]    [junit4] Suite: org.apache.lucene.util.TestRoaringDocIdSet
   [smoker]    [junit4] Completed [20/419] on J2 in 1.51s, 5 tests
   [smoker]    [junit4] 
   [smoker]    [junit4] Suite: org.apache.lucene.search.TestSameScoresWithThreads
   [smoker]    [junit4] Completed [21/419] on J1 in 4.85s, 1 test
   [smoker]    [junit4] 
   [smoker]    [junit4] Suite: org.apache.lucene.index.TestIndexWriterOnJRECrash
   [smoker]    [junit4] IGNOR/A 0.03s J1 | TestIndexWriterOnJRECrash.testNRTThreads
   [smoker]    [junit4]    > Assumption #1: 'nightly' test group is disabled (@Nightly())
   [smoker]    [junit4] Completed [22/419] on J1 in 0.05s, 1 test, 1 skipped
   [smoker]    [junit4] 
   [smoker]    [junit4] Suite: org.apache.lucene.store.TestRAMDirectory
   [smoker]    [junit4] IGNOR/A 0.00s J1 | TestRAMDirectory.testFsyncDoesntCreateNewFiles
   [smoker]    [junit4]    > Assumption #1: test only works for FSDirectory subclasses
   [smoker]    [junit4] IGNOR/A 0.00s J1 | TestRAMDirectory.testPendingDeletions
   [smoker]    [junit4]    > Assumption #1: we can only install VirusCheckingFS on an FSDirectory
   [smoker]    [junit4] Completed [23/419] on J1 in 5.24s, 49 tests, 2 skipped
   [smoker]    [junit4] 
   [smoker]    [junit4] Suite: org.apache.lucene.index.TestDocumentsWriterDeleteQueue
   [smoker]    [junit4] Completed [24/419] on J1 in 0.25s, 5 tests
   [smoker]    [junit4] 
   [smoker]    [junit4] Suite: org.apache.lucene.index.TestDemoParallelLeafReader
   [smoker]    [junit4] Completed [25/419] on J0 in 19.13s, 5 tests
   [smoker]    [junit4] 
   [smoker]    [junit4] Suite: org.apache.lucene.index.TestMaxPosition
   [smoker]    [junit4] Completed [26/419] on J1 in 0.14s, 2 tests
   [smoker]    [junit4] 
   [smoker]    [junit4] Suite: org.apache.lucene.index.TestIndexWriterMaxDocs
   [smoker]    [junit4] IGNOR/A 0.00s J0 | TestIndexWriterMaxDocs.testExactlyAtTrueLimit
   [smoker]    [junit4]    > Assumption #1: 'monster' test group is disabled (@Monster(value=takes over two hours))
   [smoker]    [junit4] Completed [27/419] on J0 in 4.31s, 21 tests, 1 skipped
   [smoker]    [junit4] 
   [smoker]    [junit4] Suite: org.apache.lucene.search.similarities.TestClassicSimilarity
   [smoker]    [junit4] Completed [28/419] on J0 in 0.45s, 11 tests
   [smoker]    [junit4] 
   [smoker]    [junit4] Suite: org.apache.lucene.index.TestCustomNorms
   [smoker]    [junit4] Completed [29/419] on J0 in 2.22s, 1 test
   [smoker]    [junit4] 
   [smoker]    [junit4] Suite: org.apache.lucene.search.TestBooleanCoord
   [smoker]    [junit4] Completed [30/419] on J0 in 0.55s, 76 tests
   [smoker]    [junit4] 
   [smoker]    [junit4] Suite: org.apache.lucene.store.TestNativeFSLockFactory
   [smoker]    [junit4] Completed [31/419] on J2 in 14.50s, 10 tests
   [smoker]    [junit4] 
   [smoker]    [junit4] Suite: org.apache.lucene.index.TestTransactionRollback
   [smoker]    [junit4] Completed [32/419] on J0 in 0.88s, 2 tests
   [smoker]    [junit4] 
   [smoker]    [junit4] Suite: org.apache.lucene.util.automaton.TestRegExp
   [smoker]    [junit4] Completed [33/419] on J2 in 1.09s, 5 tests
   [smoker]    [junit4] 
   [smoker]    [junit4] Suite: org.apache.lucene.search.spans.TestSpanSearchEquivalence
   [smoker]    [junit4] Completed [34/419] on J1 in 11.58s, 33 tests
   [smoker]    [junit4] 
   [smoker]    [junit4] Suite: org.apache.lucene.codecs.compressing.TestHighCompressionMode
   [smoker]    [junit4] Completed [35/419] on J0 in 3.52s, 7 tests
   [smoker]    [junit4] 
   [smoker]    [junit4] Suite: org.apache.lucene.store.TestDirectory
   [smoker]    [junit4] Completed [36/419] on J2 in 3.35s, 3 tests
   [smoker]    [junit4] 
   [smoker]    [junit4] Suite: org.apache.lucene.index.TestDocInverterPerFieldErrorInfo
   [smoker]    [junit4] Completed [37/419] on J1 in 0.40s, 2 tests
   [smoker]    [junit4] 
   [smoker]    [junit4] Suite: org.apache.lucene.search.TestMultiCollector
   [smoker]    [junit4] Completed [38/419] on J0 in 0.99s, 2 tests
   [smoker]    [junit4] 
   [smoker]    [junit4] Suite: org.apache.lucene.search.TestFieldCacheRewriteMethod
   [smoker]    [junit4] Completed [39/419] on J1 in 7.85s, 2 tests
   [smoker]    [junit4] 
   [smoker]    [junit4] Suite: org.apache.lucene.search.TestBooleanQuery
   [smoker]    [junit4] Completed [40/419] on J1 in 1.59s, 22 tests
   [smoker]    [junit4] 
   [smoker]    [junit4] Suite: org.apache.lucene.index.TestLongPostings
   [smoker]    [junit4] Completed [41/419] on J2 in 9.64s, 2 tests
   [smoker]    [junit4] 
   [smoker]    [junit4] Suite: org.apache.lucene.search.TestBlendedTermQuery
   [smoker]    [junit4] Completed [42/419] on J2 in 0.10s, 3 tests
   [smoker]    [junit4] 
   [smoker]    [junit4] Suite: org.apache.lucene.index.TestNoMergeScheduler
   [smoker]    [junit4] Completed [43/419] on J2 in 0.04s, 3 tests
   [smoker]    [junit4] 
   [smoker]    [junit4] Suite: org.apache.lucene.codecs.lucene50.TestLucene50FieldInfoFormat
   [smoker]    [junit4] Completed [44/419] on J1 in 3.19s, 11 tests
   [smoker]    [junit4] 
   [smoker]    [junit4] Suite: org.apache.lucene.search.TestPrefixRandom
   [smoker]    [junit4] Completed [45/419] on J1 in 1.20s, 1 test
   [smoker]    [junit4] 
   [smoker]    [junit4] Suite: org.apache.lucene.index.TestSnapshotDeletionPolicy
   [smoker]    [junit4] Completed [46/419] on J1 in 1.97s, 7 tests
   [smoker]    [junit4] 
   [smoker]    [junit4] Suite: org.apache.lucene.index.TestIndexWriterMerging
   [smoker]    [junit4] IGNOR/A 0.01s J2 | TestIndexWriterMerging.testNoWaitClose
   [smoker]    [junit4]    > Assumption #1: 'slow' test group is disabled (@Slow())
   [smoker]    [junit4] Completed [47/419] on J2 in 7.28s, 6 tests, 1 skipped
   [smoker]    [junit4] 
   [smoker]    [junit4] Suite: org.apache.lucene.search.TestCustomSearcherSort
   [smoker]    [junit4] Completed [48/419] on J2 in 3.07s, 2 tests
   [smoker]    [junit4] 
   [smoker]    [junit4] Suite: org.apache.lucene.search.TestBoostQuery
   [smoker]    [junit4] Completed [49/419] on J2 in 0.07s, 3 tests
   [smoker]    [junit4] 
   [smoker]    [junit4] Suite: org.apache.lucene.index.TestCodecUtil
   [smoker]    [junit4] Completed [50/419] on J2 in 0.60s, 15 tests
   [smoker]    [junit4] 
   [smoker]    [junit4] Suite: org.apache.lucene.util.TestIntsRef
   [smoker]    [junit4] Completed [51/419] on J2 in 0.07s, 2 tests
   [smoker]    [junit4] 
   [smoker]    [junit4] Suite: org.apache.lucene.index.TestLogMergePolicy
   [smoker]    [junit4] Completed [52/419] on J2 in 0.20s, 2 tests
   [smoker]    [junit4] 
   [smoker]    [junit4] Suite: org.apache.lucene.search.similarities.TestSimilarityBase
   [smoker]    [junit4] Completed [53/419] on J1 in 5.57s, 32 tests
   [smoker]    [junit4] 
   [smoker]    [junit4] Suite: org.apache.lucene.util.TestMathUtil
   [smoker]    [junit4] Completed [54/419] on J2 in 0.49s, 5 tests
   [smoker]    [junit4] 
   [smoker]    [junit4] Suite: org.apache.lucene.search.spans.TestFieldMaskingSpanQuery
   [smoker]    [junit4] IGNOR/A 0.00s J1 | TestFieldMaskingSpanQuery.testSimple2
   [smoker]    [junit4]    > Assumption #1: Broken scoring: LUCENE-3723
   [smoker]    [junit4] IGNOR/A 0.00s J1 | TestFieldMaskingSpanQuery.testSpans2
   [smoker]    [junit4]    > Assumption #1: Broken scoring: LUCENE-3723
   [smoker]    [junit4] Completed [55/419] on J1 in 0.58s, 11 tests, 2 skipped
   [smoker]    [junit4] 
   [smoker]    [junit4] Suite: org.apache.lucene.index.TestIndexWriterFromReader
   [smoker]    [junit4] Completed [56/419] on J2 in 1.09s, 12 tests
   [smoker]    [junit4] 
   [smoker]    [junit4] Suite: org.apache.lucene.index.TestBinaryDocValuesUpdates
   [smoker]    [junit4] IGNOR/A 0.00s J1 | TestBinaryDocValuesUpdates.testTonsOfUpdates
   [smoker]    [junit4]    > Assumption #1: 'nightly' test group is disabled (@Nightly())
   [smoker]    [junit4] Completed [57/419] on J1 in 8.97s, 28 tests, 1 skipped
   [smoker]    [junit4] 
   [smoker]    [junit4] Suite: org.apache.lucene.search.TestTopFieldCollector
   [smoker]    [junit4] Completed [58/419] on J1 in 0.42s, 7 tests
   [smoker]    [junit4] 
   [smoker]    [junit4] Suite: org.apache.lucene.index.TestSegmentTermDocs
   [smoker]    [junit4] Completed [59/419] on J1 in 0.97s, 4 tests
   [smoker]    [junit4] 
   [smoker]    [junit4] Suite: org.apache.lucene.index.TestStressIndexing
   [smoker]    [junit4] Completed [60/419] on J1 in 2.61s, 1 test
   [smoker]    [junit4] 
   [smoker]    [junit4] Suite: org.apache.lucene.search.TestScoreCachingWrappingScorer
   [smoker]    [junit4] Completed [61/419] on J1 in 0.05s, 1 test
   [smoker]    [junit4] 
   [smoker]    [junit4] Suite: org.apache.lucene.store.TestNRTCachingDirectory
   [smoker]    [junit4] IGNOR/A 0.00s J1 | TestNRTCachingDirectory.testFsyncDoesntCreateNewFiles
   [smoker]    [junit4]    > Assumption #1: test only works for FSDirectory subclasses
   [smoker]    [junit4] IGNOR/A 0.01s J1 | TestNRTCachingDirectory.testPendingDeletions
   [smoker]    [junit4]    > Assumption #1: we can only install VirusCheckingFS on an FSDirectory
   [smoker]    [junit4] Completed [62/419] on J1 in 4.05s, 47 tests, 2 skipped
   [smoker]    [junit4] 
   [smoker]    [junit4] Suite: org.apache.lucene.index.TestPointValues
   [smoker]    [junit4] Completed [63/419] on J0 in 43.61s, 29 tests
   [smoker]    [junit4] 
   [smoker]    [junit4] Suite: org.apache.lucene.search.TestSloppyPhraseQuery2
   [smoker]    [junit4] Completed [64/419] on J0 in 4.07s, 9 tests
   [smoker]    [junit4] 
   [smoker]    [junit4] Suite: org.apache.lucene.search.TestSortedNumericSortField
   [smoker]    [junit4] Completed [65/419] on J0 in 0.16s, 9 tests
   [smoker]    [junit4] 
   [smoker]    [junit4] Suite: org.apache.lucene.index.TestCheckIndex
   [smoker]    [junit4] Completed [66/419] on J0 in 2.53s, 5 tests
   [smoker]    [junit4] 
   [smoker]    [junit4] Suite: org.apache.lucene.search.TestSearcherManager
   [smoker]    [junit4] Completed [67/419] on J0 in 6.28s, 10 tests
   [smoker]    [junit4] 
   [smoker]    [junit4] Suite: org.apache.lucene.index.TestPerSegmentDeletes
   [smoker]    [junit4] Completed [68/419] on J0 in 0.09s, 1 test
   [smoker]    [junit4] 
   [smoker]    [junit4] Suite: org.apache.lucene.index.TestSegmentReader
   [smoker]    [junit4] Completed [69/419] on J0 in 1.84s, 7 tests
   [smoker]    [junit4] 
   [smoker]    [junit4] Suite: org.apache.lucene.search.TestMultiValuedNumericRangeQuery
   [smoker]    [junit4] Completed [70/419] on J0 in 3.51s, 1 test
   [smoker]    [junit4] 
   [smoker]    [junit4] Suite: org.apache.lucene.store.TestMmapDirectory
   [smoker]    [junit4] Completed [71/419] on J0 in 2.72s, 45 tests
   [smoker]    [junit4] 
   [smoker]    [junit4] Suite: org.apache.lucene.analysis.tokenattributes.TestSimpleAttributeImpl
   [smoker]    [junit4] Completed [72/419] on J0 in 0.75s, 1 test
   [smoker]    [junit4] 
   [smoker]    [junit4] Suite: org.apache.lucene.util.automaton.TestDeterminizeLexicon
   [smoker]    [junit4] Completed [73/419] on J0 in 4.49s, 1 test
   [smoker]    [junit4] 
   [smoker]    [junit4] Suite: org.apache.lucene.index.TestMultiDocValues
   [smoker]    [junit4] Completed [74/419] on J0 in 1.08s, 8 tests
   [smoker]    [junit4] 
   [smoker]    [junit4] Suite: org.apache.lucene.geo.TestGeoUtils
   [smoker]    [junit4] Completed [75/419] on J2 in 49.99s, 6 tests
   [smoker]    [junit4] 
   [smoker]    [junit4] Suite: org.apache.lucene.index.TestUpgradeIndexMergePolicy
   [smoker]    [junit4] Completed [76/419] on J2 in 0.08s, 1 test
   [smoker]    [junit4] 
   [smoker]    [junit4] Suite: org.apache.lucene.index.TestParallelReaderEmptyIndex
   [smoker]    [junit4] Completed [77/419] on J2 in 0.44s, 2 tests
   [smoker]    [junit4] 
   [smoker]    [junit4] Suite: org.apache.lucene.search.TestRegexpRandom2
   [smoker]    [junit4] Completed [78/419] on J2 in 6.36s, 1 test
   [smoker]    [junit4] 
   [smoker]    [junit4] Suite: org.apache.lucene.index.TestTermVectorsReader
   [smoker]    [junit4] Completed [79/419] on J2 in 0.92s, 13 tests
   [smoker]    [junit4] 
   [smoker]    [junit4] Suite: org.apache.lucene.util.automaton.LimitedFiniteStringsIteratorTest
   [smoker]    [junit4] Completed [80/419] on J2 in 0.21s, 6 tests
   [smoker]    [junit4] 
   [smoker]    [junit4] Suite: org.apache.lucene.document.TestField
   [smoker]    [junit4] Completed [81/419] on J2 in 0.39s, 27 tests
   [smoker]    [junit4] 
   [smoker]    [junit4] Suite: org.apache.lucene.index.TestNRTThreads
   [smoker]    [junit4] Completed [82/419] on J2 in 4.74s, 1 test
   [smoker]    [junit4] 
   [smoker]    [junit4] Suite: org.apache.lucene.index.TestStressDeletes
   [smoker]    [junit4] Completed [83/419] on J2 in 1.58s, 1 test
   [smoker]    [junit4] 
   [smoker]    [junit4] Suite: org.apache.lucene.index.TestTermsEnum2
   [smoker]    [junit4] Completed [84/419] on J2 in 1.79s, 4 tests
   [smoker]    [junit4] 
   [smoker]    [junit4] Suite: org.apache.lucene.index.Test2BNumericDocValues
   [smoker]    [junit4] IGNOR/A 0.00s J2 | Test2BNumericDocValues.testNumerics
   [smoker]    [junit4]    > Assumption #1: 'monster' test group is disabled (@Monster(value=takes ~ 2 hours if the heap is 5gb))
   [smoker]    [junit4] Completed [85/419] on J2 in 0.01s, 1 test, 1 skipped
   [smoker]    [junit4] 
   [smoker]    [junit4] Suite: org.apache.lucene.index.TestIndexReaderClose
   [smoker]    [junit4] Completed [86/419] on J2 in 0.54s, 2 tests
   [smoker]    [junit4] 
   [smoker]    [junit4] Suite: org.apache.lucene.search.TestLRUQueryCache
   [smoker]    [junit4] Completed [87/419] on J0 in 18.39s, 17 tests
   [smoker]    [junit4] 
   [smoker]    [junit4] Suite: org.apache.lucene.util.TestFixedBitDocIdSet
   [smoker]    [junit4] Completed [88/419] on J0 in 1.26s, 5 tests
   [smoker]    [junit4] 
   [smoker]    [junit4] Suite: org.apache.lucene.index.TestIsCurrent
   [smoker]    [junit4] Completed [89/419] on J0 in 0.06s, 2 tests
   [smoker]    [junit4] 
   [smoker]    [junit4] Suite: org.apache.lucene.util.TestSentinelIntSet
   [smoker]    [junit4] Completed [90/419] on J0 in 0.78s, 2 tests
   [smoker]    [junit4] 
   [smoker]    [junit4] Suite: org.apache.lucene.index.TestIndexWriterCommit
   [smoker]    [junit4] Completed [91/419] on J0 in 3.90s, 13 tests
   [smoker]    [junit4] 
   [smoker]    [junit4] Suite: org.apache.lucene.util.TestArrayUtil
   [smoker]    [junit4] Completed [92/419] on J2 in 8.14s, 13 tests
   [smoker]    [junit4] 
   [smoker]    [junit4] Suite: org.apache.lucene.index.Test2BSortedDocValuesFixedSorted
   [smoker]    [junit4] IGNOR/A 0.00s J2 | Test2BSortedDocValuesFixedSorted.testFixedSorted
   [smoker]    [junit4]    > Assumption #1: 'monster' test group is disabled (@Monster(value=Takes ~ 6 hours if the heap is 5gb))
   [smoker]    [junit4] Completed [93/419] on J2 in 0.02s, 1 test, 1 skipped
   [smoker]    [junit4] 
   [smoker]    [junit4] Suite: org.apache.lucene.store.TestSingleInstanceLockFactory
   [smoker]    [junit4] Completed [94/419] on J0 in 2.32s, 7 tests
   [smoker]    [junit4] 
   [smoker]    [junit4] Suite: org.apache.lucene.store.TestBufferedIndexInput
   [smoker]    [junit4] Completed [95/419] on J2 in 0.97s, 4 tests
   [smoker]    [junit4] 
   [smoker]    [junit4] Suite: org.apache.lucene.util.TestSPIClassIterator
   [smoker]    [junit4] Completed [96/419] on J0 in 0.07s, 1 test
   [smoker]    [junit4] 
   [smoker]    [junit4] Suite: org.apache.lucene.index.Test2BSortedDocValuesOrds
   [smoker]    [junit4] IGNOR/A 0.00s J0 | Test2BSortedDocValuesOrds.test2BOrds
   [smoker]    [junit4]    > Assumption #1: 'monster' test group is disabled (@Monster(value=Takes ~ 6 hours if the heap is 5gb))
   [smoker]    [junit4] Completed [97/419] on J0 in 0.01s, 1 test, 1 skipped
   [smoker]    [junit4] 
   [smoker]    [junit4] Suite: org.apache.lucene.document.TestBinaryDocument
   [smoker]    [junit4] Completed [98/419] on J0 in 0.11s, 2 tests
   [smoker]    [junit4] 
   [smoker]    [junit4] Suite: org.apache.lucene.analysis.TestToken
   [smoker]    [junit4] Completed [99/419] on J0 in 0.16s, 5 tests
   [smoker]    [junit4] 
   [smoker]    [junit4] Suite: org.apache.lucene.index.Test4GBStoredFields
   [smoker]    [junit4] IGNOR/A 0.00s J0 | Test4GBStoredFields.test
   [smoker]    [junit4]    > Assumption #1: 'nightly' test group is disabled (@Nightly())
   [smoker]    [junit4] Completed [100/419] on J0 in 0.01s, 1 test, 1 skipped
   [smoker]    [junit4] 
   [smoker]    [junit4] Suite: org.apache.lucene.util.TestTimSorter
   [smoker]    [junit4] Completed [101/419] on J2 in 0.29s, 9 tests
   [smoker]    [junit4] 
   [smoker]    [junit4] Suite: org.apache.lucene.index.TestOrdinalMap
   [smoker]    [junit4] Completed [102/419] on J2 in 0.18s, 1 test
   [smoker]    [junit4] 
   [smoker]    [junit4] Suite: org.apache.lucene.search.TestPhrasePrefixQuery
   [smoker]    [junit4] Completed [103/419] on J2 in 0.01s, 1 test
   [smoker]    [junit4] 
   [smoker]    [junit4] Suite: org.apache.lucene.util.TestIOUtils
   [smoker]    [junit4] Completed [104/419] on J2 in 0.45s, 18 tests
   [smoker]    [junit4] 
   [smoker]    [junit4] Suite: org.apache.lucene.search.TestQueryCachingPolicy
   [smoker]    [junit4] Completed [105/419] on J2 in 0.06s, 1 test
   [smoker]    [junit4] 
   [smoker]    [junit4] Suite: org.apache.lucene.util.TestBytesRefArray
   [smoker]    [junit4] Completed [106/419] on J0 in 0.79s, 2 tests
   [smoker]    [junit4] 
   [smoker]    [junit4] Suite: org.apache.lucene.index.TestReaderClosed
   [smoker]    [junit4] Completed [107/419] on J0 in 0.06s, 2 tests
   [smoker]    [junit4] 
   [smoker]    [junit4] Suite: org.apache.lucene.index.TestDocValues
   [smoker]    [junit4] Completed [108/419] on J2 in 0.13s, 7 tests
   [smoker]    [junit4] 
   [smoker]    [junit4] Suite: org.apache.lucene.search.TestDocBoost
   [smoker]    [junit4] Completed [109/419] on J2 in 0.06s, 1 test
   [smoker]    [junit4] 
   [smoker]    [junit4] Suite: org.apache.lucene.search.spans.TestSpanBoostQuery
   [smoker]    [junit4] Completed [110/419] on J2 in 0.05s, 2 tests
   [smoker]    [junit4] 
   [smoker]    [junit4] Suite: org.apache.lucene.search.spans.TestSpanCollection
   [smoker]    [junit4] Completed [111/419] on J0 in 0.15s, 3 tests
   [smoker]    [junit4] 
   [smoker]    [junit4] HEARTBEAT J1 PID(5258@localhost): 2016-04-09T08:03:16, stalled for 61.7s at: TestGrowableByteArrayDataOutput.testWriteLargeStrings
   [smoker]    [junit4] Suite: org.apache.lucene.index.TestConsistentFieldNumbers
   [smoker]    [junit4] Completed [112/419] on J2 in 3.05s, 4 tests
   [smoker]    [junit4] 
   [smoker]    [junit4] Suite: org.apache.lucene.index.TestDeletionPolicy
   [smoker]    [junit4] Completed [113/419] on J0 in 4.90s, 6 tests
   [smoker]    [junit4] 
   [smoker]    [junit4] Suite: org.apache.lucene.index.TestDocCount
   [smoker]    [junit4] Completed [114/419] on J0 in 0.19s, 1 test
   [smoker]    [junit4] 
   [smoker]    [junit4] Suite: org.apache.lucene.index.TestFieldReuse
   [smoker]    [junit4] Completed [115/419] on J0 in 0.07s, 3 tests
   [smoker]    [junit4] 
   [smoker]    [junit4] Suite: org.apache.lucene.analysis.TestCharFilter
   [smoker]    [junit4] Completed [116/419] on J0 in 0.23s, 4 tests
   [smoker]    [junit4] 
   [smoker]    [junit4] Suite: org.apache.lucene.search.TestNeedsScores
   [smoker]    [junit4] Completed [117/419] on J0 in 0.04s, 4 tests
   [smoker]    [junit4] 
   [smoker]    [junit4] Suite: org.apache.lucene.codecs.compressing.TestFastDecompressionMode
   [smoker]    [junit4] Completed [118/419] on J2 in 4.11s, 11 tests
   [smoker]    [junit4] 
   [smoker]    [junit4] Suite: org.apache.lucene.util.TestFixedBitSet
   [smoker]    [junit4] Completed [119/419] on J0 in 7.41s, 19 tests
   [smoker]    [junit4] 
   [smoker]    [junit4] Suite: org.apache.lucene.search.TestMinShouldMatch2
   [smoker]    [junit4] Completed [120/419] on J2 in 10.36s, 6 tests
   [smoker]    [junit4] 
   [smoker]    [junit4] Suite: org.apache.lucene.index.TestIndexWriter
   [smoker]    [junit4] Completed [121/419] on J0 in 10.39s, 71 tests
   [smoker]    [junit4] 
   [smoker]    [junit4] Suite: org.apache.lucene.store.TestMultiMMap
   [smoker]    [junit4] Completed [122/419] on J2 in 6.06s, 57 tests
   [smoker]    [junit4] 
   [smoker]    [junit4] Suite: org.apache.lucene.store.TestLockFactory
   [smoker]    [junit4] Completed [123/419] on J0 in 0.09s, 2 tests
   [smoker]    [junit4] 
   [smoker]    [junit4] Suite: org.apache.lucene.search.TestRegexpRandom
   [smoker]    [junit4] Completed [124/419] on J0 in 0.43s, 1 test
   [smoker]    [junit4] 
   [smoker]    [junit4] Suite: org.apache.lucene.index.TestRollingUpdates
   [smoker]    [junit4] Completed [125/419] on J2 in 5.53s, 2 tests
   [smoker]    [junit4] 
   [smoker]    [junit4] Suite: org.apache.lucene.search.TestWildcard
   [smoker]    [junit4] Completed [126/419] on J2 in 0.33s, 8 tests
   [smoker]    [junit4] 
   [smoker]    [junit4] Suite: org.apache.lucene.search.TestConjunctions
   [smoker]    [junit4] Completed [127/419] on J2 in 0.31s, 1 test
   [smoker]    [junit4] 
   [smoker]    [junit4] Suite: org.apache.lucene.codecs.lucene50.TestForUtil
   [smoker]    [junit4] Completed [128/419] on J2 in 0.23s, 1 test
   [smoker]    [junit4] 
   [smoker]    [junit4] Suite: org.apache.lucene.util.TestPagedBytes
   [smoker]    [junit4] Completed [129/419] on J0 in 7.01s, 4 tests, 1 skipped
   [smoker]    [junit4] 
   [smoker]    [junit4] Suite: org.apache.lucene.index.TestCrash
   [smoker]    [junit4] Completed [130/419] on J0 in 1.24s, 5 tests
   [smoker]    [junit4] 
   [smoker]    [junit4] Suite: org.apache.lucene.util.TestBytesRef
   [smoker]    [junit4] Completed [131/419] on J0 in 0.04s, 3 tests
   [smoker]    [junit4] 
   [smoker]    [junit4] Suite: org.apache.lucene.util.TestUnicodeUtil
   [smoker]    [junit4] Completed [132/419] on J0 in 1.45s, 5 tests
   [smoker]    [junit4] 
   [smoker]    [junit4] Suite: org.apache.lucene.search.TestSimilarityProvider
   [smoker]    [junit4] Completed [133/419] on J0 in 0.12s, 1 test
   [smoker]    [junit4] 
   [smoker]    [junit4] Suite: org.apache.lucene.util.TestBytesRefHash
   [smoker]    [junit4] Completed [134/419] on J2 in 5.23s, 8 tests
   [smoker]    [junit4] 
   [smoker]    [junit4] Suite: org.apache.lucene.index.TestMultiLevelSkipList
   [smoker]    [junit4] Completed [135/419] on J2 in 0.86s, 1 test
   [smoker]    [junit4] 
   [smoker]    [junit4] Suite: org.apache.lucene.search.spans.TestSpanNearQuery
   [smoker]    [junit4] Completed [136/419] on J2 in 0.11s, 4 tests
   [smoker]    [junit4] 
   [smoker]    [junit4] Suite: org.apache.lucene.index.TestIndexWriterOutOfFileDescriptors
   [smoker]    [junit4] Completed [137/419] on J2 in 12.34s, 1 test
   [smoker]    [junit4] 
   [smoker]    [junit4] Suite: org.apache.lucene.search.TestTopDocsCollector
   [smoker]    [junit4] Completed [138/419] on J2 in 0.21s, 8 tests
   [smoker]    [junit4] 
   [smoker]    [junit4] Suite: org.apache.lucene.TestMergeSchedulerExternal
   [smoker]    [junit4] Completed [139/419] on J2 in 1.09s, 2 tests
   [smoker]    [junit4] 
   [smoker]    [junit4] Suite: org.apache.lucene.geo.TestPolygon
   [smoker]    [junit4] Completed [140/419] on J0 in 21.96s, 13 tests
   [smoker]    [junit4] 
   [smoker]    [junit4] Suite: org.apache.lucene.index.TestTermVectorsWriter
   [smoker]    [junit4] Completed [141/419] on J0 in 0.74s, 15 tests
   [smoker]    [junit4] 
   [smoker]    [junit4] Suite: org.apache.lucene.index.TestNoMergePolicy
   [smoker]    [junit4] Completed [142/419] on J0 in 0.29s, 4 tests
   [smoker]    [junit4] 
   [smoker]    [junit4] Suite: org.apache.lucene.index.TestDoc
   [smoker]    [junit4] Completed [143/419] on J0 in 0.48s, 1 test
   [smoker]    [junit4] 
   [smoker]    [junit4] Suite: org.apache.lucene.index.TestParallelCompositeReader
   [smoker]    [junit4] Completed [144/419] on J0 in 0.87s, 15 tests
   [smoker]    [junit4] 
   [smoker]    [junit4] HEARTBEAT J1 PID(5258@localhost): 2016-04-09T08:04:16, stalled for  122s at: TestGrowableByteArrayDataOutput.testWriteLargeStrings
   [smoker]    [junit4] Suite: org.apache.lucene.index.TestIndexWriterThreadsToSegments
   [smoker]    [junit4] Completed [145/419] on J0 in 5.96s, 4 tests
   [smoker]    [junit4] 
   [smoker]    [junit4] Suite: org.apache.lucene.codecs.lucene50.TestLucene50TermVectorsFormat
   [smoker]    [junit4] IGNOR/A 0.00s J2 | TestLucene50TermVectorsFormat.testRamBytesUsed
   [smoker]    [junit4]    > Assumption #1: 'slow' test group is disabled (@Slow())
   [smoker]    [junit4] Completed [146/419] on J2 in 19.37s, 17 tests, 1 skipped
   [smoker]    [junit4] 
   [smoker]    [junit4] Suite: org.apache.lucene.index.TestTwoPhaseCommitTool
   [smoker]    [junit4] Completed [147/419] on J2 in 0.07s, 3 tests
   [smoker]    [junit4] 
   [smoker]    [junit4] Suite: org.apache.lucene.index.TestIndexWriterMergePolicy
   [smoker]    [junit4] Completed [148/419] on J0 in 8.27s, 7 tests
   [smoker]    [junit4] 
   [smoker]    [junit4] Suite: org.apache.lucene.search.TestSubScorerFreqs
   [smoker]    [junit4] Completed [149/419] on J0 in 0.15s, 3 tests
   [smoker]    [junit4] 
   [smoker]    [junit4] Suite: org.apache.lucene.search.TestBooleanOr
   [smoker]    [junit4] Completed [150/419] on J2 in 4.63s, 7 tests
   [smoker]    [junit4] 
   [smoker]    [junit4] Suite: org.apache.lucene.search.spans.TestSpanTermQuery
   [smoker]    [junit4] Completed [151/419] on J2 in 0.35s, 2 tests
   [smoker]    [junit4] 
   [smoker]    [junit4] Suite: org.apache.lucene.index.Test2BBinaryDocValues
   [smoker]    [junit4] IGNOR/A 0.00s J2 | Test2BBinaryDocValues.testFixedBinary
   [smoker]    [junit4]    > Assumption #1: 'monster' test group is disabled (@Monster(value=takes ~ 6 hours if the heap is 5gb))
   [smoker]    [junit4] IGNOR/A 0.00s J2 | Test2BBinaryDocValues.testVariableBinary
   [smoker]    [junit4]    > Assumption #1: 'monster' test group is disabled (@Monster(value=takes ~ 6 hours if the heap is 5gb))
   [smoker]    [junit4] Completed [152/419] on J2 in 0.05s, 2 tests, 2 skipped
   [smoker]    [junit4] 
   [smoker]    [junit4] Suite: org.apache.lucene.util.mutable.TestMutableValues
   [smoker]    [junit4] Completed [153/419] on J2 in 0.09s, 6 tests
   [smoker]    [junit4] 
   [smoker]    [junit4] Suite: org.apache.lucene.search.TestDisjunctionMaxQuery
   [smoker]    [junit4] Completed [154/419] on J0 in 2.26s, 11 tests
   [smoker]    [junit4] 
   [smoker]    [junit4] Suite: org.apache.lucene.search.TestBooleanQueryVisitSubscorers
   [smoker]    [junit4] Completed [155/419] on J0 in 0.28s, 5 tests
   [smoker]    [junit4] 
   [smoker]    [junit4] Suite: org.apache.lucene.util.TestVirtualMethod
   [smoker]    [junit4] Completed [156/419] on J0 in 0.24s, 2 tests
   [smoker]    [junit4] 
   [smoker]    [junit4] Suite: org.apache.lucene.search.TestEarlyTermination
   [smoker]    [junit4] Completed [157/419] on J0 in 0.06s, 1 test
   [smoker]    [junit4] 
   [smoker]    [junit4] Suite: org.apache.lucene.index.TestIndexWriterWithThreads
   [smoker]    [junit4] IGNOR/A 0.00s J0 | TestIndexWriterWithThreads.testImmediateDiskFullWithThreads
   [smoker]    [junit4]    > Assumption #1: 'slow' test group is disabled (@Slow())
   [smoker]    [junit4] IGNOR/A 0.00s J0 | TestIndexWriterWithThreads.testIOExceptionDuringAbortWithThreadsOnlyOnce
   [smoker]    [junit4]    > Assumption #1: 'slow' test group is disabled (@Slow())
   [smoker]    [junit4] IGNOR/A 0.00s J0 | TestIndexWriterWithThreads.testIOExceptionDuringWriteSegment
   [smoker]    [junit4]    > Assumption #1: 'slow' test group is disabled (@Slow())
   [smoker]    [junit4] IGNOR/A 0.00s J0 | TestIndexWriterWithThreads.testOpenTwoIndexWritersOnDifferentThreads
   [smoker]    [junit4]    > Assumption #1: 'slow' test group is disabled (@Slow())
   [smoker]    [junit4] IGNOR/A 0.00s J0 | TestIndexWriterWithThreads.testIOExceptionDuringAbortWithThreads
   [smoker]    [junit4]    > Assumption #1: 'slow' test group is disabled (@Slow())
   [smoker]    [junit4] IGNOR/A 0.00s J0 | TestIndexWriterWithThreads.testIOExceptionDuringWriteSegmentWithThreadsOnlyOnce
   [smoker]    [junit4]    > Assumption #1: 'slow' test group is disabled (@Slow())
   [smoker]    [junit4] IGNOR/A 0.00s J0 | TestIndexWriterWithThreads.testRollbackAndCommitWithThreads
   [smoker]    [junit4]    > Assumption #1: 'slow' test group is disabled (@Slow())
   [smoker]    [junit4] IGNOR/A 0.00s J0 | TestIndexWriterWithThreads.testIOExceptionDuringWriteSegmentOnlyOnce
   [smoker]    [junit4]    > Assumption #1: 'slow' test group is disabled (@Slow())
   [smoker]    [junit4] IGNOR/A 0.00s J0 | TestIndexWriterWithThreads.testIOExceptionDuringWriteSegmentWithThreads
   [smoker]    [junit4]    > Assumption #1: 'slow' test group is disabled (@Slow())
   [smoker]    [junit4] IGNOR/A 0.00s J0 | TestIndexWriterWithThreads.testIOExceptionDuringAbort
   [smoker]    [junit4]    > Assumption #1: 'slow' test group is disabled (@Slow())
   [smoker]    [junit4] IGNOR/A 0.00s J0 | TestIndexWriterWithThreads.testIOExceptionDuringAbortOnlyOnce
   [smoker]    [junit4]    > Assumption #1: 'slow' test group is disabled (@Slow())
   [smoker]    [junit4] IGNOR/A 0.00s J0 | TestIndexWriterWithThreads.testCloseWithThreads
   [smoker]    [junit4]    > Assumption #1: 'slow' test group is disabled (@Slow())
   [smoker]    [junit4] Completed [158/419] on J0 in 0.03s, 12 tests, 12 skipped
   [smoker]    [junit4] 
   [smoker]    [junit4] Suite: org.apache.lucene.index.TestSwappedIndexFiles
   [smoker]    [junit4] Completed [159/419] on J0 in 0.54s, 1 test
   [smoker]    [junit4] 
   [smoker]    [junit4] Suite: org.apache.lucene.search.TestMultiThreadTermVectors
   [smoker]    [junit4] Completed [160/419] on J2 in 4.80s, 1 test
   [smoker]    [junit4] 
   [smoker]    [junit4] Suite: org.apache.lucene.search.TestBooleanMinShouldMatch
   [smoker]    [junit4] Completed [161/419] on J0 in 4.58s, 17 tests
   [smoker]    [junit4] 
   [smoker]    [junit4] Suite: org.apache.lucene.search.TestComplexExplanations
   [smoker]    [junit4] Completed [162/419] on J2 in 3.72s, 21 tests
   [smoker]    [junit4] 
   [smoker]    [junit4] Suite: org.apache.lucene.analysis.tokenattributes.TestCharTermAttributeImpl
   [smoker]    [junit4] Completed [163/419] on J2 in 1.43s, 12 tests
   [smoker]    [junit4] 
   [smoker]    [junit4] Suite: org.apache.lucene.index.TestIndexWriterOnDiskFull
   [smoker]    [junit4] Completed [164/419] on J2 in 1.84s, 4 tests
   [smoker]    [junit4] 
   [smoker]    [junit4] Suite: org.apache.lucene.analysis.tokenattributes.TestPackedTokenAttributeImpl
   [smoker]    [junit4] Completed [165/419] on J2 in 0.06s, 4 tests
   [smoker]    [junit4] 
   [smoker]    [junit4] Suite: org.apache.lucene.index.TestIndexWriterReader
   [smoker]    [junit4] IGNOR/A 0.00s J2 | TestIndexWriterReader.testDuringAddIndexes
   [smoker]    [junit4]    > Assumption #1: 'nightly' test group is disabled (@Nightly())
   [smoker]    [junit4] IGNOR/A 0.00s J2 | TestIndexWriterReader.testAddIndexesAndDoDeletesThreads
   [smoker]    [junit4]    > Assumption #1: 'slow' test group is disabled (@Slow())
   [smoker]    [junit4] Completed [166/419] on J2 in 8.08s, 23 tests, 2 skipped
   [smoker]    [junit4] 
   [smoker]    [junit4] Suite: org.apache.lucene.util.fst.TestFSTs
   [smoker]    [junit4] IGNOR/A 0.00s J2 | TestFSTs.testSimple
   [smoker]    [junit4]    > Assumption #1: 'slow' test group is disabled (@Slow())
   [smoker]    [junit4] IGNOR/A 0.00s J2 | TestFSTs.testShortestPathsRandom
   [smoker]    [junit4]    > Assumption #1: 'slow' test group is disabled (@Slow())
   [smoker]    [junit4] IGNOR/A 0.00s J2 | TestFSTs.testDuplicateFSAString
   [smoker]    [junit4]    > Assumption #1: 'slow' test group is disabled (@Slow())
   [smoker]    [junit4] IGNOR/A 0.00s J2 | TestFSTs.testBigSet
   [smoker]    [junit4]    > Assumption #1: 'nightly' test group is disabled (@Nightly())
   [smoker]    [junit4] IGNOR/A 0.00s J2 | TestFSTs.testFinalOutputOnEndState
   [smoker]    [junit4]    > Assumption #1: 'slow' test group is disabled (@Slow())
   [smoker]    [junit4] IGNOR/A 0.00s J2 | TestFSTs.testExpandedCloseToRoot
   [smoker]    [junit4]    > Assumption #1: 'slow' test group is disabled (@Slow())
   [smoker]    [junit4] IGNOR/A 0.00s J2 | TestFSTs.testBasicFSA
   [smoker]    [junit4]    > Assumption #1: 'slow' test group is disabled (@Slow())
   [smoker]    [junit4] IGNOR/A 0.00s J2 | TestFSTs.testSingleString
   [smoker]    [junit4]    > Assumption #1: 'slow' test group is disabled (@Slow())
   [smoker]    [junit4] IGNOR/A 0.00s J2 | TestFSTs.testRealTerms
   [smoker]    [junit4]    > Assumption #1: 'slow' test group is disabled (@Slow())
   [smoker]    [junit4] IGNOR/A 0.00s J2 | TestFSTs.testRandomTermLookup
   [smoker]    [junit4]    > Assumption #1: 'slow' test group is disabled (@Slow())
   [smoker]    [junit4] IGNOR/A 0.00s J2 | TestFSTs.testRandomWords
   [smoker]    [junit4]    > Assumption #1: 'slow' test group is disabled (@Slow())
   [smoker]    [junit4] IGNOR/A 0.00s J2 | TestFSTs.testShortestPathsWFSTRandom
   [smoker]    [junit4]    > Assumption #1: 'slow' test group is disabled (@Slow())
   [smoker]    [junit4] IGNOR/A 0.00s J2 | TestFSTs.testIllegallyModifyRootArc
   [smoker]    [junit4]    > Assumption #1: 'slow' test group is disabled (@Slow())
   [smoker]    [junit4] IGNOR/A 0.00s J2 | TestFSTs.testInternalFinalState
   [smoker]    [junit4]    > Assumption #1: 'slow' test group is disabled (@Slow())
   [smoker]    [junit4] IGNOR/A 0.00s J2 | TestFSTs.testLargeOutputsOnArrayArcs
   [smoker]    [junit4]    > Assumption #1: 'slow' test group is disabled (@Slow())
   [smoker]    [junit4] IGNOR/A 0.00s J2 | TestFSTs.testRejectNoLimits
   [smoker]    [junit4]    > Assumption #1: 'slow' test group is disabled (@Slow())
   [smoker]    [junit4] IGNOR/A 0.00s J2 | TestFSTs.testNonFinalStopNode
   [smoker]    [junit4]    > Assumption #1: 'slow' test group is disabled (@Slow())
   [smoker]    [junit4] IGNOR/A 0.00s J2 | TestFSTs.testPrimaryKeys
   [smoker]    [junit4]    > Assumption #1: 'slow' test group is disabled (@Slow())
   [smoker]    [junit4] IGNOR/A 0.00s J2 | TestFSTs.testShortestPaths
   [smoker]    [junit4]    > Assumption #1: 'slow' test group is disabled (@Slow())
   [smoker]    [junit4] IGNOR/A 0.03s J2 | TestFSTs.testShortestPathsWFST
   [smoker]    [junit4]    > Assumption #1: 'slow' test group is disabled (@Slow())
   [smoker]    [junit4] Completed [167/419] on J2 in 0.05s, 20 tests, 20 skipped
   [smoker]    [junit4] 
   [smoker]    [junit4] Suite: org.apache.lucene.codecs.compressing.TestGrowableByteArrayDataOutput
   [smoker]    [junit4] Completed [168/419] on J1 in 159.45s, 2 tests
   [smoker]    [junit4] 
   [smoker]    [junit4] Suite: org.apache.lucene.util.automaton.TestOperations
   [smoker]    [junit4] Completed [169/419] on J1 in 2.54s, 5 tests
   [smoker]    [junit4] 
   [smoker]    [junit4] Suite: org.apache.lucene.index.TestParallelTermEnum
   [smoker]    [junit4] Completed [170/419] on J1 in 0.06s, 1 test
   [smoker]    [junit4] 
   [smoker]    [junit4] Suite: org.apache.lucene.search.TestPrefixInBooleanQuery
   [smoker]    [junit4] Completed [171/419] on J1 in 1.18s, 4 tests
   [smoker]    [junit4] 
   [smoker]    [junit4] Suite: org.apache.lucene.util.TestFixedLengthBytesRefArray
   [smoker]    [junit4] Completed [172/419] on J1 in 0.35s, 2 tests
   [smoker]    [junit4] 
   [smoker]    [junit4] Suite: org.apache.lucene.index.TestOmitPositions
   [smoker]    [junit4] Completed [173/419] on J1 in 0.59s, 4 tests
   [smoker]    [junit4] 
   [smoker]    [junit4] Suite: org.apache.lucene.util.TestSetOnce
   [smoker]    [junit4] Completed [174/419] on J1 in 0.13s, 4 tests
   [smoker]    [junit4] 
   [smoker]    [junit4] Suite: org.apache.lucene.index.TestIndexWriterExceptions2
   [smoker]    [junit4] Completed [175/419] on J1 in 30.67s, 1 test
   [smoker]    [junit4] 
   [smoker]    [junit4] Suite: org.apache.lucene.store.TestSimpleFSDirectory
   [smoker]    [junit4] Completed [176/419] on J1 in 4.43s, 45 tests
   [smoker]    [junit4] 
   [smoker]    [junit4] Suite: org.apache.lucene.util.TestRollingBuffer
   [smoker]    [junit4] Completed [177/419] on J1 in 1.68s, 1 test
   [smoker]    [junit4] 
   [smoker]    [junit4] Suite: org.apache.lucene.index.Test2BPostingsBytes
   [smoker]    [junit4] IGNOR/A 0.00s J1 | Test2BPostingsBytes.test
   [smoker]    [junit4]    > Assumption #1: 'monster' test group is disabled (@Monster(value=takes ~20GB-30GB of space and 10 minutes))
   [smoker]    [junit4] Completed [178/419] on J1 in 0.01s, 1 test, 1 skipped
   [smoker]    [junit4] 
   [smoker]    [junit4] Suite: org.apache.lucene.geo.TestGeoEncodingUtils
   [smoker]    [junit4] Completed [179/419] on J1 in 2.22s, 3 tests
   [smoker]    [junit4] 
   [smoker]    [junit4] Suite: org.apache.lucene.analysis.tokenattributes.TestBytesRefAttImpl
   [smoker]    [junit4] Completed [180/419] on J1 in 0.05s, 1 test
   [smoker]    [junit4] 
   [smoker]    [junit4] Suite: org.apache.lucene.search.TestNumericRangeQuery64
   [smoker]    [junit4] Completed [181/419] on J2 in 47.15s, 29 tests
   [smoker]    [junit4] 
   [smoker]    [junit4] Suite: org.apache.lucene.index.TestAllFilesCheckIndexHeader
   [smoker]    [junit4] Completed [182/419] on J1 in 2.40s, 1 test
   [smoker]    [junit4] 
   [smoker]    [junit4] Suite: org.apache.lucene.util.TestByteBlockPool
   [smoker]    [junit4] Completed [183/419] on J1 in 0.05s, 1 test
   [smoker]    [junit4] 
   [smoker]    [junit4] Suite: org.apache.lucene.index.TestSortedSetDocValues
   [smoker]    [junit4] Completed [184/419] on J1 in 0.02s, 1 test
   [smoker]    [junit4] 
   [smoker]    [junit4] Suite: org.apache.lucene.store.TestByteArrayDataInput
   [smoker]    [junit4] Completed [185/419] on J1 in 0.31s, 1 test
   [smoker]    [junit4] 
   [smoker]    [junit4] Suite: org.apache.lucene.util.fst.TestBytesStore
   [smoker]    [junit4] Completed [186/419] on J2 in 3.26s, 1 test
   [smoker]    [junit4] 
   [smoker]    [junit4] Suite: org.apache.lucene.index.TestDocsAndPositions
   [smoker]    [junit4] Completed [187/419] on J1 in 1.49s, 6 tests
   [smoker]    [junit4] 
   [smoker]    [junit4] Suite: org.apache.lucene.index.TestDuelingCodecs
   [smoker]    [junit4] IGNOR/A 0.00s J1 | TestDuelingCodecs.testCrazyReaderEquals
   [smoker]    [junit4]    > Assumption #1: 'slow' test group is disabled (@Slow())
   [smoker]    [junit4] IGNOR/A 0.00s J1 | TestDuelingCodecs.testEquals
   [smoker]    [junit4]    > Assumption #1: 'slow' test group is disabled (@Slow())
   [smoker]    [junit4] Completed [188/419] on J1 in 0.00s, 2 tests, 2 skipped
   [smoker]    [junit4] 
   [smoker]    [junit4] Suite: org.apache.lucene.index.TestFilterDirectoryReader
   [smoker]    [junit4] Completed [189/419] on J1 in 0.09s, 1 test
   [smoker]    [junit4] 
   [smoker]    [junit4] Suite: org.apache.lucene.TestAssertions
   [smoker]    [junit4] Completed [190/419] on J1 in 0.07s, 1 test
   [smoker]    [junit4] 
   [smoker]    [junit4] Suite: org.apache.lucene.codecs.perfield.TestPerFieldDocValuesFormat
   [smoker]    [junit4] IGNOR/A 0.00s J0 | TestPerFieldDocValuesFormat.testRamBytesUsed
   [smoker]    [junit4]    > Assumption #1: 'slow' test group is disabled (@Slow())
   [smoker]    [junit4] IGNOR/A 0.00s J0 | TestPerFieldDocValuesFormat.testThreads2
   [smoker]    [junit4]    > Assumption #1: 'slow' test group is disabled (@Slow())
   [smoker]    [junit4] IGNOR/A 0.00s J0 | TestPerFieldDocValuesFormat.testThreads3
   [smoker]    [junit4]    > Assumption #1: 'slow' test group is disabled (@Slow())
   [smoker]    [junit4] Completed [191/419] on J0 in 66.23s, 96 tests, 3 skipped
   [smoker]    [junit4] 
   [smoker]    [junit4] Suite: org.apache.lucene.search.TestSearchAfter
   [smoker]    [junit4] Completed [192/419] on J1 in 1.87s, 1 test
   [smoker]    [junit4] 
   [smoker]    [junit4] Suite: org.apache.lucene.util.TestIntArrayDocIdSet
   [smoker]    [junit4] Completed [193/419] on J1 in 1.79s, 5 tests
   [smoker]    [junit4] 
   [smoker]    [junit4] Suite: org.apache.lucene.search.TestNumericRangeQuery32
   [smoker]    [junit4] Completed [194/419] on J0 in 12.76s, 23 tests
   [smoker]    [junit4] 
   [smoker]    [junit4] Suite: org.apache.lucene.index.TestAddIndexes
   [smoker]    [junit4] Completed [195/419] on J0 in 5.20s, 23 tests
   [smoker]    [junit4] 
   [smoker]    [junit4] Suite: org.apache.lucene.index.TestIndexWriterExceptions
   [smoker]    [junit4] IGNOR/A 0.01s J1 | TestIndexWriterExceptions.testTooManyTokens
   [smoker]    [junit4]    > Assumption #1: 'nightly' test group is disabled (@Nightly())
   [smoker]    [junit4] Completed [196/419] on J1 in 22.97s, 36 tests, 1 skipped
   [smoker]    [junit4] 
   [smoker]    [junit4] Suite: org.apache.lucene.util.packed.TestPackedInts
   [smoker]    [junit4] IGNOR/A 0.00s J2 | TestPackedInts.testBlockReaderOverflow
   [smoker]    [junit4]    > Assumption #1: 'nightly' test group is disabled (@Nightly())
   [smoker]    [junit4] Completed [197/419] on J2 in 27.18s, 28 tests, 3 skipped
   [smoker]    [junit4] 
   [smoker]    [junit4] Suite: org.apache.lucene.search.TestShardSearching
   [smoker]    [junit4] Completed [198/419] on J0 in 11.92s, 1 test
   [smoker]    [junit4] 
   [smoker]    [junit4] Suite: org.apache.lucene.search.spans.TestBasics
   [smoker]    [junit4] Completed [199/419] on J2 in 5.13s, 25 tests
   [smoker]    [junit4] 
   [smoker]    [junit4] Suite: org.apache.lucene.store.TestNIOFSDirectory
   [smoker]    [junit4] Completed [200/419] on J1 in 6.33s, 45 tests
   [smoker]    [junit4] 
   [smoker]    [junit4] Suite: org.apache.lucene.search.TestSortedSetSelector
   [smoker]    [junit4] Completed [201/419] on J1 in 0.47s, 15 tests
   [smoker]    [junit4] 
   [smoker]    [junit4] Suite: org.apache.lucene.util.TestQueryBuilder
   [smoker]    [junit4] Completed [202/419] on J1 in 0.14s, 20 tests
   [smoker]    [junit4] 
   [smoker]    [junit4] Suite: org.apache.lucene.index.TestFlushByRamOrCountsPolicy
   [smoker]    [junit4] Completed [203/419] on J0 in 3.99s, 5 tests
   [smoker]    [junit4] 
   [smoker]    [junit4] Suite: org.apache.lucene.index.TestDirectoryReaderReopen
   [smoker]    [junit4] Completed [204/419] on J1 in 4.01s, 9 tests
   [smoker]    [junit4] 
   [smoker]    [junit4] Suite: org.apache.lucene.search.TestBoolean2
   [smoker]    [junit4] Completed [205/419] on J0 in 7.90s, 11 tests
   [smoker]    [junit4] 
   [smoker]    [junit4] Suite: org.apache.lucene.store.TestSleepingLockWrapper
   [smoker]    [junit4] Completed [206/419] on J1 in 6.95s, 6 tests
   [smoker]    [junit4] 
   [smoker]    [junit4] Suite: org.apache.lucene.util.TestStringHelper
   [smoker]    [junit4] Completed [207/419] on J1 in 0.03s, 7 tests
   [smoker]    [junit4] 
   [smoker]    [junit4] Suite: org.apache.lucene.search.TestWildcardRandom
   [smoker]    [junit4] Completed [208/419] on J1 in 0.41s, 1 test
   [smoker]    [junit4] 
   [smoker]    [junit4] Suite: org.apache.lucene.index.Test2BPostings
   [smoker]    [junit4] IGNOR/A 0.00s J1 | Test2BPostings.test
   [smoker]    [junit4]    > Assumption #1: 'nightly' test group is disabled (@Nightly())
   [smoker]    [junit4] Completed [209/419] on J1 in 0.00s, 1 test, 1 skipped
   [smoker]    [junit4] 
   [smoker]    [junit4] Suite: org.apache.lucene.search.MultiCollectorTest
   [smoker]    [junit4] Completed [210/419] on J1 in 0.05s, 4 tests
   [smoker]    [junit4] 
   [smoker]    [junit4] Suite: org.apache.lucene.index.TestIndexWriterDelete
   [smoker]    [junit4] IGNOR/A 0.00s J2 | TestIndexWriterDelete.testApplyDeletesOnFlush
   [smoker]    [junit4]    > Assumption #1: 'nightly' test group is disabled (@Nightly())
   [smoker]    [junit4] Completed [211/419] on J2 in 13.18s, 27 tests, 1 skipped
   [smoker]    [junit4] 
   [smoker]    [junit4] Suite: org.apache.lucene.index.TestSameTokenSamePosition
   [smoker]    [junit4] Completed [212/419] on J1 in 0.07s, 2 tests
   [smoker]    [junit4] 
   [smoker]    [junit4] Suite: org.apache.lucene.index.TestPersistentSnapshotDeletionPolicy
   [smoker]    [junit4] Completed [213/419] on J0 in 2.06s, 13 tests
   [smoker]    [junit4] 
   [smoker]    [junit4] Suite: org.apache.lucene.index.TestDocumentsWriterStallControl
   [smoker]    [junit4] Completed [214/419] on J1 in 2.47s, 3 tests
   [smoker]    [junit4] 
   [smoker]    [junit4] Suite: org.apache.lucene.index.TestSegmentMerger
   [smoker]    [junit4] Completed [215/419] on J1 in 2.46s, 3 tests
   [smoker]    [junit4] 
   [smoker]    [junit4] Suite: org.apache.lucene.index.TestAtomicUpdate
   [smoker]    [junit4] Completed [216/419] on J2 in 5.16s, 1 test
   [smoker]    [junit4] 
   [smoker]    [junit4] Suite: org.apache.lucene.index.TestNorms
   [smoker]    [junit4] IGNOR/A 0.00s J2 | TestNorms.testCustomEncoder
   [smoker]    [junit4]    > Assumption #1: 'slow' test group is disabled (@Slow())
   [smoker]    [junit4] IGNOR/A 0.00s J2 | TestNorms.testMaxByteNorms
   [smoker]    [junit4]    > Assumption #1: 'slow' test group is disabled (@Slow())
   [smoker]    [junit4] Completed [217/419] on J2 in 0.00s, 2 tests, 2 skipped
   [smoker]    [junit4] 
   [smoker]    [junit4] Suite: org.apache.lucene.index.TestStressAdvance
   [smoker]    [junit4] Completed [218/419] on J0 in 7.35s, 1 test
   [smoker]    [junit4] 
   [smoker]    [junit4] Suite: org.apache.lucene.index.TestNRTReaderWithThreads
   [smoker]    [junit4] Completed [219/419] on J1 in 3.24s, 1 test
   [smoker]    [junit4] 
   [smoker]    [junit4] Suite: org.apache.lucene.index.TestMixedDocValuesUpdates
   [smoker]    [junit4] IGNOR/A 0.00s J1 | TestMixedDocValuesUpdates.testTonsOfUpdates
   [smoker]    [junit4]    > Assumption #1: 'nightly' test group is disabled (@Nightly())
   [smoker]    [junit4] Completed [220/419] on J1 in 4.21s, 4 tests, 1 skipped
   [smoker]    [junit4] 
   [smoker]    [junit4] Suite: org.apache.lucene.search.spans.TestFilterSpans
   [smoker]    [junit4] Completed [221/419] on J1 in 0.05s, 1 test
   [smoker]    [junit4] 
   [smoker]    [junit4] Suite: org.apache.lucene.search.TestPositionIncrement
   [smoker]    [junit4] Completed [222/419] on J1 in 0.17s, 2 tests
   [smoker]    [junit4] 
   [smoker]    [junit4] Suite: org.apache.lucene.search.TestMatchAllDocsQuery
   [smoker]    [junit4] Completed [223/419] on J1 in 0.19s, 2 tests
   [smoker]    [junit4] 
   [smoker]    [junit4] Suite: org.apache.lucene.util.TestVersion
   [smoker]    [junit4] Completed [224/419] on J1 in 0.18s, 11 tests
   [smoker]    [junit4] 
   [smoker]    [junit4] Suite: org.apache.lucene.search.TestPositiveScoresOnlyCollector
   [smoker]    [junit4] Completed [225/419] on J1 in 0.03s, 1 test
   [smoker]    [junit4] 
   [smoker]    [junit4] Suite: org.apache.lucene.search.TestTimeLimitingCollector
   [smoker]    [junit4] Completed [226/419] on J2 in 7.53s, 7 tests
   [smoker]    [junit4] 
   [smoker]    [junit4] Suite: org.apache.lucene.index.TestOmitNorms
   [smoker]    [junit4] Completed [227/419] on J1 in 2.45s, 5 tests
   [smoker]    [junit4] 
   [smoker]    [junit4] Suite: org.apache.lucene.index.TestTermdocPerf
   [smoker]    [junit4] Completed [228/419] on J1 in 0.03s, 1 test
   [smoker]    [junit4] 
   [smoker]    [junit4] Suite: org.apache.lucene.search.TestSearchWithThreads
   [smoker]    [junit4] Completed [229/419] on J0 in 8.09s, 1 test
   [smoker]    [junit4] 
   [smoker]    [junit4] Suite: org.apache.lucene.index.TestNeverDelete
   [smoker]    [junit4] Completed [230/419] on J2 in 3.20s, 1 test
   [smoker]    [junit4] 
   [smoker]    [junit4] Suite: org.apache.lucene.search.TestTopDocsMerge
   [smoker]    [junit4] Completed [231/419] on J0 in 3.49s, 2 tests
   [smoker]    [junit4] 
   [smoker]    [junit4] Suite: org.apache.lucene.search.TestFieldValueQuery
   [smoker]    [junit4] Completed [232/419] on J1 in 5.47s, 6 tests
   [smoker]    [junit4] 
   [smoker]    [junit4] Suite: org.apache.lucene.util.automaton.TestMinimize
   [smoker]    [junit4] Completed [233/419] on J2 in 7.75s, 3 tests
   [smoker]    [junit4] 
   [smoker]    [junit4] Suite: org.apache.lucene.index.TestIndexWriterForceMerge
   [smoker]    [junit4] Completed [234/419] on J2 in 3.69s, 4 tests
   [smoker]    [junit4] 
   [smoker]    [junit4] Suite: org.apache.lucene.index.TestIndexWriterUnicode
   [smoker]    [junit4] Completed [235/419] on J0 in 8.15s, 5 tests
   [smoker]    [junit4] 
   [smoker]    [junit4] Suite: org.apache.lucene.index.TestTieredMergePolicy
   [smoker]    [junit4] Completed [236/419] on J1 in 8.88s, 6 tests
   [smoker]    [junit4] 
   [smoker]    [junit4] Suite: org.apache.lucene.util.automaton.TestLevenshteinAutomata
   [smoker]    [junit4] Completed [237/419] on J0 in 6.03s, 4 tests
   [smoker]    [junit4] 
   [smoker]    [junit4] Suite: org.apache.lucene.codecs.perfield.TestPerFieldPostingsFormat
   [smoker]    [junit4] IGNOR/A 0.00s J2 | TestPerFieldPostingsFormat.testPostingsEnumReuse
   [smoker]    [junit4]    > Assumption #1: The MockRandom PF randomizes content on the fly, so we can't check it
   [smoker]    [junit4] IGNOR/A 0.00s J2 | TestPerFieldPostingsFormat.testMergeStability
   [smoker]    [junit4]    > Assumption #1: The MockRandom PF randomizes content on the fly, so we can't check it
   [smoker]    [junit4] IGNOR/A 0.00s J2 | TestPerFieldPostingsFormat.testRamBytesUsed
   [smoker]    [junit4]    > Assumption #1: 'slow' test group is disabled (@Slow())
   [smoker]    [junit4] Completed [238/419] on J2 in 16.21s, 24 tests, 3 skipped
   [smoker]    [junit4] 
   [smoker]    [junit4] Suite: org.apache.lucene.search.TestSimpleExplanations
   [smoker]    [junit4] Completed [239/419] on J2 in 2.78s, 68 tests
   [smoker]    [junit4] 
   [smoker]    [junit4] Suite: org.apache.lucene.index.TestDirectoryReader
   [smoker]    [junit4] Completed [240/419] on J2 in 3.52s, 24 tests
   [smoker]    [junit4] 
   [smoker]    [junit4] Suite: org.apache.lucene.index.TestTermsEnum
   [smoker]    [junit4] IGNOR/A 0.00s J1 | TestTermsEnum.testVaryingTermsPerSegment
   [smoker]    [junit4]    > Assumption #1: 'slow' test group is disabled (@Slow())
   [smoker]    [junit4] Completed [241/419] on J1 in 21.12s, 11 tests, 1 skipped
   [smoker]    [junit4] 
   [smoker]    [junit4] Suite: org.apache.lucene.search.TestPhraseQuery
   [smoker]    [junit4] Completed [242/419] on J2 in 3.73s, 21 tests
   [smoker]    [junit4] 
   [smoker]    [junit4] Suite: org.apache.lucene.util.TestWeakIdentityMap
   [smoker]    [junit4] Completed [243/419] on J0 in 21.28s, 2 tests
   [smoker]    [junit4] 
   [smoker]    [junit4] Suite: org.apache.lucene.index.TestTransactions
   [smoker]    [junit4] Completed [244/419] on J0 in 1.67s, 1 test
   [smoker]    [junit4] 
   [smoker]    [junit4] Suite: org.apache.lucene.index.TestFieldsReader
   [smoker]    [junit4] Completed [245/419] on J0 in 1.24s, 2 tests
   [smoker]    [junit4] 
   [smoker]    [junit4] Suite: org.apache.lucene.search.TestSimpleSearchEquivalence
   [smoker]    [junit4] Completed [246/419] on J0 in 1.26s, 17 tests
   [smoker]    [junit4] 
   [smoker]    [junit4] Suite: org.apache.lucene.index.TestDocValuesIndexing
   [smoker]    [junit4] Completed [247/419] on J0 in 1.19s, 34 tests
   [smoker]    [junit4] 
   [smoker]    [junit4] Suite: org.apache.lucene.store.TestHugeRamFile
   [smoker]    [junit4] Completed [248/419] on J0 in 4.59s, 1 test
   [smoker]    [junit4] 
   [smoker]    [junit4] Suite: org.apache.lucene.index.TestIndexWriterNRTIsCurrent
   [smoker]    [junit4] Completed [249/419] on J2 in 13.55s, 1 test
   [smoker]    [junit4] 
   [smoker]    [junit4] Suite: org.apache.lucene.util.TestLegacyNumericUtils
   [smoker]    [junit4] Completed [250/419] on J0 in 2.92s, 12 tests
   [smoker]    [junit4] 
   [smoker]    [junit4] Suite: org.apache.lucene.search.spans.TestSpans
   [smoker]    [junit4] Completed [251/419] on J2 in 0.78s, 26 tests
   [smoker]    [junit4] 
   [smoker]    [junit4] Suite: org.apache.lucene.index.TestBagOfPositions
   [smoker]    [junit4] Completed [252/419] on J1 in 18.76s, 1 test
   [smoker]    [junit4] 
   [smoker]    [junit4] Suite: org.apache.lucene.index.TestFlex
   [smoker]    [junit4] Completed [253/419] on J1 in 0.31s, 2 tests
   [smoker]    [junit4] 
   [smoker]    [junit4] Suite: org.apache.lucene.index.TestPostingsOffsets
   [smoker]    [junit4] Completed [254/419] on J0 in 5.82s, 13 tests
   [smoker]    [junit4] 
   [smoker]    [junit4] Suite: org.apache.lucene.index.TestMixedCodecs
   [smoker]    [junit4] Completed [255/419] on J2 in 6.94s, 1 test
   [smoker]    [junit4] 
   [smoker]    [junit4] Suite: org.apache.lucene.search.spans.TestSpanExplanations
   [smoker]    [junit4] Completed [256/419] on J0 in 1.84s, 30 tests
   [smoker]    [junit4] 
   [smoker]    [junit4] Suite: org.apache.lucene.codecs.compressing.TestFastCompressionMode
   [smoker]    [junit4] Completed [257/419] on J2 in 1.93s, 11 tests
   [smoker]    [junit4] 
   [smoker]    [junit4] Suite: org.apache.lucene.search.TestMultiPhraseQuery
   [smoker]    [junit4] Completed [258/419] on J2 in 0.49s, 17 tests, 1 skipped
   [smoker]    [junit4] 
   [smoker]    [junit4] Suite: org.apache.lucene.index.TestStressIndexing2
   [smoker]    [junit4] Completed [259/419] on J0 in 3.17s, 3 tests
   [smoker]    [junit4] 
   [smoker]    [junit4] Suite: org.apache.lucene.util.automaton.TestUTF32ToUTF8
   [smoker]    [junit4] Completed [260/419] on J1 in 9.83s, 6 tests
   [smoker]    [junit4] 
   [smoker]    [junit4] Suite: org.apache.lucene.index.TestLazyProxSkipping
   [smoker]    [junit4] Completed [261/419] on J2 in 1.71s, 2 tests
   [smoker]    [junit4] 
   [smoker]    [junit4] Suite: org.apache.lucene.index.TestParallelLeafReader
   [smoker]    [junit4] Completed [262/419] on J2 in 1.44s, 7 tests
   [smoker]    [junit4] 
   [smoker]    [junit4] Suite: org.apache.lucene.index.TestThreadedForceMerge
   [smoker]    [junit4] Completed [263/419] on J2 in 1.38s, 1 test
   [smoker]    [junit4] 
   [smoker]    [junit4] Suite: org.apache.lucene.util.automaton.TestDeterminism
   [smoker]    [junit4] Completed [264/419] on J0 in 4.38s, 2 tests
   [smoker]    [junit4] 
   [smoker]    [junit4] Suite: org.apache.lucene.index.TestStressNRT
   [smoker]    [junit4] Completed [265/419] on J2 in 2.95s, 1 test
   [smoker]    [junit4] 
   [smoker]    [junit4] Suite: org.apache.lucene.index.TestBagOfPostings
   [smoker]    [junit4] Completed [266/419] on J1 in 6.19s, 1 test
   [smoker]    [junit4] 
   [smoker]    [junit4] Suite: org.apache.lucene.index.TestOmitTf
   [smoker]    [junit4] Completed [267/419] on J1 in 1.60s, 6 tests
   [smoker]    [junit4] 
   [smoker]    [junit4] Suite: org.apache.lucene.index.TestIndexInput
   [smoker]    [junit4] Completed [268/419] on J0 in 3.34s, 2 tests
   [smoker]    [junit4] 
   [smoker]    [junit4] Suite: org.apache.lucene.index.TestForceMergeForever
   [smoker]    [junit4] Completed [269/419] on J2 in 1.75s, 1 test
   [smoker]    [junit4] 
   [smoker]    [junit4] Suite: org.apache.lucene.search.TestTermRangeQuery
   [smoker]    [junit4] Completed [270/419] on J2 in 0.17s, 7 tests
   [smoker]    [junit4] 
   [smoker]    [junit4] Suite: org.apache.lucene.search.spans.TestNearSpansOrdered
   [smoker]    [junit4] Completed [271/419] on J1 in 0.47s, 18 tests
   [smoker]    [junit4] 
   [smoker]    [junit4] Suite: org.apache.lucene.index.TestDocumentWriter
   [smoker]    [junit4] Completed [272/419] on J2 in 0.50s, 6 tests
   [smoker]    [junit4] 
   [smoker]    [junit4] Suite: org.apache.lucene.index.TestCrashCausesCorruptIndex
   [smoker]    [junit4] Completed [273/419] on J1 in 0.56s, 1 test
   [smoker]    [junit4] 
   [smoker]    [junit4] Suite: org.apache.lucene.search.TestMultiTermConstantScore
   [smoker]    [junit4] Completed [274/419] on J1 in 1.21s, 8 tests
   [smoker]    [junit4] 
   [smoker]    [junit4] Suite: org.apache.lucene.index.TestMultiFields
   [smoker]    [junit4] Completed [275/419] on J0 in 3.96s, 3 tests
   [smoker]    [junit4] 
   [smoker]    [junit4] Suite: org.apache.lucene.index.TestForTooMuchCloning
   [smoker]    [junit4] Completed [276/419] on J0 in 0.29s, 1 test
   [smoker]    [junit4] 
   [smoker]    [junit4] Suite: org.apache.lucene.search.TestFuzzyQuery
   [smoker]    [junit4] Completed [277/419] on J0 in 0.47s, 10 tests
   [smoker]    [junit4] 
   [smoker]    [junit4] Suite: org.apache.lucene.index.TestPayloads
   [smoker]    [junit4] Completed [278/419] on J0 in 0.34s, 7 tests
   [smoker]    [junit4] 
   [smoker]    [junit4] Suite: org.apache.lucene.search.similarities.TestSimilarity2
   [smoker]    [junit4] Completed [279/419] on J0 in 0.37s, 8 tests
   [smoker]    [junit4] 
   [smoker]    [junit4] Suite: org.apache.lucene.TestExternalCodecs
   [smoker]    [junit4] Completed [280/419] on J0 in 1.10s, 1 test
   [smoker]    [junit4] 
   [smoker]    [junit4] Suite: org.apache.lucene.search.TestLiveFieldValues
   [smoker]    [junit4] Completed [281/419] on J1 in 4.85s, 1 test
   [smoker]    [junit4] 
   [smoker]    [junit4] Suite: org.apache.lucene.index.TestNoDeletionPolicy
   [smoker]    [junit4] Completed [282/419] on J0 in 0.15s, 4 tests
   [smoker]    [junit4] 
   [smoker]    [junit4] Suite: org.apache.lucene.search.TestRegexpQuery
   [smoker]    [junit4] Completed [283/419] on J0 in 0.38s, 7 tests
   [smoker]    [junit4] 
   [smoker]    [junit4] Suite: org.apache.lucene.search.TestSimpleExplanationsOfNonMatches
   [smoker]    [junit4] Completed [284/419] on J1 in 0.44s, 68 tests
   [smoker]    [junit4] 
   [smoker]    [junit4] Suite: org.apache.lucene.index.TestSegmentTermEnum
   [smoker]    [junit4] Completed [285/419] on J1 in 0.05s, 2 tests
   [smoker]    [junit4] 
   [smoker]    [junit4] Suite: org.apache.lucene.index.TestUniqueTermCount
   [smoker]    [junit4] Completed [286/419] on J1 in 0.11s, 1 test
   [smoker]    [junit4] 
   [smoker]    [junit4] Suite: org.apache.lucene.search.TestComplexExplanationsOfNonMatches
   [smoker]    [junit4] Completed [287/419] on J1 in 0.13s, 21 tests
   [smoker]    [junit4] 
   [smoker]    [junit4] Suite: org.apache.lucene.index.TestIntBlockPool
   [smoker]    [junit4] Completed [288/419] on J0 in 2.19s, 2 tests
   [smoker]    [junit4] 
   [smoker]    [junit4] Suite: org.apache.lucene.search.TestSortRandom
   [smoker]    [junit4] Completed [289/419] on J1 in 1.69s, 2 tests
   [smoker]    [junit4] 
   [smoker]    [junit4] Suite: org.apache.lucene.index.TestAllFilesHaveCodecHeader
   [smoker]    [junit4] Completed [290/419] on J0 in 2.34s, 1 test
   [smoker]    [junit4] 
   [smoker]    [junit4] Suite: org.apache.lucene.document.TestDocument
   [smoker]    [junit4] Completed [291/419] on J0 in 0.09s, 12 tests
   [smoker]    [junit4] 
   [smoker]    [junit4] Suite: org.apache.lucene.index.TestMaxTermFrequency
   [smoker]    [junit4] Completed [292/419] on J0 in 0.45s, 1 test
   [smoker]    [junit4] 
   [smoker]    [junit4] Suite: org.apache.lucene.search.TestTermScorer
   [smoker]    [junit4] Completed [293/419] on J0 in 0.06s, 4 tests
   [smoker]    [junit4] 
   [smoker]    [junit4] Suite: org.apache.lucene.search.TestScorerPerf
   [smoker]    [junit4] Completed [294/419] on J2 in 13.78s, 1 test
   [smoker]    [junit4] 
   [smoker]    [junit4] Suite: org.apache.lucene.search.TestAutomatonQuery
   [smoker]    [junit4] Completed [295/419] on J1 in 4.45s, 8 tests
   [smoker]    [junit4] 
   [smoker]    [junit4] Suite: org.apache.lucene.index.TestSumDocFreq
   [smoker]    [junit4] Completed [296/419] on J2 in 0.34s, 1 test
   [smoker]    [junit4] 
   [smoker]    [junit4] Suite: org.apache.lucene.search.TestDocValuesScoring
   [smoker]    [junit4] Completed [297/419] on J2 in 0.08s, 1 test
   [smoker]    [junit4] 
   [smoker]    [junit4] Suite: org.apache.lucene.index.TestPayloadsOnVectors
   [smoker]    [junit4] Completed [298/419] on J2 in 0.38s, 3 tests
   [smoker]    [junit4] 
   [smoker]    [junit4] Suite: org.apache.lucene.search.spans.TestSpanMultiTermQueryWrapper
   [smoker]    [junit4] Completed [299/419] on J2 in 0.13s, 9 tests
   [smoker]    [junit4] 
   [smoker]    [junit4] Suite: org.apache.lucene.index.TestIndexableField
   [smoker]    [junit4] Completed [300/419] on J1 in 2.04s, 2 tests
   [smoker]    [junit4] 
   [smoker]    [junit4] Suite: org.apache.lucene.store.TestFileSwitchDirectory
   [smoker]    [junit4] IGNOR/A 0.00s J0 | TestFileSwitchDirectory.testPendingDeletions
   [smoker]    [junit4]    > Assumption #1: we can only install VirusCheckingFS on an FSDirectory
   [smoker]    [junit4] IGNOR/A 0.00s J0 | TestFileSwitchDirectory.testFsyncDoesntCreateNewFiles
   [smoker]    [junit4]    > Assumption #1: test only works for FSDirectory subclasses
   [smoker]    [junit4] Completed [301/419] on J0 in 2.60s, 46 tests, 2 skipped
   [smoker]    [junit4] 
   [smoker]    [junit4] Suite: org.apache.lucene.TestSearchForDuplicates
   [smoker]    [junit4] Completed [302/419] on J2 in 0.39s, 1 test
   [smoker]    [junit4] 
   [smoker]    [junit4] Suite: org.apache.lucene.index.TestSizeBoundedForceMerge
   [smoker]    [junit4] Completed [303/419] on J1 in 0.40s, 11 tests
   [smoker]    [junit4] 
   [smoker]    [junit4] Suite: org.apache.lucene.search.TestConstantScoreQuery
   [smoker]    [junit4] Completed [304/419] on J1 in 0.17s, 5 tests
   [smoker]    [junit4] 
   [smoker]    [junit4] Suite: org.apache.lucene.util.automaton.TestCompiledAutomaton
   [smoker]    [junit4] Completed [305/419] on J2 in 0.38s, 6 tests
   [smoker]    [junit4] 
   [smoker]    [junit4] Suite: org.apache.lucene.index.TestIndexFileDeleter
   [smoker]    [junit4] Completed [306/419] on J0 in 1.86s, 10 tests
   [smoker]    [junit4] 
   [smoker]    [junit4] Suite: org.apache.lucene.search.TestElevationComparator
   [smoker]    [junit4] Completed [307/419] on J2 in 0.99s, 1 test
   [smoker]    [junit4] 
   [smoker]    [junit4] Suite: org.apache.lucene.index.TestBinaryTerms
   [smoker]    [junit4] Completed [308/419] on J0 in 0.27s, 2 tests
   [smoker]    [junit4] 
   [smoker]    [junit4] Suite: org.apache.lucene.util.TestRecyclingIntBlockAllocator
   [smoker]    [junit4] Completed [309/419] on J2 in 0.07s, 3 tests
   [smoker]    [junit4] 
   [smoker]    [junit4] Suite: org.apache.lucene.index.TestIndexWriterConfig
   [smoker]    [junit4] Completed [310/419] on J0 in 0.04s, 8 tests
   [smoker]    [junit4] 
   [smoker]    [junit4] Suite: org.apache.lucene.search.TestDateSort
   [smoker]    [junit4] Completed [311/419] on J2 in 0.03s, 1 test
   [smoker]    [junit4] 
   [smoker]    [junit4] Suite: org.apache.lucene.search.TestSimilarity
   [smoker]    [junit4] Completed [312/419] on J0 in 0.07s, 1 test
   [smoker]    [junit4] 
   [smoker]    [junit4] Suite: org.apache.lucene.util.TestSmallFloat
   [smoker]    [junit4] Completed [313/419] on J0 in 0.13s, 2 tests
   [smoker]    [junit4] 
   [smoker]    [junit4] Suite: org.apache.lucene.search.spans.TestSpanExplanationsOfNonMatches
   [smoker]    [junit4] Completed [314/419] on J2 in 0.28s, 30 tests
   [smoker]    [junit4] 
   [smoker]    [junit4] Suite: org.apache.lucene.analysis.TestNumericTokenStream
   [smoker]    [junit4] Completed [315/419] on J0 in 0.11s, 6 tests
   [smoker]    [junit4] 
   [smoker]    [junit4] Suite: org.apache.lucene.index.TestFilterLeafReader
   [smoker]    [junit4] Completed [316/419] on J2 in 0.03s, 3 tests
   [smoker]    [junit4] 
   [smoker]    [junit4] Suite: org.apache.lucene.TestSearch
   [smoker]    [junit4] Completed [317/419] on J0 in 0.16s, 2 tests
   [smoker]    [junit4] 
   [smoker]    [junit4] Suite: org.apache.lucene.analysis.TestCachingTokenFilter
   [smoker]    [junit4] Completed [318/419] on J2 in 0.05s, 2 tests
   [smoker]    [junit4] 
   [smoker]    [junit4] Suite: org.apache.lucene.util.TestCharsRef
   [smoker]    [junit4] Completed [319/419] on J2 in 0.05s, 5 tests
   [smoker]    [junit4] 
   [smoker]    [junit4] Suite: org.apache.lucene.search.TestCachingCollector
   [smoker]    [junit4] Completed [320/419] on J2 in 0.10s, 4 tests
   [smoker]    [junit4] 
   [smoker]    [junit4] Suite: org.apache.lucene.document.TestDateTools
   [smoker]    [junit4] Completed [321/419] on J0 in 0.47s, 5 tests
   [smoker]    [junit4] 
   [smoker]    [junit4] Suite: org.apache.lucene.search.TestAutomatonQueryUnicode
   [smoker]    [junit4] Completed [322/419] on J2 in 0.22s, 1 test
   [smoker]    [junit4] 
   [smoker]    [junit4] Suite: org.apache.lucene.util.TestAttributeSource
   [smoker]    [junit4] Completed [323/419] on J0 in 0.05s, 7 tests
   [smoker]    [junit4] 
   [smoker]    [junit4] Suite: org.apache.lucene.search.TestTotalHitCountCollector
   [smoker]    [junit4] Completed [324/419] on J2 in 0.06s, 1 test
   [smoker]    [junit4] 
   [smoker]    [junit4] Suite: org.apache.lucene.util.TestRecyclingByteBlockAllocator
   [smoker]    [junit4] Completed [325/419] on J0 in 0.07s, 3 tests
   [smoker]    [junit4] 
   [smoker]    [junit4] Suite: org.apache.lucene.search.spans.TestSpanFirstQuery
   [smoker]    [junit4] Completed [326/419] on J0 in 0.17s, 1 test
   [smoker]    [junit4] 
   [smoker]    [junit4] Suite: org.apache.lucene.util.TestNamedSPILoader
   [smoker]    [junit4] Completed [327/419] on J0 in 0.06s, 3 tests
   [smoker]    [junit4] 
   [smoker]    [junit4] Suite: org.apache.lucene.index.TestIndexWriterLockRelease
   [smoker]    [junit4] Completed [328/419] on J0 in 0.04s, 1 test
   [smoker]    [junit4] 
   [smoker]    [junit4] Suite: org.apache.lucene.TestDemo
   [smoker]    [junit4] Completed [329/419] on J0 in 0.06s, 1 test
   [smoker]    [junit4] 
   [smoker]    [junit4] Suite: org.apache.lucene.in

[...truncated too long message...]

595204508888761, lon=-0.0777586651449774]], internalEdges={}, holes=[]}]}, GeoCompositeMembershipShape: {[GeoConvexPolygon: {planetmodel=PlanetModel.WGS84, points=[[lat=0.9975360448095447, lon=-1.947231901773322], [lat=1.0804215040880678, lon=-2.120999400452007], [lat=0.8759401563733757, lon=-2.0560515158834556]], internalEdges={2}, holes=[]}, GeoConcavePolygon: {planetmodel=PlanetModel.WGS84, points=[[lat=0.9975360448095447, lon=-1.947231901773322], [lat=0.8759401563733757, lon=-2.0560515158834556], [lat=1.0593274653908336, lon=-1.9878461917050225]], internalEdges={0}, holes=[]}]}]}]}
   [smoker]    [junit4]    >   explanation:
   [smoker]    [junit4]    >     target is in leaf _1(6.1.0):C20016 of full reader StandardDirectoryReader(segments:5:nrt _1(6.1.0):C20016)
   [smoker]    [junit4]    >     full BKD path to target doc:
   [smoker]    [junit4]    >       Cell(x=-1.0010902294672446 TO -0.7975667675246342 y=-1.0007728907882345 TO -0.0014295405465486804 z=-0.9977622808698339 TO -0.011972722577672528); Shape relationship = DISJOINT; Point within cell = false; Point within shape = true
   [smoker]    [junit4]    >       Cell(x=-0.7975667679908164 TO -0.6330869556787622 y=-1.0007728907882345 TO -0.0014295405465486804 z=-0.9977622808698339 TO -0.011972722577672528); Shape relationship = OVERLAPS; Point within cell = false; Point within shape = true
   [smoker]    [junit4]    >       Cell(x=-1.0010902294672446 TO -0.6330869556787622 y=-1.0007728907882345 TO -0.0014295405465486804 z=-0.01197272304385482 TO 0.35595394953475784); Shape relationship = DISJOINT; Point within cell = false; Point within shape = true
   [smoker]    [junit4]    >       Cell(x=-1.0010902294672446 TO -0.6330869556787622 y=-1.0007728907882345 TO -0.0014295405465486804 z=0.3559539490685756 TO 0.9977622920582089); Shape relationship = DISJOINT; Point within cell = false; Point within shape = true
   [smoker]    [junit4]    >       Cell(x=-0.6330869561449444 TO -0.3492819569300436 y=-1.0007728907882345 TO -0.0014295405465486804 z=-0.9977622808698339 TO -0.6956355809209895); Shape relationship = OVERLAPS; Point within cell = false; Point within shape = true
   [smoker]    [junit4]    >       Cell(x=-0.6330869561449444 TO -0.3492819569300436 y=-1.0007728907882345 TO -0.0014295405465486804 z=-0.6956355813871717 TO 0.10900276736191666); Shape relationship = DISJOINT; Point within cell = false; Point within shape = true
   [smoker]    [junit4]    >       Cell(x=-0.6330869561449444 TO -0.3492819569300436 y=-1.0007728907882345 TO -0.0014295405465486804 z=0.10900276689573439 TO 0.7189540192817846); Shape relationship = DISJOINT; Point within cell = false; Point within shape = true
   [smoker]    [junit4]    >       Cell(x=-0.6330869561449444 TO -0.3492819569300436 y=-1.0007728907882345 TO -0.0014295405465486804 z=0.7189540188156024 TO 0.9977622920582089); Shape relationship = DISJOINT; Point within cell = false; Point within shape = true
   [smoker]    [junit4]    >       Cell(x=-0.3492819573962258 TO 0.006012160982458459 y=-1.0007728907882345 TO -0.68605594687831 z=-0.9977622808698339 TO -0.0069162292381555225); Shape relationship = DISJOINT; Point within cell = false; Point within shape = true
   [smoker]    [junit4]    >       Cell(x=-0.3492819573962258 TO 0.006012160982458459 y=-0.6860559473444922 TO -0.32059454789968617 z=-0.9977622808698339 TO -0.0069162292381555225); Shape relationship = OVERLAPS; Point within cell = false; Point within shape = true
   [smoker]    [junit4]    >       Cell(x=-0.3492819573962258 TO 0.006012160982458459 y=-1.0007728907882345 TO -0.32059454789968617 z=-0.006916229704337817 TO 0.6718162758370178); Shape relationship = DISJOINT; Point within cell = false; Point within shape = true
   [smoker]    [junit4]    >       Cell(x=-0.3492819573962258 TO 0.006012160982458459 y=-1.0007728907882345 TO -0.32059454789968617 z=0.6718162753708355 TO 0.9977622920582089); Shape relationship = DISJOINT; Point within cell = true; Point within shape = true
   [smoker]    [junit4]    >     on cell Cell(x=-1.0010902294672446 TO -0.7975667675246342 y=-1.0007728907882345 TO -0.0014295405465486804 z=-0.9977622808698339 TO -0.011972722577672528); Shape relationship = DISJOINT; Point within cell = false; Point within shape = true, wrapped visitor returned CELL_OUTSIDE_QUERY  on cell Cell(x=-0.7975667679908164 TO -0.6330869556787622 y=-1.0007728907882345 TO -0.0014295405465486804 z=-0.9977622808698339 TO -0.011972722577672528); Shape relationship = OVERLAPS; Point within cell = false; Point within shape = true, wrapped visitor returned CELL_CROSSES_QUERY
   [smoker]    [junit4]    > 	at __randomizedtesting.SeedInfo.seed([AB1C87AA82F2EF89:16C2B002C3978CEF]:0)
   [smoker]    [junit4]    > 	at org.apache.lucene.spatial3d.TestGeo3DPoint.verify(TestGeo3DPoint.java:796)
   [smoker]    [junit4]    > 	at org.apache.lucene.spatial3d.TestGeo3DPoint.doTestRandom(TestGeo3DPoint.java:518)
   [smoker]    [junit4]    > 	at org.apache.lucene.spatial3d.TestGeo3DPoint.testRandomMedium(TestGeo3DPoint.java:445)
   [smoker]    [junit4]    > 	at java.lang.Thread.run(Thread.java:745)
   [smoker]    [junit4]   2> NOTE: test params are: codec=Asserting(Lucene60): {id=Lucene50(blocksize=128)}, docValues:{id=DocValuesFormat(name=Memory)}, maxPointsInLeafNode=421, maxMBSortInHeap=6.865543172299073, sim=ClassicSimilarity, locale=es-VE, timezone=Africa/Niamey
   [smoker]    [junit4]   2> NOTE: Linux 3.13.0-52-generic amd64/Oracle Corporation 1.8.0_74 (64-bit)/cpus=4,threads=1,free=292169440,total=351797248
   [smoker]    [junit4]   2> NOTE: All tests run in this JVM: [TestGeo3DPoint]
   [smoker]    [junit4] Completed [10/10 (1!)] on J2 in 26.29s, 13 tests, 1 failure, 1 skipped <<< FAILURES!
   [smoker]    [junit4] 
   [smoker]    [junit4] 
   [smoker]    [junit4] Tests with failures [seed: AB1C87AA82F2EF89]:
   [smoker]    [junit4]   - org.apache.lucene.spatial3d.TestGeo3DPoint.testRandomMedium
   [smoker]    [junit4] 
   [smoker]    [junit4] 
   [smoker]    [junit4] JVM J0:     1.14 ..     5.22 =     4.07s
   [smoker]    [junit4] JVM J1:     0.82 ..     5.00 =     4.18s
   [smoker]    [junit4] JVM J2:     0.57 ..    29.10 =    28.52s
   [smoker]    [junit4] Execution time total: 29 seconds
   [smoker]    [junit4] Tests summary: 10 suites, 45 tests, 1 failure, 1 ignored (1 assumption)
   [smoker] 
   [smoker] BUILD FAILED
   [smoker] /x1/jenkins/jenkins-slave/workspace/Lucene-Solr-SmokeRelease-6.x/lucene/build/smokeTestRelease/tmp/unpack/lucene-6.1.0/build.xml:476: The following error occurred while executing this line:
   [smoker] /x1/jenkins/jenkins-slave/workspace/Lucene-Solr-SmokeRelease-6.x/lucene/build/smokeTestRelease/tmp/unpack/lucene-6.1.0/common-build.xml:2187: The following error occurred while executing this line:
   [smoker] /x1/jenkins/jenkins-slave/workspace/Lucene-Solr-SmokeRelease-6.x/lucene/build/smokeTestRelease/tmp/unpack/lucene-6.1.0/module-build.xml:58: The following error occurred while executing this line:
   [smoker] /x1/jenkins/jenkins-slave/workspace/Lucene-Solr-SmokeRelease-6.x/lucene/build/smokeTestRelease/tmp/unpack/lucene-6.1.0/common-build.xml:1457: The following error occurred while executing this line:
   [smoker] /x1/jenkins/jenkins-slave/workspace/Lucene-Solr-SmokeRelease-6.x/lucene/build/smokeTestRelease/tmp/unpack/lucene-6.1.0/common-build.xml:1014: There were test failures: 10 suites, 45 tests, 1 failure, 1 ignored (1 assumption) [seed: AB1C87AA82F2EF89]
   [smoker] 
   [smoker] Total time: 34 minutes 46 seconds
   [smoker] 
   [smoker] 
   [smoker] Traceback (most recent call last):
   [smoker]   File "/x1/jenkins/jenkins-slave/workspace/Lucene-Solr-SmokeRelease-6.x/dev-tools/scripts/smokeTestRelease.py", line 1412, in <module>
   [smoker]     main()
   [smoker]   File "/x1/jenkins/jenkins-slave/workspace/Lucene-Solr-SmokeRelease-6.x/dev-tools/scripts/smokeTestRelease.py", line 1356, in main
   [smoker]     smokeTest(c.java, c.url, c.revision, c.version, c.tmp_dir, c.is_signed, ' '.join(c.test_args))
   [smoker]   File "/x1/jenkins/jenkins-slave/workspace/Lucene-Solr-SmokeRelease-6.x/dev-tools/scripts/smokeTestRelease.py", line 1394, in smokeTest
   [smoker]     unpackAndVerify(java, 'lucene', tmpDir, 'lucene-%s-src.tgz' % version, gitRevision, version, testArgs, baseURL)
   [smoker]   File "/x1/jenkins/jenkins-slave/workspace/Lucene-Solr-SmokeRelease-6.x/dev-tools/scripts/smokeTestRelease.py", line 590, in unpackAndVerify
   [smoker]     verifyUnpacked(java, project, artifact, unpackPath, gitRevision, version, testArgs, tmpDir, baseURL)
   [smoker]   File "/x1/jenkins/jenkins-slave/workspace/Lucene-Solr-SmokeRelease-6.x/dev-tools/scripts/smokeTestRelease.py", line 683, in verifyUnpacked
   [smoker]     java.run_java8('ant clean test %s' % testArgs, '%s/test.log' % unpackPath)
   [smoker]   File "/x1/jenkins/jenkins-slave/workspace/Lucene-Solr-SmokeRelease-6.x/dev-tools/scripts/smokeTestRelease.py", line 1180, in run_java
   [smoker]     run('%s; %s' % (cmd_prefix, cmd), logfile)
   [smoker]   File "/x1/jenkins/jenkins-slave/workspace/Lucene-Solr-SmokeRelease-6.x/dev-tools/scripts/smokeTestRelease.py", line 515, in run
   [smoker]     raise RuntimeError('command "%s" failed; see log file %s' % (command, logPath))
   [smoker] RuntimeError: command "export JAVA_HOME="/home/jenkins/jenkins-slave/tools/hudson.model.JDK/latest1.8" PATH="/home/jenkins/jenkins-slave/tools/hudson.model.JDK/latest1.8/bin:$PATH" JAVACMD="/home/jenkins/jenkins-slave/tools/hudson.model.JDK/latest1.8/bin/java"; ant clean test -Dtests.slow=false" failed; see log file /x1/jenkins/jenkins-slave/workspace/Lucene-Solr-SmokeRelease-6.x/lucene/build/smokeTestRelease/tmp/unpack/lucene-6.1.0/test.log

BUILD FAILED
/x1/jenkins/jenkins-slave/workspace/Lucene-Solr-SmokeRelease-6.x/build.xml:536: exec returned: 1

Total time: 49 minutes 55 seconds
Build step 'Invoke Ant' marked build as failure
Email was triggered for: Failure - Any
Sending email for trigger: Failure - Any




Mime
View raw message