lucene-dev mailing list archives

Site index · List index
Message view « Date » · « Thread »
Top « Date » · « Thread »
From Policeman Jenkins Server <jenk...@thetaphi.de>
Subject [JENKINS] Lucene-Solr-6.x-Solaris (64bit/jdk1.8.0) - Build # 99 - Failure!
Date Wed, 27 Apr 2016 20:49:41 GMT
Build: http://jenkins.thetaphi.de/job/Lucene-Solr-6.x-Solaris/99/
Java: 64bit/jdk1.8.0 -XX:-UseCompressedOops -XX:+UseConcMarkSweepGC

1 tests failed.
FAILED:  org.apache.solr.handler.TestReplicationHandler.doTestIndexAndConfigAliasReplication

Error Message:
[/export/home/jenkins/workspace/Lucene-Solr-6.x-Solaris/solr/build/solr-core/test/J0/temp/solr.handler.TestReplicationHandler_1ED0A6C51BD916E0-001/solr-instance-004/./collection1/data, /export/home/jenkins/workspace/Lucene-Solr-6.x-Solaris/solr/build/solr-core/test/J0/temp/solr.handler.TestReplicationHandler_1ED0A6C51BD916E0-001/solr-instance-004/./collection1/data/index.20160428050434986, /export/home/jenkins/workspace/Lucene-Solr-6.x-Solaris/solr/build/solr-core/test/J0/temp/solr.handler.TestReplicationHandler_1ED0A6C51BD916E0-001/solr-instance-004/./collection1/data/index.20160428050435137] expected:<2> but was:<3>

Stack Trace:
java.lang.AssertionError: [/export/home/jenkins/workspace/Lucene-Solr-6.x-Solaris/solr/build/solr-core/test/J0/temp/solr.handler.TestReplicationHandler_1ED0A6C51BD916E0-001/solr-instance-004/./collection1/data, /export/home/jenkins/workspace/Lucene-Solr-6.x-Solaris/solr/build/solr-core/test/J0/temp/solr.handler.TestReplicationHandler_1ED0A6C51BD916E0-001/solr-instance-004/./collection1/data/index.20160428050434986, /export/home/jenkins/workspace/Lucene-Solr-6.x-Solaris/solr/build/solr-core/test/J0/temp/solr.handler.TestReplicationHandler_1ED0A6C51BD916E0-001/solr-instance-004/./collection1/data/index.20160428050435137] expected:<2> but was:<3>
	at __randomizedtesting.SeedInfo.seed([1ED0A6C51BD916E0:E9A3489DDD31B906]:0)
	at org.junit.Assert.fail(Assert.java:93)
	at org.junit.Assert.failNotEquals(Assert.java:647)
	at org.junit.Assert.assertEquals(Assert.java:128)
	at org.junit.Assert.assertEquals(Assert.java:472)
	at org.apache.solr.handler.TestReplicationHandler.checkForSingleIndex(TestReplicationHandler.java:824)
	at org.apache.solr.handler.TestReplicationHandler.doTestIndexAndConfigAliasReplication(TestReplicationHandler.java:1254)
	at sun.reflect.NativeMethodAccessorImpl.invoke0(Native Method)
	at sun.reflect.NativeMethodAccessorImpl.invoke(NativeMethodAccessorImpl.java:62)
	at sun.reflect.DelegatingMethodAccessorImpl.invoke(DelegatingMethodAccessorImpl.java:43)
	at java.lang.reflect.Method.invoke(Method.java:498)
	at com.carrotsearch.randomizedtesting.RandomizedRunner.invoke(RandomizedRunner.java:1764)
	at com.carrotsearch.randomizedtesting.RandomizedRunner$8.evaluate(RandomizedRunner.java:871)
	at com.carrotsearch.randomizedtesting.RandomizedRunner$9.evaluate(RandomizedRunner.java:907)
	at com.carrotsearch.randomizedtesting.RandomizedRunner$10.evaluate(RandomizedRunner.java:921)
	at com.carrotsearch.randomizedtesting.rules.SystemPropertiesRestoreRule$1.evaluate(SystemPropertiesRestoreRule.java:57)
	at org.apache.lucene.util.TestRuleSetupTeardownChained$1.evaluate(TestRuleSetupTeardownChained.java:49)
	at org.apache.lucene.util.AbstractBeforeAfterRule$1.evaluate(AbstractBeforeAfterRule.java:45)
	at org.apache.lucene.util.TestRuleThreadAndTestName$1.evaluate(TestRuleThreadAndTestName.java:48)
	at org.apache.lucene.util.TestRuleIgnoreAfterMaxFailures$1.evaluate(TestRuleIgnoreAfterMaxFailures.java:64)
	at org.apache.lucene.util.TestRuleMarkFailure$1.evaluate(TestRuleMarkFailure.java:47)
	at com.carrotsearch.randomizedtesting.rules.StatementAdapter.evaluate(StatementAdapter.java:36)
	at com.carrotsearch.randomizedtesting.ThreadLeakControl$StatementRunner.run(ThreadLeakControl.java:367)
	at com.carrotsearch.randomizedtesting.ThreadLeakControl.forkTimeoutingTask(ThreadLeakControl.java:809)
	at com.carrotsearch.randomizedtesting.ThreadLeakControl$3.evaluate(ThreadLeakControl.java:460)
	at com.carrotsearch.randomizedtesting.RandomizedRunner.runSingleTest(RandomizedRunner.java:880)
	at com.carrotsearch.randomizedtesting.RandomizedRunner$5.evaluate(RandomizedRunner.java:781)
	at com.carrotsearch.randomizedtesting.RandomizedRunner$6.evaluate(RandomizedRunner.java:816)
	at com.carrotsearch.randomizedtesting.RandomizedRunner$7.evaluate(RandomizedRunner.java:827)
	at com.carrotsearch.randomizedtesting.rules.StatementAdapter.evaluate(StatementAdapter.java:36)
	at com.carrotsearch.randomizedtesting.rules.SystemPropertiesRestoreRule$1.evaluate(SystemPropertiesRestoreRule.java:57)
	at org.apache.lucene.util.AbstractBeforeAfterRule$1.evaluate(AbstractBeforeAfterRule.java:45)
	at com.carrotsearch.randomizedtesting.rules.StatementAdapter.evaluate(StatementAdapter.java:36)
	at org.apache.lucene.util.TestRuleStoreClassName$1.evaluate(TestRuleStoreClassName.java:41)
	at com.carrotsearch.randomizedtesting.rules.NoShadowingOrOverridesOnMethodsRule$1.evaluate(NoShadowingOrOverridesOnMethodsRule.java:40)
	at com.carrotsearch.randomizedtesting.rules.NoShadowingOrOverridesOnMethodsRule$1.evaluate(NoShadowingOrOverridesOnMethodsRule.java:40)
	at com.carrotsearch.randomizedtesting.rules.StatementAdapter.evaluate(StatementAdapter.java:36)
	at com.carrotsearch.randomizedtesting.rules.StatementAdapter.evaluate(StatementAdapter.java:36)
	at com.carrotsearch.randomizedtesting.rules.StatementAdapter.evaluate(StatementAdapter.java:36)
	at org.apache.lucene.util.TestRuleAssertionsRequired$1.evaluate(TestRuleAssertionsRequired.java:53)
	at org.apache.lucene.util.TestRuleMarkFailure$1.evaluate(TestRuleMarkFailure.java:47)
	at org.apache.lucene.util.TestRuleIgnoreAfterMaxFailures$1.evaluate(TestRuleIgnoreAfterMaxFailures.java:64)
	at org.apache.lucene.util.TestRuleIgnoreTestSuites$1.evaluate(TestRuleIgnoreTestSuites.java:54)
	at com.carrotsearch.randomizedtesting.rules.StatementAdapter.evaluate(StatementAdapter.java:36)
	at com.carrotsearch.randomizedtesting.ThreadLeakControl$StatementRunner.run(ThreadLeakControl.java:367)
	at java.lang.Thread.run(Thread.java:745)




Build Log:
[...truncated 11315 lines...]
   [junit4] Suite: org.apache.solr.handler.TestReplicationHandler
   [junit4]   2> Creating dataDir: /export/home/jenkins/workspace/Lucene-Solr-6.x-Solaris/solr/build/solr-core/test/J0/temp/solr.handler.TestReplicationHandler_1ED0A6C51BD916E0-001/init-core-data-001
   [junit4]   2> 2004946 INFO  (TEST-TestReplicationHandler.testRateLimitedReplication-seed#[1ED0A6C51BD916E0]) [    ] o.a.s.SolrTestCaseJ4 ###Starting testRateLimitedReplication
   [junit4]   2> 2004947 INFO  (TEST-TestReplicationHandler.testRateLimitedReplication-seed#[1ED0A6C51BD916E0]) [    ] o.a.s.SolrTestCaseJ4 Writing core.properties file to /export/home/jenkins/workspace/Lucene-Solr-6.x-Solaris/solr/build/solr-core/test/J0/temp/solr.handler.TestReplicationHandler_1ED0A6C51BD916E0-001/solr-instance-001/collection1
   [junit4]   2> 2004952 INFO  (TEST-TestReplicationHandler.testRateLimitedReplication-seed#[1ED0A6C51BD916E0]) [    ] o.e.j.s.Server jetty-9.3.8.v20160314
   [junit4]   2> 2004953 INFO  (TEST-TestReplicationHandler.testRateLimitedReplication-seed#[1ED0A6C51BD916E0]) [    ] o.e.j.s.h.ContextHandler Started o.e.j.s.ServletContextHandler@5cdc1104{/solr,null,AVAILABLE}
   [junit4]   2> 2004955 INFO  (TEST-TestReplicationHandler.testRateLimitedReplication-seed#[1ED0A6C51BD916E0]) [    ] o.e.j.s.ServerConnector Started ServerConnector@6871d7cd{HTTP/1.1,[http/1.1]}{127.0.0.1:56656}
   [junit4]   2> 2004955 INFO  (TEST-TestReplicationHandler.testRateLimitedReplication-seed#[1ED0A6C51BD916E0]) [    ] o.e.j.s.Server Started @2009324ms
   [junit4]   2> 2004955 INFO  (TEST-TestReplicationHandler.testRateLimitedReplication-seed#[1ED0A6C51BD916E0]) [    ] o.a.s.c.s.e.JettySolrRunner Jetty properties: {solr.data.dir=/export/home/jenkins/workspace/Lucene-Solr-6.x-Solaris/solr/build/solr-core/test/J0/temp/solr.handler.TestReplicationHandler_1ED0A6C51BD916E0-001/solr-instance-001/collection1/data, hostContext=/solr, hostPort=56656}
   [junit4]   2> 2004955 INFO  (TEST-TestReplicationHandler.testRateLimitedReplication-seed#[1ED0A6C51BD916E0]) [    ] o.a.s.s.SolrDispatchFilter SolrDispatchFilter.init(): sun.misc.Launcher$AppClassLoader@6d06d69c
   [junit4]   2> 2004955 INFO  (TEST-TestReplicationHandler.testRateLimitedReplication-seed#[1ED0A6C51BD916E0]) [    ] o.a.s.c.SolrResourceLoader new SolrResourceLoader for directory: '/export/home/jenkins/workspace/Lucene-Solr-6.x-Solaris/solr/build/solr-core/test/J0/temp/solr.handler.TestReplicationHandler_1ED0A6C51BD916E0-001/solr-instance-001'
   [junit4]   2> 2004955 INFO  (TEST-TestReplicationHandler.testRateLimitedReplication-seed#[1ED0A6C51BD916E0]) [    ] o.a.s.c.SolrResourceLoader JNDI not configured for solr (NoInitialContextEx)
   [junit4]   2> 2004955 INFO  (TEST-TestReplicationHandler.testRateLimitedReplication-seed#[1ED0A6C51BD916E0]) [    ] o.a.s.c.SolrResourceLoader solr home defaulted to 'solr/' (could not find system property or JNDI)
   [junit4]   2> 2004955 INFO  (TEST-TestReplicationHandler.testRateLimitedReplication-seed#[1ED0A6C51BD916E0]) [    ] o.a.s.c.SolrXmlConfig Loading container configuration from /export/home/jenkins/workspace/Lucene-Solr-6.x-Solaris/solr/build/solr-core/test/J0/temp/solr.handler.TestReplicationHandler_1ED0A6C51BD916E0-001/solr-instance-001/solr.xml
   [junit4]   2> 2004960 INFO  (TEST-TestReplicationHandler.testRateLimitedReplication-seed#[1ED0A6C51BD916E0]) [    ] o.a.s.c.CorePropertiesLocator Config-defined core root directory: /export/home/jenkins/workspace/Lucene-Solr-6.x-Solaris/solr/build/solr-core/test/J0/temp/solr.handler.TestReplicationHandler_1ED0A6C51BD916E0-001/solr-instance-001/.
   [junit4]   2> 2004960 INFO  (TEST-TestReplicationHandler.testRateLimitedReplication-seed#[1ED0A6C51BD916E0]) [    ] o.a.s.c.CoreContainer New CoreContainer 1210322125
   [junit4]   2> 2004960 INFO  (TEST-TestReplicationHandler.testRateLimitedReplication-seed#[1ED0A6C51BD916E0]) [    ] o.a.s.c.CoreContainer Loading cores into CoreContainer [instanceDir=/export/home/jenkins/workspace/Lucene-Solr-6.x-Solaris/solr/build/solr-core/test/J0/temp/solr.handler.TestReplicationHandler_1ED0A6C51BD916E0-001/solr-instance-001]
   [junit4]   2> 2004960 WARN  (TEST-TestReplicationHandler.testRateLimitedReplication-seed#[1ED0A6C51BD916E0]) [    ] o.a.s.c.CoreContainer Couldn't add files from /export/home/jenkins/workspace/Lucene-Solr-6.x-Solaris/solr/build/solr-core/test/J0/temp/solr.handler.TestReplicationHandler_1ED0A6C51BD916E0-001/solr-instance-001/lib to classpath: /export/home/jenkins/workspace/Lucene-Solr-6.x-Solaris/solr/build/solr-core/test/J0/temp/solr.handler.TestReplicationHandler_1ED0A6C51BD916E0-001/solr-instance-001/lib
   [junit4]   2> 2004961 INFO  (TEST-TestReplicationHandler.testRateLimitedReplication-seed#[1ED0A6C51BD916E0]) [    ] o.a.s.h.c.HttpShardHandlerFactory created with socketTimeout : 90000,urlScheme : ,connTimeout : 15000,maxConnectionsPerHost : 20,maxConnections : 10000,corePoolSize : 0,maximumPoolSize : 2147483647,maxThreadIdleTime : 5,sizeOfQueue : -1,fairnessPolicy : false,useRetries : false,
   [junit4]   2> 2004962 INFO  (TEST-TestReplicationHandler.testRateLimitedReplication-seed#[1ED0A6C51BD916E0]) [    ] o.a.s.u.UpdateShardHandler Creating UpdateShardHandler HTTP client with params: socketTimeout=340000&connTimeout=45000&retry=true
   [junit4]   2> 2004962 INFO  (TEST-TestReplicationHandler.testRateLimitedReplication-seed#[1ED0A6C51BD916E0]) [    ] o.a.s.l.LogWatcher SLF4J impl is org.slf4j.impl.Log4jLoggerFactory
   [junit4]   2> 2004962 INFO  (TEST-TestReplicationHandler.testRateLimitedReplication-seed#[1ED0A6C51BD916E0]) [    ] o.a.s.l.LogWatcher Registering Log Listener [Log4j (org.slf4j.impl.Log4jLoggerFactory)]
   [junit4]   2> 2004962 INFO  (TEST-TestReplicationHandler.testRateLimitedReplication-seed#[1ED0A6C51BD916E0]) [    ] o.a.s.c.CoreContainer Security conf doesn't exist. Skipping setup for authorization module.
   [junit4]   2> 2004962 INFO  (TEST-TestReplicationHandler.testRateLimitedReplication-seed#[1ED0A6C51BD916E0]) [    ] o.a.s.c.CoreContainer No authentication plugin used.
   [junit4]   2> 2004964 INFO  (TEST-TestReplicationHandler.testRateLimitedReplication-seed#[1ED0A6C51BD916E0]) [    ] o.a.s.c.CorePropertiesLocator Looking for core definitions underneath /export/home/jenkins/workspace/Lucene-Solr-6.x-Solaris/solr/build/solr-core/test/J0/temp/solr.handler.TestReplicationHandler_1ED0A6C51BD916E0-001/solr-instance-001/.
   [junit4]   2> 2004964 INFO  (TEST-TestReplicationHandler.testRateLimitedReplication-seed#[1ED0A6C51BD916E0]) [    ] o.a.s.c.CoreDescriptor Created CoreDescriptor: {name=collection1, config=solrconfig.xml, loadOnStartup=true, schema=schema.xml, configSetProperties=configsetprops.json, transient=false, dataDir=data/}
   [junit4]   2> 2004964 INFO  (TEST-TestReplicationHandler.testRateLimitedReplication-seed#[1ED0A6C51BD916E0]) [    ] o.a.s.c.CorePropertiesLocator Found core collection1 in /export/home/jenkins/workspace/Lucene-Solr-6.x-Solaris/solr/build/solr-core/test/J0/temp/solr.handler.TestReplicationHandler_1ED0A6C51BD916E0-001/solr-instance-001/./collection1
   [junit4]   2> 2004965 INFO  (TEST-TestReplicationHandler.testRateLimitedReplication-seed#[1ED0A6C51BD916E0]) [    ] o.a.s.c.CorePropertiesLocator Found 1 core definitions
   [junit4]   2> 2004965 INFO  (TEST-TestReplicationHandler.testRateLimitedReplication-seed#[1ED0A6C51BD916E0]) [    ] o.a.s.s.SolrDispatchFilter user.dir=/export/home/jenkins/workspace/Lucene-Solr-6.x-Solaris/solr/build/solr-core/test/J0
   [junit4]   2> 2004965 INFO  (TEST-TestReplicationHandler.testRateLimitedReplication-seed#[1ED0A6C51BD916E0]) [    ] o.a.s.s.SolrDispatchFilter SolrDispatchFilter.init() done
   [junit4]   2> 2004965 INFO  (coreLoadExecutor-5935-thread-1) [    ] o.a.s.c.SolrResourceLoader new SolrResourceLoader for directory: '/export/home/jenkins/workspace/Lucene-Solr-6.x-Solaris/solr/build/solr-core/test/J0/temp/solr.handler.TestReplicationHandler_1ED0A6C51BD916E0-001/solr-instance-001/collection1'
   [junit4]   2> 2004966 INFO  (coreLoadExecutor-5935-thread-1) [    ] o.a.s.c.SolrResourceLoader JNDI not configured for solr (NoInitialContextEx)
   [junit4]   2> 2004966 INFO  (coreLoadExecutor-5935-thread-1) [    ] o.a.s.c.SolrResourceLoader solr home defaulted to 'solr/' (could not find system property or JNDI)
   [junit4]   2> 2004973 INFO  (coreLoadExecutor-5935-thread-1) [    ] o.a.s.c.SolrConfig current version of requestparams : -1
   [junit4]   2> 2004975 WARN  (coreLoadExecutor-5935-thread-1) [    ] o.a.s.c.Config Beginning with Solr 5.5, <mergePolicy> is deprecated, use <mergePolicyFactory> instead.
   [junit4]   2> 2004975 INFO  (coreLoadExecutor-5935-thread-1) [    ] o.a.s.c.SolrConfig Using Lucene MatchVersion: 6.1.0
   [junit4]   2> 2004981 INFO  (coreLoadExecutor-5935-thread-1) [    ] o.a.s.c.SolrConfig Loaded SolrConfig: solrconfig.xml
   [junit4]   2> 2004984 INFO  (coreLoadExecutor-5935-thread-1) [    ] o.a.s.s.IndexSchema [collection1] Schema name=test
   [junit4]   2> 2004986 INFO  (coreLoadExecutor-5935-thread-1) [    ] o.a.s.s.IndexSchema unique key field: id
   [junit4]   2> 2004988 INFO  (coreLoadExecutor-5935-thread-1) [    ] o.a.s.c.ConfigSetProperties Did not find ConfigSet properties, assuming default properties: Can't find resource 'configsetprops.json' in classpath or '/export/home/jenkins/workspace/Lucene-Solr-6.x-Solaris/solr/build/solr-core/test/J0/temp/solr.handler.TestReplicationHandler_1ED0A6C51BD916E0-001/solr-instance-001/collection1'
   [junit4]   2> 2004988 INFO  (coreLoadExecutor-5935-thread-1) [    ] o.a.s.c.CoreContainer Creating SolrCore 'collection1' using configuration from instancedir /export/home/jenkins/workspace/Lucene-Solr-6.x-Solaris/solr/build/solr-core/test/J0/temp/solr.handler.TestReplicationHandler_1ED0A6C51BD916E0-001/solr-instance-001/./collection1
   [junit4]   2> 2004988 INFO  (coreLoadExecutor-5935-thread-1) [    x:collection1] o.a.s.c.SolrCore org.apache.solr.core.MockDirectoryFactory
   [junit4]   2> 2004988 INFO  (coreLoadExecutor-5935-thread-1) [    x:collection1] o.a.s.c.SolrCore [[collection1] ] Opening new SolrCore at [/export/home/jenkins/workspace/Lucene-Solr-6.x-Solaris/solr/build/solr-core/test/J0/temp/solr.handler.TestReplicationHandler_1ED0A6C51BD916E0-001/solr-instance-001/collection1], dataDir=[/export/home/jenkins/workspace/Lucene-Solr-6.x-Solaris/solr/build/solr-core/test/J0/temp/solr.handler.TestReplicationHandler_1ED0A6C51BD916E0-001/solr-instance-001/./collection1/data/]
   [junit4]   2> 2004988 INFO  (coreLoadExecutor-5935-thread-1) [    x:collection1] o.a.s.c.SolrCore JMX monitoring not detected for core: collection1
   [junit4]   2> 2004989 INFO  (coreLoadExecutor-5935-thread-1) [    x:collection1] o.a.s.c.CachingDirectoryFactory return new directory for /export/home/jenkins/workspace/Lucene-Solr-6.x-Solaris/solr/build/solr-core/test/J0/temp/solr.handler.TestReplicationHandler_1ED0A6C51BD916E0-001/solr-instance-001/./collection1/data
   [junit4]   2> 2004989 INFO  (coreLoadExecutor-5935-thread-1) [    x:collection1] o.a.s.c.SolrCore New index directory detected: old=null new=/export/home/jenkins/workspace/Lucene-Solr-6.x-Solaris/solr/build/solr-core/test/J0/temp/solr.handler.TestReplicationHandler_1ED0A6C51BD916E0-001/solr-instance-001/./collection1/data/index/
   [junit4]   2> 2004989 WARN  (coreLoadExecutor-5935-thread-1) [    x:collection1] o.a.s.c.SolrCore [collection1] Solr index directory '/export/home/jenkins/workspace/Lucene-Solr-6.x-Solaris/solr/build/solr-core/test/J0/temp/solr.handler.TestReplicationHandler_1ED0A6C51BD916E0-001/solr-instance-001/./collection1/data/index' doesn't exist. Creating new index...
   [junit4]   2> 2004989 INFO  (coreLoadExecutor-5935-thread-1) [    x:collection1] o.a.s.c.CachingDirectoryFactory return new directory for /export/home/jenkins/workspace/Lucene-Solr-6.x-Solaris/solr/build/solr-core/test/J0/temp/solr.handler.TestReplicationHandler_1ED0A6C51BD916E0-001/solr-instance-001/./collection1/data/index
   [junit4]   2> 2004989 INFO  (coreLoadExecutor-5935-thread-1) [    x:collection1] o.a.s.u.RandomMergePolicy RandomMergePolicy wrapping class org.apache.lucene.index.TieredMergePolicy: [TieredMergePolicy: maxMergeAtOnce=32, maxMergeAtOnceExplicit=16, maxMergedSegmentMB=38.0673828125, floorSegmentMB=0.46484375, forceMergeDeletesPctAllowed=17.18654602647173, segmentsPerTier=43.0, maxCFSSegmentSizeMB=8.796093022207999E12, noCFSRatio=1.0
   [junit4]   2> 2004989 INFO  (coreLoadExecutor-5935-thread-1) [    x:collection1] o.a.s.c.SolrDeletionPolicy SolrDeletionPolicy.onCommit: commits: num=1
   [junit4]   2> 	commit{dir=MockDirectoryWrapper(RAMDirectory@2a884d82 lockFactory=org.apache.lucene.store.SingleInstanceLockFactory@1627e2a5),segFN=segments_1,generation=1}
   [junit4]   2> 2004989 INFO  (coreLoadExecutor-5935-thread-1) [    x:collection1] o.a.s.c.SolrDeletionPolicy newest commit generation = 1
   [junit4]   2> 2004990 INFO  (OldIndexDirectoryCleanupThreadForCore-collection1) [    x:collection1] o.a.s.c.SolrCore Looking for old index directories to cleanup for core collection1 in /export/home/jenkins/workspace/Lucene-Solr-6.x-Solaris/solr/build/solr-core/test/J0/temp/solr.handler.TestReplicationHandler_1ED0A6C51BD916E0-001/solr-instance-001/./collection1/data/
   [junit4]   2> 2004991 INFO  (coreLoadExecutor-5935-thread-1) [    x:collection1] o.a.s.c.SolrCore no updateRequestProcessorChain defined as default, creating implicit default
   [junit4]   2> 2004993 INFO  (coreLoadExecutor-5935-thread-1) [    x:collection1] o.a.s.h.l.XMLLoader xsltCacheLifetimeSeconds=60
   [junit4]   2> 2004994 INFO  (coreLoadExecutor-5935-thread-1) [    x:collection1] o.a.s.h.l.XMLLoader xsltCacheLifetimeSeconds=60
   [junit4]   2> 2004995 INFO  (coreLoadExecutor-5935-thread-1) [    x:collection1] o.a.s.h.l.XMLLoader xsltCacheLifetimeSeconds=60
   [junit4]   2> 2004996 INFO  (coreLoadExecutor-5935-thread-1) [    x:collection1] o.a.s.h.l.XMLLoader xsltCacheLifetimeSeconds=60
   [junit4]   2> 2004997 INFO  (coreLoadExecutor-5935-thread-1) [    x:collection1] o.a.s.c.PluginBag requestHandler : 'lazy' created with startup=lazy 
   [junit4]   2> 2004997 INFO  (coreLoadExecutor-5935-thread-1) [    x:collection1] o.a.s.c.RequestHandlers Registered paths: /admin/mbeans,standard,lazy,/update/json/docs,/admin/luke,/export,/get,/admin/properties,/update/json,/admin/threads,/update/csv,/sql,/admin/segments,/admin/system,/replication,defaults,/config,/stream,/schema,/admin/plugins,/admin/logging,/admin/ping,/update,/admin/file
   [junit4]   2> 2004997 INFO  (coreLoadExecutor-5935-thread-1) [    x:collection1] o.a.s.c.SolrCore Using default statsCache cache: org.apache.solr.search.stats.LocalStatsCache
   [junit4]   2> 2004997 INFO  (coreLoadExecutor-5935-thread-1) [    x:collection1] o.a.s.u.CommitTracker Hard AutoCommit: disabled
   [junit4]   2> 2004998 INFO  (coreLoadExecutor-5935-thread-1) [    x:collection1] o.a.s.u.CommitTracker Soft AutoCommit: disabled
   [junit4]   2> 2004998 INFO  (coreLoadExecutor-5935-thread-1) [    x:collection1] o.a.s.u.RandomMergePolicy RandomMergePolicy wrapping class org.apache.lucene.index.TieredMergePolicy: [TieredMergePolicy: maxMergeAtOnce=49, maxMergeAtOnceExplicit=20, maxMergedSegmentMB=99.9189453125, floorSegmentMB=1.576171875, forceMergeDeletesPctAllowed=24.730955697502147, segmentsPerTier=36.0, maxCFSSegmentSizeMB=8.796093022207999E12, noCFSRatio=1.0
   [junit4]   2> 2004998 INFO  (coreLoadExecutor-5935-thread-1) [    x:collection1] o.a.s.c.SolrDeletionPolicy SolrDeletionPolicy.onInit: commits: num=1
   [junit4]   2> 	commit{dir=MockDirectoryWrapper(RAMDirectory@2a884d82 lockFactory=org.apache.lucene.store.SingleInstanceLockFactory@1627e2a5),segFN=segments_1,generation=1}
   [junit4]   2> 2004999 INFO  (coreLoadExecutor-5935-thread-1) [    x:collection1] o.a.s.c.SolrDeletionPolicy newest commit generation = 1
   [junit4]   2> 2004999 INFO  (coreLoadExecutor-5935-thread-1) [    x:collection1] o.a.s.s.SolrIndexSearcher Opening [Searcher@134f9b30[collection1] main]
   [junit4]   2> 2004999 INFO  (coreLoadExecutor-5935-thread-1) [    x:collection1] o.a.s.r.ManagedResourceStorage File-based storage initialized to use dir: /export/home/jenkins/workspace/Lucene-Solr-6.x-Solaris/solr/build/solr-core/test/J0/temp/solr.handler.TestReplicationHandler_1ED0A6C51BD916E0-001/solr-instance-001/collection1/conf
   [junit4]   2> 2004999 INFO  (coreLoadExecutor-5935-thread-1) [    x:collection1] o.a.s.r.RestManager Initializing RestManager with initArgs: {storageDir=/export/home/jenkins/workspace/Lucene-Solr-6.x-Solaris/solr/build/solr-core/test/J0/temp/solr.handler.TestReplicationHandler_1ED0A6C51BD916E0-001/solr-instance-001/collection1/conf}
   [junit4]   2> 2004999 INFO  (coreLoadExecutor-5935-thread-1) [    x:collection1] o.a.s.r.ManagedResourceStorage Reading _rest_managed.json using file:dir=/export/home/jenkins/workspace/Lucene-Solr-6.x-Solaris/solr/build/solr-core/test/J0/temp/solr.handler.TestReplicationHandler_1ED0A6C51BD916E0-001/solr-instance-001/collection1/conf
   [junit4]   2> 2004999 INFO  (coreLoadExecutor-5935-thread-1) [    x:collection1] o.a.s.r.RestManager Initializing 0 registered ManagedResources
   [junit4]   2> 2004999 INFO  (coreLoadExecutor-5935-thread-1) [    x:collection1] o.a.s.h.ReplicationHandler Replication enabled for following config files: schema.xml,xslt/dummy.xsl
   [junit4]   2> 2004999 INFO  (coreLoadExecutor-5935-thread-1) [    x:collection1] o.a.s.h.ReplicationHandler Commits will be reserved for  10000
   [junit4]   2> 2004999 INFO  (searcherExecutor-5936-thread-1-processing-x:collection1) [    x:collection1] o.a.s.c.SolrCore [collection1] Registered new searcher Searcher@134f9b30[collection1] main{ExitableDirectoryReader(UninvertingDirectoryReader())}
   [junit4]   2> 2005000 INFO  (coreLoadExecutor-5935-thread-1) [    x:collection1] o.a.s.c.CoreContainer registering core: collection1
   [junit4]   2> 2005467 INFO  (TEST-TestReplicationHandler.testRateLimitedReplication-seed#[1ED0A6C51BD916E0]) [    ] o.a.s.SolrTestCaseJ4 Writing core.properties file to /export/home/jenkins/workspace/Lucene-Solr-6.x-Solaris/solr/build/solr-core/test/J0/temp/solr.handler.TestReplicationHandler_1ED0A6C51BD916E0-001/solr-instance-002/collection1
   [junit4]   2> 2005470 INFO  (TEST-TestReplicationHandler.testRateLimitedReplication-seed#[1ED0A6C51BD916E0]) [    ] o.e.j.s.Server jetty-9.3.8.v20160314
   [junit4]   2> 2005472 INFO  (TEST-TestReplicationHandler.testRateLimitedReplication-seed#[1ED0A6C51BD916E0]) [    ] o.e.j.s.h.ContextHandler Started o.e.j.s.ServletContextHandler@fddc66f{/solr,null,AVAILABLE}
   [junit4]   2> 2005472 INFO  (TEST-TestReplicationHandler.testRateLimitedReplication-seed#[1ED0A6C51BD916E0]) [    ] o.e.j.s.ServerConnector Started ServerConnector@5e03cb4f{HTTP/1.1,[http/1.1]}{127.0.0.1:58486}
   [junit4]   2> 2005472 INFO  (TEST-TestReplicationHandler.testRateLimitedReplication-seed#[1ED0A6C51BD916E0]) [    ] o.e.j.s.Server Started @2009842ms
   [junit4]   2> 2005472 INFO  (TEST-TestReplicationHandler.testRateLimitedReplication-seed#[1ED0A6C51BD916E0]) [    ] o.a.s.c.s.e.JettySolrRunner Jetty properties: {solr.data.dir=/export/home/jenkins/workspace/Lucene-Solr-6.x-Solaris/solr/build/solr-core/test/J0/temp/solr.handler.TestReplicationHandler_1ED0A6C51BD916E0-001/solr-instance-002/collection1/data, hostContext=/solr, hostPort=58486}
   [junit4]   2> 2005472 INFO  (TEST-TestReplicationHandler.testRateLimitedReplication-seed#[1ED0A6C51BD916E0]) [    ] o.a.s.s.SolrDispatchFilter SolrDispatchFilter.init(): sun.misc.Launcher$AppClassLoader@6d06d69c
   [junit4]   2> 2005473 INFO  (TEST-TestReplicationHandler.testRateLimitedReplication-seed#[1ED0A6C51BD916E0]) [    ] o.a.s.c.SolrResourceLoader new SolrResourceLoader for directory: '/export/home/jenkins/workspace/Lucene-Solr-6.x-Solaris/solr/build/solr-core/test/J0/temp/solr.handler.TestReplicationHandler_1ED0A6C51BD916E0-001/solr-instance-002'
   [junit4]   2> 2005474 INFO  (TEST-TestReplicationHandler.testRateLimitedReplication-seed#[1ED0A6C51BD916E0]) [    ] o.a.s.c.SolrResourceLoader JNDI not configured for solr (NoInitialContextEx)
   [junit4]   2> 2005474 INFO  (TEST-TestReplicationHandler.testRateLimitedReplication-seed#[1ED0A6C51BD916E0]) [    ] o.a.s.c.SolrResourceLoader solr home defaulted to 'solr/' (could not find system property or JNDI)
   [junit4]   2> 2005474 INFO  (TEST-TestReplicationHandler.testRateLimitedReplication-seed#[1ED0A6C51BD916E0]) [    ] o.a.s.c.SolrXmlConfig Loading container configuration from /export/home/jenkins/workspace/Lucene-Solr-6.x-Solaris/solr/build/solr-core/test/J0/temp/solr.handler.TestReplicationHandler_1ED0A6C51BD916E0-001/solr-instance-002/solr.xml
   [junit4]   2> 2005477 INFO  (TEST-TestReplicationHandler.testRateLimitedReplication-seed#[1ED0A6C51BD916E0]) [    ] o.a.s.c.CorePropertiesLocator Config-defined core root directory: /export/home/jenkins/workspace/Lucene-Solr-6.x-Solaris/solr/build/solr-core/test/J0/temp/solr.handler.TestReplicationHandler_1ED0A6C51BD916E0-001/solr-instance-002/.
   [junit4]   2> 2005477 INFO  (TEST-TestReplicationHandler.testRateLimitedReplication-seed#[1ED0A6C51BD916E0]) [    ] o.a.s.c.CoreContainer New CoreContainer 696121583
   [junit4]   2> 2005477 INFO  (TEST-TestReplicationHandler.testRateLimitedReplication-seed#[1ED0A6C51BD916E0]) [    ] o.a.s.c.CoreContainer Loading cores into CoreContainer [instanceDir=/export/home/jenkins/workspace/Lucene-Solr-6.x-Solaris/solr/build/solr-core/test/J0/temp/solr.handler.TestReplicationHandler_1ED0A6C51BD916E0-001/solr-instance-002]
   [junit4]   2> 2005478 WARN  (TEST-TestReplicationHandler.testRateLimitedReplication-seed#[1ED0A6C51BD916E0]) [    ] o.a.s.c.CoreContainer Couldn't add files from /export/home/jenkins/workspace/Lucene-Solr-6.x-Solaris/solr/build/solr-core/test/J0/temp/solr.handler.TestReplicationHandler_1ED0A6C51BD916E0-001/solr-instance-002/lib to classpath: /export/home/jenkins/workspace/Lucene-Solr-6.x-Solaris/solr/build/solr-core/test/J0/temp/solr.handler.TestReplicationHandler_1ED0A6C51BD916E0-001/solr-instance-002/lib
   [junit4]   2> 2005479 INFO  (TEST-TestReplicationHandler.testRateLimitedReplication-seed#[1ED0A6C51BD916E0]) [    ] o.a.s.h.c.HttpShardHandlerFactory created with socketTimeout : 90000,urlScheme : ,connTimeout : 15000,maxConnectionsPerHost : 20,maxConnections : 10000,corePoolSize : 0,maximumPoolSize : 2147483647,maxThreadIdleTime : 5,sizeOfQueue : -1,fairnessPolicy : false,useRetries : false,
   [junit4]   2> 2005480 INFO  (TEST-TestReplicationHandler.testRateLimitedReplication-seed#[1ED0A6C51BD916E0]) [    ] o.a.s.u.UpdateShardHandler Creating UpdateShardHandler HTTP client with params: socketTimeout=340000&connTimeout=45000&retry=true
   [junit4]   2> 2005480 INFO  (TEST-TestReplicationHandler.testRateLimitedReplication-seed#[1ED0A6C51BD916E0]) [    ] o.a.s.l.LogWatcher SLF4J impl is org.slf4j.impl.Log4jLoggerFactory
   [junit4]   2> 2005480 INFO  (TEST-TestReplicationHandler.testRateLimitedReplication-seed#[1ED0A6C51BD916E0]) [    ] o.a.s.l.LogWatcher Registering Log Listener [Log4j (org.slf4j.impl.Log4jLoggerFactory)]
   [junit4]   2> 2005480 INFO  (TEST-TestReplicationHandler.testRateLimitedReplication-seed#[1ED0A6C51BD916E0]) [    ] o.a.s.c.CoreContainer Security conf doesn't exist. Skipping setup for authorization module.
   [junit4]   2> 2005480 INFO  (TEST-TestReplicationHandler.testRateLimitedReplication-seed#[1ED0A6C51BD916E0]) [    ] o.a.s.c.CoreContainer No authentication plugin used.
   [junit4]   2> 2005481 INFO  (TEST-TestReplicationHandler.testRateLimitedReplication-seed#[1ED0A6C51BD916E0]) [    ] o.a.s.c.CorePropertiesLocator Looking for core definitions underneath /export/home/jenkins/workspace/Lucene-Solr-6.x-Solaris/solr/build/solr-core/test/J0/temp/solr.handler.TestReplicationHandler_1ED0A6C51BD916E0-001/solr-instance-002/.
   [junit4]   2> 2005482 INFO  (TEST-TestReplicationHandler.testRateLimitedReplication-seed#[1ED0A6C51BD916E0]) [    ] o.a.s.c.CoreDescriptor Created CoreDescriptor: {name=collection1, config=solrconfig.xml, loadOnStartup=true, schema=schema.xml, configSetProperties=configsetprops.json, transient=false, dataDir=data/}
   [junit4]   2> 2005482 INFO  (TEST-TestReplicationHandler.testRateLimitedReplication-seed#[1ED0A6C51BD916E0]) [    ] o.a.s.c.CorePropertiesLocator Found core collection1 in /export/home/jenkins/workspace/Lucene-Solr-6.x-Solaris/solr/build/solr-core/test/J0/temp/solr.handler.TestReplicationHandler_1ED0A6C51BD916E0-001/solr-instance-002/./collection1
   [junit4]   2> 2005482 INFO  (TEST-TestReplicationHandler.testRateLimitedReplication-seed#[1ED0A6C51BD916E0]) [    ] o.a.s.c.CorePropertiesLocator Found 1 core definitions
   [junit4]   2> 2005483 INFO  (TEST-TestReplicationHandler.testRateLimitedReplication-seed#[1ED0A6C51BD916E0]) [    ] o.a.s.s.SolrDispatchFilter user.dir=/export/home/jenkins/workspace/Lucene-Solr-6.x-Solaris/solr/build/solr-core/test/J0
   [junit4]   2> 2005483 INFO  (TEST-TestReplicationHandler.testRateLimitedReplication-seed#[1ED0A6C51BD916E0]) [    ] o.a.s.s.SolrDispatchFilter SolrDispatchFilter.init() done
   [junit4]   2> 2005483 INFO  (coreLoadExecutor-5945-thread-1) [    ] o.a.s.c.SolrResourceLoader new SolrResourceLoader for directory: '/export/home/jenkins/workspace/Lucene-Solr-6.x-Solaris/solr/build/solr-core/test/J0/temp/solr.handler.TestReplicationHandler_1ED0A6C51BD916E0-001/solr-instance-002/collection1'
   [junit4]   2> 2005484 INFO  (coreLoadExecutor-5945-thread-1) [    ] o.a.s.c.SolrResourceLoader JNDI not configured for solr (NoInitialContextEx)
   [junit4]   2> 2005484 INFO  (coreLoadExecutor-5945-thread-1) [    ] o.a.s.c.SolrResourceLoader solr home defaulted to 'solr/' (could not find system property or JNDI)
   [junit4]   2> 2005488 INFO  (coreLoadExecutor-5945-thread-1) [    ] o.a.s.c.SolrConfig current version of requestparams : -1
   [junit4]   2> 2005490 WARN  (coreLoadExecutor-5945-thread-1) [    ] o.a.s.c.Config Beginning with Solr 5.5, <mergePolicy> is deprecated, use <mergePolicyFactory> instead.
   [junit4]   2> 2005491 INFO  (coreLoadExecutor-5945-thread-1) [    ] o.a.s.c.SolrConfig Using Lucene MatchVersion: 6.1.0
   [junit4]   2> 2005495 INFO  (coreLoadExecutor-5945-thread-1) [    ] o.a.s.c.SolrConfig Loaded SolrConfig: solrconfig.xml
   [junit4]   2> 2005497 INFO  (coreLoadExecutor-5945-thread-1) [    ] o.a.s.s.IndexSchema [collection1] Schema name=test
   [junit4]   2> 2005505 INFO  (coreLoadExecutor-5945-thread-1) [    ] o.a.s.s.IndexSchema unique key field: id
   [junit4]   2> 2005506 INFO  (coreLoadExecutor-5945-thread-1) [    ] o.a.s.c.ConfigSetProperties Did not find ConfigSet properties, assuming default properties: Can't find resource 'configsetprops.json' in classpath or '/export/home/jenkins/workspace/Lucene-Solr-6.x-Solaris/solr/build/solr-core/test/J0/temp/solr.handler.TestReplicationHandler_1ED0A6C51BD916E0-001/solr-instance-002/collection1'
   [junit4]   2> 2005506 INFO  (coreLoadExecutor-5945-thread-1) [    ] o.a.s.c.CoreContainer Creating SolrCore 'collection1' using configuration from instancedir /export/home/jenkins/workspace/Lucene-Solr-6.x-Solaris/solr/build/solr-core/test/J0/temp/solr.handler.TestReplicationHandler_1ED0A6C51BD916E0-001/solr-instance-002/./collection1
   [junit4]   2> 2005507 INFO  (coreLoadExecutor-5945-thread-1) [    x:collection1] o.a.s.c.SolrCore org.apache.solr.core.MockDirectoryFactory
   [junit4]   2> 2005507 INFO  (coreLoadExecutor-5945-thread-1) [    x:collection1] o.a.s.c.SolrCore [[collection1] ] Opening new SolrCore at [/export/home/jenkins/workspace/Lucene-Solr-6.x-Solaris/solr/build/solr-core/test/J0/temp/solr.handler.TestReplicationHandler_1ED0A6C51BD916E0-001/solr-instance-002/collection1], dataDir=[/export/home/jenkins/workspace/Lucene-Solr-6.x-Solaris/solr/build/solr-core/test/J0/temp/solr.handler.TestReplicationHandler_1ED0A6C51BD916E0-001/solr-instance-002/./collection1/data/]
   [junit4]   2> 2005507 INFO  (coreLoadExecutor-5945-thread-1) [    x:collection1] o.a.s.c.SolrCore JMX monitoring not detected for core: collection1
   [junit4]   2> 2005507 INFO  (coreLoadExecutor-5945-thread-1) [    x:collection1] o.a.s.c.CachingDirectoryFactory return new directory for /export/home/jenkins/workspace/Lucene-Solr-6.x-Solaris/solr/build/solr-core/test/J0/temp/solr.handler.TestReplicationHandler_1ED0A6C51BD916E0-001/solr-instance-002/./collection1/data
   [junit4]   2> 2005507 INFO  (coreLoadExecutor-5945-thread-1) [    x:collection1] o.a.s.c.SolrCore New index directory detected: old=null new=/export/home/jenkins/workspace/Lucene-Solr-6.x-Solaris/solr/build/solr-core/test/J0/temp/solr.handler.TestReplicationHandler_1ED0A6C51BD916E0-001/solr-instance-002/./collection1/data/index/
   [junit4]   2> 2005507 WARN  (coreLoadExecutor-5945-thread-1) [    x:collection1] o.a.s.c.SolrCore [collection1] Solr index directory '/export/home/jenkins/workspace/Lucene-Solr-6.x-Solaris/solr/build/solr-core/test/J0/temp/solr.handler.TestReplicationHandler_1ED0A6C51BD916E0-001/solr-instance-002/./collection1/data/index' doesn't exist. Creating new index...
   [junit4]   2> 2005507 INFO  (coreLoadExecutor-5945-thread-1) [    x:collection1] o.a.s.c.CachingDirectoryFactory return new directory for /export/home/jenkins/workspace/Lucene-Solr-6.x-Solaris/solr/build/solr-core/test/J0/temp/solr.handler.TestReplicationHandler_1ED0A6C51BD916E0-001/solr-instance-002/./collection1/data/index
   [junit4]   2> 2005507 INFO  (coreLoadExecutor-5945-thread-1) [    x:collection1] o.a.s.u.RandomMergePolicy RandomMergePolicy wrapping class org.apache.lucene.index.TieredMergePolicy: [TieredMergePolicy: maxMergeAtOnce=32, maxMergeAtOnceExplicit=16, maxMergedSegmentMB=38.0673828125, floorSegmentMB=0.46484375, forceMergeDeletesPctAllowed=17.18654602647173, segmentsPerTier=43.0, maxCFSSegmentSizeMB=8.796093022207999E12, noCFSRatio=1.0
   [junit4]   2> 2005508 INFO  (coreLoadExecutor-5945-thread-1) [    x:collection1] o.a.s.c.SolrDeletionPolicy SolrDeletionPolicy.onCommit: commits: num=1
   [junit4]   2> 	commit{dir=MockDirectoryWrapper(RAMDirectory@3c3b9817 lockFactory=org.apache.lucene.store.SingleInstanceLockFactory@4a714571),segFN=segments_1,generation=1}
   [junit4]   2> 2005508 INFO  (coreLoadExecutor-5945-thread-1) [    x:collection1] o.a.s.c.SolrDeletionPolicy newest commit generation = 1
   [junit4]   2> 2005508 INFO  (OldIndexDirectoryCleanupThreadForCore-collection1) [    x:collection1] o.a.s.c.SolrCore Looking for old index directories to cleanup for core collection1 in /export/home/jenkins/workspace/Lucene-Solr-6.x-Solaris/solr/build/solr-core/test/J0/temp/solr.handler.TestReplicationHandler_1ED0A6C51BD916E0-001/solr-instance-002/./collection1/data/
   [junit4]   2> 2005509 INFO  (coreLoadExecutor-5945-thread-1) [    x:collection1] o.a.s.c.SolrCore no updateRequestProcessorChain defined as default, creating implicit default
   [junit4]   2> 2005510 INFO  (coreLoadExecutor-5945-thread-1) [    x:collection1] o.a.s.h.l.XMLLoader xsltCacheLifetimeSeconds=60
   [junit4]   2> 2005511 INFO  (coreLoadExecutor-5945-thread-1) [    x:collection1] o.a.s.h.l.XMLLoader xsltCacheLifetimeSeconds=60
   [junit4]   2> 2005511 INFO  (coreLoadExecutor-5945-thread-1) [    x:collection1] o.a.s.h.l.XMLLoader xsltCacheLifetimeSeconds=60
   [junit4]   2> 2005512 INFO  (coreLoadExecutor-5945-thread-1) [    x:collection1] o.a.s.h.l.XMLLoader xsltCacheLifetimeSeconds=60
   [junit4]   2> 2005513 INFO  (coreLoadExecutor-5945-thread-1) [    x:collection1] o.a.s.c.PluginBag requestHandler : 'lazy' created with startup=lazy 
   [junit4]   2> 2005513 INFO  (coreLoadExecutor-5945-thread-1) [    x:collection1] o.a.s.c.RequestHandlers Registered paths: /admin/mbeans,standard,lazy,/update/json/docs,/admin/luke,/export,/get,/admin/properties,/update/json,/admin/threads,/update/csv,/sql,/admin/segments,/admin/system,/replication,defaults,/config,/stream,/schema,/admin/plugins,/admin/logging,/admin/ping,/update,/admin/file
   [junit4]   2> 2005513 INFO  (coreLoadExecutor-5945-thread-1) [    x:collection1] o.a.s.c.SolrCore Using default statsCache cache: org.apache.solr.search.stats.LocalStatsCache
   [junit4]   2> 2005514 INFO  (coreLoadExecutor-5945-thread-1) [    x:collection1] o.a.s.u.CommitTracker Hard AutoCommit: disabled
   [junit4]   2> 2005514 INFO  (coreLoadExecutor-5945-thread-1) [    x:collection1] o.a.s.u.CommitTracker Soft AutoCommit: disabled
   [junit4]   2> 2005514 INFO  (coreLoadExecutor-5945-thread-1) [    x:collection1] o.a.s.u.RandomMergePolicy RandomMergePolicy wrapping class org.apache.lucene.index.TieredMergePolicy: [TieredMergePolicy: maxMergeAtOnce=49, maxMergeAtOnceExplicit=20, maxMergedSegmentMB=99.9189453125, floorSegmentMB=1.576171875, forceMergeDeletesPctAllowed=24.730955697502147, segmentsPerTier=36.0, maxCFSSegmentSizeMB=8.796093022207999E12, noCFSRatio=1.0
   [junit4]   2> 2005514 INFO  (coreLoadExecutor-5945-thread-1) [    x:collection1] o.a.s.c.SolrDeletionPolicy SolrDeletionPolicy.onInit: commits: num=1
   [junit4]   2> 	commit{dir=MockDirectoryWrapper(RAMDirectory@3c3b9817 lockFactory=org.apache.lucene.store.SingleInstanceLockFactory@4a714571),segFN=segments_1,generation=1}
   [junit4]   2> 2005514 INFO  (coreLoadExecutor-5945-thread-1) [    x:collection1] o.a.s.c.SolrDeletionPolicy newest commit generation = 1
   [junit4]   2> 2005514 INFO  (coreLoadExecutor-5945-thread-1) [    x:collection1] o.a.s.s.SolrIndexSearcher Opening [Searcher@63e011f3[collection1] main]
   [junit4]   2> 2005514 INFO  (coreLoadExecutor-5945-thread-1) [    x:collection1] o.a.s.r.ManagedResourceStorage File-based storage initialized to use dir: /export/home/jenkins/workspace/Lucene-Solr-6.x-Solaris/solr/build/solr-core/test/J0/temp/solr.handler.TestReplicationHandler_1ED0A6C51BD916E0-001/solr-instance-002/collection1/conf
   [junit4]   2> 2005514 INFO  (coreLoadExecutor-5945-thread-1) [    x:collection1] o.a.s.r.RestManager Initializing RestManager with initArgs: {storageDir=/export/home/jenkins/workspace/Lucene-Solr-6.x-Solaris/solr/build/solr-core/test/J0/temp/solr.handler.TestReplicationHandler_1ED0A6C51BD916E0-001/solr-instance-002/collection1/conf}
   [junit4]   2> 2005514 INFO  (coreLoadExecutor-5945-thread-1) [    x:collection1] o.a.s.r.ManagedResourceStorage Reading _rest_managed.json using file:dir=/export/home/jenkins/workspace/Lucene-Solr-6.x-Solaris/solr/build/solr-core/test/J0/temp/solr.handler.TestReplicationHandler_1ED0A6C51BD916E0-001/solr-instance-002/collection1/conf
   [junit4]   2> 2005514 INFO  (coreLoadExecutor-5945-thread-1) [    x:collection1] o.a.s.r.RestManager Initializing 0 registered ManagedResources
   [junit4]   2> 2005516 INFO  (coreLoadExecutor-5945-thread-1) [    x:collection1] o.a.s.h.ReplicationHandler Poll scheduled at an interval of 1000ms
   [junit4]   2> 2005516 INFO  (searcherExecutor-5946-thread-1-processing-x:collection1) [    x:collection1] o.a.s.c.SolrCore [collection1] Registered new searcher Searcher@63e011f3[collection1] main{ExitableDirectoryReader(UninvertingDirectoryReader())}
   [junit4]   2> 2005516 INFO  (coreLoadExecutor-5945-thread-1) [    x:collection1] o.a.s.c.CoreContainer registering core: collection1
   [junit4]   2> 2005987 INFO  (qtp1158371953-13396) [    x:collection1] o.a.s.u.DirectUpdateHandler2 [collection1] REMOVING ALL DOCUMENTS FROM INDEX
   [junit4]   2> 2005987 INFO  (qtp1158371953-13396) [    x:collection1] o.a.s.u.p.LogUpdateProcessorFactory [collection1]  webapp=/solr path=/update params={wt=javabin&version=2}{deleteByQuery=*:*} 0 0
   [junit4]   2> 2005990 INFO  (qtp752642587-13413) [    x:collection1] o.a.s.u.DirectUpdateHandler2 [collection1] REMOVING ALL DOCUMENTS FROM INDEX
   [junit4]   2> 2005990 INFO  (qtp752642587-13413) [    x:collection1] o.a.s.u.p.LogUpdateProcessorFactory [collection1]  webapp=/solr path=/update params={wt=javabin&version=2}{deleteByQuery=*:*} 0 0
   [junit4]   2> 2005992 INFO  (qtp1158371953-13397) [    x:collection1] o.a.s.u.DirectUpdateHandler2 start commit{,optimize=false,openSearcher=true,waitSearcher=true,expungeDeletes=false,softCommit=false,prepareCommit=false}
   [junit4]   2> 2005992 INFO  (qtp1158371953-13397) [    x:collection1] o.a.s.c.SolrDeletionPolicy SolrDeletionPolicy.onCommit: commits: num=2
   [junit4]   2> 	commit{dir=MockDirectoryWrapper(RAMDirectory@2a884d82 lockFactory=org.apache.lucene.store.SingleInstanceLockFactory@1627e2a5),segFN=segments_1,generation=1}
   [junit4]   2> 	commit{dir=MockDirectoryWrapper(RAMDirectory@2a884d82 lockFactory=org.apache.lucene.store.SingleInstanceLockFactory@1627e2a5),segFN=segments_2,generation=2}
   [junit4]   2> 2005993 INFO  (qtp1158371953-13397) [    x:collection1] o.a.s.c.SolrDeletionPolicy newest commit generation = 2
   [junit4]   2> 2005994 INFO  (qtp1158371953-13397) [    x:collection1] o.a.s.s.SolrIndexSearcher Opening [Searcher@4ba833f6[collection1] main]
   [junit4]   2> 2005994 INFO  (qtp1158371953-13397) [    x:collection1] o.a.s.u.DirectUpdateHandler2 end_commit_flush
   [junit4]   2> 2005994 INFO  (searcherExecutor-5936-thread-1-processing-x:collection1) [    x:collection1] o.a.s.c.SolrCore [collection1] Registered new searcher Searcher@4ba833f6[collection1] main{ExitableDirectoryReader(UninvertingDirectoryReader())}
   [junit4]   2> 2005994 INFO  (qtp1158371953-13397) [    x:collection1] o.a.s.u.p.LogUpdateProcessorFactory [collection1]  webapp=/solr path=/update params={waitSearcher=true&commit=true&softCommit=false&wt=javabin&version=2}{commit=} 0 2
   [junit4]   2> 2005996 INFO  (qtp752642587-13414) [    x:collection1] o.a.s.u.DirectUpdateHandler2 start commit{,optimize=false,openSearcher=true,waitSearcher=true,expungeDeletes=false,softCommit=false,prepareCommit=false}
   [junit4]   2> 2005996 INFO  (qtp752642587-13414) [    x:collection1] o.a.s.c.SolrDeletionPolicy SolrDeletionPolicy.onCommit: commits: num=2
   [junit4]   2> 	commit{dir=MockDirectoryWrapper(RAMDirectory@3c3b9817 lockFactory=org.apache.lucene.store.SingleInstanceLockFactory@4a714571),segFN=segments_1,generation=1}
   [junit4]   2> 	commit{dir=MockDirectoryWrapper(RAMDirectory@3c3b9817 lockFactory=org.apache.lucene.store.SingleInstanceLockFactory@4a714571),segFN=segments_2,generation=2}
   [junit4]   2> 2005997 INFO  (qtp752642587-13414) [    x:collection1] o.a.s.c.SolrDeletionPolicy newest commit generation = 2
   [junit4]   2> 2005997 INFO  (qtp752642587-13414) [    x:collection1] o.a.s.s.SolrIndexSearcher Opening [Searcher@13adb643[collection1] main]
   [junit4]   2> 2005997 INFO  (qtp752642587-13414) [    x:collection1] o.a.s.u.DirectUpdateHandler2 end_commit_flush
   [junit4]   2> 2005997 INFO  (searcherExecutor-5946-thread-1-processing-x:collection1) [    x:collection1] o.a.s.c.SolrCore [collection1] Registered new searcher Searcher@13adb643[collection1] main{ExitableDirectoryReader(UninvertingDirectoryReader())}
   [junit4]   2> 2005997 INFO  (qtp752642587-13414) [    x:collection1] o.a.s.u.p.LogUpdateProcessorFactory [collection1]  webapp=/solr path=/update params={waitSearcher=true&commit=true&softCommit=false&wt=javabin&version=2}{commit=} 0 1
   [junit4]   2> 2005998 INFO  (TEST-TestReplicationHandler.testRateLimitedReplication-seed#[1ED0A6C51BD916E0]) [    ] o.e.j.s.ServerConnector Stopped ServerConnector@6871d7cd{HTTP/1.1,[http/1.1]}{127.0.0.1:0}
   [junit4]   2> 2005998 INFO  (TEST-TestReplicationHandler.testRateLimitedReplication-seed#[1ED0A6C51BD916E0]) [    ] o.a.s.c.CoreContainer Shutting down CoreContainer instance=1210322125
   [junit4]   2> 2005999 INFO  (coreCloseExecutor-5951-thread-1) [    x:collection1] o.a.s.c.SolrCore [collection1]  CLOSING SolrCore org.apache.solr.core.SolrCore@76e5fb1
   [junit4]   2> 2005999 INFO  (coreCloseExecutor-5951-thread-1) [    x:collection1] o.a.s.u.DirectUpdateHandler2 closing DirectUpdateHandler2{commits=1,autocommits=0,soft autocommits=0,optimizes=0,rollbacks=0,expungeDeletes=0,docsPending=0,adds=0,deletesById=0,deletesByQuery=0,errors=0,cumulative_adds=0,cumulative_deletesById=0,cumulative_deletesByQuery=1,cumulative_errors=0}
   [junit4]   2> 2005999 INFO  (coreCloseExecutor-5951-thread-1) [    x:collection1] o.a.s.u.SolrCoreState Closing SolrCoreState
   [junit4]   2> 2005999 INFO  (coreCloseExecutor-5951-thread-1) [    x:collection1] o.a.s.u.DefaultSolrCoreState SolrCoreState ref count has reached 0 - closing IndexWriter
   [junit4]   2> 2005999 INFO  (coreCloseExecutor-5951-thread-1) [    x:collection1] o.a.s.u.DefaultSolrCoreState closing IndexWriter with IndexWriterCloser
   [junit4]   2> 2006000 INFO  (coreCloseExecutor-5951-thread-1) [    x:collection1] o.a.s.c.SolrCore [collection1] Closing main searcher on request.
   [junit4]   2> 2006000 INFO  (coreCloseExecutor-5951-thread-1) [    x:collection1] o.a.s.c.CachingDirectoryFactory Closing MockDirectoryFactory - 2 directories currently being tracked
   [junit4]   2> 2006000 INFO  (coreCloseExecutor-5951-thread-1) [    x:collection1] o.a.s.c.CachingDirectoryFactory looking to close /export/home/jenkins/workspace/Lucene-Solr-6.x-Solaris/solr/build/solr-core/test/J0/temp/solr.handler.TestReplicationHandler_1ED0A6C51BD916E0-001/solr-instance-001/./collection1/data/index [CachedDir<<refCount=0;path=/export/home/jenkins/workspace/Lucene-Solr-6.x-Solaris/solr/build/solr-core/test/J0/temp/solr.handler.TestReplicationHandler_1ED0A6C51BD916E0-001/solr-instance-001/./collection1/data/index;done=false>>]
   [junit4]   2> 2006000 INFO  (coreCloseExecutor-5951-thread-1) [    x:collection1] o.a.s.c.CachingDirectoryFactory Closing directory, CoreContainer#isShutdown=true
   [junit4]   2> 2006000 INFO  (coreCloseExecutor-5951-thread-1) [    x:collection1] o.a.s.c.CachingDirectoryFactory Closing directory: /export/home/jenkins/workspace/Lucene-Solr-6.x-Solaris/solr/build/solr-core/test/J0/temp/solr.handler.TestReplicationHandler_1ED0A6C51BD916E0-001/solr-instance-001/./collection1/data/index
   [junit4]   2> 2006000 INFO  (coreCloseExecutor-5951-thread-1) [    x:collection1] o.a.s.c.CachingDirectoryFactory looking to close /export/home/jenkins/workspace/Lucene-Solr-6.x-Solaris/solr/build/solr-core/test/J0/temp/solr.handler.TestReplicationHandler_1ED0A6C51BD916E0-001/solr-instance-001/./collection1/data [CachedDir<<refCount=0;path=/export/home/jenkins/workspace/Lucene-Solr-6.x-Solaris/solr/build/solr-core/test/J0/temp/solr.handler.TestReplicationHandler_1ED0A6C51BD916E0-001/solr-instance-001/./collection1/data;done=false>>]
   [junit4]   2> 2006000 INFO  (coreCloseExecutor-5951-thread-1) [    x:collection1] o.a.s.c.CachingDirectoryFactory Closing directory, CoreContainer#isShutdown=true
   [junit4]   2> 2006000 INFO  (coreCloseExecutor-5951-thread-1) [    x:collection1] o.a.s.c.CachingDirectoryFactory Closing directory: /export/home/jenkins/workspace/Lucene-Solr-6.x-Solaris/solr/build/solr-core/test/J0/temp/solr.handler.TestReplicationHandler_1ED0A6C51BD916E0-001/solr-instance-001/./collection1/data
   [junit4]   2> 2006000 INFO  (TEST-TestReplicationHandler.testRateLimitedReplication-seed#[1ED0A6C51BD916E0]) [    ] o.e.j.s.h.ContextHandler Stopped o.e.j.s.ServletContextHandler@5cdc1104{/solr,null,UNAVAILABLE}
   [junit4]   2> 2006003 INFO  (TEST-TestReplicationHandler.testRateLimitedReplication-seed#[1ED0A6C51BD916E0]) [    ] o.e.j.s.ServerConnector Stopped ServerConnector@5e03cb4f{HTTP/1.1,[http/1.1]}{127.0.0.1:0}
   [junit4]   2> 2006004 INFO  (TEST-TestReplicationHandler.testRateLimitedReplication-seed#[1ED0A6C51BD916E0]) [    ] o.a.s.c.CoreContainer Shutting down CoreContainer instance=696121583
   [junit4]   2> 2006004 INFO  (coreCloseExecutor-5953-thread-1) [    x:collection1] o.a.s.c.SolrCore [collection1]  CLOSING SolrCore org.apache.solr.core.SolrCore@68d81886
   [junit4]   2> 2006005 INFO  (coreCloseExecutor-5953-thread-1) [    x:collection1] o.a.s.u.DirectUpdateHandler2 closing DirectUpdateHandler2{commits=1,autocommits=0,soft autocommits=0,optimizes=0,rollbacks=0,expungeDeletes=0,docsPending=0,adds=0,deletesById=0,deletesByQuery=0,errors=0,cumulative_adds=0,cumulative_deletesById=0,cumulative_deletesByQuery=1,cumulative_errors=0}
   [junit4]   2> 2006005 INFO  (coreCloseExecutor-5953-thread-1) [    x:collection1] o.a.s.u.SolrCoreState Closing SolrCoreState
   [junit4]   2> 2006005 INFO  (coreCloseExecutor-5953-thread-1) [    x:collection1] o.a.s.u.DefaultSolrCoreState SolrCoreState ref count has reached 0 - closing IndexWriter
   [junit4]   2> 2006005 INFO  (coreCloseExecutor-5953-thread-1) [    x:collection1] o.a.s.u.DefaultSolrCoreState closing IndexWriter with IndexWriterCloser
   [junit4]   2> 2006005 INFO  (coreCloseExecutor-5953-thread-1) [    x:collection1] o.a.s.c.SolrCore [collection1] Closing main searcher on request.
   [junit4]   2> 2006005 INFO  (coreCloseExecutor-5953-thread-1) [    x:collection1] o.a.s.c.CachingDirectoryFactory Closing MockDirectoryFactory - 2 directories currently being tracked
   [junit4]   2> 2006005 INFO  (coreCloseExecutor-5953-thread-1) [    x:collection1] o.a.s.c.CachingDirectoryFactory looking to close /export/home/jenkins/workspace/Lucene-Solr-6.x-Solaris/solr/build/solr-core/test/J0/temp/solr.handler.TestReplicationHandler_1ED0A6C51BD916E0-001/solr-instance-002/./collection1/data [CachedDir<<refCount=0;path=/export/home/jenkins/workspace/Lucene-Solr-6.x-Solaris/solr/build/solr-core/test/J0/temp/solr.handler.TestReplicationHandler_1ED0A6C51BD916E0-001/solr-instance-002/./collection1/data;done=false>>]
   [junit4]   2> 2006005 INFO  (coreCloseExecutor-5953-thread-1) [    x:collection1] o.a.s.c.CachingDirectoryFactory Closing directory, CoreContainer#isShutdown=true
   [junit4]   2> 2006005 INFO  (coreCloseExecutor-5953-thread-1) [    x:collection1] o.a.s.c.CachingDirectoryFactory Closing directory: /export/home/jenkins/workspace/Lucene-Solr-6.x-Solaris/solr/build/solr-core/test/J0/temp/solr.handler.TestReplicationHandler_1ED0A6C51BD916E0-001/solr-instance-002/./collection1/data
   [junit4]   2> 2006005 INFO  (coreCloseExecutor-5953-thread-1) [    x:collection1] o.a.s.c.CachingDirectoryFactory looking to close /export/home/jenkins/workspace/Lucene-Solr-6.x-Solaris/solr/build/solr-core/test/J0/temp/solr.handler.TestReplicationHandler_1ED0A6C51BD916E0-001/solr-instance-002/./collection1/data/index [CachedDir<<refCount=0;path=/export/home/jenkins/workspace/Lucene-Solr-6.x-Solaris/solr/build/solr-core/test/J0/temp/solr.handler.TestReplicationHandler_1ED0A6C51BD916E0-001/solr-instance-002/./collection1/data/index;done=false>>]
   [junit4]   2> 2006005 INFO  (coreCloseExecutor-5953-thread-1) [    x:collection1] o.a.s.c.CachingDirectoryFactory Closing directory, CoreContainer#isShutdown=true
   [junit4]   2> 2006005 INFO  (coreCloseExecutor-5953-thread-1) [    x:collection1] o.a.s.c.CachingDirectoryFactory Closing directory: /export/home/jenkins/workspace/Lucene-Solr-6.x-Solaris/solr/build/solr-core/test/J0/temp/solr.handler.TestReplicationHandler_1ED0A6C51BD916E0-001/solr-instance-002/./collection1/data/index
   [junit4]   2> 2006006 INFO  (TEST-TestReplicationHandler.testRateLimitedReplication-seed#[1ED0A6C51BD916E0]) [    ] o.e.j.s.h.ContextHandler Stopped o.e.j.s.ServletContextHandler@fddc66f{/solr,null,UNAVAILABLE}
   [junit4]   2> 2006010 INFO  (TEST-TestReplicationHandler.testRateLimitedReplication-seed#[1ED0A6C51BD916E0]) [    ] o.e.j.s.Server jetty-9.3.8.v20160314
   [junit4]   2> 2006011 INFO  (TEST-TestReplicationHandler.testRateLimitedReplication-seed#[1ED0A6C51BD916E0]) [    ] o.e.j.s.h.ContextHandler Started o.e.j.s.ServletContextHandler@72865940{/solr,null,AVAILABLE}
   [junit4]   2> 2006012 INFO  (TEST-TestReplicationHandler.testRateLimitedReplication-seed#[1ED0A6C51BD916E0]) [    ] o.e.j.s.ServerConnector Started ServerConnector@3d4ed3f1{HTTP/1.1,[http/1.1]}{127.0.0.1:47757}
   [junit4]   2> 2006012 INFO  (TEST-TestReplicationHandler.testRateLimitedReplication-seed#[1ED0A6C51BD916E0]) [    ] o.e.j.s.Server Started @2010381ms
   [junit4]   2> 2006012 INFO  (TEST-TestReplicationHandler.testRateLimitedReplication-seed#[1ED0A6C51BD916E0]) [    ] o.a.s.c.s.e.JettySolrRunner Jetty properties: {solr.data.dir=/export/home/jenkins/workspace/Lucene-Solr-6.x-Solaris/solr/build/solr-core/test/J0/temp/solr.handler.TestReplicationHandler_1ED0A6C51BD916E0-001/solr-instance-001/collection1/data, hostContext=/solr, hostPort=47757}
   [junit4]   2> 2006012 INFO  (TEST-TestReplicationHandler.testRateLimitedReplication-seed#[1ED0A6C51BD916E0]) [    ] o.a.s.s.SolrDispatchFilter SolrDispatchFilter.init(): sun.misc.Launcher$AppClassLoader@6d06d69c
   [junit4]   2> 2006012 INFO  (TEST-TestReplicationHandler.testRateLimitedReplication-seed#[1ED0A6C51BD916E0]) [    ] o.a.s.c.SolrResourceLoader new SolrResourceLoader for directory: '/export/home/jenkins/workspace/Lucene-Solr-6.x-Solaris/solr/build/solr-core/test/J0/temp/solr.handler.TestReplicationHandler_1ED0A6C51BD916E0-001/solr-instance-001'
   [junit4]   2> 2006013 INFO  (TEST-TestReplicationHandler.testRateLimitedReplication-seed#[1ED0A6C51BD916E0]) [    ] o.a.s.c.SolrResourceLoader JNDI not configured for solr (NoInitialContextEx)
   [junit4]   2> 2006013 INFO  (TEST-TestReplicationHandler.testRateLimitedReplication-seed#[1ED0A6C51BD916E0]) [    ] o.a.s.c.SolrResourceLoader solr home defaulted to 'solr/' (could not find system property or JNDI)
   [junit4]   2> 2006013 INFO  (TEST-TestReplicationHandler.testRateLimitedReplication-seed#[1ED0A6C51BD916E0]) [    ] o.a.s.c.SolrXmlConfig Loading container configuration from /export/home/jenkins/workspace/Lucene-Solr-6.x-Solaris/solr/build/solr-core/test/J0/temp/solr.handler.TestReplicationHandler_1ED0A6C51BD916E0-001/solr-instance-001/solr.xml
   [junit4]   2> 2006016 INFO  (TEST-TestReplicationHandler.testRateLimitedReplication-seed#[1ED0A6C51BD916E0]) [    ] o.a.s.c.CorePropertiesLocator Config-defined core root directory: /export/home/jenkins/workspace/Lucene-Solr-6.x-Solaris/solr/build/solr-core/test/J0/temp/solr.handler.TestReplicationHandler_1ED0A6C51BD916E0-001/solr-instance-001/.
   [junit4]   2> 2006016 INFO  (TEST-TestReplicationHandler.testRateLimitedReplication-seed#[1ED0A6C51BD916E0]) [    ] o.a.s.c.CoreContainer New CoreContainer 1054349820
   [junit4]   2> 2006016 INFO  (TEST-TestReplicationHandler.testRateLimitedReplication-seed#[1ED0A6C51BD916E0]) [    ] o.a.s.c.CoreContainer Loading cores into CoreContainer [instanceDir=/export/home/jenkins/workspace/Lucene-Solr-6.x-Solaris/solr/build/solr-core/test/J0/temp/solr.handler.TestReplicationHandler_1ED0A6C51BD916E0-001/solr-instance-001]
   [junit4]   2> 2006016 WARN  (TEST-TestReplicationHandler.testRateLimitedReplication-seed#[1ED0A6C51BD916E0]) [    ] o.a.s.c.CoreContainer Couldn't add files from /export/home/jenkins/workspace/Lucene-Solr-6.x-Solaris/solr/build/solr-core/test/J0/temp/solr.handler.TestReplicationHandler_1ED0A6C51BD916E0-001/solr-instance-001/lib to classpath: /export/home/jenkins/workspace/Lucene-Solr-6.x-Solaris/solr/build/solr-core/test/J0/temp/solr.handler.TestReplicationHandler_1ED0A6C51BD916E0-001/solr-instance-001/lib
   [junit4]   2> 2006017 INFO  (TEST-TestReplicationHandler.testRateLimitedReplication-seed#[1ED0A6C51BD916E0]) [    ] o.a.s.h.c.HttpShardHandlerFactory created with socketTimeout : 90000,urlScheme : ,connTimeout : 15000,maxConnectionsPerHost : 20,maxConnections : 10000,corePoolSize : 0,maximumPoolSize : 2147483647,maxThreadIdleTime : 5,sizeOfQueue : -1,fairnessPolicy : false,useRetries : false,
   [junit4]   2> 2006017 INFO  (TEST-TestReplicationHandler.testRateLimitedReplication-seed#[1ED0A6C51BD916E0]) [    ] o.a.s.u.UpdateShardHandler Creating UpdateShardHandler HTTP client with params: socketTimeout=340000&connTimeout=45000&retry=true
   [junit4]   2> 2006018 INFO  (TEST-TestReplicationHandler.testRateLimitedReplication-seed#[1ED0A6C51BD916E0]) [    ] o.a.s.l.LogWatcher SLF4J impl is org.slf4j.impl.Log4jLoggerFactory
   [junit4]   2> 2006018 INFO  (TEST-TestReplicationHandler.testRateLimitedReplication-seed#[1ED0A6C51BD916E0]) [    ] o.a.s.l.LogWatcher Registering Log Listener [Log4j (org.slf4j.impl.Log4jLoggerFactory)]
   [junit4]   2> 2006018 INFO  (TEST-TestReplicationHandler.testRateLimitedReplication-seed#[1ED0A6C51BD916E0]) [    ] o.a.s.c.CoreContainer Security conf doesn't exist. Skipping setup for authorization module.
   [junit4]   2> 2006018 INFO  (TEST-TestReplicationHandler.testRateLimitedReplication-seed#[1ED0A6C51BD916E0]) [    ] o.a.s.c.CoreContainer No authentication plugin used.
   [junit4]   2> 2006019 INFO  (TEST-TestReplicationHandler.testRateLimitedReplication-seed#[1ED0A6C51BD916E0]) [    ] o.a.s.c.CorePropertiesLocator Looking for core definitions underneath /export/home/jenkins/workspace/Lucene-Solr-6.x-Solaris/solr/build/solr-core/test/J0/temp/solr.handler.TestReplicationHandler_1ED0A6C51BD916E0-001/solr-instance-001/.
   [junit4]   2> 2006019 INFO  (TEST-TestReplicationHandler.testRateLimitedReplication-seed#[1ED0A6C51BD916E0]) [    ] o.a.s.c.CoreDescriptor Created CoreDescriptor: {name=collection1, config=solrconfig.xml, loadOnStartup=true, schema=schema.xml, configSetProperties=configsetprops.json, transient=false, dataDir=data/}
   [junit4]   2> 2006019 INFO  (TEST-TestReplicationHandler.testRateLimitedReplication-seed#[1ED0A6C51BD916E0]) [    ] o.a.s.c.CorePropertiesLocator Found core collection1 in /export/home/jenkins/workspace/Lucene-Solr-6.x-Solaris/solr/build/solr-core/test/J0/temp/solr.handler.TestReplicationHandler_1ED0A6C51BD916E0-001/solr-instance-001/./collection1
   [junit4]   2> 2006020 INFO  (TEST-TestReplicationHandler.testRateLimitedReplication-seed#[1ED0A6C51BD916E0]) [    ] o.a.s.c.CorePropertiesLocator Found 1 core definitions
   [junit4]   2> 2006020 INFO  (TEST-TestReplicationHandler.testRateLimitedReplication-seed#[1ED0A6C51BD916E0]) [    ] o.a.s.s.SolrDispatchFilter user.dir=/export/home/jenkins/workspace/Lucene-Solr-6.x-Solaris/solr/build/solr-core/test/J0
   [junit4]   2> 2006020 INFO  (TEST-TestReplicationHandler.testRateLimitedReplication-seed#[1ED0A6C51BD916E0]) [    ] o.a.s.s.SolrDispatchFilter SolrDispatchFilter.init() done
   [junit4]   2> 2006020 INFO  (coreLoadExecutor-5960-thread-1) [    ] o.a.s.c.SolrResourceLoader new SolrResourceLoader for directory: '/export/home/jenkins/workspace/Lucene-Solr-6.x-Solaris/solr/build/solr-core/test/J0/temp/solr.handler.TestReplicationHandler_1ED0A6C51BD916E0-001/solr-instance-001/collection1'
   [junit4]   2> 2006021 INFO  (coreLoadExecutor-5960-thread-1) [    ] o.a.s.c.SolrResourceLoader JNDI not configured for solr (NoInitialContextEx)
   [junit4]   2> 2006021 INFO  (coreLoadExecutor-5960-thread-1) [    ] o.a.s.c.SolrResourceLoader solr home defaulted to 'solr/' (could not find system property or JNDI)
   [junit4]   2> 2006025 INFO  (coreLoadExecutor-5960-thread-1) [    ] o.a.s.c.SolrConfig current version of requestparams : -1
   [junit4]   2> 2006027 WARN  (coreLoadExecutor-5960-thread-1) [    ] o.a.s.c.Config Beginning with Solr 5.5, <mergePolicy> is deprecated, use <mergePolicyFactory> instead.
   [junit4]   2> 2006028 INFO  (coreLoadExecutor-5960-thread-1) [    ] o.a.s.c.SolrConfig Using Lucene MatchVersion: 6.1.0
   [junit4]   2> 2006033 INFO  (coreLoadExecutor-5960-thread-1) [    ] o.a.s.c.SolrConfig Loaded SolrConfig: solrconfig.xml
   [junit4]   2> 2006036 INFO  (coreLoadExecutor-5960-thread-1) [    ] o.a.s.s.IndexSchema [collection1] Schema name=test
   [junit4]   2> 2006037 INFO  (coreLoadExecutor-5960-thread-1) [    ] o.a.s.s.IndexSchema unique key field: id
   [junit4]   2> 2006038 INFO  (coreLoadExecutor-5960-thread-1) [    ] o.a.s.c.ConfigSetProperties Did not find ConfigSet properties, assuming default properties: Can't find resource 'configsetprops.json' in classpath or '/export/home/jenkins/workspace/Lucene-Solr-6.x-Solaris/solr/build/solr-core/test/J0/temp/solr.handler.TestReplicationHandler_1ED0A6C51BD916E0-001/solr-instance-001/collection1'
   [junit4]   2> 2006038 INFO  (coreLoadExecutor-5960-thread-1) [    ] o.a.s.c.CoreContainer Creating SolrCore 'collection1' using configuration from instancedir /export/home/jenkins/workspace/Lucene-Solr-6.x-Solaris/solr/build/solr-core/test/J0/temp/solr.handler.TestReplicationHandler_1ED0A6C51BD916E0-001/solr-instance-001/./collection1
   [junit4]   2> 2006038 INFO  (coreLoadExecutor-5960-thread-1) [    x:collection1] o.a.s.c.SolrCore solr.NRTCachingDirectoryFactory
   [junit4]   2> 2006038 INFO  (coreLoadExecutor-5960-thread-1) [    x:collection1] o.a.s.c.SolrCore [[collection1] ] Opening new SolrCore at [/export/home/jenkins/workspace/Lucene-Solr-6.x-Solaris/solr/build/solr-core/test/J0/temp/solr.handler.TestReplicationHandler_1ED0A6C51BD916E0-001/solr-instance-001/collection1], dataDir=[/export/home/jenkins/workspace/Lucene-Solr-6.x-Solaris/solr/build/solr-core/test/J0/temp/solr.handler.TestReplicationHandler_1ED0A6C51BD916E0-001/solr-instance-001/./collection1/data/]
   [junit4]   2> 2006038 INFO  (coreLoadExecutor-5960-thread-1) [    x:collection1] o.a.s.c.SolrCore JMX monitoring not detected for core: collection1
   [junit4]   2> 2006039 INFO  (coreLoadExecutor-5960-thread-1) [    x:collection1] o.a.s.c.CachingDirectoryFactory return new directory for /export/home/jenkins/workspace/Lucene-Solr-6.x-Solaris/solr/build/solr-core/test/J0/temp/solr.handler.TestReplicationHandler_1ED0A6C51BD916E0-001/solr-instance-001/collection1/data
   [junit4]   2> 2006039 INFO  (coreLoadExecutor-5960-thread-1) [    x:collection1] o.a.s.c.SolrCore New index directory detected: old=null new=/export/home/jenkins/workspace/Lucene-Solr-6.x-Solaris/solr/build/solr-core/test/J0/temp/solr.handler.TestReplicationHandler_1ED0A6C51BD916E0-001/solr-instance-001/./collection1/data/index/
   [junit4]   2> 2006039 WARN  (coreLoadExecutor-5960-thread-1) [    x:collection1] o.a.s.c.SolrCore [collection1] Solr index directory '/export/home/jenkins/workspace/Lucene-Solr-6.x-Solaris/solr/build/solr-core/test/J0/temp/solr.handler.TestReplicationHandler_1ED0A6C51BD916E0-001/solr-instance-001/./collection1/data/index' doesn't exist. Creating new index...
   [junit4]   2> 2006039 INFO  (coreLoadExecutor-5960-thread-1) [    x:collection1] o.a.s.c.CachingDirectoryFactory return new directory for /export/home/jenkins/workspace/Lucene-Solr-6.x-Solaris/solr/build/solr-core/test/J0/temp/solr.handler.TestReplicationHandler_1ED0A6C51BD916E0-001/solr-instance-001/collection1/data/index
   [junit4]   2> 2006040 INFO  (coreLoadExecutor-5960-thread-1) [    x:collection1] o.a.s.u.RandomMergePolicy RandomMergePolicy wrapping class org.apache.lucene.index.LogDocMergePolicy: [LogDocMergePolicy: minMergeSize=1000, mergeFactor=45, maxMergeSize=9223372036854775807, maxMergeSizeForForcedMerge=9223372036854775807, calibrateSizeByDeletes=true, maxMergeDocs=2147483647, maxCFSSegmentSizeMB=8.796093022207999E12, noCFSRatio=0.11485148166270989]
   [junit4]   2> 2006071 INFO  (coreLoadExecutor-5960-thread-1) [    x:collection1] o.a.s.c.SolrDeletionPolicy SolrDeletionPolicy.onCommit: commits: num=1
   [junit4]   2> 	commit{dir=NRTCachingDirectory(MMapDirectory@/export/home/jenkins/workspace/Lucene-Solr-6.x-Solaris/solr/build/solr-core/test/J0/temp/solr.handler.TestReplicationHandler_1ED0A6C51BD916E0-001/solr-instance-001/collection1/data/index lockFactory=org.apache.lucene.store.SingleInstanceLockFactory@381c4a7b; maxCacheMB=48.0 maxMergeSizeMB=4.0),segFN=segments_1,generation=1}
   [junit4]   2> 2006071 INFO  (coreLoadExecutor-5960-thread-1) [    x:collection1] o.a.s.c.SolrDeletionPolicy newest commit generation = 1
   [junit4]   2> 2006072 INFO  (OldIndexDirectoryCleanupThreadForCore-collection1) [    x:collection1] o.a.s.c.SolrCore Looking for old index directories to cleanup for core collection1 in /export/home/jenkins/workspace/Lucene-Solr-6.x-Solaris/solr/build/solr-core/test/J0/temp/solr.handler.TestReplicationHandler_1ED0A6C51BD916E0-001/solr-instance-001/./collection1/data/
   [junit4]   2> 2006073 INFO  (coreLoadExecutor-5960-thread-1) [    x:collection1] o.a.s.c.SolrCore no updateRequestProcessorChain defined as default, creating implicit default
   [junit4]   2> 2006074 INFO  (coreLoadExecutor-5960-thread-1) [    x:collection1] o.a.s.h.l.XMLLoader xsltCacheLifetimeSeconds=60
   [junit4]   2> 2006075 INFO  (coreLoadExecutor-5960-thread-1) [    x:collection1] o.a.s.h.l.XMLLoader xsltCacheLifetimeSeconds=60
   [junit4]   2> 2006075 INFO  (coreLoadExecutor-5960-thread-1) [    x:collection1] o.a.s.h.l.XMLLoader xsltCacheLifetimeSeconds=60
   [junit4]   2> 2006076 INFO  (coreLoadExecutor-5960-thread-1) [    x:collection1] o.a.s.h.l.XMLLoader xsltCacheLifetimeSeconds=60
   [junit4]   2> 2006077 INFO  (coreLoadExecutor-5960-thread-1) [    x:collection1] o.a.s.c.PluginBag requestHandler : 'lazy' created with startup=lazy 
   [junit4]   2> 2006077 INFO  (coreLoadExecutor-5960-thread-1) [    x:collection1] o.a.s.c.RequestHandlers Registered paths: /admin/mbeans,standard,lazy,/update/json/docs,/admin/luke,/export,/get,/admin/properties,/update/json,/admin/threads,/update/csv,/sql,/admin/segments,/admin/system,/replication,defaults,/config,/stream,/schema,/admin/plugins,/admin/logging,/admin/ping,/update,/admin/file
   [junit4]   2> 2006077 INFO  (coreLoadExecutor-5960-thread-1) [    x:collection1] o.a.s.c.SolrCore Using default statsCache cache: org.apache.solr.search.stats.LocalStatsCache
   [junit4]   2> 2006078 INFO  (coreLoadExecutor-5960-thread-1) [    x:collection1] o.a.s.u.CommitTracker Hard AutoCommit: disabled
   [junit4]   2> 2006078 INFO  (coreLoadExecutor-5960-thread-1) [    x:collection1] o.a.s.u.CommitTracker Soft AutoCommit: disabled
   [junit4]   2> 2006078 INFO  (coreLoadExecutor-5960-thread-1) [    x:collection1] o.a.s.u.RandomMergePolicy RandomMergePolicy wrapping class org.apache.lucene.index.AlcoholicMergePolicy: [AlcoholicMergePolicy: minMergeSize=0, mergeFactor=10, maxMergeSize=1804776262, maxMergeSizeForForcedMerge=9223372036854775807, calibrateSizeByDeletes=true, maxMergeDocs=2147483647, maxCFSSegmentSizeMB=8.796093022207999E12, noCFSRatio=0.1]
   [junit4]   2> 2006079 INFO  (coreLoadExecutor-5960-thread-1) [    x:collection1] o.a.s.c.SolrDeletionPolicy SolrDeletionPolicy.onInit: commits: num=1
   [junit4]   2> 	commit{dir=NRTCachingDirectory(MMapDirectory@/export/home/jenkins/workspace/Lucene-Solr-6.x-Solaris/solr/build/solr-core/test/J0/temp/solr.handler.TestReplicationHandler_1ED0A6C51BD916E0-001/solr-instance-001/collection1/data/index lockFactory=org.apache.lucene.store.SingleInstanceLockFactory@381c4a7b; maxCacheMB=48.0 maxMergeSizeMB=4.0),segFN=segments_1,generation=1}
   [junit4]   2> 2006079 INFO  (coreLoadExecutor-5960-thread-1) [    x:collection1] o.a.s.c.SolrDeletionPolicy newest commit generation = 1
   [junit4]   2> 2006079 INFO  (coreLoadExecutor-5960-thread-1) [    x:collection1] o.a.s.s.SolrIndexSearcher Opening [Searcher@5d19d6b7[collection1] main]
   [junit4]   2> 2006079 INFO  (coreLoadExecutor-5960-thread-1) [    x:collection1] o.a.s.r.ManagedResourceStorage File-based storage initialized to use dir: /export/home/jenkins/workspace/Lucene-Solr-6.x-Solaris/solr/build/solr-core/test/J0/temp/solr.handler.TestReplicationHandler_1ED0A6C51BD916E0-001/solr-instance-001/collection1/conf
   [junit4]   2> 2006079 INFO  (coreLoadExecutor-5960-thread-1) [    x:collection1] o.a.s.r.RestManager Initializing RestManager with initArgs: {storageDir=/export/home/jenkins/workspace/Lucene-Solr-6.x-Solaris/solr/build/solr-core/test/J0/temp/solr.handler.TestReplicationHandler_1ED0A6C51BD916E0-001/solr-instance-001/collection1/conf}
   [junit4]   2> 2006079 INFO  (coreLoadExecutor-5960-thread-1) [    x:collection1] o.a.s.r.ManagedResourceStorage Reading _rest_managed.json using file:dir=/export/home/jenkins/workspace/Lucene-Solr-6.x-Solaris/solr/build/solr-core/test/J0/temp/solr.handler.TestReplicationHandler_1ED0A6C51BD916E0-001/solr-instance-001/collection1/conf
   [junit4]   2> 2006080 INFO  (coreLoadExecutor-5960-thread-1) [    x:collection1] o.a.s.r.RestManager Initializing 0 registered ManagedResources
   [junit4]   2> 2006080 INFO  (coreLoadExecutor-5960-thread-1) [    x:collection1] o.a.s.h.ReplicationHandler Commits will be reserved for  10000
   [junit4]   2> 2006080 INFO  (coreLoadExecutor-5960-thread-1) [    x:collection1] o.a.s.c.CoreContainer registering core: collection1
   [junit4]   2> 2006080 INFO  (searcherExecutor-5961-thread-1-processing-x:collection1) [    x:collection1] o.a.s.c.SolrCore [collection1] Registered new searcher Searcher@5d19d6b7[collection1] main{ExitableDirectoryReader(UninvertingDirectoryReader())}
   [junit4]   2> 2006526 INFO  (qtp1242714504-13435) [    x:collection1] o.a.s.u.p.LogUpdateProcessorFactory [collection1]  webapp=/solr path=/update params={wt=javabin&version=2}{add=[0]} 0 0
   [junit4]   2> 2006528 INFO  (qtp1242714504-13436) [    x:collection1] o.a.s.u.p.LogUpdateProcessorFactory [collection1]  webapp=/solr path=/update params={wt=javabin&version=2}{add=[1]} 0 0
   [junit4]   2> 2006530 INFO  (qtp1242714504-13437) [    x:collection1] o.a.s.u.p.LogUpdateProcessorFactory [collection1]  webapp=/solr path=/update params={wt=javabin&version=2}{add=[2]} 0 0
   [junit4]   2> 2006533 INFO  (qtp1242714504-13438) [    x:collection1] o.a.s.u.p.LogUpdateProcessorFactory [collection1]  webapp=/solr path=/update params={wt=javabin&version=2}{add=[3]} 0 1
   [junit4]   2> 2006535 INFO  (qtp1242714504-13439) [    x:collection1] o.a.s.u.p.LogUpdateProcessorFactory [collection1]  webapp=/solr path=/update params={wt=javabin&version=2}{add=[4]} 0 0
   [junit4]   2> 2006538 INFO  (qtp1242714504-13439) [    x:collection1] o.a.s.u.p.LogUpdateProcessorFactory [collection1]  webapp=/solr path=/update params={wt=javabin&version=2}{add=[5]} 0 0
   [junit4]   2> 2006540 INFO  (qtp1242714504-13433) [    x:collection1] o.a.s.u.p.LogUpdateProcessorFactory [collection1]  webapp=/solr path=/update params={wt=javabin&version=2}{add=[6]} 0 0
   [junit4]   2> 2006541 INFO  (qtp1242714504-13435) [    x:collection1] o.a.s.u.p.LogUpdateProcessorFactory [collection1]  webapp=/solr path=/update params={wt=javabin&version=2}{add=[7]} 0 0
   [junit4]   2> 2006543 INFO  (qtp1242714504-13436) [    x:collection1] o.a.s.u.p.LogUpdateProcessorFactory [collection1]  webapp=/solr path=/update params={wt=javabin&version=2}{add=[8]} 0 0
   [junit4]   2> 2006546 INFO  (qtp1242714504-13437) [    x:collection1] o.a.s.u.p.LogUpdateProcessorFactory [collection1]  webapp=/solr path=/update params={wt=javabin&version=2}{add=[9]} 0 0
   [junit4]   2> 2006549 INFO  (qtp1242714504-13438) [    x:collection1] o.a.s.u.p.LogUpdateProcessorFactory [collection1]  webapp=/solr path=/update params={wt=javabin&version=2}{add=[10]} 0 0
   [junit4]   2> 2006550 INFO  (qtp1242714504-13440) [    x:collection1] o.a.s.u.p.LogUpdateProcessorFactory [collection1]  webapp=/solr path=/update params={wt=javabin&version=2}{add=[11]} 0 0
   [junit4]   2> 2006552 INFO  (qtp1242714504-13439) [    x:collection1] o.a.s.u.p.LogUpdateProcessorFactory [collection1]  webapp=/solr path=/update params={wt=javabin&version=2}{add=[12]} 0 0
   [junit4]   2> 2006554 INFO  (qtp1242714504-13433) [    x:collection1] o.a.s.u.p.LogUpdateProcessorFactory [collection1]  webapp=/solr path=/update params={wt=javabin&version=2}{add=[13]} 0 0
   [junit4]   2> 2006556 INFO  (qtp1242714504-13435) [    x:collection1] o.a.s.u.p.LogUpdateProcessorFactory [collection1]  webapp=/solr path=/update params={wt=javabin&version=2}{add=[14]} 0 0
   [junit4]   2> 2006558 INFO  (qtp1242714504-13436) [    x:collection1] o.a.s.u.p.LogUpdateProcessorFactory [collection1]  webapp=/solr path=/update params={wt=javabin&version=2}{add=[15]} 0 0
   [junit4]   2> 2006560 INFO  (qtp1242714504-13437) [    x:collection1] o.a.s.u.p.LogUpdateProcessorFactory [collection1]  webapp=/solr path=/update params={wt=javabin&version=2}{add=[16]} 0 0
   [junit4]   2> 2006562 INFO  (qtp1242714504-13438) [    x:collection1] o.a.s.u.p.LogUpdateProcessorFactory [collection1]  webapp=/solr path=/update params={wt=javabin&version=2}{add=[17]} 0 0
   [junit4]   2> 2006563 INFO  (qtp1242714504-13440) [    x:collection1] o.a.s.u.p.LogUpdateProcessorFactory [collection1]  webapp=/solr path=/update params={wt=javabin&version=2}{add=[18]} 0 0
   [junit4]   2> 2006565 INFO  (qtp1242714504-13439) [    x:collection1] o.a.s.u.p.LogUpdateProcessorFactory [collection1]  webapp=/solr path=/update params={wt=javabin&version=2}{add=[19]} 0 0
   [junit4]   2> 2006566 INFO  (qtp1242714504-13433) [    x:collection1] o.a.s.u.p.LogUpdateProcessorFactory [collection1]  webapp=/solr path=/update params={wt=javabin&version=2}{add=[20]} 0 0
   [junit4]   2> 2006568 INFO  (qtp1242714504-13435) [    x:collection1] o.a.s.u.p.LogUpdateProcessorFactory [collection1]  webapp=/solr path=/update params={wt=javabin&version=2}{add=[21]} 0 0
   [junit4]   2> 2006571 INFO  (qtp1242714504-13436) [    x:collection1] o.a.s.u.p.LogUpdateProcessorFactory [collection1]  webapp=/solr path=/update params={wt=javabin&version=2}{add=[22]} 0 1
   [junit4]   2> 2006573 INFO  (qtp1242714504-13437) [    x:collection1] o.a.s.u.p.LogUpdateProcessorFactory [collection1]  webapp=/solr path=/update params={wt=javabin&version=2}{add=[23]} 0 0
   [junit4]   2> 2006575 INFO  (qtp1242714504-13438) [    x:collection1] o.a.s.u.p.LogUpdateProcessorFactory [collection1]  webapp=/solr path=/update params={wt=javabin&version=2}{add=[24]} 0 0
   [junit4]   2> 2006577 INFO  (qtp1242714504-13440) [    x:collection1] o.a.s.u.p.LogUpdateProcessorFactory [collection1]  webapp=/solr path=/update params={wt=javabin&version=2}{add=[25]} 0 0
   [junit4]   2> 2006579 INFO  (qtp1242714504-13440) [    x:collection1] o.a.s.u.p.LogUpdateProcessorFactory [collection1]  webapp=/solr path=/update params={wt=javabin&version=2}{add=[26]} 0 0
   [junit4]   2> 2006581 INFO  (qtp1242714504-13433) [    x:collection1] o.a.s.u.p.LogUpdateProcessorFactory [collection1]  webapp=/solr path=/update params={wt=javabin&version=2}{add=[27]} 0 0
   [junit4]   2> 2006583 INFO  (qtp1242714504-13435) [    x:collection1] o.a.s.u.p.LogUpdateProcessorFactory [collection1]  webapp=/solr path=/update params={wt=javabin&version=2}{add=[28]} 0 0
   [junit4]   2> 2006587 INFO  (qtp1242714504-13436) [    x:collection1] o.a.s.u.p.LogUpdateProcessorFactory [collection1]  webapp=/solr path=/update params={wt=javabin&version=2}{add=[29]} 0 0
   [junit4]   2> 2006588 INFO  (qtp1242714504-13437) [    x:collection1] o.a.s.u.p.LogUpdateProcessorFactory [collection1]  webapp=/solr path=/update params={wt=javabin&version=2}{add=[30]} 0 0
   [junit4]   2> 2006590 INFO  (qtp1242714504-13438) [    x:collection1] o.a.s.u.p.LogUpdateProcessorFactory [collection1]  webapp=/solr path=/update params={wt=javabin&version=2}{add=[31]} 0 0
   [junit4]   2> 2006592 INFO  (qtp1242714504-13439) [    x:collection1] o.a.s.u.p.LogUpdateProcessorFactory [collection1]  webapp=/solr path=/update params={wt=javabin&version=2}{add=[32]} 0 0
   [junit4]   2> 2006593 INFO  (qtp1242714504-13440) [    x:collection1] o.a.s.u.p.LogUpdateProcessorFactory [collection1]  webapp=/solr path=/update params={wt=javabin&version=2}{add=[33]} 0 0
   [junit4]   2> 2006595 INFO  (qtp1242714504-13433) [    x:collection1] o.a.s.u.p.LogUpdateProcessorFactory [collection1]  webapp=/solr path=/update params={wt=javabin&version=2}{add=[34]} 0 0
   [junit4]   2> 2006598 INFO  (qtp1242714504-13435) [    x:collection1] o.a.s.u.p.LogUpdateProcessorFactory [collection1]  webapp=/solr path=/update params={wt=javabin&version=2}{add=[35]} 0 0
   [junit4]   2> 2006599 INFO  (qtp1242714504-13436) [    x:collection1] o.a.s.u.p.LogUpdateProcessorFactory [collection1]  webapp=/solr path=/update params={wt=javabin&version=2}{add=[36]} 0 0
   [junit4]   2> 2006601 INFO  (qtp1242714504-13437) [    x:collection1] o.a.s.u.p.LogUpdateProcessorFactory [collection1]  webapp=/solr path=/update params={wt=javabin&version=2}{add=[37]} 0 0
   [junit4]   2> 2006602 INFO  (qtp1242714504-13438) [    x:collection1] o.a.s.u.p.LogUpdateProcessorFactory [collection1]  webapp=/solr path=/update params={wt=javabin&version=2}{add=[38]} 0 0
   [junit4]   2> 2006604 INFO  (qtp1242714504-13439) [    x:collection1] o.a.s.u.p.LogUpdateProcessorFactory [collection1]  webapp=/solr path=/update params={wt=javabin&version=2}{add=[39]} 0 0
   [junit4]   2> 2006606 INFO  (qtp1242714504-13440) [    x:collection1] o.a.s.u.p.LogUpdateProcessorFactory [collection1]  webapp=/solr path=/update params={wt=javabin&version=2}{add=[40]} 0 0
   [junit4]   2> 2006607 INFO  (qtp1242714504-13433) [    x:collection1] o.a.s.u.p.LogUpdateProcessorFactory [collection1]  webapp=/solr path=/update params={wt=javabin&version=2}{add=[41]} 0 0
   [junit4]   2> 2006610 INFO  (qtp1242714504-13435) [    x:collection1] o.a.s.u.p.LogUpdateProcessorFactory [collection1]  webapp=/solr path=/update params={wt=javabin&version=2}{add=[42]} 0 0
   [junit4]   2> 2006611 INFO  (qtp1242714504-13436) [    x:collection1] o.a.s.u.p.LogUpdateProcessorFactory [collection1]  webapp=/solr path=/update params={wt=javabin&version=2}{add=[43]} 0 0
   [junit4]   2> 2006613 INFO  (qtp1242714504-13437) [    x:collection1] o.a.s.u.p.LogUpdateProcessorFactory [collection1]  webapp=/solr path=/update params={wt=javabin&version=2}{add=[44]} 0 0
   [junit4]   2> 2006615 INFO  (qtp1242714504-13438) [    x:collection1] o.a.s.u.p.LogUpdateProcessorFactory [collection1]  webapp=/solr path=/update params={wt=javabin&version=2}{add=[45]} 0 0
   [junit4]   2> 2006616 INFO  (qtp1242714504-13439) [    x:collection1] o.a.s.u.p.LogUpdateProcessorFactory [collection1]  webapp=/solr path=/update params={wt=javabin&version=2}{add=[46]} 0 0
   [junit4]   2> 2006620 INFO  (qtp1242714504-13440) [    x:collection1] o.a.s.u.p.LogUpdateProcessorFactory [collection1]  webapp=/solr path=/update params={wt=javabin&version=2}{add=[47]} 0 1
   [junit4]   2> 2006624 INFO  (qtp1242714504-13433) [    x:collection1] o.a.s.u.p.LogUpdateProcessorFactory [collection1]  webapp=/solr path=/update params={wt=javabin&version=2}{add=[48]} 0 0
   [junit4]   2> 2006625 INFO  (qtp1242714504-13435) [    x:collection1] o.a.s.u.p.LogUpdateProcessorFactory [collection1]  webapp=/solr path=/update params={wt=javabin&version=2}{add=[49]} 0 0
   [junit4]   2> 2006628 INFO  (qtp1242714504-13436) [    x:collection1] o.a.s.u.p.LogUpdateProcessorFactory [collection1]  webapp=/solr path=/update params={wt=javabin&version=2}{add=[50]} 0 0
   [junit4]   2> 2006630 INFO  (qtp1242714504-13437) [    x:collection1] o.a.s.u.p.LogUpdateProcessorFactory [collection1]  webapp=/solr path=/update params={wt=javabin&version=2}{add=[51]} 0 0
   [junit4]   2> 2006633 INFO  (qtp1242714504-13437) [    x:collection1] o.a.s.u.p.LogUpdateProcessorFactory [collection1]  webapp=/solr path=/update params={wt=javabin&version=2}{add=[52]} 0 1
   [junit4]   2> 2006635 INFO  (qtp1242714504-13439) [    x:collection1] o.a.s.u.DirectUpdateHandler2 start commit{,optimize=false,openSearcher=true,waitSearcher=true,expungeDeletes=false,softCommit=false,prepareCommit=false}
   [junit4]   2> 2006712 INFO  (qtp1242714504-13439) [    x:collection1] o.a.s.c.SolrDeletionPolicy SolrDeletionPolicy.onCommit: commits: num=2
   [junit4]   2> 	commit{dir=NRTCachingDirectory(MMapDirectory@/export/home/jenkins/workspace/Lucene-Solr-6.x-Solaris/solr/build/solr-core/test/J0/temp/solr.handler.TestReplicationHandler_1ED0A6C51BD916E0-001/solr-instance-001/collection1/data/index lockFactory=org.apache.lucene.store.SingleInstanceLockFactory@381c4a7b; maxCacheMB=48.0 maxMergeSizeMB=4.0),segFN=segments_1,generation=1}
   [junit4]   2> 	commit{dir=NRTCachingDirectory(MMapDirectory@/export/home/jenkins/workspace/Lucene-Solr-6.x-Solaris/solr/build/solr-core/test/J0/temp/solr.handler.TestReplicationHandler_1ED0A6C51BD916E0-001/solr-instance-001/collection1/data/index lockFactory=org.apache.lucene.store.SingleInstanceLockFactory@381c4a7b; maxCacheMB=48.0 maxMergeSizeMB=4.0),segFN=segments_2,generation=2}
   [junit4]   2> 2006713 INFO  (qtp1242714504-13439) [    x:collection1] o.a.s.c.SolrDeletionPolicy newest commit generation = 2
   [junit4]   2> 2006715 INFO  (qtp1242714504-13439) [    x:collection1] o.a.s.s.SolrIndexSearcher Opening [Searcher@40d538c4[collection1] main]
   [junit4]   2> 2006716 INFO  (qtp1242714504-13439) [    x:collection1] o.a.s.u.DirectUpdateHandler2 end_commit_flush
   [junit4]   2> 2006716 INFO  (searcherExecutor-5961-thread-1-processing-x:collection1) [    x:collection1] o.a.s.c.SolrCore [collection1] Registered new searcher Searcher@40d538c4[collection1] main{ExitableDirectoryReader(UninvertingDirectoryReader(Uninverting(_0(6.1.0):c53)))}
   [junit4]   2> 2006716 INFO  (qtp1242714504-13439) [    x:collection1] o.a.s.u.p.LogUpdateProcessorFactory [collection1]  webapp=/solr path=/update params={waitSearcher=true&commit=true&softCommit=false&wt=javabin&version=2}{commit=} 0 80
   [junit4]   2> 2006717 INFO  (TEST-TestReplicationHandler.testRateLimitedReplication-seed#[1ED0A6C51BD916E0]) [    ] o.e.j.s.ServerConnector Stopped ServerConnector@3d4ed3f1{HTTP/1.1,[http/1.1]}{127.0.0.1:0}
   [junit4]   2> 2006717 INFO  (TEST-TestReplicationHandler.testRateLimitedReplication-seed#[1ED0A6C51BD916E0]) [    ] o.a.s.c.CoreContainer Shutting down CoreContainer instance=1054349820
   [junit4]   2> 2006718 INFO  (coreCloseExecutor-5965-thread-1) [    x:collection1] o.a.s.c.SolrCore [collection1]  CLOSING SolrCore org.apache.solr.core.SolrCore@3f6a1a69
   [junit4]   2> 2006718 INFO  (coreCloseExecutor-5965-thread-1) [    x:collection1] o.a.s.u.DirectUpdateHandler2 closing DirectUpdateHandler2{commits=1,autocommits=0,soft autocommits=0,optimizes=0,rollbacks=0,expungeDeletes=0,docsPending=0,adds=0,deletesById=0,deletesByQuery=0,errors=0,cumulative_adds=53,cumulative_deletesById=0,cumulative_deletesByQuery=0,cumulative_errors=0}
   [junit4]   2> 2006718 INFO  (coreCloseExecutor-5965-thread-1) [    x:collection1] o.a.s.u.SolrCoreState Closing SolrCoreState
   [junit4]   2> 2006718 INFO  (coreCloseExecutor-5965-thread-1) [    x:collection1] o.a.s.u.DefaultSolrCoreState SolrCoreState ref count has reached 0 - closing IndexWriter
   [junit4]   2> 2006718 INFO  (coreCloseExecutor-5965-thread-1) [    x:collection1] o.a.s.u.DefaultSolrCoreState closing IndexWriter with IndexWriterCloser
   [junit4]   2> 2006719 INFO  (coreCloseExecutor-5965-thread-1) [    x:collection1] o.a.s.c.SolrCore [collection1] Closing main searcher on request.
   [junit4]   2> 2006719 INFO  (coreCloseExecutor-5965-thread-1) [    x:collection1] o.a.s.c.CachingDirectoryFactory Closing NRTCachingDirectoryFactory - 2 directories currently being tracked
   [junit4]   2> 2006719 INFO  (coreCloseExecutor-5965-thread-1) [    x:collection1] o.a.s.c.CachingDirectoryFactory looking to close /export/home/jenkins/workspace/Lucene-Solr-6.x-Solaris/solr/build/solr-core/test/J0/temp/solr.handler.TestReplicationHandler_1ED0A6C51BD916E0-001/solr-instance-001/collection1/data [CachedDir<<refCount=0;path=/export/home/jenkins/workspace/Lucene-Solr-6.x-Solaris/solr/build/solr-core/test/J0/temp/solr.handler.TestReplicationHandler_1ED0A6C51BD916E0-001/solr-instance-001/collection1/data;done=false>>]
   [junit4]   2> 2006719 INFO  (coreCloseExecutor-5965-thread-1) [    x:collection1] o.a.s.c.CachingDirectoryFactory Closing directory, CoreContainer#isShutdown=true
   [junit4]   2> 2006719 INFO  (coreCloseExecutor-5965-thread-1) [    x:collection1] o.a.s.c.CachingDirectoryFactory Closing directory: /export/home/jenkins/workspace/Lucene-Solr-6.x-Solaris/solr/build/solr-core/test/J0/temp/solr.handler.TestReplicationHandler_1ED0A6C51BD916E0-001/solr-instance-001/collection1/data
   [junit4]   2> 2006719 INFO  (coreCloseExecutor-5965-thread-1) [    x:collection1] o.a.s.c.CachingDirectoryFactory looking to close /export/home/jenkins/workspace/Lucene-Solr-6.x-Solaris/solr/build/solr-core/test/J0/temp/solr.handler.TestReplicationHandler_1ED0A6C51BD916E0-001/solr-instance-001/collection1/data/index [CachedDir<<refCount=0;path=/export/home/jenkins/workspace/Lucene-Solr-6.x-Solaris/solr/build/solr-core/test/J0/temp/solr.handler.TestReplicationHandler_1ED0A6C51BD916E0-001/solr-instance-001/collection1/data/index;done=false>>]
   [junit4]   2> 2006719 INFO  (coreCloseExecutor-5965-thread-1) [    x:collection1] o.a.s.c.CachingDirectoryFactory Closing directory, CoreContainer#isShutdown=true
   [junit4]   2> 2006719 INFO  (coreCloseExecutor-5965-thread-1) [    x:collection1] o.a.s.c.CachingDirectoryFactory Closing directory: /export/home/jenkins/workspace/Lucene-Solr-6.x-Solaris/solr/build/solr-core/test/J0/temp/solr.handler.TestReplicationHandler_1ED0A6C51BD916E0-001/solr-instance-001/collection1/data/index
   [junit4]   2> 2006720 INFO  (TEST-TestReplicationHandler.testRateLimitedReplication-seed#[1ED0A6C51BD916E0]) [    ] o.e.j.s.h.ContextHandler Stopped o.e.j.s.ServletContextHandler@72865940{/solr,null,UNAVAILABLE}
   [junit4]   2> 2006722 INFO  (TEST-TestReplicationHandler.testRateLimitedReplication-seed#[1ED0A6C51BD916E0]) [    ] o.e.j.s.Server jetty-9.3.8.v20160314
   [junit4]   2> 2006723 INFO  (TEST-TestReplicationHandler.testRateLimitedReplication-seed#[1ED0A6C51BD916E0]) [    ] o.e.j.s.h.ContextHandler Started o.e.j.s.ServletContextHandler@6d0e46be{/solr,null,AVAILABLE}
   [junit4]   2> 2006723 INFO  (TEST-TestReplicationHandler.testRateLimitedReplication-seed#[1ED0A6C51BD916E0]) [    ] o.e.j.s.ServerConnector Started ServerConnector@685021ed{HTTP/1.1,[http/1.1]}{127.0.0.1:44095}
   [junit4]   2> 2006723 INFO  (TEST-TestReplicationHandler.testRateLimitedReplication-seed#[1ED0A6C51BD916E0]) [    ] o.e.j.s.Server Started @2011093ms
   [junit4]   2> 2006723 INFO  (TEST-TestReplicationHandler.testRateLimitedReplication-seed#[1ED0A6C51BD916E0]) [    ] o.a.s.c.s.e.JettySolrRunner Jetty properties: {solr.data.dir=/export/home/jenkins/workspace/Lucene-Solr-6.x-Solaris/solr/build/solr-core/test/J0/temp/solr.handler.TestReplicationHandler_1ED0A6C51BD916E0-001/solr-instance-001/collection1/data, hostContext=/solr, hostPort=44095}
   [junit4]   2> 2006724 INFO  (TEST-TestReplicationHandler.testRateLimitedReplication-seed#[1ED0A6C51BD916E0]) [    ] o.a.s.s.SolrDispatchFilter SolrDispatchFilter.init(): sun.misc.Launcher$AppClassLoader@6d06d69c
   [junit4]   2> 2006724 INFO  (TEST-TestReplicationHandler.testRateLimitedReplication-seed#[1ED0A6C51BD916E0]) [    ] o.a.s.c.SolrResourceLoader new SolrResourceLoader for directory: '/export/home/jenkins/workspace/Lucene-Solr-6.x-Solaris/solr/build/solr-core/test/J0/temp/solr.handler.TestReplicationHandler_1ED0A6C51BD916E0-001/solr-instance-001'
   [junit4]   2> 2006724 INFO  (TEST-TestReplicationHandler.testRateLimitedReplication-seed#[1ED0A6C51BD916E0]) [    ] o.a.s.c.SolrResourceLoader JNDI not configured for solr (NoInitialContextEx)
   [junit4]   2> 2006724 INFO  (TEST-TestReplicationHandler.testRateLimitedReplication-seed#[1ED0A6C51BD916E0]) [    ] o.a.s.c.SolrResourceLoader solr home defaulted to 'solr/' (could not find system property or JNDI)
   [junit4]   2> 2006725 INFO  (TEST-TestReplicationHandler.testRateLimitedReplication-seed#[1ED0A6C51BD916E0]) [    ] o.a.s.c.SolrXmlConfig Loading container configuration from /export/home/jenkins/workspace/Lucene-Solr-6.x-Solaris/solr/build/solr-core/test/J0/temp/solr.handler.TestReplicationHandler_1ED0A6C51BD916E0-001/solr-instance-001/solr.xml
   [junit4]   2> 2006727 INFO  (TEST-TestReplicationHandler.testRateLimitedReplication-seed#[1ED0A6C51BD916E0]) [    ] o.a.s.c.CorePropertiesLocator Config-defined core root directory: /export/home/jenkins/workspace/Lucene-Solr-6.x-Solaris/solr/build/solr-core/test/J0/temp/solr.handler.TestReplicationHandler_1ED0A6C51BD916E0-001/solr-instance-001/.
   [junit4]   2> 2006728 INFO  (TEST-TestReplicationHandler.testRateLimitedReplication-seed#[1ED0A6C51BD916E0]) [    ] o.a.s.c.CoreContainer New CoreContainer 2087270330
   [junit4]   2> 2006728 INFO  (TEST-TestReplicationHandler.testRateLimitedReplication-seed#[1ED0A6C51BD916E0]) [    ] o.a.s.c.CoreContainer Loading cores into CoreContainer [instanceDir=/export/hom

[...truncated too long message...]

collection1/data
   [junit4]   2> 2087534 INFO  (TEST-TestReplicationHandler.doTestReplicateAfterStartup-seed#[1ED0A6C51BD916E0]) [    ] o.e.j.s.h.ContextHandler Stopped o.e.j.s.ServletContextHandler@52cc6845{/solr,null,UNAVAILABLE}
   [junit4]   2> 2087536 INFO  (TEST-TestReplicationHandler.doTestReplicateAfterStartup-seed#[1ED0A6C51BD916E0]) [    ] o.e.j.s.ServerConnector Stopped ServerConnector@3d9708c5{HTTP/1.1,[http/1.1]}{127.0.0.1:0}
   [junit4]   2> 2087537 INFO  (TEST-TestReplicationHandler.doTestReplicateAfterStartup-seed#[1ED0A6C51BD916E0]) [    ] o.a.s.c.CoreContainer Shutting down CoreContainer instance=195231720
   [junit4]   2> 2087537 INFO  (coreCloseExecutor-6592-thread-1) [    x:collection1] o.a.s.c.SolrCore [collection1]  CLOSING SolrCore org.apache.solr.core.SolrCore@6c338b4b
   [junit4]   2> 2087538 INFO  (coreCloseExecutor-6592-thread-1) [    x:collection1] o.a.s.u.DirectUpdateHandler2 closing DirectUpdateHandler2{commits=0,autocommits=0,soft autocommits=0,optimizes=0,rollbacks=0,expungeDeletes=0,docsPending=0,adds=0,deletesById=0,deletesByQuery=0,errors=0,cumulative_adds=0,cumulative_deletesById=0,cumulative_deletesByQuery=0,cumulative_errors=0}
   [junit4]   2> 2087538 INFO  (coreCloseExecutor-6592-thread-1) [    x:collection1] o.a.s.u.SolrCoreState Closing SolrCoreState
   [junit4]   2> 2087538 INFO  (coreCloseExecutor-6592-thread-1) [    x:collection1] o.a.s.u.DefaultSolrCoreState SolrCoreState ref count has reached 0 - closing IndexWriter
   [junit4]   2> 2087538 INFO  (coreCloseExecutor-6592-thread-1) [    x:collection1] o.a.s.u.DefaultSolrCoreState closing IndexWriter with IndexWriterCloser
   [junit4]   2> 2087538 INFO  (coreCloseExecutor-6592-thread-1) [    x:collection1] o.a.s.c.SolrCore [collection1] Closing main searcher on request.
   [junit4]   2> 2087538 INFO  (coreCloseExecutor-6592-thread-1) [    x:collection1] o.a.s.c.CachingDirectoryFactory Closing MockDirectoryFactory - 2 directories currently being tracked
   [junit4]   2> 2087538 INFO  (coreCloseExecutor-6592-thread-1) [    x:collection1] o.a.s.c.CachingDirectoryFactory looking to close /export/home/jenkins/workspace/Lucene-Solr-6.x-Solaris/solr/build/solr-core/test/J0/temp/solr.handler.TestReplicationHandler_1ED0A6C51BD916E0-001/solr-instance-030/./collection1/data/index [CachedDir<<refCount=0;path=/export/home/jenkins/workspace/Lucene-Solr-6.x-Solaris/solr/build/solr-core/test/J0/temp/solr.handler.TestReplicationHandler_1ED0A6C51BD916E0-001/solr-instance-030/./collection1/data/index;done=false>>]
   [junit4]   2> 2087538 INFO  (coreCloseExecutor-6592-thread-1) [    x:collection1] o.a.s.c.CachingDirectoryFactory Closing directory, CoreContainer#isShutdown=true
   [junit4]   2> 2087538 INFO  (coreCloseExecutor-6592-thread-1) [    x:collection1] o.a.s.c.CachingDirectoryFactory Closing directory: /export/home/jenkins/workspace/Lucene-Solr-6.x-Solaris/solr/build/solr-core/test/J0/temp/solr.handler.TestReplicationHandler_1ED0A6C51BD916E0-001/solr-instance-030/./collection1/data/index
   [junit4]   2> 2087538 INFO  (coreCloseExecutor-6592-thread-1) [    x:collection1] o.a.s.c.CachingDirectoryFactory looking to close /export/home/jenkins/workspace/Lucene-Solr-6.x-Solaris/solr/build/solr-core/test/J0/temp/solr.handler.TestReplicationHandler_1ED0A6C51BD916E0-001/solr-instance-030/./collection1/data [CachedDir<<refCount=0;path=/export/home/jenkins/workspace/Lucene-Solr-6.x-Solaris/solr/build/solr-core/test/J0/temp/solr.handler.TestReplicationHandler_1ED0A6C51BD916E0-001/solr-instance-030/./collection1/data;done=false>>]
   [junit4]   2> 2087539 INFO  (coreCloseExecutor-6592-thread-1) [    x:collection1] o.a.s.c.CachingDirectoryFactory Closing directory, CoreContainer#isShutdown=true
   [junit4]   2> 2087539 INFO  (coreCloseExecutor-6592-thread-1) [    x:collection1] o.a.s.c.CachingDirectoryFactory Closing directory: /export/home/jenkins/workspace/Lucene-Solr-6.x-Solaris/solr/build/solr-core/test/J0/temp/solr.handler.TestReplicationHandler_1ED0A6C51BD916E0-001/solr-instance-030/./collection1/data
   [junit4]   2> 2087539 INFO  (TEST-TestReplicationHandler.doTestReplicateAfterStartup-seed#[1ED0A6C51BD916E0]) [    ] o.e.j.s.h.ContextHandler Stopped o.e.j.s.ServletContextHandler@2d9edfca{/solr,null,UNAVAILABLE}
   [junit4]   2> 2087541 INFO  (SUITE-TestReplicationHandler-seed#[1ED0A6C51BD916E0]-worker) [    ] o.a.s.SolrTestCaseJ4 ###deleteCore
   [junit4]   2> NOTE: leaving temporary files on disk at: /export/home/jenkins/workspace/Lucene-Solr-6.x-Solaris/solr/build/solr-core/test/J0/temp/solr.handler.TestReplicationHandler_1ED0A6C51BD916E0-001
   [junit4]   2> NOTE: test params are: codec=Lucene60, sim=RandomSimilarity(queryNorm=false,coord=yes): {}, locale=et-EE, timezone=Australia/Eucla
   [junit4]   2> NOTE: SunOS 5.11 amd64/Oracle Corporation 1.8.0_92 (64-bit)/cpus=3,threads=1,free=249354872,total=518979584
   [junit4]   2> NOTE: All tests run in this JVM: [DistributedFacetPivotLongTailTest, UUIDUpdateProcessorFallbackTest, PathHierarchyTokenizerFactoryTest, OverseerTest, DistribCursorPagingTest, InfoHandlerTest, ChangedSchemaMergeTest, TestRuleBasedAuthorizationPlugin, DistributedSuggestComponentTest, TestPseudoReturnFields, TestFaceting, TestSolrConfigHandlerConcurrent, SyncSliceTest, CustomCollectionTest, TestArbitraryIndexDir, TestXmlQParser, HighlighterMaxOffsetTest, CollectionStateFormat2Test, StandardRequestHandlerTest, TestMiniSolrCloudClusterSSL, JSONWriterTest, TermsComponentTest, TriLevelCompositeIdRoutingTest, DocumentAnalysisRequestHandlerTest, TestLMDirichletSimilarityFactory, TestExtendedDismaxParser, TestNRTOpen, TestTolerantUpdateProcessorRandomCloud, TestRemoteStreaming, SoftAutoCommitTest, SegmentsInfoRequestHandlerTest, OutOfBoxZkACLAndCredentialsProvidersTest, TestUniqueKeyFieldResource, TestFileDictionaryLookup, RulesTest, TestHashQParserPlugin, RegexBoostProcessorTest, DocExpirationUpdateProcessorFactoryTest, UpdateParamsTest, CircularListTest, PingRequestHandlerTest, MigrateRouteKeyTest, TestFunctionQuery, LeaderElectionTest, TestConfigSetsAPIZkFailure, CdcrRequestHandlerTest, BasicDistributedZkTest, ClassificationUpdateProcessorFactoryTest, TestManagedSynonymFilterFactory, TestLRUCache, TestPartialUpdateDeduplication, TestQuerySenderNoQuery, SaslZkACLProviderTest, RecoveryZkTest, SuggestComponentTest, DOMUtilTest, TestLazyCores, TestConfig, TestDistribIDF, TestFieldResource, TestJmxIntegration, DistributedFacetPivotSmallTest, TestExclusionRuleCollectionAccess, DocValuesTest, MergeStrategyTest, TestCloudSchemaless, TimeZoneUtilsTest, HardAutoCommitTest, HdfsBasicDistributedZk2Test, HdfsUnloadDistributedZkTest, ClusterStateTest, TestStressVersions, TestAnalyzeInfixSuggestions, SimplePostToolTest, TestSchemaManager, TestInfoStreamLogging, TestMacros, ResponseHeaderTest, TestSweetSpotSimilarityFactory, DistributedQueryElevationComponentTest, PolyFieldTest, SpatialRPTFieldTypeTest, HdfsThreadLeakTest, SortSpecParsingTest, TestRandomRequestDistribution, TestPerFieldSimilarityClassic, TestRandomDVFaceting, BadComponentTest, TestExpandComponent, HdfsRestartWhileUpdatingTest, TestDocumentBuilder, HdfsChaosMonkeyNothingIsSafeTest, TestSchemaVersionResource, PreAnalyzedFieldTest, QueryElevationComponentTest, TestDynamicFieldResource, TestHighFrequencyDictionaryFactory, TestCloudDeleteByQuery, TestDocBasedVersionConstraints, BigEndianAscendingWordDeserializerTest, MBeansHandlerTest, SpatialFilterTest, TestAnalyzedSuggestions, TestSizeLimitedDistributedMap, XmlUpdateRequestHandlerTest, SliceStateTest, TestSolrFieldCacheMBean, ActionThrottleTest, TestMiniSolrCloudClusterBase, DocValuesMultiTest, TestConfigSetsAPI, TestStressLucene, HdfsDirectoryFactoryTest, TestDFISimilarityFactory, HdfsDirectoryTest, ChaosMonkeyNothingIsSafeTest, AsyncMigrateRouteKeyTest, TestDistribDocBasedVersion, TestMaxScoreQueryParser, DirectoryFactoryTest, TestConfigSetProperties, TestUseDocValuesAsStored2, TestTolerantSearch, TestSearcherReuse, TestNoOpRegenerator, TestScoreJoinQPNoScore, StatelessScriptUpdateProcessorFactoryTest, TestLeaderInitiatedRecoveryThread, ClusterStateUpdateTest, TestMergePolicyConfig, HdfsRecoverLeaseTest, SolrIndexConfigTest, MoreLikeThisHandlerTest, XsltUpdateRequestHandlerTest, TestSchemaResource, TestSolrQueryResponse, TestExactStatsCache, OverseerStatusTest, AnalyticsQueryTest, TestFieldSortValues, IndexBasedSpellCheckerTest, DeleteLastCustomShardedReplicaTest, ChaosMonkeySafeLeaderTest, UnloadDistributedZkTest, OpenCloseCoreStressTest, LeaderElectionIntegrationTest, ShardRoutingTest, FullSolrCloudDistribCmdsTest, TestReplicationHandler]
   [junit4] Completed [273/591 (1!)] on J0 in 82.63s, 14 tests, 1 failure <<< FAILURES!

[...truncated 1067 lines...]
BUILD FAILED
/export/home/jenkins/workspace/Lucene-Solr-6.x-Solaris/build.xml:740: The following error occurred while executing this line:
/export/home/jenkins/workspace/Lucene-Solr-6.x-Solaris/build.xml:684: The following error occurred while executing this line:
/export/home/jenkins/workspace/Lucene-Solr-6.x-Solaris/build.xml:59: The following error occurred while executing this line:
/export/home/jenkins/workspace/Lucene-Solr-6.x-Solaris/solr/build.xml:233: The following error occurred while executing this line:
/export/home/jenkins/workspace/Lucene-Solr-6.x-Solaris/solr/common-build.xml:529: The following error occurred while executing this line:
/export/home/jenkins/workspace/Lucene-Solr-6.x-Solaris/lucene/common-build.xml:1457: The following error occurred while executing this line:
/export/home/jenkins/workspace/Lucene-Solr-6.x-Solaris/lucene/common-build.xml:1014: There were test failures: 591 suites (10 ignored), 2383 tests, 1 failure, 86 ignored (71 assumptions) [seed: 1ED0A6C51BD916E0]

Total time: 83 minutes 49 seconds
Build step 'Invoke Ant' marked build as failure
Archiving artifacts
[WARNINGS] Skipping publisher since build result is FAILURE
Recording test results
Email was triggered for: Failure - Any
Sending email for trigger: Failure - Any



Mime
View raw message