lucene-dev mailing list archives

Site index · List index
Message view « Date » · « Thread »
Top « Date » · « Thread »
From Policeman Jenkins Server <jenk...@thetaphi.de>
Subject [JENKINS] Lucene-Solr-6.x-MacOSX (64bit/jdk1.8.0) - Build # 93 - Failure!
Date Thu, 21 Apr 2016 22:05:14 GMT
Build: http://jenkins.thetaphi.de/job/Lucene-Solr-6.x-MacOSX/93/
Java: 64bit/jdk1.8.0 -XX:-UseCompressedOops -XX:+UseSerialGC

1 tests failed.
FAILED:  org.apache.solr.schema.TestManagedSchemaAPI.test

Error Message:
Error from server at http://127.0.0.1:53030/solr/testschemaapi_shard1_replica1: ERROR: [doc=2] unknown field 'myNewField1'

Stack Trace:
org.apache.solr.client.solrj.impl.CloudSolrClient$RouteException: Error from server at http://127.0.0.1:53030/solr/testschemaapi_shard1_replica1: ERROR: [doc=2] unknown field 'myNewField1'
	at __randomizedtesting.SeedInfo.seed([15674B1DEE069395:9D3374C740FAFE6D]:0)
	at org.apache.solr.client.solrj.impl.CloudSolrClient.directUpdate(CloudSolrClient.java:661)
	at org.apache.solr.client.solrj.impl.CloudSolrClient.sendRequest(CloudSolrClient.java:1073)
	at org.apache.solr.client.solrj.impl.CloudSolrClient.requestWithRetryOnStaleState(CloudSolrClient.java:962)
	at org.apache.solr.client.solrj.impl.CloudSolrClient.request(CloudSolrClient.java:898)
	at org.apache.solr.schema.TestManagedSchemaAPI.testAddFieldAndDocument(TestManagedSchemaAPI.java:86)
	at org.apache.solr.schema.TestManagedSchemaAPI.test(TestManagedSchemaAPI.java:55)
	at sun.reflect.NativeMethodAccessorImpl.invoke0(Native Method)
	at sun.reflect.NativeMethodAccessorImpl.invoke(NativeMethodAccessorImpl.java:62)
	at sun.reflect.DelegatingMethodAccessorImpl.invoke(DelegatingMethodAccessorImpl.java:43)
	at java.lang.reflect.Method.invoke(Method.java:498)
	at com.carrotsearch.randomizedtesting.RandomizedRunner.invoke(RandomizedRunner.java:1764)
	at com.carrotsearch.randomizedtesting.RandomizedRunner$8.evaluate(RandomizedRunner.java:871)
	at com.carrotsearch.randomizedtesting.RandomizedRunner$9.evaluate(RandomizedRunner.java:907)
	at com.carrotsearch.randomizedtesting.RandomizedRunner$10.evaluate(RandomizedRunner.java:921)
	at com.carrotsearch.randomizedtesting.rules.SystemPropertiesRestoreRule$1.evaluate(SystemPropertiesRestoreRule.java:57)
	at org.apache.lucene.util.TestRuleSetupTeardownChained$1.evaluate(TestRuleSetupTeardownChained.java:49)
	at org.apache.lucene.util.AbstractBeforeAfterRule$1.evaluate(AbstractBeforeAfterRule.java:45)
	at org.apache.lucene.util.TestRuleThreadAndTestName$1.evaluate(TestRuleThreadAndTestName.java:48)
	at org.apache.lucene.util.TestRuleIgnoreAfterMaxFailures$1.evaluate(TestRuleIgnoreAfterMaxFailures.java:64)
	at org.apache.lucene.util.TestRuleMarkFailure$1.evaluate(TestRuleMarkFailure.java:47)
	at com.carrotsearch.randomizedtesting.rules.StatementAdapter.evaluate(StatementAdapter.java:36)
	at com.carrotsearch.randomizedtesting.ThreadLeakControl$StatementRunner.run(ThreadLeakControl.java:367)
	at com.carrotsearch.randomizedtesting.ThreadLeakControl.forkTimeoutingTask(ThreadLeakControl.java:809)
	at com.carrotsearch.randomizedtesting.ThreadLeakControl$3.evaluate(ThreadLeakControl.java:460)
	at com.carrotsearch.randomizedtesting.RandomizedRunner.runSingleTest(RandomizedRunner.java:880)
	at com.carrotsearch.randomizedtesting.RandomizedRunner$5.evaluate(RandomizedRunner.java:781)
	at com.carrotsearch.randomizedtesting.RandomizedRunner$6.evaluate(RandomizedRunner.java:816)
	at com.carrotsearch.randomizedtesting.RandomizedRunner$7.evaluate(RandomizedRunner.java:827)
	at com.carrotsearch.randomizedtesting.rules.StatementAdapter.evaluate(StatementAdapter.java:36)
	at com.carrotsearch.randomizedtesting.rules.SystemPropertiesRestoreRule$1.evaluate(SystemPropertiesRestoreRule.java:57)
	at org.apache.lucene.util.AbstractBeforeAfterRule$1.evaluate(AbstractBeforeAfterRule.java:45)
	at com.carrotsearch.randomizedtesting.rules.StatementAdapter.evaluate(StatementAdapter.java:36)
	at org.apache.lucene.util.TestRuleStoreClassName$1.evaluate(TestRuleStoreClassName.java:41)
	at com.carrotsearch.randomizedtesting.rules.NoShadowingOrOverridesOnMethodsRule$1.evaluate(NoShadowingOrOverridesOnMethodsRule.java:40)
	at com.carrotsearch.randomizedtesting.rules.NoShadowingOrOverridesOnMethodsRule$1.evaluate(NoShadowingOrOverridesOnMethodsRule.java:40)
	at com.carrotsearch.randomizedtesting.rules.StatementAdapter.evaluate(StatementAdapter.java:36)
	at com.carrotsearch.randomizedtesting.rules.StatementAdapter.evaluate(StatementAdapter.java:36)
	at com.carrotsearch.randomizedtesting.rules.StatementAdapter.evaluate(StatementAdapter.java:36)
	at org.apache.lucene.util.TestRuleAssertionsRequired$1.evaluate(TestRuleAssertionsRequired.java:53)
	at org.apache.lucene.util.TestRuleMarkFailure$1.evaluate(TestRuleMarkFailure.java:47)
	at org.apache.lucene.util.TestRuleIgnoreAfterMaxFailures$1.evaluate(TestRuleIgnoreAfterMaxFailures.java:64)
	at org.apache.lucene.util.TestRuleIgnoreTestSuites$1.evaluate(TestRuleIgnoreTestSuites.java:54)
	at com.carrotsearch.randomizedtesting.rules.StatementAdapter.evaluate(StatementAdapter.java:36)
	at com.carrotsearch.randomizedtesting.ThreadLeakControl$StatementRunner.run(ThreadLeakControl.java:367)
	at java.lang.Thread.run(Thread.java:745)
Caused by: org.apache.solr.client.solrj.impl.HttpSolrClient$RemoteSolrException: Error from server at http://127.0.0.1:53030/solr/testschemaapi_shard1_replica1: ERROR: [doc=2] unknown field 'myNewField1'
	at org.apache.solr.client.solrj.impl.HttpSolrClient.executeMethod(HttpSolrClient.java:590)
	at org.apache.solr.client.solrj.impl.HttpSolrClient.request(HttpSolrClient.java:259)
	at org.apache.solr.client.solrj.impl.HttpSolrClient.request(HttpSolrClient.java:248)
	at org.apache.solr.client.solrj.impl.LBHttpSolrClient.doRequest(LBHttpSolrClient.java:404)
	at org.apache.solr.client.solrj.impl.LBHttpSolrClient.request(LBHttpSolrClient.java:357)
	at org.apache.solr.client.solrj.impl.CloudSolrClient.lambda$directUpdate$0(CloudSolrClient.java:638)
	at java.util.concurrent.FutureTask.run(FutureTask.java:266)
	at org.apache.solr.common.util.ExecutorUtil$MDCAwareThreadPoolExecutor.lambda$execute$0(ExecutorUtil.java:229)
	at java.util.concurrent.ThreadPoolExecutor.runWorker(ThreadPoolExecutor.java:1142)
	at java.util.concurrent.ThreadPoolExecutor$Worker.run(ThreadPoolExecutor.java:617)
	... 1 more




Build Log:
[...truncated 11229 lines...]
   [junit4] Suite: org.apache.solr.schema.TestManagedSchemaAPI
   [junit4]   2> Creating dataDir: /Users/jenkins/workspace/Lucene-Solr-6.x-MacOSX/solr/build/solr-core/test/J1/temp/solr.schema.TestManagedSchemaAPI_15674B1DEE069395-001/init-core-data-001
   [junit4]   2> 1663091 INFO  (SUITE-TestManagedSchemaAPI-seed#[15674B1DEE069395]-worker) [    ] o.a.s.SolrTestCaseJ4 Randomized ssl (false) and clientAuth (false)
   [junit4]   2> 1663093 INFO  (SUITE-TestManagedSchemaAPI-seed#[15674B1DEE069395]-worker) [    ] o.a.s.c.ZkTestServer STARTING ZK TEST SERVER
   [junit4]   2> 1663093 INFO  (Thread-2776) [    ] o.a.s.c.ZkTestServer client port:0.0.0.0/0.0.0.0:0
   [junit4]   2> 1663093 INFO  (Thread-2776) [    ] o.a.s.c.ZkTestServer Starting server
   [junit4]   2> 1663201 INFO  (SUITE-TestManagedSchemaAPI-seed#[15674B1DEE069395]-worker) [    ] o.a.s.c.ZkTestServer start zk server on port:53028
   [junit4]   2> 1663201 INFO  (SUITE-TestManagedSchemaAPI-seed#[15674B1DEE069395]-worker) [    ] o.a.s.c.c.SolrZkClient Using default ZkCredentialsProvider
   [junit4]   2> 1663202 INFO  (SUITE-TestManagedSchemaAPI-seed#[15674B1DEE069395]-worker) [    ] o.a.s.c.c.ConnectionManager Waiting for client to connect to ZooKeeper
   [junit4]   2> 1663217 INFO  (zkCallback-1352-thread-1) [    ] o.a.s.c.c.ConnectionManager Watcher org.apache.solr.common.cloud.ConnectionManager@7835df4 name:ZooKeeperConnection Watcher:127.0.0.1:53028 got event WatchedEvent state:SyncConnected type:None path:null path:null type:None
   [junit4]   2> 1663218 INFO  (SUITE-TestManagedSchemaAPI-seed#[15674B1DEE069395]-worker) [    ] o.a.s.c.c.ConnectionManager Client is connected to ZooKeeper
   [junit4]   2> 1663218 INFO  (SUITE-TestManagedSchemaAPI-seed#[15674B1DEE069395]-worker) [    ] o.a.s.c.c.SolrZkClient Using default ZkACLProvider
   [junit4]   2> 1663218 INFO  (SUITE-TestManagedSchemaAPI-seed#[15674B1DEE069395]-worker) [    ] o.a.s.c.c.SolrZkClient makePath: /solr/solr.xml
   [junit4]   2> 1663227 INFO  (jetty-launcher-1351-thread-1) [    ] o.e.j.s.Server jetty-9.3.8.v20160314
   [junit4]   2> 1663227 INFO  (jetty-launcher-1351-thread-2) [    ] o.e.j.s.Server jetty-9.3.8.v20160314
   [junit4]   2> 1663231 INFO  (jetty-launcher-1351-thread-1) [    ] o.e.j.s.h.ContextHandler Started o.e.j.s.ServletContextHandler@6b183583{/solr,null,AVAILABLE}
   [junit4]   2> 1663231 INFO  (jetty-launcher-1351-thread-2) [    ] o.e.j.s.h.ContextHandler Started o.e.j.s.ServletContextHandler@7a195b21{/solr,null,AVAILABLE}
   [junit4]   2> 1663235 INFO  (jetty-launcher-1351-thread-2) [    ] o.e.j.s.ServerConnector Started ServerConnector@2eef764{HTTP/1.1,[http/1.1]}{127.0.0.1:53031}
   [junit4]   2> 1663236 INFO  (jetty-launcher-1351-thread-1) [    ] o.e.j.s.ServerConnector Started ServerConnector@7950a0d8{HTTP/1.1,[http/1.1]}{127.0.0.1:53030}
   [junit4]   2> 1663236 INFO  (jetty-launcher-1351-thread-2) [    ] o.e.j.s.Server Started @1669250ms
   [junit4]   2> 1663236 INFO  (jetty-launcher-1351-thread-1) [    ] o.e.j.s.Server Started @1669250ms
   [junit4]   2> 1663236 INFO  (jetty-launcher-1351-thread-2) [    ] o.a.s.c.s.e.JettySolrRunner Jetty properties: {hostContext=/solr, hostPort=53031}
   [junit4]   2> 1663236 INFO  (jetty-launcher-1351-thread-1) [    ] o.a.s.c.s.e.JettySolrRunner Jetty properties: {hostContext=/solr, hostPort=53030}
   [junit4]   2> 1663236 INFO  (jetty-launcher-1351-thread-2) [    ] o.a.s.s.SolrDispatchFilter SolrDispatchFilter.init(): sun.misc.Launcher$AppClassLoader@4554617c
   [junit4]   2> 1663236 INFO  (jetty-launcher-1351-thread-1) [    ] o.a.s.s.SolrDispatchFilter SolrDispatchFilter.init(): sun.misc.Launcher$AppClassLoader@4554617c
   [junit4]   2> 1663236 INFO  (jetty-launcher-1351-thread-2) [    ] o.a.s.c.SolrResourceLoader new SolrResourceLoader for directory: '/Users/jenkins/workspace/Lucene-Solr-6.x-MacOSX/solr/build/solr-core/test/J1/temp/solr.schema.TestManagedSchemaAPI_15674B1DEE069395-001/tempDir-001/node2'
   [junit4]   2> 1663236 INFO  (jetty-launcher-1351-thread-1) [    ] o.a.s.c.SolrResourceLoader new SolrResourceLoader for directory: '/Users/jenkins/workspace/Lucene-Solr-6.x-MacOSX/solr/build/solr-core/test/J1/temp/solr.schema.TestManagedSchemaAPI_15674B1DEE069395-001/tempDir-001/node1'
   [junit4]   2> 1663237 INFO  (jetty-launcher-1351-thread-2) [    ] o.a.s.c.SolrResourceLoader JNDI not configured for solr (NoInitialContextEx)
   [junit4]   2> 1663237 INFO  (jetty-launcher-1351-thread-1) [    ] o.a.s.c.SolrResourceLoader JNDI not configured for solr (NoInitialContextEx)
   [junit4]   2> 1663237 INFO  (jetty-launcher-1351-thread-1) [    ] o.a.s.c.SolrResourceLoader solr home defaulted to 'solr/' (could not find system property or JNDI)
   [junit4]   2> 1663237 INFO  (jetty-launcher-1351-thread-2) [    ] o.a.s.c.SolrResourceLoader solr home defaulted to 'solr/' (could not find system property or JNDI)
   [junit4]   2> 1663237 INFO  (jetty-launcher-1351-thread-1) [    ] o.a.s.c.c.SolrZkClient Using default ZkCredentialsProvider
   [junit4]   2> 1663237 INFO  (jetty-launcher-1351-thread-2) [    ] o.a.s.c.c.SolrZkClient Using default ZkCredentialsProvider
   [junit4]   2> 1663238 INFO  (jetty-launcher-1351-thread-1) [    ] o.a.s.c.c.ConnectionManager Waiting for client to connect to ZooKeeper
   [junit4]   2> 1663238 INFO  (jetty-launcher-1351-thread-2) [    ] o.a.s.c.c.ConnectionManager Waiting for client to connect to ZooKeeper
   [junit4]   2> 1663240 INFO  (zkCallback-1353-thread-1) [    ] o.a.s.c.c.ConnectionManager Watcher org.apache.solr.common.cloud.ConnectionManager@24332033 name:ZooKeeperConnection Watcher:127.0.0.1:53028/solr got event WatchedEvent state:SyncConnected type:None path:null path:null type:None
   [junit4]   2> 1663240 INFO  (jetty-launcher-1351-thread-1) [    ] o.a.s.c.c.ConnectionManager Client is connected to ZooKeeper
   [junit4]   2> 1663240 INFO  (zkCallback-1354-thread-1) [    ] o.a.s.c.c.ConnectionManager Watcher org.apache.solr.common.cloud.ConnectionManager@5be0bcbd name:ZooKeeperConnection Watcher:127.0.0.1:53028/solr got event WatchedEvent state:SyncConnected type:None path:null path:null type:None
   [junit4]   2> 1663240 INFO  (jetty-launcher-1351-thread-2) [    ] o.a.s.c.c.ConnectionManager Client is connected to ZooKeeper
   [junit4]   2> 1663241 INFO  (jetty-launcher-1351-thread-1) [    ] o.a.s.c.c.SolrZkClient Using default ZkACLProvider
   [junit4]   2> 1663241 INFO  (jetty-launcher-1351-thread-2) [    ] o.a.s.c.c.SolrZkClient Using default ZkACLProvider
   [junit4]   2> 1663241 INFO  (jetty-launcher-1351-thread-1) [    ] o.a.s.s.SolrDispatchFilter solr.xml found in ZooKeeper. Loading...
   [junit4]   2> 1663241 INFO  (jetty-launcher-1351-thread-2) [    ] o.a.s.s.SolrDispatchFilter solr.xml found in ZooKeeper. Loading...
   [junit4]   2> 1663251 INFO  (jetty-launcher-1351-thread-2) [    ] o.a.s.c.CorePropertiesLocator Config-defined core root directory: /Users/jenkins/workspace/Lucene-Solr-6.x-MacOSX/solr/build/solr-core/test/J1/temp/solr.schema.TestManagedSchemaAPI_15674B1DEE069395-001/tempDir-001/node2/.
   [junit4]   2> 1663251 INFO  (jetty-launcher-1351-thread-2) [    ] o.a.s.c.CoreContainer New CoreContainer 1516005140
   [junit4]   2> 1663251 INFO  (jetty-launcher-1351-thread-2) [    ] o.a.s.c.CoreContainer Loading cores into CoreContainer [instanceDir=/Users/jenkins/workspace/Lucene-Solr-6.x-MacOSX/solr/build/solr-core/test/J1/temp/solr.schema.TestManagedSchemaAPI_15674B1DEE069395-001/tempDir-001/node2]
   [junit4]   2> 1663252 INFO  (jetty-launcher-1351-thread-1) [    ] o.a.s.c.CorePropertiesLocator Config-defined core root directory: /Users/jenkins/workspace/Lucene-Solr-6.x-MacOSX/solr/build/solr-core/test/J1/temp/solr.schema.TestManagedSchemaAPI_15674B1DEE069395-001/tempDir-001/node1/.
   [junit4]   2> 1663252 WARN  (jetty-launcher-1351-thread-2) [    ] o.a.s.c.CoreContainer Couldn't add files from /Users/jenkins/workspace/Lucene-Solr-6.x-MacOSX/solr/build/solr-core/test/J1/temp/solr.schema.TestManagedSchemaAPI_15674B1DEE069395-001/tempDir-001/node2/lib to classpath: /Users/jenkins/workspace/Lucene-Solr-6.x-MacOSX/solr/build/solr-core/test/J1/temp/solr.schema.TestManagedSchemaAPI_15674B1DEE069395-001/tempDir-001/node2/lib
   [junit4]   2> 1663252 INFO  (jetty-launcher-1351-thread-1) [    ] o.a.s.c.CoreContainer New CoreContainer 1484414831
   [junit4]   2> 1663252 INFO  (jetty-launcher-1351-thread-1) [    ] o.a.s.c.CoreContainer Loading cores into CoreContainer [instanceDir=/Users/jenkins/workspace/Lucene-Solr-6.x-MacOSX/solr/build/solr-core/test/J1/temp/solr.schema.TestManagedSchemaAPI_15674B1DEE069395-001/tempDir-001/node1]
   [junit4]   2> 1663252 INFO  (jetty-launcher-1351-thread-2) [    ] o.a.s.h.c.HttpShardHandlerFactory created with socketTimeout : 90000,urlScheme : ,connTimeout : 15000,maxConnectionsPerHost : 20,maxConnections : 10000,corePoolSize : 0,maximumPoolSize : 2147483647,maxThreadIdleTime : 5,sizeOfQueue : -1,fairnessPolicy : false,useRetries : false,
   [junit4]   2> 1663252 WARN  (jetty-launcher-1351-thread-1) [    ] o.a.s.c.CoreContainer Couldn't add files from /Users/jenkins/workspace/Lucene-Solr-6.x-MacOSX/solr/build/solr-core/test/J1/temp/solr.schema.TestManagedSchemaAPI_15674B1DEE069395-001/tempDir-001/node1/lib to classpath: /Users/jenkins/workspace/Lucene-Solr-6.x-MacOSX/solr/build/solr-core/test/J1/temp/solr.schema.TestManagedSchemaAPI_15674B1DEE069395-001/tempDir-001/node1/lib
   [junit4]   2> 1663252 INFO  (jetty-launcher-1351-thread-1) [    ] o.a.s.h.c.HttpShardHandlerFactory created with socketTimeout : 90000,urlScheme : ,connTimeout : 15000,maxConnectionsPerHost : 20,maxConnections : 10000,corePoolSize : 0,maximumPoolSize : 2147483647,maxThreadIdleTime : 5,sizeOfQueue : -1,fairnessPolicy : false,useRetries : false,
   [junit4]   2> 1663255 INFO  (jetty-launcher-1351-thread-2) [    ] o.a.s.u.UpdateShardHandler Creating UpdateShardHandler HTTP client with params: socketTimeout=340000&connTimeout=45000&retry=true
   [junit4]   2> 1663255 INFO  (jetty-launcher-1351-thread-1) [    ] o.a.s.u.UpdateShardHandler Creating UpdateShardHandler HTTP client with params: socketTimeout=340000&connTimeout=45000&retry=true
   [junit4]   2> 1663255 INFO  (jetty-launcher-1351-thread-2) [    ] o.a.s.l.LogWatcher SLF4J impl is org.slf4j.impl.Log4jLoggerFactory
   [junit4]   2> 1663255 INFO  (jetty-launcher-1351-thread-2) [    ] o.a.s.l.LogWatcher Registering Log Listener [Log4j (org.slf4j.impl.Log4jLoggerFactory)]
   [junit4]   2> 1663255 INFO  (jetty-launcher-1351-thread-2) [    ] o.a.s.c.ZkContainer Zookeeper client=127.0.0.1:53028/solr
   [junit4]   2> 1663255 INFO  (jetty-launcher-1351-thread-2) [    ] o.a.s.c.ZkController zkHost includes chroot
   [junit4]   2> 1663255 INFO  (jetty-launcher-1351-thread-1) [    ] o.a.s.l.LogWatcher SLF4J impl is org.slf4j.impl.Log4jLoggerFactory
   [junit4]   2> 1663255 INFO  (jetty-launcher-1351-thread-2) [    ] o.a.s.c.c.SolrZkClient Using default ZkCredentialsProvider
   [junit4]   2> 1663255 INFO  (jetty-launcher-1351-thread-1) [    ] o.a.s.l.LogWatcher Registering Log Listener [Log4j (org.slf4j.impl.Log4jLoggerFactory)]
   [junit4]   2> 1663256 INFO  (jetty-launcher-1351-thread-1) [    ] o.a.s.c.ZkContainer Zookeeper client=127.0.0.1:53028/solr
   [junit4]   2> 1663256 INFO  (jetty-launcher-1351-thread-1) [    ] o.a.s.c.ZkController zkHost includes chroot
   [junit4]   2> 1663257 INFO  (jetty-launcher-1351-thread-1) [    ] o.a.s.c.c.SolrZkClient Using default ZkCredentialsProvider
   [junit4]   2> 1663257 INFO  (jetty-launcher-1351-thread-2) [    ] o.a.s.c.c.ConnectionManager Waiting for client to connect to ZooKeeper
   [junit4]   2> 1663258 INFO  (jetty-launcher-1351-thread-1) [    ] o.a.s.c.c.ConnectionManager Waiting for client to connect to ZooKeeper
   [junit4]   2> 1663259 INFO  (zkCallback-1359-thread-1) [    ] o.a.s.c.c.ConnectionManager Watcher org.apache.solr.common.cloud.ConnectionManager@6717513e name:ZooKeeperConnection Watcher:127.0.0.1:53028 got event WatchedEvent state:SyncConnected type:None path:null path:null type:None
   [junit4]   2> 1663259 INFO  (jetty-launcher-1351-thread-2) [    ] o.a.s.c.c.ConnectionManager Client is connected to ZooKeeper
   [junit4]   2> 1663259 INFO  (zkCallback-1360-thread-1) [    ] o.a.s.c.c.ConnectionManager Watcher org.apache.solr.common.cloud.ConnectionManager@5d473597 name:ZooKeeperConnection Watcher:127.0.0.1:53028 got event WatchedEvent state:SyncConnected type:None path:null path:null type:None
   [junit4]   2> 1663259 INFO  (jetty-launcher-1351-thread-2) [    ] o.a.s.c.c.SolrZkClient Using default ZkACLProvider
   [junit4]   2> 1663259 INFO  (jetty-launcher-1351-thread-1) [    ] o.a.s.c.c.ConnectionManager Client is connected to ZooKeeper
   [junit4]   2> 1663259 INFO  (jetty-launcher-1351-thread-1) [    ] o.a.s.c.c.SolrZkClient Using default ZkACLProvider
   [junit4]   2> 1663261 INFO  (jetty-launcher-1351-thread-2) [n:127.0.0.1:53031_solr    ] o.a.s.c.ZkController Added new OnReconnect listener org.apache.solr.cloud.ZkController$$Lambda$10/2068143778@2891d56a
   [junit4]   2> 1663261 INFO  (jetty-launcher-1351-thread-1) [n:127.0.0.1:53030_solr    ] o.a.s.c.ZkController Added new OnReconnect listener org.apache.solr.cloud.ZkController$$Lambda$10/2068143778@37cbfdaa
   [junit4]   2> 1663261 INFO  (jetty-launcher-1351-thread-1) [n:127.0.0.1:53030_solr    ] o.a.s.c.c.ConnectionManager Waiting for client to connect to ZooKeeper
   [junit4]   2> 1663262 INFO  (jetty-launcher-1351-thread-2) [n:127.0.0.1:53031_solr    ] o.a.s.c.c.ConnectionManager Waiting for client to connect to ZooKeeper
   [junit4]   2> 1663263 INFO  (zkCallback-1362-thread-1-processing-n:127.0.0.1:53030_solr) [n:127.0.0.1:53030_solr    ] o.a.s.c.c.ConnectionManager Watcher org.apache.solr.common.cloud.ConnectionManager@491444ff name:ZooKeeperConnection Watcher:127.0.0.1:53028/solr got event WatchedEvent state:SyncConnected type:None path:null path:null type:None
   [junit4]   2> 1663263 INFO  (jetty-launcher-1351-thread-1) [n:127.0.0.1:53030_solr    ] o.a.s.c.c.ConnectionManager Client is connected to ZooKeeper
   [junit4]   2> 1663263 INFO  (zkCallback-1361-thread-1-processing-n:127.0.0.1:53031_solr) [n:127.0.0.1:53031_solr    ] o.a.s.c.c.ConnectionManager Watcher org.apache.solr.common.cloud.ConnectionManager@2d07938 name:ZooKeeperConnection Watcher:127.0.0.1:53028/solr got event WatchedEvent state:SyncConnected type:None path:null path:null type:None
   [junit4]   2> 1663263 INFO  (jetty-launcher-1351-thread-2) [n:127.0.0.1:53031_solr    ] o.a.s.c.c.ConnectionManager Client is connected to ZooKeeper
   [junit4]   2> 1663264 INFO  (jetty-launcher-1351-thread-1) [n:127.0.0.1:53030_solr    ] o.a.s.c.c.SolrZkClient makePath: /overseer/queue
   [junit4]   2> 1663265 INFO  (jetty-launcher-1351-thread-2) [n:127.0.0.1:53031_solr    ] o.a.s.c.c.SolrZkClient makePath: /overseer/queue
   [junit4]   2> 1663268 INFO  (jetty-launcher-1351-thread-2) [n:127.0.0.1:53031_solr    ] o.a.s.c.c.SolrZkClient makePath: /overseer/collection-queue-work
   [junit4]   2> 1663268 INFO  (jetty-launcher-1351-thread-1) [n:127.0.0.1:53030_solr    ] o.a.s.c.c.SolrZkClient makePath: /overseer/collection-queue-work
   [junit4]   2> 1663273 INFO  (jetty-launcher-1351-thread-2) [n:127.0.0.1:53031_solr    ] o.a.s.c.c.SolrZkClient makePath: /overseer/collection-map-running
   [junit4]   2> 1663274 INFO  (jetty-launcher-1351-thread-1) [n:127.0.0.1:53030_solr    ] o.a.s.c.c.SolrZkClient makePath: /overseer/collection-map-running
   [junit4]   2> 1663276 INFO  (jetty-launcher-1351-thread-1) [n:127.0.0.1:53030_solr    ] o.a.s.c.c.SolrZkClient makePath: /overseer/collection-map-completed
   [junit4]   2> 1663277 INFO  (jetty-launcher-1351-thread-2) [n:127.0.0.1:53031_solr    ] o.a.s.c.c.SolrZkClient makePath: /overseer/collection-map-completed
   [junit4]   2> 1663279 INFO  (jetty-launcher-1351-thread-2) [n:127.0.0.1:53031_solr    ] o.a.s.c.c.SolrZkClient makePath: /overseer/collection-map-failure
   [junit4]   2> 1663280 INFO  (jetty-launcher-1351-thread-1) [n:127.0.0.1:53030_solr    ] o.a.s.c.c.SolrZkClient makePath: /overseer/collection-map-failure
   [junit4]   2> 1663283 INFO  (jetty-launcher-1351-thread-1) [n:127.0.0.1:53030_solr    ] o.a.s.c.c.SolrZkClient makePath: /live_nodes
   [junit4]   2> 1663283 INFO  (jetty-launcher-1351-thread-2) [n:127.0.0.1:53031_solr    ] o.a.s.c.c.SolrZkClient makePath: /live_nodes
   [junit4]   2> 1663285 INFO  (jetty-launcher-1351-thread-2) [n:127.0.0.1:53031_solr    ] o.a.s.c.c.SolrZkClient makePath: /collections
   [junit4]   2> 1663286 INFO  (jetty-launcher-1351-thread-1) [n:127.0.0.1:53030_solr    ] o.a.s.c.c.SolrZkClient makePath: /collections
   [junit4]   2> 1663287 INFO  (jetty-launcher-1351-thread-2) [n:127.0.0.1:53031_solr    ] o.a.s.c.c.SolrZkClient makePath: /aliases.json
   [junit4]   2> 1663287 INFO  (jetty-launcher-1351-thread-1) [n:127.0.0.1:53030_solr    ] o.a.s.c.c.SolrZkClient makePath: /aliases.json
   [junit4]   2> 1663289 INFO  (jetty-launcher-1351-thread-1) [n:127.0.0.1:53030_solr    ] o.a.s.c.c.SolrZkClient makePath: /clusterstate.json
   [junit4]   2> 1663290 INFO  (jetty-launcher-1351-thread-2) [n:127.0.0.1:53031_solr    ] o.a.s.c.c.SolrZkClient makePath: /clusterstate.json
   [junit4]   2> 1663292 INFO  (jetty-launcher-1351-thread-2) [n:127.0.0.1:53031_solr    ] o.a.s.c.c.SolrZkClient makePath: /security.json
   [junit4]   2> 1663292 INFO  (jetty-launcher-1351-thread-1) [n:127.0.0.1:53030_solr    ] o.a.s.c.c.SolrZkClient makePath: /security.json
   [junit4]   2> 1663294 INFO  (jetty-launcher-1351-thread-1) [n:127.0.0.1:53030_solr    ] o.a.s.c.c.ZkStateReader Updating cluster state from ZooKeeper... 
   [junit4]   2> 1663294 INFO  (jetty-launcher-1351-thread-2) [n:127.0.0.1:53031_solr    ] o.a.s.c.c.ZkStateReader Updating cluster state from ZooKeeper... 
   [junit4]   2> 1663296 INFO  (jetty-launcher-1351-thread-1) [n:127.0.0.1:53030_solr    ] o.a.s.c.c.ZkStateReader Updated live nodes from ZooKeeper... (0) -> (0)
   [junit4]   2> 1663296 INFO  (jetty-launcher-1351-thread-2) [n:127.0.0.1:53031_solr    ] o.a.s.c.c.ZkStateReader Updated live nodes from ZooKeeper... (0) -> (0)
   [junit4]   2> 1663299 INFO  (jetty-launcher-1351-thread-1) [n:127.0.0.1:53030_solr    ] o.a.s.c.c.SolrZkClient makePath: /overseer_elect
   [junit4]   2> 1663300 INFO  (jetty-launcher-1351-thread-2) [n:127.0.0.1:53031_solr    ] o.a.s.c.c.SolrZkClient makePath: /overseer_elect
   [junit4]   2> 1663302 INFO  (jetty-launcher-1351-thread-1) [n:127.0.0.1:53030_solr    ] o.a.s.c.c.SolrZkClient makePath: /overseer_elect/election
   [junit4]   2> 1663302 INFO  (jetty-launcher-1351-thread-2) [n:127.0.0.1:53031_solr    ] o.a.s.c.c.SolrZkClient makePath: /overseer_elect/election
   [junit4]   2> 1663304 INFO  (jetty-launcher-1351-thread-1) [n:127.0.0.1:53030_solr    ] o.a.s.c.Overseer Overseer (id=null) closing
   [junit4]   2> 1663305 INFO  (jetty-launcher-1351-thread-2) [n:127.0.0.1:53031_solr    ] o.a.s.c.Overseer Overseer (id=null) closing
   [junit4]   2> 1663305 INFO  (jetty-launcher-1351-thread-1) [n:127.0.0.1:53030_solr    ] o.a.s.c.LeaderElector Joined leadership election with path: /overseer_elect/election/95766064236789765-127.0.0.1:53030_solr-n_0000000000
   [junit4]   2> 1663305 INFO  (jetty-launcher-1351-thread-2) [n:127.0.0.1:53031_solr    ] o.a.s.c.LeaderElector Joined leadership election with path: /overseer_elect/election/95766064236789766-127.0.0.1:53031_solr-n_0000000001
   [junit4]   2> 1663305 INFO  (jetty-launcher-1351-thread-1) [n:127.0.0.1:53030_solr    ] o.a.s.c.OverseerElectionContext I am going to be the leader 127.0.0.1:53030_solr
   [junit4]   2> 1663306 INFO  (jetty-launcher-1351-thread-1) [n:127.0.0.1:53030_solr    ] o.a.s.c.c.SolrZkClient makePath: /overseer_elect/leader
   [junit4]   2> 1663307 INFO  (jetty-launcher-1351-thread-2) [n:127.0.0.1:53031_solr    ] o.a.s.c.LeaderElector Watching path /overseer_elect/election/95766064236789765-127.0.0.1:53030_solr-n_0000000000 to know if I could be the leader
   [junit4]   2> 1663308 INFO  (jetty-launcher-1351-thread-2) [n:127.0.0.1:53031_solr    ] o.a.s.c.ZkController Register node as live in ZooKeeper:/live_nodes/127.0.0.1:53031_solr
   [junit4]   2> 1663308 INFO  (jetty-launcher-1351-thread-1) [n:127.0.0.1:53030_solr    ] o.a.s.c.Overseer Overseer (id=95766064236789765-127.0.0.1:53030_solr-n_0000000000) starting
   [junit4]   2> 1663308 INFO  (jetty-launcher-1351-thread-2) [n:127.0.0.1:53031_solr    ] o.a.s.c.c.SolrZkClient makePath: /live_nodes/127.0.0.1:53031_solr
   [junit4]   2> 1663310 INFO  (zkCallback-1362-thread-1-processing-n:127.0.0.1:53030_solr) [n:127.0.0.1:53030_solr    ] o.a.s.c.c.ZkStateReader A live node change: [WatchedEvent state:SyncConnected type:NodeChildrenChanged path:/live_nodes], has occurred - updating... (live nodes size: [0])
   [junit4]   2> 1663310 INFO  (zkCallback-1361-thread-1-processing-n:127.0.0.1:53031_solr) [n:127.0.0.1:53031_solr    ] o.a.s.c.c.ZkStateReader A live node change: [WatchedEvent state:SyncConnected type:NodeChildrenChanged path:/live_nodes], has occurred - updating... (live nodes size: [0])
   [junit4]   2> 1663312 INFO  (zkCallback-1362-thread-1-processing-n:127.0.0.1:53030_solr) [n:127.0.0.1:53030_solr    ] o.a.s.c.c.ZkStateReader Updated live nodes from ZooKeeper... (0) -> (1)
   [junit4]   2> 1663312 INFO  (zkCallback-1361-thread-1-processing-n:127.0.0.1:53031_solr) [n:127.0.0.1:53031_solr    ] o.a.s.c.c.ZkStateReader Updated live nodes from ZooKeeper... (0) -> (1)
   [junit4]   2> 1663312 INFO  (jetty-launcher-1351-thread-1) [n:127.0.0.1:53030_solr    ] o.a.s.c.c.SolrZkClient makePath: /overseer/queue-work
   [junit4]   2> 1663322 INFO  (jetty-launcher-1351-thread-2) [n:127.0.0.1:53031_solr    ] o.a.s.c.CoreContainer Security conf doesn't exist. Skipping setup for authorization module.
   [junit4]   2> 1663322 INFO  (jetty-launcher-1351-thread-2) [n:127.0.0.1:53031_solr    ] o.a.s.c.CoreContainer No authentication plugin used.
   [junit4]   2> 1663323 INFO  (jetty-launcher-1351-thread-2) [n:127.0.0.1:53031_solr    ] o.a.s.c.CorePropertiesLocator Looking for core definitions underneath /Users/jenkins/workspace/Lucene-Solr-6.x-MacOSX/solr/build/solr-core/test/J1/temp/solr.schema.TestManagedSchemaAPI_15674B1DEE069395-001/tempDir-001/node2/.
   [junit4]   2> 1663323 INFO  (jetty-launcher-1351-thread-2) [n:127.0.0.1:53031_solr    ] o.a.s.c.CorePropertiesLocator Found 0 core definitions
   [junit4]   2> 1663324 INFO  (jetty-launcher-1351-thread-1) [n:127.0.0.1:53030_solr    ] o.a.s.c.OverseerAutoReplicaFailoverThread Starting OverseerAutoReplicaFailoverThread autoReplicaFailoverWorkLoopDelay=10000 autoReplicaFailoverWaitAfterExpiration=30000 autoReplicaFailoverBadNodeExpiration=60000
   [junit4]   2> 1663324 INFO  (jetty-launcher-1351-thread-2) [n:127.0.0.1:53031_solr    ] o.a.s.s.SolrDispatchFilter user.dir=/Users/jenkins/workspace/Lucene-Solr-6.x-MacOSX/solr/build/solr-core/test/J1
   [junit4]   2> 1663324 INFO  (jetty-launcher-1351-thread-2) [n:127.0.0.1:53031_solr    ] o.a.s.s.SolrDispatchFilter SolrDispatchFilter.init() done
   [junit4]   2> 1663324 INFO  (OverseerCollectionConfigSetProcessor-95766064236789765-127.0.0.1:53030_solr-n_0000000000) [n:127.0.0.1:53030_solr    ] o.a.s.c.OverseerTaskProcessor Process current queue of overseer operations
   [junit4]   2> 1663325 INFO  (OverseerStateUpdate-95766064236789765-127.0.0.1:53030_solr-n_0000000000) [n:127.0.0.1:53030_solr    ] o.a.s.c.Overseer Starting to work on the main queue
   [junit4]   2> 1663325 INFO  (jetty-launcher-1351-thread-1) [n:127.0.0.1:53030_solr    ] o.a.s.c.ZkController Publish node=127.0.0.1:53030_solr as DOWN
   [junit4]   2> 1663328 INFO  (OverseerStateUpdate-95766064236789765-127.0.0.1:53030_solr-n_0000000000) [n:127.0.0.1:53030_solr    ] o.a.s.c.c.ZkStateReader Updated live nodes from ZooKeeper... (1) -> (1)
   [junit4]   2> 1663330 INFO  (OverseerStateUpdate-95766064236789765-127.0.0.1:53030_solr-n_0000000000) [n:127.0.0.1:53030_solr    ] o.a.s.c.Overseer processMessage: queueSize: 1, message = {
   [junit4]   2>   "operation":"downnode",
   [junit4]   2>   "node_name":"127.0.0.1:53030_solr"} current state version: 0
   [junit4]   2> 1663331 INFO  (OverseerStateUpdate-95766064236789765-127.0.0.1:53030_solr-n_0000000000) [n:127.0.0.1:53030_solr    ] o.a.s.c.o.NodeMutator DownNode state invoked for node: 127.0.0.1:53030_solr
   [junit4]   2> 1664330 INFO  (jetty-launcher-1351-thread-1) [n:127.0.0.1:53030_solr    ] o.a.s.c.ZkController Register node as live in ZooKeeper:/live_nodes/127.0.0.1:53030_solr
   [junit4]   2> 1664331 INFO  (jetty-launcher-1351-thread-1) [n:127.0.0.1:53030_solr    ] o.a.s.c.c.SolrZkClient makePath: /live_nodes/127.0.0.1:53030_solr
   [junit4]   2> 1664333 INFO  (zkCallback-1362-thread-1-processing-n:127.0.0.1:53030_solr) [n:127.0.0.1:53030_solr    ] o.a.s.c.c.ZkStateReader A live node change: [WatchedEvent state:SyncConnected type:NodeChildrenChanged path:/live_nodes], has occurred - updating... (live nodes size: [1])
   [junit4]   2> 1664333 INFO  (zkCallback-1361-thread-1-processing-n:127.0.0.1:53031_solr) [n:127.0.0.1:53031_solr    ] o.a.s.c.c.ZkStateReader A live node change: [WatchedEvent state:SyncConnected type:NodeChildrenChanged path:/live_nodes], has occurred - updating... (live nodes size: [1])
   [junit4]   2> 1664334 INFO  (zkCallback-1361-thread-1-processing-n:127.0.0.1:53031_solr) [n:127.0.0.1:53031_solr    ] o.a.s.c.c.ZkStateReader Updated live nodes from ZooKeeper... (1) -> (2)
   [junit4]   2> 1664334 INFO  (zkCallback-1362-thread-1-processing-n:127.0.0.1:53030_solr) [n:127.0.0.1:53030_solr    ] o.a.s.c.c.ZkStateReader Updated live nodes from ZooKeeper... (1) -> (2)
   [junit4]   2> 1664345 INFO  (jetty-launcher-1351-thread-1) [n:127.0.0.1:53030_solr    ] o.a.s.c.CoreContainer Security conf doesn't exist. Skipping setup for authorization module.
   [junit4]   2> 1664345 INFO  (jetty-launcher-1351-thread-1) [n:127.0.0.1:53030_solr    ] o.a.s.c.CoreContainer No authentication plugin used.
   [junit4]   2> 1664346 INFO  (jetty-launcher-1351-thread-1) [n:127.0.0.1:53030_solr    ] o.a.s.c.CorePropertiesLocator Looking for core definitions underneath /Users/jenkins/workspace/Lucene-Solr-6.x-MacOSX/solr/build/solr-core/test/J1/temp/solr.schema.TestManagedSchemaAPI_15674B1DEE069395-001/tempDir-001/node1/.
   [junit4]   2> 1664346 INFO  (jetty-launcher-1351-thread-1) [n:127.0.0.1:53030_solr    ] o.a.s.c.CorePropertiesLocator Found 0 core definitions
   [junit4]   2> 1664347 INFO  (jetty-launcher-1351-thread-1) [n:127.0.0.1:53030_solr    ] o.a.s.s.SolrDispatchFilter user.dir=/Users/jenkins/workspace/Lucene-Solr-6.x-MacOSX/solr/build/solr-core/test/J1
   [junit4]   2> 1664347 INFO  (jetty-launcher-1351-thread-1) [n:127.0.0.1:53030_solr    ] o.a.s.s.SolrDispatchFilter SolrDispatchFilter.init() done
   [junit4]   2> 1664348 INFO  (SUITE-TestManagedSchemaAPI-seed#[15674B1DEE069395]-worker) [    ] o.a.s.c.c.SolrZkClient Using default ZkCredentialsProvider
   [junit4]   2> 1664349 INFO  (SUITE-TestManagedSchemaAPI-seed#[15674B1DEE069395]-worker) [    ] o.a.s.c.c.ConnectionManager Waiting for client to connect to ZooKeeper
   [junit4]   2> 1664350 INFO  (zkCallback-1363-thread-1) [    ] o.a.s.c.c.ConnectionManager Watcher org.apache.solr.common.cloud.ConnectionManager@1f2600dc name:ZooKeeperConnection Watcher:127.0.0.1:53028 got event WatchedEvent state:SyncConnected type:None path:null path:null type:None
   [junit4]   2> 1664351 INFO  (SUITE-TestManagedSchemaAPI-seed#[15674B1DEE069395]-worker) [    ] o.a.s.c.c.ConnectionManager Client is connected to ZooKeeper
   [junit4]   2> 1664351 INFO  (SUITE-TestManagedSchemaAPI-seed#[15674B1DEE069395]-worker) [    ] o.a.s.c.c.SolrZkClient Using default ZkACLProvider
   [junit4]   2> 1664353 INFO  (SUITE-TestManagedSchemaAPI-seed#[15674B1DEE069395]-worker) [    ] o.a.s.c.s.i.CloudSolrClient Final constructed zkHost string: 127.0.0.1:53028/solr
   [junit4]   2> 1664353 INFO  (SUITE-TestManagedSchemaAPI-seed#[15674B1DEE069395]-worker) [    ] o.a.s.c.c.SolrZkClient Using default ZkCredentialsProvider
   [junit4]   2> 1664354 INFO  (SUITE-TestManagedSchemaAPI-seed#[15674B1DEE069395]-worker) [    ] o.a.s.c.c.ConnectionManager Waiting for client to connect to ZooKeeper
   [junit4]   2> 1664355 INFO  (zkCallback-1365-thread-1) [    ] o.a.s.c.c.ConnectionManager Watcher org.apache.solr.common.cloud.ConnectionManager@64f0407a name:ZooKeeperConnection Watcher:127.0.0.1:53028/solr got event WatchedEvent state:SyncConnected type:None path:null path:null type:None
   [junit4]   2> 1664355 INFO  (SUITE-TestManagedSchemaAPI-seed#[15674B1DEE069395]-worker) [    ] o.a.s.c.c.ConnectionManager Client is connected to ZooKeeper
   [junit4]   2> 1664356 INFO  (SUITE-TestManagedSchemaAPI-seed#[15674B1DEE069395]-worker) [    ] o.a.s.c.c.SolrZkClient Using default ZkACLProvider
   [junit4]   2> 1664356 INFO  (SUITE-TestManagedSchemaAPI-seed#[15674B1DEE069395]-worker) [    ] o.a.s.c.c.ZkStateReader Updating cluster state from ZooKeeper... 
   [junit4]   2> 1664358 INFO  (SUITE-TestManagedSchemaAPI-seed#[15674B1DEE069395]-worker) [    ] o.a.s.c.c.ZkStateReader Updated live nodes from ZooKeeper... (0) -> (2)
   [junit4]   2> 1664359 INFO  (SUITE-TestManagedSchemaAPI-seed#[15674B1DEE069395]-worker) [    ] o.a.s.c.c.SolrZkClient makePath: /configs/conf1/managed-schema
   [junit4]   2> 1664366 INFO  (SUITE-TestManagedSchemaAPI-seed#[15674B1DEE069395]-worker) [    ] o.a.s.c.c.SolrZkClient makePath: /configs/conf1/solrconfig.xml
   [junit4]   2> 1664386 INFO  (TEST-TestManagedSchemaAPI.test-seed#[15674B1DEE069395]) [    ] o.a.s.SolrTestCaseJ4 ###Starting test
   [junit4]   2> 1664391 INFO  (qtp231214276-7953) [n:127.0.0.1:53031_solr    ] o.a.s.h.a.CollectionsHandler Invoked Collection Action :create with params replicationFactor=2&collection.configName=conf1&name=testschemaapi&action=CREATE&numShards=1&wt=javabin&version=2 and sendToOCPQueue=true
   [junit4]   2> 1664395 INFO  (OverseerCollectionConfigSetProcessor-95766064236789765-127.0.0.1:53030_solr-n_0000000000) [n:127.0.0.1:53030_solr    ] o.a.s.c.OverseerTaskProcessor Overseer Collection Message Handler: Get the message id:/overseer/collection-queue-work/qn-0000000000 message:{
   [junit4]   2>   "name":"testschemaapi",
   [junit4]   2>   "fromApi":"true",
   [junit4]   2>   "replicationFactor":"2",
   [junit4]   2>   "collection.configName":"conf1",
   [junit4]   2>   "numShards":"1",
   [junit4]   2>   "stateFormat":"2",
   [junit4]   2>   "operation":"create"}
   [junit4]   2> 1664396 INFO  (OverseerThreadFactory-3740-thread-1-processing-n:127.0.0.1:53030_solr) [n:127.0.0.1:53030_solr    ] o.a.s.c.OverseerCollectionMessageHandler OverseerCollectionMessageHandler.processMessage : create , {
   [junit4]   2>   "name":"testschemaapi",
   [junit4]   2>   "fromApi":"true",
   [junit4]   2>   "replicationFactor":"2",
   [junit4]   2>   "collection.configName":"conf1",
   [junit4]   2>   "numShards":"1",
   [junit4]   2>   "stateFormat":"2",
   [junit4]   2>   "operation":"create"}
   [junit4]   2> 1664396 INFO  (OverseerThreadFactory-3740-thread-1-processing-n:127.0.0.1:53030_solr) [n:127.0.0.1:53030_solr    ] o.a.s.c.OverseerCollectionMessageHandler Create collection testschemaapi
   [junit4]   2> 1664398 INFO  (OverseerThreadFactory-3740-thread-1-processing-n:127.0.0.1:53030_solr) [n:127.0.0.1:53030_solr    ] o.a.s.c.OverseerCollectionMessageHandler creating collections conf node /collections/testschemaapi 
   [junit4]   2> 1664398 INFO  (OverseerThreadFactory-3740-thread-1-processing-n:127.0.0.1:53030_solr) [n:127.0.0.1:53030_solr    ] o.a.s.c.c.SolrZkClient makePath: /collections/testschemaapi
   [junit4]   2> 1664400 INFO  (zkCallback-1362-thread-1-processing-n:127.0.0.1:53030_solr) [n:127.0.0.1:53030_solr    ] o.a.s.c.c.ZkStateReader A collections change: [WatchedEvent state:SyncConnected type:NodeChildrenChanged path:/collections], has occurred - updating...
   [junit4]   2> 1664400 INFO  (zkCallback-1361-thread-1-processing-n:127.0.0.1:53031_solr) [n:127.0.0.1:53031_solr    ] o.a.s.c.c.ZkStateReader A collections change: [WatchedEvent state:SyncConnected type:NodeChildrenChanged path:/collections], has occurred - updating...
   [junit4]   2> 1664400 INFO  (zkCallback-1365-thread-1) [    ] o.a.s.c.c.ZkStateReader A collections change: [WatchedEvent state:SyncConnected type:NodeChildrenChanged path:/collections], has occurred - updating...
   [junit4]   2> 1664404 INFO  (OverseerStateUpdate-95766064236789765-127.0.0.1:53030_solr-n_0000000000) [n:127.0.0.1:53030_solr    ] o.a.s.c.Overseer processMessage: queueSize: 1, message = {
   [junit4]   2>   "name":"testschemaapi",
   [junit4]   2>   "fromApi":"true",
   [junit4]   2>   "replicationFactor":"2",
   [junit4]   2>   "collection.configName":"conf1",
   [junit4]   2>   "numShards":"1",
   [junit4]   2>   "stateFormat":"2",
   [junit4]   2>   "operation":"create"} current state version: 0
   [junit4]   2> 1664404 INFO  (OverseerStateUpdate-95766064236789765-127.0.0.1:53030_solr-n_0000000000) [n:127.0.0.1:53030_solr    ] o.a.s.c.o.ClusterStateMutator building a new cName: testschemaapi
   [junit4]   2> 1664406 INFO  (OverseerStateUpdate-95766064236789765-127.0.0.1:53030_solr-n_0000000000) [n:127.0.0.1:53030_solr    ] o.a.s.c.o.ZkStateWriter going to create_collection /collections/testschemaapi/state.json
   [junit4]   2> 1664505 INFO  (OverseerThreadFactory-3740-thread-1-processing-n:127.0.0.1:53030_solr) [n:127.0.0.1:53030_solr    ] o.a.s.c.OverseerCollectionMessageHandler Creating SolrCores for new collection testschemaapi, shardNames [shard1] , replicationFactor : 2
   [junit4]   2> 1664505 INFO  (OverseerThreadFactory-3740-thread-1-processing-n:127.0.0.1:53030_solr) [n:127.0.0.1:53030_solr    ] o.a.s.c.OverseerCollectionMessageHandler Creating core testschemaapi_shard1_replica1 as part of shard shard1 of collection testschemaapi on 127.0.0.1:53030_solr
   [junit4]   2> 1664506 INFO  (OverseerThreadFactory-3740-thread-1-processing-n:127.0.0.1:53030_solr) [n:127.0.0.1:53030_solr    ] o.a.s.c.OverseerCollectionMessageHandler Creating core testschemaapi_shard1_replica2 as part of shard shard1 of collection testschemaapi on 127.0.0.1:53031_solr
   [junit4]   2> 1664509 INFO  (qtp276665345-7946) [n:127.0.0.1:53030_solr    ] o.a.s.h.a.CoreAdminOperation core create command qt=/admin/cores&collection.configName=conf1&name=testschemaapi_shard1_replica1&action=CREATE&numShards=1&collection=testschemaapi&shard=shard1&wt=javabin&version=2
   [junit4]   2> 1664510 INFO  (qtp231214276-7956) [n:127.0.0.1:53031_solr    ] o.a.s.h.a.CoreAdminOperation core create command qt=/admin/cores&collection.configName=conf1&name=testschemaapi_shard1_replica2&action=CREATE&numShards=1&collection=testschemaapi&shard=shard1&wt=javabin&version=2
   [junit4]   2> 1664510 INFO  (qtp276665345-7946) [n:127.0.0.1:53030_solr    ] o.a.s.c.CoreDescriptor Created CoreDescriptor: {name=testschemaapi_shard1_replica1, collection.configName=conf1, config=solrconfig.xml, transient=false, schema=schema.xml, loadOnStartup=true, configSetProperties=configsetprops.json, collection=testschemaapi, numShards=1, dataDir=data/, shard=shard1}
   [junit4]   2> 1664510 INFO  (qtp231214276-7956) [n:127.0.0.1:53031_solr    ] o.a.s.c.CoreDescriptor Created CoreDescriptor: {name=testschemaapi_shard1_replica2, collection.configName=conf1, config=solrconfig.xml, transient=false, schema=schema.xml, loadOnStartup=true, configSetProperties=configsetprops.json, collection=testschemaapi, numShards=1, dataDir=data/, shard=shard1}
   [junit4]   2> 1664512 INFO  (qtp231214276-7956) [n:127.0.0.1:53031_solr c:testschemaapi s:shard1  x:testschemaapi_shard1_replica2] o.a.s.c.ZkController publishing state=down
   [junit4]   2> 1664512 INFO  (qtp276665345-7946) [n:127.0.0.1:53030_solr c:testschemaapi s:shard1  x:testschemaapi_shard1_replica1] o.a.s.c.ZkController publishing state=down
   [junit4]   2> 1664514 INFO  (qtp231214276-7956) [n:127.0.0.1:53031_solr c:testschemaapi s:shard1  x:testschemaapi_shard1_replica2] o.a.s.c.ZkController Registering watch for collection testschemaapi
   [junit4]   2> 1664514 INFO  (qtp231214276-7956) [n:127.0.0.1:53031_solr c:testschemaapi s:shard1  x:testschemaapi_shard1_replica2] o.a.s.c.c.ZkStateReader addZkWatch [testschemaapi]
   [junit4]   2> 1664514 INFO  (qtp276665345-7946) [n:127.0.0.1:53030_solr c:testschemaapi s:shard1  x:testschemaapi_shard1_replica1] o.a.s.c.ZkController Registering watch for collection testschemaapi
   [junit4]   2> 1664514 INFO  (qtp276665345-7946) [n:127.0.0.1:53030_solr c:testschemaapi s:shard1  x:testschemaapi_shard1_replica1] o.a.s.c.c.ZkStateReader addZkWatch [testschemaapi]
   [junit4]   2> 1664514 INFO  (qtp231214276-7956) [n:127.0.0.1:53031_solr c:testschemaapi s:shard1  x:testschemaapi_shard1_replica2] o.a.s.c.c.ZkStateReader Add data for [testschemaapi] ver [0]
   [junit4]   2> 1664515 INFO  (qtp231214276-7956) [n:127.0.0.1:53031_solr c:testschemaapi s:shard1  x:testschemaapi_shard1_replica2] o.a.s.c.ZkController look for our core node name
   [junit4]   2> 1664515 INFO  (qtp276665345-7946) [n:127.0.0.1:53030_solr c:testschemaapi s:shard1  x:testschemaapi_shard1_replica1] o.a.s.c.c.ZkStateReader Add data for [testschemaapi] ver [0]
   [junit4]   2> 1664515 INFO  (OverseerStateUpdate-95766064236789765-127.0.0.1:53030_solr-n_0000000000) [n:127.0.0.1:53030_solr    ] o.a.s.c.Overseer processMessage: queueSize: 2, message = {
   [junit4]   2>   "core":"testschemaapi_shard1_replica2",
   [junit4]   2>   "roles":null,
   [junit4]   2>   "base_url":"http://127.0.0.1:53031/solr",
   [junit4]   2>   "node_name":"127.0.0.1:53031_solr",
   [junit4]   2>   "numShards":"1",
   [junit4]   2>   "state":"down",
   [junit4]   2>   "shard":"shard1",
   [junit4]   2>   "collection":"testschemaapi",
   [junit4]   2>   "operation":"state"} current state version: 0
   [junit4]   2> 1664515 INFO  (qtp276665345-7946) [n:127.0.0.1:53030_solr c:testschemaapi s:shard1  x:testschemaapi_shard1_replica1] o.a.s.c.ZkController look for our core node name
   [junit4]   2> 1664516 INFO  (OverseerStateUpdate-95766064236789765-127.0.0.1:53030_solr-n_0000000000) [n:127.0.0.1:53030_solr    ] o.a.s.c.o.ReplicaMutator Update state numShards=1 message={
   [junit4]   2>   "core":"testschemaapi_shard1_replica2",
   [junit4]   2>   "roles":null,
   [junit4]   2>   "base_url":"http://127.0.0.1:53031/solr",
   [junit4]   2>   "node_name":"127.0.0.1:53031_solr",
   [junit4]   2>   "numShards":"1",
   [junit4]   2>   "state":"down",
   [junit4]   2>   "shard":"shard1",
   [junit4]   2>   "collection":"testschemaapi",
   [junit4]   2>   "operation":"state"}
   [junit4]   2> 1664519 INFO  (OverseerStateUpdate-95766064236789765-127.0.0.1:53030_solr-n_0000000000) [n:127.0.0.1:53030_solr    ] o.a.s.c.Overseer processMessage: queueSize: 2, message = {
   [junit4]   2>   "core":"testschemaapi_shard1_replica1",
   [junit4]   2>   "roles":null,
   [junit4]   2>   "base_url":"http://127.0.0.1:53030/solr",
   [junit4]   2>   "node_name":"127.0.0.1:53030_solr",
   [junit4]   2>   "numShards":"1",
   [junit4]   2>   "state":"down",
   [junit4]   2>   "shard":"shard1",
   [junit4]   2>   "collection":"testschemaapi",
   [junit4]   2>   "operation":"state"} current state version: 0
   [junit4]   2> 1664519 INFO  (OverseerStateUpdate-95766064236789765-127.0.0.1:53030_solr-n_0000000000) [n:127.0.0.1:53030_solr    ] o.a.s.c.o.ReplicaMutator Update state numShards=1 message={
   [junit4]   2>   "core":"testschemaapi_shard1_replica1",
   [junit4]   2>   "roles":null,
   [junit4]   2>   "base_url":"http://127.0.0.1:53030/solr",
   [junit4]   2>   "node_name":"127.0.0.1:53030_solr",
   [junit4]   2>   "numShards":"1",
   [junit4]   2>   "state":"down",
   [junit4]   2>   "shard":"shard1",
   [junit4]   2>   "collection":"testschemaapi",
   [junit4]   2>   "operation":"state"}
   [junit4]   2> 1664623 INFO  (OverseerStateUpdate-95766064236789765-127.0.0.1:53030_solr-n_0000000000) [n:127.0.0.1:53030_solr    ] o.a.s.c.o.ZkStateWriter going to update_collection /collections/testschemaapi/state.json version: 0
   [junit4]   2> 1664624 INFO  (zkCallback-1362-thread-1-processing-n:127.0.0.1:53030_solr) [n:127.0.0.1:53030_solr    ] o.a.s.c.c.ZkStateReader A cluster state change: [WatchedEvent state:SyncConnected type:NodeDataChanged path:/collections/testschemaapi/state.json] for collection [testschemaapi] has occurred - updating... (live nodes size: [2])
   [junit4]   2> 1664624 INFO  (zkCallback-1361-thread-1-processing-n:127.0.0.1:53031_solr) [n:127.0.0.1:53031_solr    ] o.a.s.c.c.ZkStateReader A cluster state change: [WatchedEvent state:SyncConnected type:NodeDataChanged path:/collections/testschemaapi/state.json] for collection [testschemaapi] has occurred - updating... (live nodes size: [2])
   [junit4]   2> 1664625 INFO  (zkCallback-1361-thread-1-processing-n:127.0.0.1:53031_solr) [n:127.0.0.1:53031_solr    ] o.a.s.c.c.ZkStateReader Updating data for [testschemaapi] from [0] to [1]
   [junit4]   2> 1664625 INFO  (zkCallback-1362-thread-1-processing-n:127.0.0.1:53030_solr) [n:127.0.0.1:53030_solr    ] o.a.s.c.c.ZkStateReader Updating data for [testschemaapi] from [0] to [1]
   [junit4]   2> 1665515 INFO  (qtp231214276-7956) [n:127.0.0.1:53031_solr c:testschemaapi s:shard1  x:testschemaapi_shard1_replica2] o.a.s.c.ZkController waiting to find shard id in clusterstate for testschemaapi_shard1_replica2
   [junit4]   2> 1665515 INFO  (qtp231214276-7956) [n:127.0.0.1:53031_solr c:testschemaapi s:shard1  x:testschemaapi_shard1_replica2] o.a.s.c.ZkController Check for collection zkNode:testschemaapi
   [junit4]   2> 1665516 INFO  (qtp276665345-7946) [n:127.0.0.1:53030_solr c:testschemaapi s:shard1  x:testschemaapi_shard1_replica1] o.a.s.c.ZkController waiting to find shard id in clusterstate for testschemaapi_shard1_replica1
   [junit4]   2> 1665516 INFO  (qtp276665345-7946) [n:127.0.0.1:53030_solr c:testschemaapi s:shard1  x:testschemaapi_shard1_replica1] o.a.s.c.ZkController Check for collection zkNode:testschemaapi
   [junit4]   2> 1665516 INFO  (qtp231214276-7956) [n:127.0.0.1:53031_solr c:testschemaapi s:shard1  x:testschemaapi_shard1_replica2] o.a.s.c.ZkController Collection zkNode exists
   [junit4]   2> 1665516 INFO  (qtp231214276-7956) [n:127.0.0.1:53031_solr c:testschemaapi s:shard1  x:testschemaapi_shard1_replica2] o.a.s.c.c.ZkStateReader Load collection config from: [/collections/testschemaapi]
   [junit4]   2> 1665517 INFO  (qtp276665345-7946) [n:127.0.0.1:53030_solr c:testschemaapi s:shard1  x:testschemaapi_shard1_replica1] o.a.s.c.ZkController Collection zkNode exists
   [junit4]   2> 1665517 INFO  (qtp276665345-7946) [n:127.0.0.1:53030_solr c:testschemaapi s:shard1  x:testschemaapi_shard1_replica1] o.a.s.c.c.ZkStateReader Load collection config from: [/collections/testschemaapi]
   [junit4]   2> 1665518 INFO  (qtp231214276-7956) [n:127.0.0.1:53031_solr c:testschemaapi s:shard1  x:testschemaapi_shard1_replica2] o.a.s.c.c.ZkStateReader path=[/collections/testschemaapi] [configName]=[conf1] specified config exists in ZooKeeper
   [junit4]   2> 1665518 INFO  (qtp231214276-7956) [n:127.0.0.1:53031_solr c:testschemaapi s:shard1  x:testschemaapi_shard1_replica2] o.a.s.c.SolrResourceLoader new SolrResourceLoader for directory: '/Users/jenkins/workspace/Lucene-Solr-6.x-MacOSX/solr/build/solr-core/test/J1/temp/solr.schema.TestManagedSchemaAPI_15674B1DEE069395-001/tempDir-001/node2/testschemaapi_shard1_replica2'
   [junit4]   2> 1665518 INFO  (qtp231214276-7956) [n:127.0.0.1:53031_solr c:testschemaapi s:shard1  x:testschemaapi_shard1_replica2] o.a.s.c.SolrResourceLoader JNDI not configured for solr (NoInitialContextEx)
   [junit4]   2> 1665518 INFO  (qtp276665345-7946) [n:127.0.0.1:53030_solr c:testschemaapi s:shard1  x:testschemaapi_shard1_replica1] o.a.s.c.c.ZkStateReader path=[/collections/testschemaapi] [configName]=[conf1] specified config exists in ZooKeeper
   [junit4]   2> 1665518 INFO  (qtp276665345-7946) [n:127.0.0.1:53030_solr c:testschemaapi s:shard1  x:testschemaapi_shard1_replica1] o.a.s.c.SolrResourceLoader new SolrResourceLoader for directory: '/Users/jenkins/workspace/Lucene-Solr-6.x-MacOSX/solr/build/solr-core/test/J1/temp/solr.schema.TestManagedSchemaAPI_15674B1DEE069395-001/tempDir-001/node1/testschemaapi_shard1_replica1'
   [junit4]   2> 1665518 INFO  (qtp231214276-7956) [n:127.0.0.1:53031_solr c:testschemaapi s:shard1  x:testschemaapi_shard1_replica2] o.a.s.c.SolrResourceLoader solr home defaulted to 'solr/' (could not find system property or JNDI)
   [junit4]   2> 1665518 INFO  (qtp276665345-7946) [n:127.0.0.1:53030_solr c:testschemaapi s:shard1  x:testschemaapi_shard1_replica1] o.a.s.c.SolrResourceLoader JNDI not configured for solr (NoInitialContextEx)
   [junit4]   2> 1665519 INFO  (qtp276665345-7946) [n:127.0.0.1:53030_solr c:testschemaapi s:shard1  x:testschemaapi_shard1_replica1] o.a.s.c.SolrResourceLoader solr home defaulted to 'solr/' (could not find system property or JNDI)
   [junit4]   2> 1665520 INFO  (qtp231214276-7956) [n:127.0.0.1:53031_solr c:testschemaapi s:shard1  x:testschemaapi_shard1_replica2] o.a.s.c.Config loaded config solrconfig.xml with version 0 
   [junit4]   2> 1665539 INFO  (qtp276665345-7946) [n:127.0.0.1:53030_solr c:testschemaapi s:shard1  x:testschemaapi_shard1_replica1] o.a.s.c.Config loaded config solrconfig.xml with version 0 
   [junit4]   2> 1665542 INFO  (qtp231214276-7956) [n:127.0.0.1:53031_solr c:testschemaapi s:shard1  x:testschemaapi_shard1_replica2] o.a.s.c.SolrConfig current version of requestparams : -1
   [junit4]   2> 1665544 INFO  (qtp276665345-7946) [n:127.0.0.1:53030_solr c:testschemaapi s:shard1  x:testschemaapi_shard1_replica1] o.a.s.c.SolrConfig current version of requestparams : -1
   [junit4]   2> 1665545 INFO  (qtp231214276-7956) [n:127.0.0.1:53031_solr c:testschemaapi s:shard1  x:testschemaapi_shard1_replica2] o.a.s.c.SolrConfig Using Lucene MatchVersion: 6.1.0
   [junit4]   2> 1665567 INFO  (qtp276665345-7946) [n:127.0.0.1:53030_solr c:testschemaapi s:shard1  x:testschemaapi_shard1_replica1] o.a.s.c.SolrConfig Using Lucene MatchVersion: 6.1.0
   [junit4]   2> 1665572 INFO  (qtp231214276-7956) [n:127.0.0.1:53031_solr c:testschemaapi s:shard1  x:testschemaapi_shard1_replica2] o.a.s.c.SolrConfig Loaded SolrConfig: solrconfig.xml
   [junit4]   2> 1665574 INFO  (qtp276665345-7946) [n:127.0.0.1:53030_solr c:testschemaapi s:shard1  x:testschemaapi_shard1_replica1] o.a.s.c.SolrConfig Loaded SolrConfig: solrconfig.xml
   [junit4]   2> 1665578 INFO  (qtp231214276-7956) [n:127.0.0.1:53031_solr c:testschemaapi s:shard1  x:testschemaapi_shard1_replica2] o.a.s.s.IndexSchema [testschemaapi_shard1_replica2] Schema name=minimal
   [junit4]   2> 1665579 INFO  (qtp276665345-7946) [n:127.0.0.1:53030_solr c:testschemaapi s:shard1  x:testschemaapi_shard1_replica1] o.a.s.s.IndexSchema [testschemaapi_shard1_replica1] Schema name=minimal
   [junit4]   2> 1665584 INFO  (qtp231214276-7956) [n:127.0.0.1:53031_solr c:testschemaapi s:shard1  x:testschemaapi_shard1_replica2] o.a.s.s.IndexSchema unique key field: id
   [junit4]   2> 1665585 INFO  (qtp276665345-7946) [n:127.0.0.1:53030_solr c:testschemaapi s:shard1  x:testschemaapi_shard1_replica1] o.a.s.s.IndexSchema unique key field: id
   [junit4]   2> 1665588 INFO  (qtp276665345-7946) [n:127.0.0.1:53030_solr c:testschemaapi s:shard1  x:testschemaapi_shard1_replica1] o.a.s.c.ConfigSetProperties Did not find ConfigSet properties, assuming default properties: Can't find resource 'configsetprops.json' in classpath or '/configs/conf1', cwd=/Users/jenkins/workspace/Lucene-Solr-6.x-MacOSX/solr/build/solr-core/test/J1
   [junit4]   2> 1665588 INFO  (qtp231214276-7956) [n:127.0.0.1:53031_solr c:testschemaapi s:shard1  x:testschemaapi_shard1_replica2] o.a.s.c.ConfigSetProperties Did not find ConfigSet properties, assuming default properties: Can't find resource 'configsetprops.json' in classpath or '/configs/conf1', cwd=/Users/jenkins/workspace/Lucene-Solr-6.x-MacOSX/solr/build/solr-core/test/J1
   [junit4]   2> 1665588 INFO  (qtp276665345-7946) [n:127.0.0.1:53030_solr c:testschemaapi s:shard1  x:testschemaapi_shard1_replica1] o.a.s.c.CoreContainer Creating SolrCore 'testschemaapi_shard1_replica1' using configuration from collection testschemaapi
   [junit4]   2> 1665588 INFO  (qtp231214276-7956) [n:127.0.0.1:53031_solr c:testschemaapi s:shard1  x:testschemaapi_shard1_replica2] o.a.s.c.CoreContainer Creating SolrCore 'testschemaapi_shard1_replica2' using configuration from collection testschemaapi
   [junit4]   2> 1665589 INFO  (qtp276665345-7946) [n:127.0.0.1:53030_solr c:testschemaapi s:shard1 r:core_node2 x:testschemaapi_shard1_replica1] o.a.s.c.SolrCore org.apache.solr.core.MockDirectoryFactory
   [junit4]   2> 1665589 INFO  (qtp231214276-7956) [n:127.0.0.1:53031_solr c:testschemaapi s:shard1 r:core_node1 x:testschemaapi_shard1_replica2] o.a.s.c.SolrCore org.apache.solr.core.MockDirectoryFactory
   [junit4]   2> 1665589 INFO  (qtp276665345-7946) [n:127.0.0.1:53030_solr c:testschemaapi s:shard1 r:core_node2 x:testschemaapi_shard1_replica1] o.a.s.c.SolrCore [[testschemaapi_shard1_replica1] ] Opening new SolrCore at [/Users/jenkins/workspace/Lucene-Solr-6.x-MacOSX/solr/build/solr-core/test/J1/temp/solr.schema.TestManagedSchemaAPI_15674B1DEE069395-001/tempDir-001/node1/testschemaapi_shard1_replica1], dataDir=[/Users/jenkins/workspace/Lucene-Solr-6.x-MacOSX/solr/build/solr-core/test/J1/temp/solr.schema.TestManagedSchemaAPI_15674B1DEE069395-001/tempDir-001/node1/./testschemaapi_shard1_replica1/data/]
   [junit4]   2> 1665589 INFO  (qtp276665345-7946) [n:127.0.0.1:53030_solr c:testschemaapi s:shard1 r:core_node2 x:testschemaapi_shard1_replica1] o.a.s.c.SolrCore JMX monitoring not detected for core: testschemaapi_shard1_replica1
   [junit4]   2> 1665589 INFO  (qtp231214276-7956) [n:127.0.0.1:53031_solr c:testschemaapi s:shard1 r:core_node1 x:testschemaapi_shard1_replica2] o.a.s.c.SolrCore [[testschemaapi_shard1_replica2] ] Opening new SolrCore at [/Users/jenkins/workspace/Lucene-Solr-6.x-MacOSX/solr/build/solr-core/test/J1/temp/solr.schema.TestManagedSchemaAPI_15674B1DEE069395-001/tempDir-001/node2/testschemaapi_shard1_replica2], dataDir=[/Users/jenkins/workspace/Lucene-Solr-6.x-MacOSX/solr/build/solr-core/test/J1/temp/solr.schema.TestManagedSchemaAPI_15674B1DEE069395-001/tempDir-001/node2/./testschemaapi_shard1_replica2/data/]
   [junit4]   2> 1665589 INFO  (qtp231214276-7956) [n:127.0.0.1:53031_solr c:testschemaapi s:shard1 r:core_node1 x:testschemaapi_shard1_replica2] o.a.s.c.SolrCore JMX monitoring not detected for core: testschemaapi_shard1_replica2
   [junit4]   2> 1665590 INFO  (qtp276665345-7946) [n:127.0.0.1:53030_solr c:testschemaapi s:shard1 r:core_node2 x:testschemaapi_shard1_replica1] o.a.s.c.CachingDirectoryFactory return new directory for /Users/jenkins/workspace/Lucene-Solr-6.x-MacOSX/solr/build/solr-core/test/J1/temp/solr.schema.TestManagedSchemaAPI_15674B1DEE069395-001/tempDir-001/node1/./testschemaapi_shard1_replica1/data
   [junit4]   2> 1665590 INFO  (qtp276665345-7946) [n:127.0.0.1:53030_solr c:testschemaapi s:shard1 r:core_node2 x:testschemaapi_shard1_replica1] o.a.s.c.SolrCore New index directory detected: old=null new=/Users/jenkins/workspace/Lucene-Solr-6.x-MacOSX/solr/build/solr-core/test/J1/temp/solr.schema.TestManagedSchemaAPI_15674B1DEE069395-001/tempDir-001/node1/./testschemaapi_shard1_replica1/data/index/
   [junit4]   2> 1665590 INFO  (qtp231214276-7956) [n:127.0.0.1:53031_solr c:testschemaapi s:shard1 r:core_node1 x:testschemaapi_shard1_replica2] o.a.s.c.CachingDirectoryFactory return new directory for /Users/jenkins/workspace/Lucene-Solr-6.x-MacOSX/solr/build/solr-core/test/J1/temp/solr.schema.TestManagedSchemaAPI_15674B1DEE069395-001/tempDir-001/node2/./testschemaapi_shard1_replica2/data
   [junit4]   2> 1665590 WARN  (qtp276665345-7946) [n:127.0.0.1:53030_solr c:testschemaapi s:shard1 r:core_node2 x:testschemaapi_shard1_replica1] o.a.s.c.SolrCore [testschemaapi_shard1_replica1] Solr index directory '/Users/jenkins/workspace/Lucene-Solr-6.x-MacOSX/solr/build/solr-core/test/J1/temp/solr.schema.TestManagedSchemaAPI_15674B1DEE069395-001/tempDir-001/node1/./testschemaapi_shard1_replica1/data/index' doesn't exist. Creating new index...
   [junit4]   2> 1665591 INFO  (qtp231214276-7956) [n:127.0.0.1:53031_solr c:testschemaapi s:shard1 r:core_node1 x:testschemaapi_shard1_replica2] o.a.s.c.SolrCore New index directory detected: old=null new=/Users/jenkins/workspace/Lucene-Solr-6.x-MacOSX/solr/build/solr-core/test/J1/temp/solr.schema.TestManagedSchemaAPI_15674B1DEE069395-001/tempDir-001/node2/./testschemaapi_shard1_replica2/data/index/
   [junit4]   2> 1665591 WARN  (qtp231214276-7956) [n:127.0.0.1:53031_solr c:testschemaapi s:shard1 r:core_node1 x:testschemaapi_shard1_replica2] o.a.s.c.SolrCore [testschemaapi_shard1_replica2] Solr index directory '/Users/jenkins/workspace/Lucene-Solr-6.x-MacOSX/solr/build/solr-core/test/J1/temp/solr.schema.TestManagedSchemaAPI_15674B1DEE069395-001/tempDir-001/node2/./testschemaapi_shard1_replica2/data/index' doesn't exist. Creating new index...
   [junit4]   2> 1665591 INFO  (qtp276665345-7946) [n:127.0.0.1:53030_solr c:testschemaapi s:shard1 r:core_node2 x:testschemaapi_shard1_replica1] o.a.s.c.CachingDirectoryFactory return new directory for /Users/jenkins/workspace/Lucene-Solr-6.x-MacOSX/solr/build/solr-core/test/J1/temp/solr.schema.TestManagedSchemaAPI_15674B1DEE069395-001/tempDir-001/node1/./testschemaapi_shard1_replica1/data/index
   [junit4]   2> 1665593 INFO  (qtp231214276-7956) [n:127.0.0.1:53031_solr c:testschemaapi s:shard1 r:core_node1 x:testschemaapi_shard1_replica2] o.a.s.c.CachingDirectoryFactory return new directory for /Users/jenkins/workspace/Lucene-Solr-6.x-MacOSX/solr/build/solr-core/test/J1/temp/solr.schema.TestManagedSchemaAPI_15674B1DEE069395-001/tempDir-001/node2/./testschemaapi_shard1_replica2/data/index
   [junit4]   2> 1665593 INFO  (qtp276665345-7946) [n:127.0.0.1:53030_solr c:testschemaapi s:shard1 r:core_node2 x:testschemaapi_shard1_replica1] o.a.s.c.SolrDeletionPolicy SolrDeletionPolicy.onCommit: commits: num=1
   [junit4]   2> 	commit{dir=MockDirectoryWrapper(RAMDirectory@6f96ae67 lockFactory=org.apache.lucene.store.SingleInstanceLockFactory@2d1d079f),segFN=segments_1,generation=1}
   [junit4]   2> 1665594 INFO  (qtp276665345-7946) [n:127.0.0.1:53030_solr c:testschemaapi s:shard1 r:core_node2 x:testschemaapi_shard1_replica1] o.a.s.c.SolrDeletionPolicy newest commit generation = 1
   [junit4]   2> 1665594 INFO  (qtp231214276-7956) [n:127.0.0.1:53031_solr c:testschemaapi s:shard1 r:core_node1 x:testschemaapi_shard1_replica2] o.a.s.c.SolrDeletionPolicy SolrDeletionPolicy.onCommit: commits: num=1
   [junit4]   2> 	commit{dir=MockDirectoryWrapper(RAMDirectory@bc8fe76 lockFactory=org.apache.lucene.store.SingleInstanceLockFactory@676bdedf),segFN=segments_1,generation=1}
   [junit4]   2> 1665594 INFO  (qtp231214276-7956) [n:127.0.0.1:53031_solr c:testschemaapi s:shard1 r:core_node1 x:testschemaapi_shard1_replica2] o.a.s.c.SolrDeletionPolicy newest commit generation = 1
   [junit4]   2> 1665595 INFO  (OldIndexDirectoryCleanupThreadForCore-testschemaapi_shard1_replica1) [n:127.0.0.1:53030_solr c:testschemaapi s:shard1 r:core_node2 x:testschemaapi_shard1_replica1] o.a.s.c.SolrCore Looking for old index directories to cleanup for core testschemaapi_shard1_replica1 in /Users/jenkins/workspace/Lucene-Solr-6.x-MacOSX/solr/build/solr-core/test/J1/temp/solr.schema.TestManagedSchemaAPI_15674B1DEE069395-001/tempDir-001/node1/./testschemaapi_shard1_replica1/data/
   [junit4]   2> 1665595 WARN  (OldIndexDirectoryCleanupThreadForCore-testschemaapi_shard1_replica1) [n:127.0.0.1:53030_solr c:testschemaapi s:shard1 r:core_node2 x:testschemaapi_shard1_replica1] o.a.s.c.DirectoryFactory /Users/jenkins/workspace/Lucene-Solr-6.x-MacOSX/solr/build/solr-core/test/J1/temp/solr.schema.TestManagedSchemaAPI_15674B1DEE069395-001/tempDir-001/node1/./testschemaapi_shard1_replica1/data/ does not point to a valid data directory; skipping clean-up of old index directories.
   [junit4]   2> 1665597 INFO  (OldIndexDirectoryCleanupThreadForCore-testschemaapi_shard1_replica2) [n:127.0.0.1:53031_solr c:testschemaapi s:shard1 r:core_node1 x:testschemaapi_shard1_replica2] o.a.s.c.SolrCore Looking for old index directories to cleanup for core testschemaapi_shard1_replica2 in /Users/jenkins/workspace/Lucene-Solr-6.x-MacOSX/solr/build/solr-core/test/J1/temp/solr.schema.TestManagedSchemaAPI_15674B1DEE069395-001/tempDir-001/node2/./testschemaapi_shard1_replica2/data/
   [junit4]   2> 1665597 INFO  (qtp276665345-7946) [n:127.0.0.1:53030_solr c:testschemaapi s:shard1 r:core_node2 x:testschemaapi_shard1_replica1] o.a.s.c.SolrCore no updateRequestProcessorChain defined as default, creating implicit default
   [junit4]   2> 1665598 WARN  (OldIndexDirectoryCleanupThreadForCore-testschemaapi_shard1_replica2) [n:127.0.0.1:53031_solr c:testschemaapi s:shard1 r:core_node1 x:testschemaapi_shard1_replica2] o.a.s.c.DirectoryFactory /Users/jenkins/workspace/Lucene-Solr-6.x-MacOSX/solr/build/solr-core/test/J1/temp/solr.schema.TestManagedSchemaAPI_15674B1DEE069395-001/tempDir-001/node2/./testschemaapi_shard1_replica2/data/ does not point to a valid data directory; skipping clean-up of old index directories.
   [junit4]   2> 1665599 INFO  (qtp231214276-7956) [n:127.0.0.1:53031_solr c:testschemaapi s:shard1 r:core_node1 x:testschemaapi_shard1_replica2] o.a.s.c.SolrCore no updateRequestProcessorChain defined as default, creating implicit default
   [junit4]   2> 1665605 INFO  (qtp276665345-7946) [n:127.0.0.1:53030_solr c:testschemaapi s:shard1 r:core_node2 x:testschemaapi_shard1_replica1] o.a.s.h.l.XMLLoader xsltCacheLifetimeSeconds=60
   [junit4]   2> 1665605 INFO  (qtp231214276-7956) [n:127.0.0.1:53031_solr c:testschemaapi s:shard1 r:core_node1 x:testschemaapi_shard1_replica2] o.a.s.h.l.XMLLoader xsltCacheLifetimeSeconds=60
   [junit4]   2> 1665606 INFO  (qtp276665345-7946) [n:127.0.0.1:53030_solr c:testschemaapi s:shard1 r:core_node2 x:testschemaapi_shard1_replica1] o.a.s.h.l.XMLLoader xsltCacheLifetimeSeconds=60
   [junit4]   2> 1665606 INFO  (qtp231214276-7956) [n:127.0.0.1:53031_solr c:testschemaapi s:shard1 r:core_node1 x:testschemaapi_shard1_replica2] o.a.s.h.l.XMLLoader xsltCacheLifetimeSeconds=60
   [junit4]   2> 1665607 INFO  (qtp276665345-7946) [n:127.0.0.1:53030_solr c:testschemaapi s:shard1 r:core_node2 x:testschemaapi_shard1_replica1] o.a.s.h.l.XMLLoader xsltCacheLifetimeSeconds=60
   [junit4]   2> 1665607 INFO  (qtp231214276-7956) [n:127.0.0.1:53031_solr c:testschemaapi s:shard1 r:core_node1 x:testschemaapi_shard1_replica2] o.a.s.h.l.XMLLoader xsltCacheLifetimeSeconds=60
   [junit4]   2> 1665609 INFO  (qtp276665345-7946) [n:127.0.0.1:53030_solr c:testschemaapi s:shard1 r:core_node2 x:testschemaapi_shard1_replica1] o.a.s.h.l.XMLLoader xsltCacheLifetimeSeconds=60
   [junit4]   2> 1665609 INFO  (qtp231214276-7956) [n:127.0.0.1:53031_solr c:testschemaapi s:shard1 r:core_node1 x:testschemaapi_shard1_replica2] o.a.s.h.l.XMLLoader xsltCacheLifetimeSeconds=60
   [junit4]   2> 1665617 INFO  (qtp231214276-7956) [n:127.0.0.1:53031_solr c:testschemaapi s:shard1 r:core_node1 x:testschemaapi_shard1_replica2] o.a.s.c.RequestHandlers Registered paths: /admin/mbeans,/update/csv,/sql,/update/json/docs,/admin/luke,/export,/select,/admin/segments,/get,/admin/system,/replication,/admin/properties,/config,/stream,/schema,/admin/plugins,/admin/logging,/update/json,/admin/ping,/admin/threads,/update,/admin/file
   [junit4]   2> 1665617 INFO  (qtp231214276-7956) [n:127.0.0.1:53031_solr c:testschemaapi s:shard1 r:core_node1 x:testschemaapi_shard1_replica2] o.a.s.c.SolrCore Using default statsCache cache: org.apache.solr.search.stats.LocalStatsCache
   [junit4]   2> 1665617 INFO  (qtp276665345-7946) [n:127.0.0.1:53030_solr c:testschemaapi s:shard1 r:core_node2 x:testschemaapi_shard1_replica1] o.a.s.c.RequestHandlers Registered paths: /admin/mbeans,/update/csv,/sql,/update/json/docs,/admin/luke,/export,/select,/admin/segments,/get,/admin/system,/replication,/admin/properties,/config,/stream,/schema,/admin/plugins,/admin/logging,/update/json,/admin/ping,/admin/threads,/update,/admin/file
   [junit4]   2> 1665617 INFO  (qtp276665345-7946) [n:127.0.0.1:53030_solr c:testschemaapi s:shard1 r:core_node2 x:testschemaapi_shard1_replica1] o.a.s.c.SolrCore Using default statsCache cache: org.apache.solr.search.stats.LocalStatsCache
   [junit4]   2> 1665618 INFO  (qtp231214276-7956) [n:127.0.0.1:53031_solr c:testschemaapi s:shard1 r:core_node1 x:testschemaapi_shard1_replica2] o.a.s.u.UpdateHandler Using UpdateLog implementation: org.apache.solr.update.UpdateLog
   [junit4]   2> 1665618 INFO  (qtp231214276-7956) [n:127.0.0.1:53031_solr c:testschemaapi s:shard1 r:core_node1 x:testschemaapi_shard1_replica2] o.a.s.u.UpdateLog Initializing UpdateLog: dataDir=null defaultSyncLevel=FLUSH numRecordsToKeep=100 maxNumLogsToKeep=10 numVersionBuckets=65536
   [junit4]   2> 1665618 INFO  (qtp276665345-7946) [n:127.0.0.1:53030_solr c:testschemaapi s:shard1 r:core_node2 x:testschemaapi_shard1_replica1] o.a.s.u.UpdateHandler Using UpdateLog implementation: org.apache.solr.update.UpdateLog
   [junit4]   2> 1665619 INFO  (qtp276665345-7946) [n:127.0.0.1:53030_solr c:testschemaapi s:shard1 r:core_node2 x:testschemaapi_shard1_replica1] o.a.s.u.UpdateLog Initializing UpdateLog: dataDir=null defaultSyncLevel=FLUSH numRecordsToKeep=100 maxNumLogsToKeep=10 numVersionBuckets=65536
   [junit4]   2> 1665622 INFO  (qtp231214276-7956) [n:127.0.0.1:53031_solr c:testschemaapi s:shard1 r:core_node1 x:testschemaapi_shard1_replica2] o.a.s.u.CommitTracker Hard AutoCommit: disabled
   [junit4]   2> 1665622 INFO  (qtp231214276-7956) [n:127.0.0.1:53031_solr c:testschemaapi s:shard1 r:core_node1 x:testschemaapi_shard1_replica2] o.a.s.u.CommitTracker Soft AutoCommit: disabled
   [junit4]   2> 1665622 INFO  (qtp276665345-7946) [n:127.0.0.1:53030_solr c:testschemaapi s:shard1 r:core_node2 x:testschemaapi_shard1_replica1] o.a.s.u.CommitTracker Hard AutoCommit: disabled
   [junit4]   2> 1665622 INFO  (qtp276665345-7946) [n:127.0.0.1:53030_solr c:testschemaapi s:shard1 r:core_node2 x:testschemaapi_shard1_replica1] o.a.s.u.CommitTracker Soft AutoCommit: disabled
   [junit4]   2> 1665622 INFO  (qtp231214276-7956) [n:127.0.0.1:53031_solr c:testschemaapi s:shard1 r:core_node1 x:testschemaapi_shard1_replica2] o.a.s.c.SolrDeletionPolicy SolrDeletionPolicy.onInit: commits: num=1
   [junit4]   2> 	commit{dir=MockDirectoryWrapper(RAMDirectory@bc8fe76 lockFactory=org.apache.lucene.store.SingleInstanceLockFactory@676bdedf),segFN=segments_1,generation=1}
   [junit4]   2> 1665623 INFO  (qtp231214276-7956) [n:127.0.0.1:53031_solr c:testschemaapi s:shard1 r:core_node1 x:testschemaapi_shard1_replica2] o.a.s.c.SolrDeletionPolicy newest commit generation = 1
   [junit4]   2> 1665623 INFO  (qtp276665345-7946) [n:127.0.0.1:53030_solr c:testschemaapi s:shard1 r:core_node2 x:testschemaapi_shard1_replica1] o.a.s.c.SolrDeletionPolicy SolrDeletionPolicy.onInit: commits: num=1
   [junit4]   2> 	commit{dir=MockDirectoryWrapper(RAMDirectory@6f96ae67 lockFactory=org.apache.lucene.store.SingleInstanceLockFactory@2d1d079f),segFN=segments_1,generation=1}
   [junit4]   2> 1665623 INFO  (qtp276665345-7946) [n:127.0.0.1:53030_solr c:testschemaapi s:shard1 r:core_node2 x:testschemaapi_shard1_replica1] o.a.s.c.SolrDeletionPolicy newest commit generation = 1
   [junit4]   2> 1665623 INFO  (qtp231214276-7956) [n:127.0.0.1:53031_solr c:testschemaapi s:shard1 r:core_node1 x:testschemaapi_shard1_replica2] o.a.s.s.SolrIndexSearcher Opening [Searcher@329215a2[testschemaapi_shard1_replica2] main]
   [junit4]   2> 1665623 INFO  (qtp276665345-7946) [n:127.0.0.1:53030_solr c:testschemaapi s:shard1 r:core_node2 x:testschemaapi_shard1_replica1] o.a.s.s.SolrIndexSearcher Opening [Searcher@502b6147[testschemaapi_shard1_replica1] main]
   [junit4]   2> 1665623 INFO  (qtp231214276-7956) [n:127.0.0.1:53031_solr c:testschemaapi s:shard1 r:core_node1 x:testschemaapi_shard1_replica2] o.a.s.c.c.ZkStateReader Load collection config from: [/collections/testschemaapi]
   [junit4]   2> 1665623 INFO  (qtp276665345-7946) [n:127.0.0.1:53030_solr c:testschemaapi s:shard1 r:core_node2 x:testschemaapi_shard1_replica1] o.a.s.c.c.ZkStateReader Load collection config from: [/collections/testschemaapi]
   [junit4]   2> 1665624 INFO  (qtp276665345-7946) [n:127.0.0.1:53030_solr c:testschemaapi s:shard1 r:core_node2 x:testschemaapi_shard1_replica1] o.a.s.c.c.ZkStateReader path=[/collections/testschemaapi] [configName]=[conf1] specified config exists in ZooKeeper
   [junit4]   2> 1665624 INFO  (qtp231214276-7956) [n:127.0.0.1:53031_solr c:testschemaapi s:shard1 r:core_node1 x:testschemaapi_shard1_replica2] o.a.s.c.c.ZkStateReader path=[/collections/testschemaapi] [configName]=[conf1] specified config exists in ZooKeeper
   [junit4]   2> 1665625 INFO  (qtp231214276-7956) [n:127.0.0.1:53031_solr c:testschemaapi s:shard1 r:core_node1 x:testschemaapi_shard1_replica2] o.a.s.r.ManagedResourceStorage Setting up ZooKeeper-based storage for the RestManager with znodeBase: /configs/conf1
   [junit4]   2> 1665624 INFO  (qtp276665345-7946) [n:127.0.0.1:53030_solr c:testschemaapi s:shard1 r:core_node2 x:testschemaapi_shard1_replica1] o.a.s.r.ManagedResourceStorage Setting up ZooKeeper-based storage for the RestManager with znodeBase: /configs/conf1
   [junit4]   2> 1665625 INFO  (qtp231214276-7956) [n:127.0.0.1:53031_solr c:testschemaapi s:shard1 r:core_node1 x:testschemaapi_shard1_replica2] o.a.s.r.ManagedResourceStorage Configured ZooKeeperStorageIO with znodeBase: /configs/conf1
   [junit4]   2> 1665625 INFO  (qtp276665345-7946) [n:127.0.0.1:53030_solr c:testschemaapi s:shard1 r:core_node2 x:testschemaapi_shard1_replica1] o.a.s.r.ManagedResourceStorage Configured ZooKeeperStorageIO with znodeBase: /configs/conf1
   [junit4]   2> 1665625 INFO  (qtp231214276-7956) [n:127.0.0.1:53031_solr c:testschemaapi s:shard1 r:core_node1 x:testschemaapi_shard1_replica2] o.a.s.r.RestManager Initializing RestManager with initArgs: {}
   [junit4]   2> 1665625 INFO  (qtp276665345-7946) [n:127.0.0.1:53030_solr c:testschemaapi s:shard1 r:core_node2 x:testschemaapi_shard1_replica1] o.a.s.r.RestManager Initializing RestManager with initArgs: {}
   [junit4]   2> 1665626 INFO  (qtp231214276-7956) [n:127.0.0.1:53031_solr c:testschemaapi s:shard1 r:core_node1 x:testschemaapi_shard1_replica2] o.a.s.r.ManagedResourceStorage Reading _rest_managed.json using ZooKeeperStorageIO:path=/configs/conf1
   [junit4]   2> 1665626 INFO  (qtp276665345-7946) [n:127.0.0.1:53030_solr c:testschemaapi s:shard1 r:core_node2 x:testschemaapi_shard1_replica1] o.a.s.r.ManagedResourceStorage Reading _rest_managed.json using ZooKeeperStorageIO:path=/configs/conf1
   [junit4]   2> 1665627 INFO  (qtp231214276-7956) [n:127.0.0.1:53031_solr c:testschemaapi s:shard1 r:core_node1 x:testschemaapi_shard1_replica2] o.a.s.r.ManagedResourceStorage No data found for znode /configs/conf1/_rest_managed.json
   [junit4]   2> 1665627 INFO  (qtp231214276-7956) [n:127.0.0.1:53031_solr c:testschemaapi s:shard1 r:core_node1 x:testschemaapi_shard1_replica2] o.a.s.r.ManagedResourceStorage Loaded null at path _rest_managed.json using ZooKeeperStorageIO:path=/configs/conf1
   [junit4]   2> 1665627 INFO  (qtp231214276-7956) [n:127.0.0.1:53031_solr c:testschemaapi s:shard1 r:core_node1 x:testschemaapi_shard1_replica2] o.a.s.r.RestManager Initializing 0 registered ManagedResources
   [junit4]   2> 1665627 INFO  (qtp231214276-7956) [n:127.0.0.1:53031_solr c:testschemaapi s:shard1 r:core_node1 x:testschemaapi_shard1_replica2] o.a.s.s.ZkIndexSchemaReader Creating ZooKeeper watch for the managed schema at /configs/conf1/managed-schema
   [junit4]   2> 1665627 INFO  (qtp276665345-7946) [n:127.0.0.1:53030_solr c:testschemaapi s:shard1 r:core_node2 x:testschemaapi_shard1_replica1] o.a.s.r.ManagedResourceStorage No data found for znode /configs/conf1/_rest_managed.json
   [junit4]   2> 1665627 INFO  (qtp276665345-7946) [n:127.0.0.1:53030_solr c:testschemaapi s:shard1 r:core_node2 x:testschemaapi_shard1_replica1] o.a.s.r.ManagedResourceStorage Loaded null at path _rest_managed.json using ZooKeeperStorageIO:path=/configs/conf1
   [junit4]   2> 1665627 INFO  (qtp276665345-7946) [n:127.0.0.1:53030_solr c:testschemaapi s:shard1 r:core_node2 x:testschemaapi_shard1_replica1] o.a.s.r.RestManager Initializing 0 registered ManagedResources
   [junit4]   2> 1665627 INFO  (qtp276665345-7946) [n:127.0.0.1:53030_solr c:testschemaapi s:shard1 r:core_node2 x:testschemaapi_shard1_replica1] o.a.s.s.ZkIndexSchemaReader Creating ZooKeeper watch for the managed schema at /configs/conf1/managed-schema
   [junit4]   2> 1665628 INFO  (qtp231214276-7956) [n:127.0.0.1:53031_solr c:testschemaapi s:shard1 r:core_node1 x:testschemaapi_shard1_replica2] o.a.s.c.ZkController Added new OnReconnect listener ZkIndexSchemaReader: /configs/conf1/managed-schema, uniqueCoreId: testschemaapi_shard1_replica2:3697852134162
   [junit4]   2> 1665628 INFO  (qtp231214276-7956) [n:127.0.0.1:53031_solr c:testschemaapi s:shard1 r:core_node1 x:testschemaapi_shard1_replica2] o.a.s.h.ReplicationHandler Commits will be reserved for  10000
   [junit4]   2> 1665628 INFO  (qtp231214276-7956) [n:127.0.0.1:53031_solr c:testschemaapi s:shard1 r:core_node1 x:testschemaapi_shard1_replica2] o.a.s.u.UpdateLog Looking up max value of version field to seed version buckets
   [junit4]   2> 1665628 INFO  (qtp231214276-7956) [n:127.0.0.1:53031_solr c:testschemaapi s:shard1 r:core_node1 x:testschemaapi_shard1_replica2] o.a.s.u.VersionInfo Refreshing highest value of _version_ for 65536 version buckets from index
   [junit4]   2> 1665628 INFO  (qtp231214276-7956) [n:127.0.0.1:53031_solr c:testschemaapi s:shard1 r:core_node1 x:testschemaapi_shard1_replica2] o.a.s.u.VersionInfo No terms found for _version_, cannot seed version bucket highest value from index
   [junit4]   2> 1665628 INFO  (searcherExecutor-3744-thread-1-processing-n:127.0.0.1:53031_solr x:testschemaapi_shard1_replica2 s:shard1 c:testschemaapi r:core_node1) [n:127.0.0.1:53031_solr c:testschemaapi s:shard1 r:core_node1 x:testschemaapi_shard1_replica2] o.a.s.c.SolrCore [testschemaapi_shard1_replica2] Registered new searcher Searcher@329215a2[testschemaapi_shard1_replica2] main{ExitableDirectoryReader(UninvertingDirectoryReader())}
   [junit4]   2> 1665628 INFO  (qtp276665345-7946) [n:127.0.0.1:53030_solr c:testschemaapi s:shard1 r:core_node2 x:testschemaapi_shard1_replica1] o.a.s.c.ZkController Added new OnReconnect listener ZkIndexSchemaReader: /configs/conf1/managed-schema, uniqueCoreId: testschemaapi_shard1_replica1:3697852013427
   [junit4]   2> 1665628 INFO  (qtp231214276-7956) [n:127.0.0.1:53031_solr c:testschemaapi s:shard1 r:core_node1 x:testschemaapi_shard1_replica2] o.a.s.u.UpdateLog Could not find max version in index or recent updates, using new clock 1532257030443630592
   [junit4]   2> 1665629 INFO  (qtp276665345-7946) [n:127.0.0.1:53030_solr c:testschemaapi s:shard1 r:core_node2 x:testschemaapi_shard1_replica1] o.a.s.h.ReplicationHandler Commits will be reserved for  10000
   [junit4]   2> 1665629 INFO  (qtp276665345-7946) [n:127.0.0.1:53030_solr c:testschemaapi s:shard1 r:core_node2 x:testschemaapi_shard1_replica1] o.a.s.u.UpdateLog Looking up max value of version field to seed version buckets
   [junit4]   2> 1665629 INFO  (searcherExecutor-3743-thread-1-processing-n:127.0.0.1:53030_solr x:testschemaapi_shard1_replica1 s:shard1 c:testschemaapi r:core_node2) [n:127.0.0.1:53030_solr c:testschemaapi s:shard1 r:core_node2 x:testschemaapi_shard1_replica1] o.a.s.c.SolrCore [testschemaapi_shard1_replica1] Registered new searcher Searcher@502b6147[testschemaapi_shard1_replica1] main{ExitableDirectoryReader(UninvertingDirectoryReader())}
   [junit4]   2> 1665629 INFO  (qtp276665345-7946) [n:127.0.0.1:53030_solr c:testschemaapi s:shard1 r:core_node2 x:testschemaapi_shard1_replica1] o.a.s.u.VersionInfo Refreshing highest value of _version_ for 65536 version buckets from index
   [junit4]   2> 1665629 INFO  (qtp276665345-7946) [n:127.0.0.1:53030_solr c:testschemaapi s:shard1 r:core_node2 x:testschemaapi_shard1_replica1] o.a.s.u.VersionInfo No terms found for _version_, cannot seed version bucket highest value from index
   [junit4]   2> 1665629 INFO  (qtp276665345-7946) [n:127.0.0.1:53030_solr c:testschemaapi s:shard1 r:core_node2 x:testschemaapi_shard1_replica1] o.a.s.u.UpdateLog Could not find max version in index or recent updates, using new clock 1532257030444679168
   [junit4]   2> 1665631 INFO  (qtp231214276-7956) [n:127.0.0.1:53031_solr c:testschemaapi s:shard1 r:core_node1 x:testschemaapi_shard1_replica2] o.a.s.u.UpdateLog Took 2.0ms to seed version buckets with highest version 1532257030443630592
   [junit4]   2> 1665631 INFO  (qtp231214276-7956) [n:127.0.0.1:53031_solr c:testschemaapi s:shard1 r:core_node1 x:testschemaapi_shard1_replica2] o.a.s.c.ZkController watch zkdir /configs/conf1
   [junit4]   2> 1665631 INFO  (qtp276665345-7946) [n:127.0.0.1:53030_solr c:testschemaapi s:shard1 r:core_node2 x:testschemaapi_shard1_replica1] o.a.s.u.UpdateLog Took 1.0ms to seed version buckets with highest version 1532257030444679168
   [junit4]   2> 1665633 INFO  (qtp276665345-7946) [n:127.0.0.1:53030_solr c:testschemaapi s:shard1 r:core_node2 x:testschemaapi_shard1_replica1] o.a.s.c.ZkController watch zkdir /configs/conf1
   [junit4]   2> 1665634 INFO  (qtp231214276-7956) [n:127.0.0.1:53031_solr c:testschemaapi s:shard1 r:core_node1 x:testschemaapi_shard1_replica2] o.a.s.c.CoreContainer registering core: testschemaapi_shard1_replica2
   [junit4]   2> 1665634 INFO  (qtp231214276-7956) [n:127.0.0.1:53031_solr c:testschemaapi s:shard1 r:core_node1 x:testschemaapi_shard1_replica2] o.a.s.c.ZkController Register replica - core:testschemaapi_shard1_replica2 address:http://127.0.0.1:53031/solr collection:testschemaapi shard:shard1
   [junit4]   2> 1665634 INFO  (qtp276665345-7946) [n:127.0.0.1:53030_solr c:testschemaapi s:shard1 r:core_node2 x:testschemaapi_shard1_replica1] o.a.s.c.CoreContainer registering core: testschemaapi_shard1_replica1
   [junit4]   2> 1665634 INFO  (qtp276665345-7946) [n:127.0.0.1:53030_solr c:testschemaapi s:shard1 r:core_node2 x:testschemaapi_shard1_replica1] o.a.s.c.ZkController Register replica - core:testschemaapi_shard1_replica1 address:http://127.0.0.1:53030/solr collection:testschemaapi shard:shard1
   [junit4]   2> 1665636 INFO  (qtp231214276-7956) [n:127.0.0.1:53031_solr c:testschemaapi s:shard1 r:core_node1 x:testschemaapi_shard1_replica2] o.a.s.c.c.SolrZkClient makePath: /collections/testschemaapi/leader_elect/shard1/election
   [junit4]   2> 1665636 INFO  (qtp276665345-7946) [n:127.0.0.1:53030_solr c:testschemaapi s:shard1 r:core_node2 x:testschemaapi_shard1_replica1] o.a.s.c.c.SolrZkClient makePath: /collections/testschemaapi/leader_elect/shard1/election
   [junit4]   2> 1665644 INFO  (qtp231214276-7956) [n:127.0.0.1:53031_solr c:testschemaapi s:shard1 r:core_node1 x:testschemaapi_shard1_replica2] o.a.s.c.LeaderElector Joined leadership election with path: /collections/testschemaapi/leader_elect/shard1/election/95766064236789766-core_node1-n_0000000001
   [junit4]   2> 1665644 INFO  (qtp276665345-7946) [n:127.0.0.1:53030_solr c:testschemaapi s:shard1 r:core_node2 x:testschemaapi_shard1_replica1] o.a.s.c.LeaderElector Joined leadership election with path: /collections/testschemaapi/leader_elect/shard1/election/95766064236789765-core_node2-n_0000000000
   [junit4]   2> 1665645 INFO  (qtp276665345-7946) [n:127.0.0.1:53030_solr c:testschemaapi s:shard1 r:core_node2 x:testschemaapi_shard1_replica1] o.a.s.c.ShardLeaderElectionContext Running the leader process for shard=shard1 and weAreReplacement=false and leaderVoteWait=10000
   [junit4]   2> 1665645 INFO  (qtp231214276-7956) [n:127.0.0.1:53031_solr c:testschemaapi s:shard1 r:core_node1 x:testschemaapi_shard1_replica2] o.a.s.c.LeaderElector Watching path /collections/testschemaapi/leader_elect/shard1/election/95766064236789765-core_node2-n_0000000000 to know if I could be the leader
   [junit4]   2> 1665649 INFO  (qtp276665345-7946) [n:127.0.0.1:53030_solr c:testschemaapi s:shard1 r:core_node2 x:testschemaapi_shard1_replica1] o.a.s.c.ShardLeaderElectionContext Enough replicas found to continue.
   [junit4]   2> 1665649 INFO  (qtp276665345-7946) [n:127.0.0.1:53030_solr c:testschemaapi s:shard1 r:core_node2 x:testschemaapi_shard1_replica1] o.a.s.c.ShardLeaderElectionContext I may be the new leader - try and sync
   [junit4]   2> 1665649 INFO  (qtp276665345-7946) [n:127.0.0.1:53030_solr c:testschemaapi s:shard1 r:core_node2 x:testschemaapi_shard1_replica1] o.a.s.c.SyncStrategy Sync replicas to http://127.0.0.1:53030/solr/testschemaapi_shard1_replica1/
   [junit4]   2> 1665649 INFO  (qtp276665345-7946) [n:127.0.0.1:53030_solr c:testschemaapi s:shard1 r:core_node2 x:testschemaapi_shard1_replica1] o.a.s.u.PeerSync PeerSync: core=testschemaapi_shard1_replica1 url=http://127.0.0.1:53030/solr START replicas=[http://127.0.0.1:53031/solr/testschemaapi_shard1_replica2/] nUpdates=100
   [junit4]   2> 1665649 INFO  (qtp276665345-7946) [n:127.0.0.1:53030_solr c:testschemaapi s:shard1 r:core_node2 x:testschemaapi_shard1_replica1] o.a.s.u.PeerSync PeerSync: core=testschemaapi_shard1_replica1 url=http://127.0.0.1:53030/solr DONE.  We have no versions.  sync failed.
   [junit4]   2> 1665649 INFO  (qtp276665345-7946) [n:127.0.0.1:53030_solr c:testschemaapi s:shard1 r:core_node2 x:testschemaapi_shard1_replica1] o.a.s.c.SyncStrategy Leader's attempt to sync with shard failed, moving to the next candidate
   [junit4]   2> 1665649 INFO  (OverseerStateUpdate-95766064236789765-127.0.0.1:53030_solr-n_0000000000) [n:127.0.0.1:53030_solr    ] o.a.s.c.Overseer processMessage: queueSize: 1, message = {
   [junit4]   2>   "operation":"leader",
   [junit4]   2>   "shard":"shard1",
   [junit4]   2>   "collection":"testschemaapi"} current state version: 0
   [junit4]   2> 1665649 INFO  (qtp276665345-7946) [n:127.0.0.1:53030_solr c:testschemaapi s:shard1 r:core_node2 x:testschemaapi_shard1_replica1] o.a.s.c.ShardLeaderElectionContext We failed sync, but we have no versions - we can't sync in that case - we were active before, so become leader anyway
   [junit4]   2> 1665653 INFO  (qtp231214276-7959) [n:127.0.0.1:53031_solr c:testschemaapi s:shard1 r:core_node1 x:testschemaapi_shard1_replica2] o.a.s.c.S.Request [testschemaapi_shard1_replica2]  webapp=/solr path=/get params={distrib=false&qt=/get&fingerprint=false&getVersions=100&wt=javabin&version=2} status=0 QTime=1
   [junit4]   2> 1665654 INFO  (qtp276665345-7946) [n:127.0.0.1:53030_solr c:testschemaapi s:shard1 r:core_node2 x:testschemaapi_shard1_replica1] o.a.s.c.c.SolrZkClient makePath: /collections/testschemaapi/leaders/shard1
   [junit4]   2> 1665659 INFO  (qtp276665345-7946) [n:127.0.0.1:53030_solr c:testschemaapi s:shard1 r:core_node2 x:testschemaapi_shard1_replica1] o.a.s.c.ShardLeaderElectionContextBase Creating leader registration node /collections/testschemaapi/leaders/shard1/leader after winning as /collections/testschemaapi/leader_elect/shard1/election/95766064236789765-core_node2-n_0000000000
   [junit4]   2> 1665663 INFO  (qtp276665345-7946) [n:127.0.0.1:53030_solr c:testschemaapi s:shard1 r:core_node2 x:testschemaapi_shard1_replica1] o.a.s.c.ShardLeaderElectionContext I am the new leader: http://127.0.0.1:53030/solr/testschemaapi_shard1_replica1/ shard1
   [junit4]   2> 1665665 INFO  (OverseerStateUpdate-95766064236789765-127.0.0.1:53030_solr-n_0000000000) [n:127.0.0.1:53030_solr    ] o.a.s.c.Overseer processMessage: queueSize: 1, message = {
   [junit4]   2>   "operation":"leader",
   [junit4]   2>   "shard":"shard1",
   [junit4]   2>   "collection":"testschemaapi",
   [junit4]   2>   "base_url":"http://127.0.0.1:53030/solr",
   [junit4]   2>   "core":"testschemaapi_shard1_replica1",
   [junit4]   2>   "state":"active"} current state version: 0
   [junit4]   2> 1665770 INFO  (OverseerStateUpdate-95766064236789765-127.0.0.1:53030_solr-n_0000000000) [n:127.0.0.1:53030_solr    ] o.a.s.c.o.ZkStateWriter going to update_collection /collections/testschemaapi/state.json version: 1
   [junit4]   2> 1665771 INFO  (zkCallback-1362-thread-1-processing-n:127.0.0.1:53030_solr) [n:127.0.0.1:53030_solr    ] o.a.s.c.c.ZkStateReader A cluster state change: [WatchedEvent state:SyncConnected type:NodeDataChanged path:/collections/testschemaapi/state.json] for collection [testschemaapi] has occurred - updating... (live nodes size: [2])
   [junit4]   2> 1665771 INFO  (zkCallback-1361-thread-1-processing-n:127.0.0.1:53031_solr) [n:127.0.0.1:53031_solr    ] o.a.s.c.c.ZkStateReader A cluster state change: [WatchedEvent state:SyncConnected type:NodeDataChanged path:/collections/testschemaapi/state.json] for collection [testschemaapi] has occurred - updating... (live nodes size: [2])
   [junit4]   2> 1665772 INFO  (zkCallback-1361-thread-1-processing-n:127.0.0.1:53031_solr) [n:127.0.0.1:53031_solr    ] o.a.s.c.c.ZkStateReader Updating data for [testschemaapi] from [1] to [2]
   [junit4]   2> 1665772 INFO  (zkCallback-1362-thread-1-processing-n:127.0.0.1:53030_solr) [n:127.0.0.1:53030_solr    ] o.a.s.c.c.ZkStateReader Updating data for [testschemaapi] from [1] to [2]
   [junit4]   2> 1665816 INFO  (qtp276665345-7946) [n:127.0.0.1:53030_solr c:testschemaapi s:shard1 r:core_node2 x:testschemaapi_shard1_replica1] o.a.s.c.ZkController We are http://127.0.0.1:53030/solr/testschemaapi_shard1_replica1/ and leader is http://127.0.0.1:53030/solr/testschemaapi_shard1_replica1/
   [junit4]   2> 1665816 INFO  (qtp276665345-7946) [n:127.0.0.1:53030_solr c:testschemaapi s:shard1 r:core_node2 x:testschemaapi_shard1_replica1] o.a.s.c.ZkController No LogReplay needed for core=testschemaapi_shard1_replica1 baseURL=http://127.0.0.1:53030/solr
   [junit4]   2> 1665816 INFO  (qtp276665345-7946) [n:127.0.0.1:53030_solr c:testschemaapi s:shard1 r:core_node2 x:testschemaapi_shard1_replica1] o.a.s.c.ZkController I am the leader, no recovery necessary
   [junit4]   2> 1665816 INFO  (qtp276665345-7946) [n:127.0.0.1:53030_solr c:testschemaapi s:shard1 r:core_node2 x:testschemaapi_shard1_replica1] o.a.s.c.ZkController publishing state=active
   [junit4]   2> 1665819 INFO  (OverseerStateUpdate-95766064236789765-127.0.0.1:53030_solr-n_0000000000) [n:127.0.0.1:53030_solr    ] o.a.s.c.Overseer processMessage: queueSize: 1, message = {
   [junit4]   2>   "core":"testschemaapi_shard1_replica1",
   [junit4]   2>   "core_node_name":"core_node2",
   [junit4]   2>   "roles":null,
   [junit4]   2>   "base_url":"http://127.0.0.1:53030/solr",
   [junit4]   2>   "node_name":"127.0.0.1:53030_solr",
   [junit4]   2>   "numShards":"1",
   [junit4]   2>   "state":"active",
   [junit4]   2>   "shard":"shard1",
   [junit4]   2>   "collection":"testschemaapi",
   [junit4]   2>   "operation":"state"} current state version: 0
   [junit4]   2> 1665820 INFO  (qtp276665345-7946) [n:127.0.0.1:53030_solr c:testschemaapi s:shard1 r:core_node2 x:testschemaapi_shard1_replica1] o.a.s.s.HttpSolrCall [admin] webapp=null path=/admin/cores params={qt=/admin/cores&collection.configName=conf1&name=testschemaapi_shard1_replica1&action=CREATE&numShards=1&collection=testschemaapi&shard=shard1&wt=javabin&version=2} status=0 QTime=1310
   [junit4]   2> 1665820 INFO  (OverseerStateUpdate-95766064236789765-127.0.0.1:53030_solr-n_0000000000) [n:127.0.0.1:53030_solr    ] o.a.s.c.o.ReplicaMutator Update state numShards=1 message={
   [junit4]   2>   "core":"testschemaapi_shard1_replica1",
   [junit4]   2>   "core_node_name":"core_node2",
   [junit4]   2>   "roles":null,
   [junit4]   2>   "base_url":"h

[...truncated too long message...]

/temp/solr.schema.TestManagedSchemaAPI_15674B1DEE069395-001/tempDir-001/node2/./testschemaapi_shard1_replica2/data [CachedDir<<refCount=0;path=/Users/jenkins/workspace/Lucene-Solr-6.x-MacOSX/solr/build/solr-core/test/J1/temp/solr.schema.TestManagedSchemaAPI_15674B1DEE069395-001/tempDir-001/node2/./testschemaapi_shard1_replica2/data;done=false>>]
   [junit4]   2> 1674978 INFO  (Thread-2809) [n:127.0.0.1:53031_solr c:testschemaapi s:shard1 r:core_node1 x:testschemaapi_shard1_replica2] o.a.s.c.CachingDirectoryFactory Closing directory, CoreContainer#isShutdown=true
   [junit4]   2> 1674978 INFO  (Thread-2809) [n:127.0.0.1:53031_solr c:testschemaapi s:shard1 r:core_node1 x:testschemaapi_shard1_replica2] o.a.s.c.CachingDirectoryFactory Closing directory: /Users/jenkins/workspace/Lucene-Solr-6.x-MacOSX/solr/build/solr-core/test/J1/temp/solr.schema.TestManagedSchemaAPI_15674B1DEE069395-001/tempDir-001/node2/./testschemaapi_shard1_replica2/data
   [junit4]   2> 1674978 INFO  (zkCallback-1362-thread-2-processing-n:127.0.0.1:53030_solr) [n:127.0.0.1:53030_solr    ] o.a.s.c.c.ZkStateReader A live node change: [WatchedEvent state:SyncConnected type:NodeChildrenChanged path:/live_nodes], has occurred - updating... (live nodes size: [1])
   [junit4]   2> 1674978 WARN  (zkCallback-1362-thread-2-processing-n:127.0.0.1:53030_solr) [n:127.0.0.1:53030_solr    ] o.a.s.c.c.ZkStateReader ZooKeeper watch triggered, but Solr cannot talk to ZK: [KeeperErrorCode = Session expired for /live_nodes]
   [junit4]   2> 1674979 INFO  (jetty-launcher-1351-thread-2) [    ] o.e.j.s.h.ContextHandler Stopped o.e.j.s.ServletContextHandler@6b183583{/solr,null,UNAVAILABLE}
   [junit4]   2> 1674980 INFO  (Thread-2809) [n:127.0.0.1:53031_solr c:testschemaapi s:shard1 r:core_node1 x:testschemaapi_shard1_replica2] o.a.s.c.CachingDirectoryFactory looking to close /Users/jenkins/workspace/Lucene-Solr-6.x-MacOSX/solr/build/solr-core/test/J1/temp/solr.schema.TestManagedSchemaAPI_15674B1DEE069395-001/tempDir-001/node2/./testschemaapi_shard1_replica2/data/index [CachedDir<<refCount=0;path=/Users/jenkins/workspace/Lucene-Solr-6.x-MacOSX/solr/build/solr-core/test/J1/temp/solr.schema.TestManagedSchemaAPI_15674B1DEE069395-001/tempDir-001/node2/./testschemaapi_shard1_replica2/data/index;done=false>>]
   [junit4]   2> 1674980 INFO  (Thread-2809) [n:127.0.0.1:53031_solr c:testschemaapi s:shard1 r:core_node1 x:testschemaapi_shard1_replica2] o.a.s.c.CachingDirectoryFactory Closing directory, CoreContainer#isShutdown=true
   [junit4]   2> 1674980 INFO  (Thread-2809) [n:127.0.0.1:53031_solr c:testschemaapi s:shard1 r:core_node1 x:testschemaapi_shard1_replica2] o.a.s.c.CachingDirectoryFactory Closing directory: /Users/jenkins/workspace/Lucene-Solr-6.x-MacOSX/solr/build/solr-core/test/J1/temp/solr.schema.TestManagedSchemaAPI_15674B1DEE069395-001/tempDir-001/node2/./testschemaapi_shard1_replica2/data/index
   [junit4]   2> 1674981 WARN  (Thread-2809) [n:127.0.0.1:53031_solr c:testschemaapi s:shard1 r:core_node1 x:testschemaapi_shard1_replica2] o.a.s.c.ZkController listener throws error
   [junit4]   2> org.apache.solr.common.SolrException: Unable to reload core [testschemaapi_shard1_replica2]
   [junit4]   2> 	at org.apache.solr.core.CoreContainer.reload(CoreContainer.java:921)
   [junit4]   2> 	at org.apache.solr.core.SolrCore.lambda$getConfListener$6(SolrCore.java:2488)
   [junit4]   2> 	at org.apache.solr.cloud.ZkController$4.run(ZkController.java:2425)
   [junit4]   2> Caused by: org.apache.solr.common.SolrException: Could not find config name for collection:testschemaapi
   [junit4]   2> 	at org.apache.solr.core.SolrCore.<init>(SolrCore.java:772)
   [junit4]   2> 	at org.apache.solr.core.SolrCore.reload(SolrCore.java:461)
   [junit4]   2> 	at org.apache.solr.core.CoreContainer.reload(CoreContainer.java:915)
   [junit4]   2> 	... 2 more
   [junit4]   2> Caused by: org.apache.solr.common.SolrException: Could not find config name for collection:testschemaapi
   [junit4]   2> 	at org.apache.solr.rest.ManagedResourceStorage.newStorageIO(ManagedResourceStorage.java:101)
   [junit4]   2> 	at org.apache.solr.core.SolrCore.initRestManager(SolrCore.java:2283)
   [junit4]   2> 	at org.apache.solr.core.SolrCore.<init>(SolrCore.java:748)
   [junit4]   2> 	... 4 more
   [junit4]   2> 1674981 INFO  (SUITE-TestManagedSchemaAPI-seed#[15674B1DEE069395]-worker) [    ] o.a.s.c.ZkTestServer connecting to 127.0.0.1:53028 53028
   [junit4]   2> 1675000 INFO  (Thread-2776) [    ] o.a.s.c.ZkTestServer connecting to 127.0.0.1:53028 53028
   [junit4]   2> 1676228 WARN  (Thread-2776) [    ] o.a.s.c.ZkTestServer Watch limit violations: 
   [junit4]   2> Maximum concurrent create/delete watches above limit:
   [junit4]   2> 
   [junit4]   2> 	6	/solr/configs/conf1/managed-schema
   [junit4]   2> 	6	/solr/configs/conf1
   [junit4]   2> 	3	/solr/aliases.json
   [junit4]   2> 	2	/solr/security.json
   [junit4]   2> 
   [junit4]   2> Maximum concurrent data watches above limit:
   [junit4]   2> 
   [junit4]   2> 	3	/solr/clusterstate.json
   [junit4]   2> 	2	/solr/collections/testschemaapi/state.json
   [junit4]   2> 
   [junit4]   2> Maximum concurrent children watches above limit:
   [junit4]   2> 
   [junit4]   2> 	3	/solr/live_nodes
   [junit4]   2> 	3	/solr/collections
   [junit4]   2> 
   [junit4]   2> 1676229 INFO  (SUITE-TestManagedSchemaAPI-seed#[15674B1DEE069395]-worker) [    ] o.a.s.SolrTestCaseJ4 ###deleteCore
   [junit4]   2> NOTE: leaving temporary files on disk at: /Users/jenkins/workspace/Lucene-Solr-6.x-MacOSX/solr/build/solr-core/test/J1/temp/solr.schema.TestManagedSchemaAPI_15674B1DEE069395-001
   [junit4]   2> NOTE: test params are: codec=Asserting(Lucene60): {_version_=PostingsFormat(name=LuceneVarGapDocFreqInterval), id=PostingsFormat(name=LuceneFixedGap), myNewField=PostingsFormat(name=LuceneVarGapDocFreqInterval)}, docValues:{}, maxPointsInLeafNode=1642, maxMBSortInHeap=5.119354162099513, sim=RandomSimilarity(queryNorm=true,coord=no): {}, locale=fr-CA, timezone=Africa/Maseru
   [junit4]   2> NOTE: Mac OS X 10.11.4 x86_64/Oracle Corporation 1.8.0_72 (64-bit)/cpus=3,threads=1,free=166747912,total=419364864
   [junit4]   2> NOTE: All tests run in this JVM: [SSLMigrationTest, DeleteInactiveReplicaTest, TestAuthenticationFramework, TestPivotHelperCode, DistanceUnitsTest, TestStandardQParsers, TestSolrQueryParser, TestFoldingMultitermQuery, TestSolrQueryParserResource, TestBinaryField, ConfigSetsAPITest, TestIntervalFaceting, TestRandomCollapseQParserPlugin, DataDrivenBlockJoinTest, TermVectorComponentDistributedTest, DistributedDebugComponentTest, ShardRoutingCustomTest, VMParamsZkACLAndCredentialsProvidersTest, LeaderInitiatedRecoveryOnShardRestartTest, DirectUpdateHandlerOptimizeTest, TestManagedResourceStorage, BasicZkTest, TestCSVResponseWriter, TestRTGBase, TestCollationField, TestCollectionAPI, FullSolrCloudDistribCmdsTest, TestSolrIndexConfig, RequestHandlersTest, TestSolr4Spatial2, VersionInfoTest, IndexSchemaRuntimeFieldTest, CreateCollectionCleanupTest, TestFuzzyAnalyzedSuggestions, TestSuggestSpellingConverter, CopyFieldTest, FieldMutatingUpdateProcessorTest, HdfsSyncSliceTest, MultiTermTest, TestNonDefinedSimilarityFactory, TestCoreDiscovery, DistributedFacetPivotSmallAdvancedTest, TestShortCircuitedRequests, DirectSolrConnectionTest, ConjunctionSolrSpellCheckerTest, TestSolrXml, BasicDistributedZk2Test, FacetPivotSmallTest, TestDistributedGrouping, TestImplicitCoreProperties, UpdateRequestProcessorFactoryTest, TestConfigSetsAPIExclusivity, BlobRepositoryCloudTest, BJQParserTest, TestFreeTextSuggestions, TestDynamicFieldCollectionResource, TestRecovery, TestMissingGroups, CursorMarkTest, TestLRUStatsCache, TestTrie, TestBlobHandler, CleanupOldIndexTest, OverseerTaskQueueTest, TestSimpleTrackingShardHandler, AsyncCallRequestStatusResponseTest, TestReRankQParserPlugin, TestCustomSort, TestReplicationHandlerBackup, ZkSolrClientTest, TestCharFilters, SolrCoreCheckLockOnStartupTest, TestSha256AuthenticationProvider, SuggestComponentContextFilterQueryTest, HdfsChaosMonkeySafeLeaderTest, EnumFieldTest, HLLSerializationTest, DateMathParserTest, TestBulkSchemaConcurrent, DeleteReplicaTest, TestSystemIdResolver, CoreAdminHandlerTest, TestSchemaNameResource, BigEndianAscendingWordSerializerTest, TestCryptoKeys, OpenExchangeRatesOrgProviderTest, BaseCdcrDistributedZkTest, QueryParsingTest, TestClassicSimilarityFactory, SearchHandlerTest, TolerantUpdateProcessorTest, TestCrossCoreJoin, RankQueryTest, QueryResultKeyTest, ConnectionReuseTest, TestJsonFacets, SignatureUpdateProcessorFactoryTest, DeleteStatusTest, HdfsRecoveryZkTest, SparseHLLTest, TestManagedSchemaAPI]
   [junit4] Completed [242/591 (1!)] on J1 in 13.16s, 1 test, 1 error <<< FAILURES!

[...truncated 1136 lines...]
BUILD FAILED
/Users/jenkins/workspace/Lucene-Solr-6.x-MacOSX/build.xml:740: The following error occurred while executing this line:
/Users/jenkins/workspace/Lucene-Solr-6.x-MacOSX/build.xml:684: The following error occurred while executing this line:
/Users/jenkins/workspace/Lucene-Solr-6.x-MacOSX/build.xml:59: The following error occurred while executing this line:
/Users/jenkins/workspace/Lucene-Solr-6.x-MacOSX/solr/build.xml:233: The following error occurred while executing this line:
/Users/jenkins/workspace/Lucene-Solr-6.x-MacOSX/solr/common-build.xml:529: The following error occurred while executing this line:
/Users/jenkins/workspace/Lucene-Solr-6.x-MacOSX/lucene/common-build.xml:1457: The following error occurred while executing this line:
/Users/jenkins/workspace/Lucene-Solr-6.x-MacOSX/lucene/common-build.xml:1014: There were test failures: 591 suites (10 ignored), 2380 tests, 1 error, 119 ignored (69 assumptions) [seed: 15674B1DEE069395]

Total time: 95 minutes 36 seconds
Build step 'Invoke Ant' marked build as failure
Archiving artifacts
[WARNINGS] Skipping publisher since build result is FAILURE
Recording test results
Email was triggered for: Failure - Any
Sending email for trigger: Failure - Any



Mime
View raw message