lucene-dev mailing list archives

Site index · List index
Message view « Date » · « Thread »
Top « Date » · « Thread »
From Policeman Jenkins Server <jenk...@thetaphi.de>
Subject [JENKINS] Lucene-Solr-master-Linux (64bit/jdk1.8.0_72) - Build # 16548 - Failure!
Date Wed, 20 Apr 2016 11:28:46 GMT
Build: http://jenkins.thetaphi.de/job/Lucene-Solr-master-Linux/16548/
Java: 64bit/jdk1.8.0_72 -XX:-UseCompressedOops -XX:+UseG1GC

1 tests failed.
FAILED:  org.apache.solr.cloud.overseer.ZkStateReaderTest.testStateFormatUpdateWithExplicitRefresh

Error Message:
Could not find collection : c1

Stack Trace:
org.apache.solr.common.SolrException: Could not find collection : c1
	at __randomizedtesting.SeedInfo.seed([B1645EA559BD4B3B:AEDE2F5289DD8DFE]:0)
	at org.apache.solr.common.cloud.ClusterState.getCollection(ClusterState.java:170)
	at org.apache.solr.cloud.overseer.ZkStateReaderTest.testStateFormatUpdate(ZkStateReaderTest.java:135)
	at org.apache.solr.cloud.overseer.ZkStateReaderTest.testStateFormatUpdateWithExplicitRefresh(ZkStateReaderTest.java:41)
	at sun.reflect.NativeMethodAccessorImpl.invoke0(Native Method)
	at sun.reflect.NativeMethodAccessorImpl.invoke(NativeMethodAccessorImpl.java:62)
	at sun.reflect.DelegatingMethodAccessorImpl.invoke(DelegatingMethodAccessorImpl.java:43)
	at java.lang.reflect.Method.invoke(Method.java:498)
	at com.carrotsearch.randomizedtesting.RandomizedRunner.invoke(RandomizedRunner.java:1764)
	at com.carrotsearch.randomizedtesting.RandomizedRunner$8.evaluate(RandomizedRunner.java:871)
	at com.carrotsearch.randomizedtesting.RandomizedRunner$9.evaluate(RandomizedRunner.java:907)
	at com.carrotsearch.randomizedtesting.RandomizedRunner$10.evaluate(RandomizedRunner.java:921)
	at com.carrotsearch.randomizedtesting.rules.SystemPropertiesRestoreRule$1.evaluate(SystemPropertiesRestoreRule.java:57)
	at org.apache.lucene.util.TestRuleSetupTeardownChained$1.evaluate(TestRuleSetupTeardownChained.java:49)
	at org.apache.lucene.util.AbstractBeforeAfterRule$1.evaluate(AbstractBeforeAfterRule.java:45)
	at org.apache.lucene.util.TestRuleThreadAndTestName$1.evaluate(TestRuleThreadAndTestName.java:48)
	at org.apache.lucene.util.TestRuleIgnoreAfterMaxFailures$1.evaluate(TestRuleIgnoreAfterMaxFailures.java:64)
	at org.apache.lucene.util.TestRuleMarkFailure$1.evaluate(TestRuleMarkFailure.java:47)
	at com.carrotsearch.randomizedtesting.rules.StatementAdapter.evaluate(StatementAdapter.java:36)
	at com.carrotsearch.randomizedtesting.ThreadLeakControl$StatementRunner.run(ThreadLeakControl.java:367)
	at com.carrotsearch.randomizedtesting.ThreadLeakControl.forkTimeoutingTask(ThreadLeakControl.java:809)
	at com.carrotsearch.randomizedtesting.ThreadLeakControl$3.evaluate(ThreadLeakControl.java:460)
	at com.carrotsearch.randomizedtesting.RandomizedRunner.runSingleTest(RandomizedRunner.java:880)
	at com.carrotsearch.randomizedtesting.RandomizedRunner$5.evaluate(RandomizedRunner.java:781)
	at com.carrotsearch.randomizedtesting.RandomizedRunner$6.evaluate(RandomizedRunner.java:816)
	at com.carrotsearch.randomizedtesting.RandomizedRunner$7.evaluate(RandomizedRunner.java:827)
	at com.carrotsearch.randomizedtesting.rules.StatementAdapter.evaluate(StatementAdapter.java:36)
	at com.carrotsearch.randomizedtesting.rules.SystemPropertiesRestoreRule$1.evaluate(SystemPropertiesRestoreRule.java:57)
	at org.apache.lucene.util.AbstractBeforeAfterRule$1.evaluate(AbstractBeforeAfterRule.java:45)
	at com.carrotsearch.randomizedtesting.rules.StatementAdapter.evaluate(StatementAdapter.java:36)
	at org.apache.lucene.util.TestRuleStoreClassName$1.evaluate(TestRuleStoreClassName.java:41)
	at com.carrotsearch.randomizedtesting.rules.NoShadowingOrOverridesOnMethodsRule$1.evaluate(NoShadowingOrOverridesOnMethodsRule.java:40)
	at com.carrotsearch.randomizedtesting.rules.NoShadowingOrOverridesOnMethodsRule$1.evaluate(NoShadowingOrOverridesOnMethodsRule.java:40)
	at com.carrotsearch.randomizedtesting.rules.StatementAdapter.evaluate(StatementAdapter.java:36)
	at com.carrotsearch.randomizedtesting.rules.StatementAdapter.evaluate(StatementAdapter.java:36)
	at com.carrotsearch.randomizedtesting.rules.StatementAdapter.evaluate(StatementAdapter.java:36)
	at org.apache.lucene.util.TestRuleAssertionsRequired$1.evaluate(TestRuleAssertionsRequired.java:53)
	at org.apache.lucene.util.TestRuleMarkFailure$1.evaluate(TestRuleMarkFailure.java:47)
	at org.apache.lucene.util.TestRuleIgnoreAfterMaxFailures$1.evaluate(TestRuleIgnoreAfterMaxFailures.java:64)
	at org.apache.lucene.util.TestRuleIgnoreTestSuites$1.evaluate(TestRuleIgnoreTestSuites.java:54)
	at com.carrotsearch.randomizedtesting.rules.StatementAdapter.evaluate(StatementAdapter.java:36)
	at com.carrotsearch.randomizedtesting.ThreadLeakControl$StatementRunner.run(ThreadLeakControl.java:367)
	at java.lang.Thread.run(Thread.java:745)




Build Log:
[...truncated 11137 lines...]
   [junit4] Suite: org.apache.solr.cloud.overseer.ZkStateReaderTest
   [junit4]   2> Creating dataDir: /home/jenkins/workspace/Lucene-Solr-master-Linux/solr/build/solr-core/test/J0/temp/solr.cloud.overseer.ZkStateReaderTest_B1645EA559BD4B3B-001/init-core-data-001
   [junit4]   2> 742420 INFO  (SUITE-ZkStateReaderTest-seed#[B1645EA559BD4B3B]-worker) [    ] o.a.s.SolrTestCaseJ4 Randomized ssl (false) and clientAuth (false)
   [junit4]   2> 742422 INFO  (TEST-ZkStateReaderTest.testWatchedCollectionCreation-seed#[B1645EA559BD4B3B]) [    ] o.a.s.SolrTestCaseJ4 ###Starting testWatchedCollectionCreation
   [junit4]   2> 742422 INFO  (TEST-ZkStateReaderTest.testWatchedCollectionCreation-seed#[B1645EA559BD4B3B]) [    ] o.a.s.c.ZkTestServer STARTING ZK TEST SERVER
   [junit4]   2> 742427 INFO  (Thread-2280) [    ] o.a.s.c.ZkTestServer client port:0.0.0.0/0.0.0.0:0
   [junit4]   2> 742427 INFO  (Thread-2280) [    ] o.a.s.c.ZkTestServer Starting server
   [junit4]   2> 742527 INFO  (TEST-ZkStateReaderTest.testWatchedCollectionCreation-seed#[B1645EA559BD4B3B]) [    ] o.a.s.c.ZkTestServer start zk server on port:36515
   [junit4]   2> 742527 INFO  (TEST-ZkStateReaderTest.testWatchedCollectionCreation-seed#[B1645EA559BD4B3B]) [    ] o.a.s.c.c.SolrZkClient Using default ZkCredentialsProvider
   [junit4]   2> 742527 INFO  (TEST-ZkStateReaderTest.testWatchedCollectionCreation-seed#[B1645EA559BD4B3B]) [    ] o.a.s.c.c.ConnectionManager Waiting for client to connect to ZooKeeper
   [junit4]   2> 742531 INFO  (zkCallback-900-thread-1) [    ] o.a.s.c.c.ConnectionManager Watcher org.apache.solr.common.cloud.ConnectionManager@63ba7508 name:ZooKeeperConnection Watcher:127.0.0.1:36515 got event WatchedEvent state:SyncConnected type:None path:null path:null type:None
   [junit4]   2> 742531 INFO  (TEST-ZkStateReaderTest.testWatchedCollectionCreation-seed#[B1645EA559BD4B3B]) [    ] o.a.s.c.c.ConnectionManager Client is connected to ZooKeeper
   [junit4]   2> 742531 INFO  (TEST-ZkStateReaderTest.testWatchedCollectionCreation-seed#[B1645EA559BD4B3B]) [    ] o.a.s.c.c.SolrZkClient Using default ZkACLProvider
   [junit4]   2> 742532 INFO  (TEST-ZkStateReaderTest.testWatchedCollectionCreation-seed#[B1645EA559BD4B3B]) [    ] o.a.s.c.c.SolrZkClient Using default ZkCredentialsProvider
   [junit4]   2> 742533 INFO  (TEST-ZkStateReaderTest.testWatchedCollectionCreation-seed#[B1645EA559BD4B3B]) [    ] o.a.s.c.c.ConnectionManager Waiting for client to connect to ZooKeeper
   [junit4]   2> 742533 INFO  (zkCallback-901-thread-1) [    ] o.a.s.c.c.ConnectionManager Watcher org.apache.solr.common.cloud.ConnectionManager@22fed514 name:ZooKeeperConnection Watcher:127.0.0.1:36515 got event WatchedEvent state:SyncConnected type:None path:null path:null type:None
   [junit4]   2> 742533 INFO  (TEST-ZkStateReaderTest.testWatchedCollectionCreation-seed#[B1645EA559BD4B3B]) [    ] o.a.s.c.c.ConnectionManager Client is connected to ZooKeeper
   [junit4]   2> 742534 INFO  (TEST-ZkStateReaderTest.testWatchedCollectionCreation-seed#[B1645EA559BD4B3B]) [    ] o.a.s.c.c.SolrZkClient Using default ZkACLProvider
   [junit4]   2> 742534 INFO  (TEST-ZkStateReaderTest.testWatchedCollectionCreation-seed#[B1645EA559BD4B3B]) [    ] o.a.s.c.c.SolrZkClient makePath: /solr
   [junit4]   2> 742538 INFO  (TEST-ZkStateReaderTest.testWatchedCollectionCreation-seed#[B1645EA559BD4B3B]) [    ] o.a.s.c.c.SolrZkClient Using default ZkCredentialsProvider
   [junit4]   2> 742539 INFO  (TEST-ZkStateReaderTest.testWatchedCollectionCreation-seed#[B1645EA559BD4B3B]) [    ] o.a.s.c.c.ConnectionManager Waiting for client to connect to ZooKeeper
   [junit4]   2> 742539 INFO  (zkCallback-902-thread-1) [    ] o.a.s.c.c.ConnectionManager Watcher org.apache.solr.common.cloud.ConnectionManager@16afc94f name:ZooKeeperConnection Watcher:127.0.0.1:36515/solr got event WatchedEvent state:SyncConnected type:None path:null path:null type:None
   [junit4]   2> 742540 INFO  (TEST-ZkStateReaderTest.testWatchedCollectionCreation-seed#[B1645EA559BD4B3B]) [    ] o.a.s.c.c.ConnectionManager Client is connected to ZooKeeper
   [junit4]   2> 742540 INFO  (TEST-ZkStateReaderTest.testWatchedCollectionCreation-seed#[B1645EA559BD4B3B]) [    ] o.a.s.c.c.SolrZkClient Using default ZkACLProvider
   [junit4]   2> 742540 INFO  (TEST-ZkStateReaderTest.testWatchedCollectionCreation-seed#[B1645EA559BD4B3B]) [    ] o.a.s.c.c.SolrZkClient makePath: /live_nodes
   [junit4]   2> 742542 INFO  (TEST-ZkStateReaderTest.testWatchedCollectionCreation-seed#[B1645EA559BD4B3B]) [    ] o.a.s.c.c.SolrZkClient makePath: /collections
   [junit4]   2> 742543 INFO  (TEST-ZkStateReaderTest.testWatchedCollectionCreation-seed#[B1645EA559BD4B3B]) [    ] o.a.s.c.c.SolrZkClient makePath: /aliases.json
   [junit4]   2> 742543 INFO  (TEST-ZkStateReaderTest.testWatchedCollectionCreation-seed#[B1645EA559BD4B3B]) [    ] o.a.s.c.c.SolrZkClient makePath: /clusterstate.json
   [junit4]   2> 742544 INFO  (TEST-ZkStateReaderTest.testWatchedCollectionCreation-seed#[B1645EA559BD4B3B]) [    ] o.a.s.c.c.SolrZkClient makePath: /security.json
   [junit4]   2> 742544 INFO  (TEST-ZkStateReaderTest.testWatchedCollectionCreation-seed#[B1645EA559BD4B3B]) [    ] o.a.s.c.c.ZkStateReader Updating cluster state from ZooKeeper... 
   [junit4]   2> 742545 INFO  (TEST-ZkStateReaderTest.testWatchedCollectionCreation-seed#[B1645EA559BD4B3B]) [    ] o.a.s.c.c.ZkStateReader Updated live nodes from ZooKeeper... (0) -> (0)
   [junit4]   2> 742545 INFO  (TEST-ZkStateReaderTest.testWatchedCollectionCreation-seed#[B1645EA559BD4B3B]) [    ] o.a.s.c.c.ZkStateReader addZkWatch [c1]
   [junit4]   2> 742546 INFO  (TEST-ZkStateReaderTest.testWatchedCollectionCreation-seed#[B1645EA559BD4B3B]) [    ] o.a.s.c.c.ZkStateReader Deleting data for [c1]
   [junit4]   2> 742546 INFO  (TEST-ZkStateReaderTest.testWatchedCollectionCreation-seed#[B1645EA559BD4B3B]) [    ] o.a.s.c.c.SolrZkClient makePath: /collections/c1
   [junit4]   2> 742547 INFO  (zkCallback-902-thread-1) [    ] o.a.s.c.c.ZkStateReader A collections change: [WatchedEvent state:SyncConnected type:NodeChildrenChanged path:/collections], has occurred - updating...
   [junit4]   2> 742549 INFO  (TEST-ZkStateReaderTest.testWatchedCollectionCreation-seed#[B1645EA559BD4B3B]) [    ] o.a.s.c.o.ZkStateWriter going to create_collection /collections/c1/state.json
   [junit4]   2> 742550 INFO  (zkCallback-902-thread-1) [    ] o.a.s.c.c.ZkStateReader A cluster state change: [WatchedEvent state:SyncConnected type:NodeCreated path:/collections/c1/state.json] for collection [c1] has occurred - updating... (live nodes size: [0])
   [junit4]   2> 742550 INFO  (zkCallback-902-thread-1) [    ] o.a.s.c.c.ZkStateReader Add data for [c1] ver [0]
   [junit4]   2> 742602 INFO  (TEST-ZkStateReaderTest.testWatchedCollectionCreation-seed#[B1645EA559BD4B3B]) [    ] o.a.s.c.ZkTestServer connecting to 127.0.0.1:36515 36515
   [junit4]   2> 742734 INFO  (Thread-2280) [    ] o.a.s.c.ZkTestServer connecting to 127.0.0.1:36515 36515
   [junit4]   2> 742738 INFO  (TEST-ZkStateReaderTest.testWatchedCollectionCreation-seed#[B1645EA559BD4B3B]) [    ] o.a.s.SolrTestCaseJ4 ###Ending testWatchedCollectionCreation
   [junit4]   2> 742743 INFO  (TEST-ZkStateReaderTest.testExternalCollectionWatchedNotWatched-seed#[B1645EA559BD4B3B]) [    ] o.a.s.SolrTestCaseJ4 ###Starting testExternalCollectionWatchedNotWatched
   [junit4]   2> 742743 INFO  (TEST-ZkStateReaderTest.testExternalCollectionWatchedNotWatched-seed#[B1645EA559BD4B3B]) [    ] o.a.s.c.ZkTestServer STARTING ZK TEST SERVER
   [junit4]   2> 742743 INFO  (Thread-2281) [    ] o.a.s.c.ZkTestServer client port:0.0.0.0/0.0.0.0:0
   [junit4]   2> 742743 INFO  (Thread-2281) [    ] o.a.s.c.ZkTestServer Starting server
   [junit4]   2> 742843 INFO  (TEST-ZkStateReaderTest.testExternalCollectionWatchedNotWatched-seed#[B1645EA559BD4B3B]) [    ] o.a.s.c.ZkTestServer start zk server on port:36278
   [junit4]   2> 742843 INFO  (TEST-ZkStateReaderTest.testExternalCollectionWatchedNotWatched-seed#[B1645EA559BD4B3B]) [    ] o.a.s.c.c.SolrZkClient Using default ZkCredentialsProvider
   [junit4]   2> 742844 INFO  (TEST-ZkStateReaderTest.testExternalCollectionWatchedNotWatched-seed#[B1645EA559BD4B3B]) [    ] o.a.s.c.c.ConnectionManager Waiting for client to connect to ZooKeeper
   [junit4]   2> 742847 INFO  (zkCallback-903-thread-1) [    ] o.a.s.c.c.ConnectionManager Watcher org.apache.solr.common.cloud.ConnectionManager@191187fd name:ZooKeeperConnection Watcher:127.0.0.1:36278 got event WatchedEvent state:SyncConnected type:None path:null path:null type:None
   [junit4]   2> 742847 INFO  (TEST-ZkStateReaderTest.testExternalCollectionWatchedNotWatched-seed#[B1645EA559BD4B3B]) [    ] o.a.s.c.c.ConnectionManager Client is connected to ZooKeeper
   [junit4]   2> 742847 INFO  (TEST-ZkStateReaderTest.testExternalCollectionWatchedNotWatched-seed#[B1645EA559BD4B3B]) [    ] o.a.s.c.c.SolrZkClient Using default ZkACLProvider
   [junit4]   2> 742848 INFO  (TEST-ZkStateReaderTest.testExternalCollectionWatchedNotWatched-seed#[B1645EA559BD4B3B]) [    ] o.a.s.c.c.SolrZkClient Using default ZkCredentialsProvider
   [junit4]   2> 742848 INFO  (TEST-ZkStateReaderTest.testExternalCollectionWatchedNotWatched-seed#[B1645EA559BD4B3B]) [    ] o.a.s.c.c.ConnectionManager Waiting for client to connect to ZooKeeper
   [junit4]   2> 742849 INFO  (zkCallback-904-thread-1) [    ] o.a.s.c.c.ConnectionManager Watcher org.apache.solr.common.cloud.ConnectionManager@276a2f83 name:ZooKeeperConnection Watcher:127.0.0.1:36278 got event WatchedEvent state:SyncConnected type:None path:null path:null type:None
   [junit4]   2> 742849 INFO  (TEST-ZkStateReaderTest.testExternalCollectionWatchedNotWatched-seed#[B1645EA559BD4B3B]) [    ] o.a.s.c.c.ConnectionManager Client is connected to ZooKeeper
   [junit4]   2> 742849 INFO  (TEST-ZkStateReaderTest.testExternalCollectionWatchedNotWatched-seed#[B1645EA559BD4B3B]) [    ] o.a.s.c.c.SolrZkClient Using default ZkACLProvider
   [junit4]   2> 742849 INFO  (TEST-ZkStateReaderTest.testExternalCollectionWatchedNotWatched-seed#[B1645EA559BD4B3B]) [    ] o.a.s.c.c.SolrZkClient makePath: /solr
   [junit4]   2> 742852 INFO  (TEST-ZkStateReaderTest.testExternalCollectionWatchedNotWatched-seed#[B1645EA559BD4B3B]) [    ] o.a.s.c.c.SolrZkClient Using default ZkCredentialsProvider
   [junit4]   2> 742855 INFO  (TEST-ZkStateReaderTest.testExternalCollectionWatchedNotWatched-seed#[B1645EA559BD4B3B]) [    ] o.a.s.c.c.ConnectionManager Waiting for client to connect to ZooKeeper
   [junit4]   2> 742855 INFO  (zkCallback-905-thread-1) [    ] o.a.s.c.c.ConnectionManager Watcher org.apache.solr.common.cloud.ConnectionManager@6ba4edca name:ZooKeeperConnection Watcher:127.0.0.1:36278/solr got event WatchedEvent state:SyncConnected type:None path:null path:null type:None
   [junit4]   2> 742855 INFO  (TEST-ZkStateReaderTest.testExternalCollectionWatchedNotWatched-seed#[B1645EA559BD4B3B]) [    ] o.a.s.c.c.ConnectionManager Client is connected to ZooKeeper
   [junit4]   2> 742855 INFO  (TEST-ZkStateReaderTest.testExternalCollectionWatchedNotWatched-seed#[B1645EA559BD4B3B]) [    ] o.a.s.c.c.SolrZkClient Using default ZkACLProvider
   [junit4]   2> 742861 INFO  (TEST-ZkStateReaderTest.testExternalCollectionWatchedNotWatched-seed#[B1645EA559BD4B3B]) [    ] o.a.s.c.c.SolrZkClient makePath: /live_nodes
   [junit4]   2> 742883 INFO  (TEST-ZkStateReaderTest.testExternalCollectionWatchedNotWatched-seed#[B1645EA559BD4B3B]) [    ] o.a.s.c.c.SolrZkClient makePath: /collections
   [junit4]   2> 742883 INFO  (TEST-ZkStateReaderTest.testExternalCollectionWatchedNotWatched-seed#[B1645EA559BD4B3B]) [    ] o.a.s.c.c.SolrZkClient makePath: /aliases.json
   [junit4]   2> 742884 INFO  (TEST-ZkStateReaderTest.testExternalCollectionWatchedNotWatched-seed#[B1645EA559BD4B3B]) [    ] o.a.s.c.c.SolrZkClient makePath: /clusterstate.json
   [junit4]   2> 742885 INFO  (TEST-ZkStateReaderTest.testExternalCollectionWatchedNotWatched-seed#[B1645EA559BD4B3B]) [    ] o.a.s.c.c.SolrZkClient makePath: /security.json
   [junit4]   2> 742885 INFO  (TEST-ZkStateReaderTest.testExternalCollectionWatchedNotWatched-seed#[B1645EA559BD4B3B]) [    ] o.a.s.c.c.ZkStateReader Updating cluster state from ZooKeeper... 
   [junit4]   2> 742886 INFO  (TEST-ZkStateReaderTest.testExternalCollectionWatchedNotWatched-seed#[B1645EA559BD4B3B]) [    ] o.a.s.c.c.ZkStateReader Updated live nodes from ZooKeeper... (0) -> (0)
   [junit4]   2> 742886 INFO  (TEST-ZkStateReaderTest.testExternalCollectionWatchedNotWatched-seed#[B1645EA559BD4B3B]) [    ] o.a.s.c.c.SolrZkClient makePath: /collections/c1
   [junit4]   2> 742887 INFO  (zkCallback-905-thread-1) [    ] o.a.s.c.c.ZkStateReader A collections change: [WatchedEvent state:SyncConnected type:NodeChildrenChanged path:/collections], has occurred - updating...
   [junit4]   2> 742900 INFO  (TEST-ZkStateReaderTest.testExternalCollectionWatchedNotWatched-seed#[B1645EA559BD4B3B]) [    ] o.a.s.c.o.ZkStateWriter going to create_collection /collections/c1/state.json
   [junit4]   2> 742900 INFO  (TEST-ZkStateReaderTest.testExternalCollectionWatchedNotWatched-seed#[B1645EA559BD4B3B]) [    ] o.a.s.c.c.ZkStateReader addZkWatch [c1]
   [junit4]   2> 742900 INFO  (TEST-ZkStateReaderTest.testExternalCollectionWatchedNotWatched-seed#[B1645EA559BD4B3B]) [    ] o.a.s.c.c.ZkStateReader Add data for [c1] ver [0]
   [junit4]   2> 742901 INFO  (TEST-ZkStateReaderTest.testExternalCollectionWatchedNotWatched-seed#[B1645EA559BD4B3B]) [    ] o.a.s.c.c.ZkStateReader Removing watch for uninteresting collection [c1]
   [junit4]   2> 742902 INFO  (TEST-ZkStateReaderTest.testExternalCollectionWatchedNotWatched-seed#[B1645EA559BD4B3B]) [    ] o.a.s.c.ZkTestServer connecting to 127.0.0.1:36278 36278
   [junit4]   2> 743031 INFO  (Thread-2281) [    ] o.a.s.c.ZkTestServer connecting to 127.0.0.1:36278 36278
   [junit4]   2> 743034 INFO  (TEST-ZkStateReaderTest.testExternalCollectionWatchedNotWatched-seed#[B1645EA559BD4B3B]) [    ] o.a.s.SolrTestCaseJ4 ###Ending testExternalCollectionWatchedNotWatched
   [junit4]   2> 743037 INFO  (TEST-ZkStateReaderTest.testStateFormatUpdateWithTimeDelay-seed#[B1645EA559BD4B3B]) [    ] o.a.s.SolrTestCaseJ4 ###Starting testStateFormatUpdateWithTimeDelay
   [junit4]   2> 743038 INFO  (TEST-ZkStateReaderTest.testStateFormatUpdateWithTimeDelay-seed#[B1645EA559BD4B3B]) [    ] o.a.s.c.ZkTestServer STARTING ZK TEST SERVER
   [junit4]   2> 743038 INFO  (Thread-2282) [    ] o.a.s.c.ZkTestServer client port:0.0.0.0/0.0.0.0:0
   [junit4]   2> 743038 INFO  (Thread-2282) [    ] o.a.s.c.ZkTestServer Starting server
   [junit4]   2> 743138 INFO  (TEST-ZkStateReaderTest.testStateFormatUpdateWithTimeDelay-seed#[B1645EA559BD4B3B]) [    ] o.a.s.c.ZkTestServer start zk server on port:34291
   [junit4]   2> 743138 INFO  (TEST-ZkStateReaderTest.testStateFormatUpdateWithTimeDelay-seed#[B1645EA559BD4B3B]) [    ] o.a.s.c.c.SolrZkClient Using default ZkCredentialsProvider
   [junit4]   2> 743139 INFO  (TEST-ZkStateReaderTest.testStateFormatUpdateWithTimeDelay-seed#[B1645EA559BD4B3B]) [    ] o.a.s.c.c.ConnectionManager Waiting for client to connect to ZooKeeper
   [junit4]   2> 743141 INFO  (zkCallback-906-thread-1) [    ] o.a.s.c.c.ConnectionManager Watcher org.apache.solr.common.cloud.ConnectionManager@ed0e46b name:ZooKeeperConnection Watcher:127.0.0.1:34291 got event WatchedEvent state:SyncConnected type:None path:null path:null type:None
   [junit4]   2> 743141 INFO  (TEST-ZkStateReaderTest.testStateFormatUpdateWithTimeDelay-seed#[B1645EA559BD4B3B]) [    ] o.a.s.c.c.ConnectionManager Client is connected to ZooKeeper
   [junit4]   2> 743141 INFO  (TEST-ZkStateReaderTest.testStateFormatUpdateWithTimeDelay-seed#[B1645EA559BD4B3B]) [    ] o.a.s.c.c.SolrZkClient Using default ZkACLProvider
   [junit4]   2> 743143 INFO  (TEST-ZkStateReaderTest.testStateFormatUpdateWithTimeDelay-seed#[B1645EA559BD4B3B]) [    ] o.a.s.c.c.SolrZkClient Using default ZkCredentialsProvider
   [junit4]   2> 743143 INFO  (TEST-ZkStateReaderTest.testStateFormatUpdateWithTimeDelay-seed#[B1645EA559BD4B3B]) [    ] o.a.s.c.c.ConnectionManager Waiting for client to connect to ZooKeeper
   [junit4]   2> 743145 INFO  (zkCallback-907-thread-1) [    ] o.a.s.c.c.ConnectionManager Watcher org.apache.solr.common.cloud.ConnectionManager@22343e37 name:ZooKeeperConnection Watcher:127.0.0.1:34291 got event WatchedEvent state:SyncConnected type:None path:null path:null type:None
   [junit4]   2> 743145 INFO  (TEST-ZkStateReaderTest.testStateFormatUpdateWithTimeDelay-seed#[B1645EA559BD4B3B]) [    ] o.a.s.c.c.ConnectionManager Client is connected to ZooKeeper
   [junit4]   2> 743145 INFO  (TEST-ZkStateReaderTest.testStateFormatUpdateWithTimeDelay-seed#[B1645EA559BD4B3B]) [    ] o.a.s.c.c.SolrZkClient Using default ZkACLProvider
   [junit4]   2> 743145 INFO  (TEST-ZkStateReaderTest.testStateFormatUpdateWithTimeDelay-seed#[B1645EA559BD4B3B]) [    ] o.a.s.c.c.SolrZkClient makePath: /solr
   [junit4]   2> 743149 INFO  (TEST-ZkStateReaderTest.testStateFormatUpdateWithTimeDelay-seed#[B1645EA559BD4B3B]) [    ] o.a.s.c.c.SolrZkClient Using default ZkCredentialsProvider
   [junit4]   2> 743150 INFO  (TEST-ZkStateReaderTest.testStateFormatUpdateWithTimeDelay-seed#[B1645EA559BD4B3B]) [    ] o.a.s.c.c.ConnectionManager Waiting for client to connect to ZooKeeper
   [junit4]   2> 743151 INFO  (zkCallback-908-thread-1) [    ] o.a.s.c.c.ConnectionManager Watcher org.apache.solr.common.cloud.ConnectionManager@6fc28086 name:ZooKeeperConnection Watcher:127.0.0.1:34291/solr got event WatchedEvent state:SyncConnected type:None path:null path:null type:None
   [junit4]   2> 743151 INFO  (TEST-ZkStateReaderTest.testStateFormatUpdateWithTimeDelay-seed#[B1645EA559BD4B3B]) [    ] o.a.s.c.c.ConnectionManager Client is connected to ZooKeeper
   [junit4]   2> 743151 INFO  (TEST-ZkStateReaderTest.testStateFormatUpdateWithTimeDelay-seed#[B1645EA559BD4B3B]) [    ] o.a.s.c.c.SolrZkClient Using default ZkACLProvider
   [junit4]   2> 743151 INFO  (TEST-ZkStateReaderTest.testStateFormatUpdateWithTimeDelay-seed#[B1645EA559BD4B3B]) [    ] o.a.s.c.c.SolrZkClient makePath: /live_nodes
   [junit4]   2> 743152 INFO  (TEST-ZkStateReaderTest.testStateFormatUpdateWithTimeDelay-seed#[B1645EA559BD4B3B]) [    ] o.a.s.c.c.SolrZkClient makePath: /collections
   [junit4]   2> 743154 INFO  (TEST-ZkStateReaderTest.testStateFormatUpdateWithTimeDelay-seed#[B1645EA559BD4B3B]) [    ] o.a.s.c.c.SolrZkClient makePath: /aliases.json
   [junit4]   2> 743154 INFO  (TEST-ZkStateReaderTest.testStateFormatUpdateWithTimeDelay-seed#[B1645EA559BD4B3B]) [    ] o.a.s.c.c.SolrZkClient makePath: /clusterstate.json
   [junit4]   2> 743155 INFO  (TEST-ZkStateReaderTest.testStateFormatUpdateWithTimeDelay-seed#[B1645EA559BD4B3B]) [    ] o.a.s.c.c.SolrZkClient makePath: /security.json
   [junit4]   2> 743155 INFO  (TEST-ZkStateReaderTest.testStateFormatUpdateWithTimeDelay-seed#[B1645EA559BD4B3B]) [    ] o.a.s.c.c.ZkStateReader Updating cluster state from ZooKeeper... 
   [junit4]   2> 743156 INFO  (TEST-ZkStateReaderTest.testStateFormatUpdateWithTimeDelay-seed#[B1645EA559BD4B3B]) [    ] o.a.s.c.c.ZkStateReader Updated live nodes from ZooKeeper... (0) -> (0)
   [junit4]   2> 743156 INFO  (TEST-ZkStateReaderTest.testStateFormatUpdateWithTimeDelay-seed#[B1645EA559BD4B3B]) [    ] o.a.s.c.c.ZkStateReader addZkWatch [c1]
   [junit4]   2> 743156 INFO  (TEST-ZkStateReaderTest.testStateFormatUpdateWithTimeDelay-seed#[B1645EA559BD4B3B]) [    ] o.a.s.c.c.ZkStateReader Deleting data for [c1]
   [junit4]   2> 743156 INFO  (TEST-ZkStateReaderTest.testStateFormatUpdateWithTimeDelay-seed#[B1645EA559BD4B3B]) [    ] o.a.s.c.c.SolrZkClient makePath: /collections/c1
   [junit4]   2> 743157 INFO  (zkCallback-908-thread-1) [    ] o.a.s.c.c.ZkStateReader A collections change: [WatchedEvent state:SyncConnected type:NodeChildrenChanged path:/collections], has occurred - updating...
   [junit4]   2> 743171 INFO  (zkCallback-908-thread-2) [    ] o.a.s.c.c.ZkStateReader A cluster state change: [WatchedEvent state:SyncConnected type:NodeDataChanged path:/clusterstate.json], has occurred - updating... (live nodes size: [0])
   [junit4]   2> 743172 INFO  (TEST-ZkStateReaderTest.testStateFormatUpdateWithTimeDelay-seed#[B1645EA559BD4B3B]) [    ] o.a.s.c.o.ZkStateWriter going to create_collection /collections/c1/state.json
   [junit4]   2> 743173 INFO  (zkCallback-908-thread-2) [    ] o.a.s.c.c.ZkStateReader A cluster state change: [WatchedEvent state:SyncConnected type:NodeCreated path:/collections/c1/state.json] for collection [c1] has occurred - updating... (live nodes size: [0])
   [junit4]   2> 743173 INFO  (zkCallback-908-thread-1) [    ] o.a.s.c.c.ZkStateReader A cluster state change: [WatchedEvent state:SyncConnected type:NodeDataChanged path:/clusterstate.json], has occurred - updating... (live nodes size: [0])
   [junit4]   2> 743173 INFO  (zkCallback-908-thread-2) [    ] o.a.s.c.c.ZkStateReader Add data for [c1] ver [0]
   [junit4]   2> 743175 INFO  (TEST-ZkStateReaderTest.testStateFormatUpdateWithTimeDelay-seed#[B1645EA559BD4B3B]) [    ] o.a.s.c.ZkTestServer connecting to 127.0.0.1:34291 34291
   [junit4]   2> 743274 INFO  (Thread-2282) [    ] o.a.s.c.ZkTestServer connecting to 127.0.0.1:34291 34291
   [junit4]   2> 743276 INFO  (TEST-ZkStateReaderTest.testStateFormatUpdateWithTimeDelay-seed#[B1645EA559BD4B3B]) [    ] o.a.s.SolrTestCaseJ4 ###Ending testStateFormatUpdateWithTimeDelay
   [junit4]   2> 743278 INFO  (TEST-ZkStateReaderTest.testStateFormatUpdateWithTimeDelayLazy-seed#[B1645EA559BD4B3B]) [    ] o.a.s.SolrTestCaseJ4 ###Starting testStateFormatUpdateWithTimeDelayLazy
   [junit4]   2> 743279 INFO  (TEST-ZkStateReaderTest.testStateFormatUpdateWithTimeDelayLazy-seed#[B1645EA559BD4B3B]) [    ] o.a.s.c.ZkTestServer STARTING ZK TEST SERVER
   [junit4]   2> 743279 INFO  (Thread-2283) [    ] o.a.s.c.ZkTestServer client port:0.0.0.0/0.0.0.0:0
   [junit4]   2> 743279 INFO  (Thread-2283) [    ] o.a.s.c.ZkTestServer Starting server
   [junit4]   2> 743379 INFO  (TEST-ZkStateReaderTest.testStateFormatUpdateWithTimeDelayLazy-seed#[B1645EA559BD4B3B]) [    ] o.a.s.c.ZkTestServer start zk server on port:33516
   [junit4]   2> 743379 INFO  (TEST-ZkStateReaderTest.testStateFormatUpdateWithTimeDelayLazy-seed#[B1645EA559BD4B3B]) [    ] o.a.s.c.c.SolrZkClient Using default ZkCredentialsProvider
   [junit4]   2> 743387 INFO  (TEST-ZkStateReaderTest.testStateFormatUpdateWithTimeDelayLazy-seed#[B1645EA559BD4B3B]) [    ] o.a.s.c.c.ConnectionManager Waiting for client to connect to ZooKeeper
   [junit4]   2> 743411 INFO  (zkCallback-909-thread-1) [    ] o.a.s.c.c.ConnectionManager Watcher org.apache.solr.common.cloud.ConnectionManager@5b51673e name:ZooKeeperConnection Watcher:127.0.0.1:33516 got event WatchedEvent state:SyncConnected type:None path:null path:null type:None
   [junit4]   2> 743411 INFO  (TEST-ZkStateReaderTest.testStateFormatUpdateWithTimeDelayLazy-seed#[B1645EA559BD4B3B]) [    ] o.a.s.c.c.ConnectionManager Client is connected to ZooKeeper
   [junit4]   2> 743411 INFO  (TEST-ZkStateReaderTest.testStateFormatUpdateWithTimeDelayLazy-seed#[B1645EA559BD4B3B]) [    ] o.a.s.c.c.SolrZkClient Using default ZkACLProvider
   [junit4]   2> 743423 INFO  (TEST-ZkStateReaderTest.testStateFormatUpdateWithTimeDelayLazy-seed#[B1645EA559BD4B3B]) [    ] o.a.s.c.c.SolrZkClient Using default ZkCredentialsProvider
   [junit4]   2> 743430 INFO  (TEST-ZkStateReaderTest.testStateFormatUpdateWithTimeDelayLazy-seed#[B1645EA559BD4B3B]) [    ] o.a.s.c.c.ConnectionManager Waiting for client to connect to ZooKeeper
   [junit4]   2> 743432 INFO  (zkCallback-910-thread-1) [    ] o.a.s.c.c.ConnectionManager Watcher org.apache.solr.common.cloud.ConnectionManager@4fcaae9d name:ZooKeeperConnection Watcher:127.0.0.1:33516 got event WatchedEvent state:SyncConnected type:None path:null path:null type:None
   [junit4]   2> 743432 INFO  (TEST-ZkStateReaderTest.testStateFormatUpdateWithTimeDelayLazy-seed#[B1645EA559BD4B3B]) [    ] o.a.s.c.c.ConnectionManager Client is connected to ZooKeeper
   [junit4]   2> 743432 INFO  (TEST-ZkStateReaderTest.testStateFormatUpdateWithTimeDelayLazy-seed#[B1645EA559BD4B3B]) [    ] o.a.s.c.c.SolrZkClient Using default ZkACLProvider
   [junit4]   2> 743432 INFO  (TEST-ZkStateReaderTest.testStateFormatUpdateWithTimeDelayLazy-seed#[B1645EA559BD4B3B]) [    ] o.a.s.c.c.SolrZkClient makePath: /solr
   [junit4]   2> 743437 INFO  (TEST-ZkStateReaderTest.testStateFormatUpdateWithTimeDelayLazy-seed#[B1645EA559BD4B3B]) [    ] o.a.s.c.c.SolrZkClient Using default ZkCredentialsProvider
   [junit4]   2> 743437 INFO  (TEST-ZkStateReaderTest.testStateFormatUpdateWithTimeDelayLazy-seed#[B1645EA559BD4B3B]) [    ] o.a.s.c.c.ConnectionManager Waiting for client to connect to ZooKeeper
   [junit4]   2> 743440 INFO  (zkCallback-911-thread-1) [    ] o.a.s.c.c.ConnectionManager Watcher org.apache.solr.common.cloud.ConnectionManager@5b6bbca0 name:ZooKeeperConnection Watcher:127.0.0.1:33516/solr got event WatchedEvent state:SyncConnected type:None path:null path:null type:None
   [junit4]   2> 743440 INFO  (TEST-ZkStateReaderTest.testStateFormatUpdateWithTimeDelayLazy-seed#[B1645EA559BD4B3B]) [    ] o.a.s.c.c.ConnectionManager Client is connected to ZooKeeper
   [junit4]   2> 743440 INFO  (TEST-ZkStateReaderTest.testStateFormatUpdateWithTimeDelayLazy-seed#[B1645EA559BD4B3B]) [    ] o.a.s.c.c.SolrZkClient Using default ZkACLProvider
   [junit4]   2> 743440 INFO  (TEST-ZkStateReaderTest.testStateFormatUpdateWithTimeDelayLazy-seed#[B1645EA559BD4B3B]) [    ] o.a.s.c.c.SolrZkClient makePath: /live_nodes
   [junit4]   2> 743459 INFO  (TEST-ZkStateReaderTest.testStateFormatUpdateWithTimeDelayLazy-seed#[B1645EA559BD4B3B]) [    ] o.a.s.c.c.SolrZkClient makePath: /collections
   [junit4]   2> 743461 INFO  (TEST-ZkStateReaderTest.testStateFormatUpdateWithTimeDelayLazy-seed#[B1645EA559BD4B3B]) [    ] o.a.s.c.c.SolrZkClient makePath: /aliases.json
   [junit4]   2> 743462 INFO  (TEST-ZkStateReaderTest.testStateFormatUpdateWithTimeDelayLazy-seed#[B1645EA559BD4B3B]) [    ] o.a.s.c.c.SolrZkClient makePath: /clusterstate.json
   [junit4]   2> 743463 INFO  (TEST-ZkStateReaderTest.testStateFormatUpdateWithTimeDelayLazy-seed#[B1645EA559BD4B3B]) [    ] o.a.s.c.c.SolrZkClient makePath: /security.json
   [junit4]   2> 743463 INFO  (TEST-ZkStateReaderTest.testStateFormatUpdateWithTimeDelayLazy-seed#[B1645EA559BD4B3B]) [    ] o.a.s.c.c.ZkStateReader Updating cluster state from ZooKeeper... 
   [junit4]   2> 743466 INFO  (TEST-ZkStateReaderTest.testStateFormatUpdateWithTimeDelayLazy-seed#[B1645EA559BD4B3B]) [    ] o.a.s.c.c.ZkStateReader Updated live nodes from ZooKeeper... (0) -> (0)
   [junit4]   2> 743466 INFO  (TEST-ZkStateReaderTest.testStateFormatUpdateWithTimeDelayLazy-seed#[B1645EA559BD4B3B]) [    ] o.a.s.c.c.SolrZkClient makePath: /collections/c1
   [junit4]   2> 743467 INFO  (zkCallback-911-thread-1) [    ] o.a.s.c.c.ZkStateReader A collections change: [WatchedEvent state:SyncConnected type:NodeChildrenChanged path:/collections], has occurred - updating...
   [junit4]   2> 743469 INFO  (zkCallback-911-thread-2) [    ] o.a.s.c.c.ZkStateReader A cluster state change: [WatchedEvent state:SyncConnected type:NodeDataChanged path:/clusterstate.json], has occurred - updating... (live nodes size: [0])
   [junit4]   2> 743470 INFO  (TEST-ZkStateReaderTest.testStateFormatUpdateWithTimeDelayLazy-seed#[B1645EA559BD4B3B]) [    ] o.a.s.c.o.ZkStateWriter going to create_collection /collections/c1/state.json
   [junit4]   2> 743471 INFO  (zkCallback-911-thread-2) [    ] o.a.s.c.c.ZkStateReader A cluster state change: [WatchedEvent state:SyncConnected type:NodeDataChanged path:/clusterstate.json], has occurred - updating... (live nodes size: [0])
   [junit4]   2> 743473 INFO  (TEST-ZkStateReaderTest.testStateFormatUpdateWithTimeDelayLazy-seed#[B1645EA559BD4B3B]) [    ] o.a.s.c.ZkTestServer connecting to 127.0.0.1:33516 33516
   [junit4]   2> 743482 INFO  (Thread-2283) [    ] o.a.s.c.ZkTestServer connecting to 127.0.0.1:33516 33516
   [junit4]   2> 743484 INFO  (TEST-ZkStateReaderTest.testStateFormatUpdateWithTimeDelayLazy-seed#[B1645EA559BD4B3B]) [    ] o.a.s.SolrTestCaseJ4 ###Ending testStateFormatUpdateWithTimeDelayLazy
   [junit4]   2> 743489 INFO  (TEST-ZkStateReaderTest.testStateFormatUpdateWithExplicitRefreshLazy-seed#[B1645EA559BD4B3B]) [    ] o.a.s.SolrTestCaseJ4 ###Starting testStateFormatUpdateWithExplicitRefreshLazy
   [junit4]   2> 743490 INFO  (TEST-ZkStateReaderTest.testStateFormatUpdateWithExplicitRefreshLazy-seed#[B1645EA559BD4B3B]) [    ] o.a.s.c.ZkTestServer STARTING ZK TEST SERVER
   [junit4]   2> 743491 INFO  (Thread-2284) [    ] o.a.s.c.ZkTestServer client port:0.0.0.0/0.0.0.0:0
   [junit4]   2> 743491 INFO  (Thread-2284) [    ] o.a.s.c.ZkTestServer Starting server
   [junit4]   2> 743591 INFO  (TEST-ZkStateReaderTest.testStateFormatUpdateWithExplicitRefreshLazy-seed#[B1645EA559BD4B3B]) [    ] o.a.s.c.ZkTestServer start zk server on port:33481
   [junit4]   2> 743591 INFO  (TEST-ZkStateReaderTest.testStateFormatUpdateWithExplicitRefreshLazy-seed#[B1645EA559BD4B3B]) [    ] o.a.s.c.c.SolrZkClient Using default ZkCredentialsProvider
   [junit4]   2> 743592 INFO  (TEST-ZkStateReaderTest.testStateFormatUpdateWithExplicitRefreshLazy-seed#[B1645EA559BD4B3B]) [    ] o.a.s.c.c.ConnectionManager Waiting for client to connect to ZooKeeper
   [junit4]   2> 743595 INFO  (zkCallback-912-thread-1) [    ] o.a.s.c.c.ConnectionManager Watcher org.apache.solr.common.cloud.ConnectionManager@2e23e2a2 name:ZooKeeperConnection Watcher:127.0.0.1:33481 got event WatchedEvent state:SyncConnected type:None path:null path:null type:None
   [junit4]   2> 743595 INFO  (TEST-ZkStateReaderTest.testStateFormatUpdateWithExplicitRefreshLazy-seed#[B1645EA559BD4B3B]) [    ] o.a.s.c.c.ConnectionManager Client is connected to ZooKeeper
   [junit4]   2> 743595 INFO  (TEST-ZkStateReaderTest.testStateFormatUpdateWithExplicitRefreshLazy-seed#[B1645EA559BD4B3B]) [    ] o.a.s.c.c.SolrZkClient Using default ZkACLProvider
   [junit4]   2> 743596 INFO  (TEST-ZkStateReaderTest.testStateFormatUpdateWithExplicitRefreshLazy-seed#[B1645EA559BD4B3B]) [    ] o.a.s.c.c.SolrZkClient Using default ZkCredentialsProvider
   [junit4]   2> 743606 INFO  (TEST-ZkStateReaderTest.testStateFormatUpdateWithExplicitRefreshLazy-seed#[B1645EA559BD4B3B]) [    ] o.a.s.c.c.ConnectionManager Waiting for client to connect to ZooKeeper
   [junit4]   2> 743606 INFO  (zkCallback-913-thread-1) [    ] o.a.s.c.c.ConnectionManager Watcher org.apache.solr.common.cloud.ConnectionManager@50b1d74b name:ZooKeeperConnection Watcher:127.0.0.1:33481 got event WatchedEvent state:SyncConnected type:None path:null path:null type:None
   [junit4]   2> 743606 INFO  (TEST-ZkStateReaderTest.testStateFormatUpdateWithExplicitRefreshLazy-seed#[B1645EA559BD4B3B]) [    ] o.a.s.c.c.ConnectionManager Client is connected to ZooKeeper
   [junit4]   2> 743607 INFO  (TEST-ZkStateReaderTest.testStateFormatUpdateWithExplicitRefreshLazy-seed#[B1645EA559BD4B3B]) [    ] o.a.s.c.c.SolrZkClient Using default ZkACLProvider
   [junit4]   2> 743607 INFO  (TEST-ZkStateReaderTest.testStateFormatUpdateWithExplicitRefreshLazy-seed#[B1645EA559BD4B3B]) [    ] o.a.s.c.c.SolrZkClient makePath: /solr
   [junit4]   2> 743610 INFO  (TEST-ZkStateReaderTest.testStateFormatUpdateWithExplicitRefreshLazy-seed#[B1645EA559BD4B3B]) [    ] o.a.s.c.c.SolrZkClient Using default ZkCredentialsProvider
   [junit4]   2> 743610 INFO  (TEST-ZkStateReaderTest.testStateFormatUpdateWithExplicitRefreshLazy-seed#[B1645EA559BD4B3B]) [    ] o.a.s.c.c.ConnectionManager Waiting for client to connect to ZooKeeper
   [junit4]   2> 743611 INFO  (zkCallback-914-thread-1) [    ] o.a.s.c.c.ConnectionManager Watcher org.apache.solr.common.cloud.ConnectionManager@180ddfab name:ZooKeeperConnection Watcher:127.0.0.1:33481/solr got event WatchedEvent state:SyncConnected type:None path:null path:null type:None
   [junit4]   2> 743611 INFO  (TEST-ZkStateReaderTest.testStateFormatUpdateWithExplicitRefreshLazy-seed#[B1645EA559BD4B3B]) [    ] o.a.s.c.c.ConnectionManager Client is connected to ZooKeeper
   [junit4]   2> 743612 INFO  (TEST-ZkStateReaderTest.testStateFormatUpdateWithExplicitRefreshLazy-seed#[B1645EA559BD4B3B]) [    ] o.a.s.c.c.SolrZkClient Using default ZkACLProvider
   [junit4]   2> 743612 INFO  (TEST-ZkStateReaderTest.testStateFormatUpdateWithExplicitRefreshLazy-seed#[B1645EA559BD4B3B]) [    ] o.a.s.c.c.SolrZkClient makePath: /live_nodes
   [junit4]   2> 743613 INFO  (TEST-ZkStateReaderTest.testStateFormatUpdateWithExplicitRefreshLazy-seed#[B1645EA559BD4B3B]) [    ] o.a.s.c.c.SolrZkClient makePath: /collections
   [junit4]   2> 743613 INFO  (TEST-ZkStateReaderTest.testStateFormatUpdateWithExplicitRefreshLazy-seed#[B1645EA559BD4B3B]) [    ] o.a.s.c.c.SolrZkClient makePath: /aliases.json
   [junit4]   2> 743614 INFO  (TEST-ZkStateReaderTest.testStateFormatUpdateWithExplicitRefreshLazy-seed#[B1645EA559BD4B3B]) [    ] o.a.s.c.c.SolrZkClient makePath: /clusterstate.json
   [junit4]   2> 743615 INFO  (TEST-ZkStateReaderTest.testStateFormatUpdateWithExplicitRefreshLazy-seed#[B1645EA559BD4B3B]) [    ] o.a.s.c.c.SolrZkClient makePath: /security.json
   [junit4]   2> 743615 INFO  (TEST-ZkStateReaderTest.testStateFormatUpdateWithExplicitRefreshLazy-seed#[B1645EA559BD4B3B]) [    ] o.a.s.c.c.ZkStateReader Updating cluster state from ZooKeeper... 
   [junit4]   2> 743616 INFO  (TEST-ZkStateReaderTest.testStateFormatUpdateWithExplicitRefreshLazy-seed#[B1645EA559BD4B3B]) [    ] o.a.s.c.c.ZkStateReader Updated live nodes from ZooKeeper... (0) -> (0)
   [junit4]   2> 743616 INFO  (TEST-ZkStateReaderTest.testStateFormatUpdateWithExplicitRefreshLazy-seed#[B1645EA559BD4B3B]) [    ] o.a.s.c.c.SolrZkClient makePath: /collections/c1
   [junit4]   2> 743617 INFO  (zkCallback-914-thread-1) [    ] o.a.s.c.c.ZkStateReader A collections change: [WatchedEvent state:SyncConnected type:NodeChildrenChanged path:/collections], has occurred - updating...
   [junit4]   2> 743618 INFO  (zkCallback-914-thread-1) [    ] o.a.s.c.c.ZkStateReader A cluster state change: [WatchedEvent state:SyncConnected type:NodeDataChanged path:/clusterstate.json], has occurred - updating... (live nodes size: [0])
   [junit4]   2> 743618 INFO  (TEST-ZkStateReaderTest.testStateFormatUpdateWithExplicitRefreshLazy-seed#[B1645EA559BD4B3B]) [    ] o.a.s.c.o.ZkStateWriter going to create_collection /collections/c1/state.json
   [junit4]   2> 743619 INFO  (zkCallback-914-thread-1) [    ] o.a.s.c.c.ZkStateReader A cluster state change: [WatchedEvent state:SyncConnected type:NodeDataChanged path:/clusterstate.json], has occurred - updating... (live nodes size: [0])
   [junit4]   2> 743622 INFO  (TEST-ZkStateReaderTest.testStateFormatUpdateWithExplicitRefreshLazy-seed#[B1645EA559BD4B3B]) [    ] o.a.s.c.ZkTestServer connecting to 127.0.0.1:33481 33481
   [junit4]   2> 743644 INFO  (Thread-2284) [    ] o.a.s.c.ZkTestServer connecting to 127.0.0.1:33481 33481
   [junit4]   2> 743646 INFO  (TEST-ZkStateReaderTest.testStateFormatUpdateWithExplicitRefreshLazy-seed#[B1645EA559BD4B3B]) [    ] o.a.s.SolrTestCaseJ4 ###Ending testStateFormatUpdateWithExplicitRefreshLazy
   [junit4]   2> 743652 INFO  (TEST-ZkStateReaderTest.testStateFormatUpdateWithExplicitRefresh-seed#[B1645EA559BD4B3B]) [    ] o.a.s.SolrTestCaseJ4 ###Starting testStateFormatUpdateWithExplicitRefresh
   [junit4]   2> 743653 INFO  (TEST-ZkStateReaderTest.testStateFormatUpdateWithExplicitRefresh-seed#[B1645EA559BD4B3B]) [    ] o.a.s.c.ZkTestServer STARTING ZK TEST SERVER
   [junit4]   2> 743654 INFO  (Thread-2285) [    ] o.a.s.c.ZkTestServer client port:0.0.0.0/0.0.0.0:0
   [junit4]   2> 743654 INFO  (Thread-2285) [    ] o.a.s.c.ZkTestServer Starting server
   [junit4]   2> 743754 INFO  (TEST-ZkStateReaderTest.testStateFormatUpdateWithExplicitRefresh-seed#[B1645EA559BD4B3B]) [    ] o.a.s.c.ZkTestServer start zk server on port:37023
   [junit4]   2> 743754 INFO  (TEST-ZkStateReaderTest.testStateFormatUpdateWithExplicitRefresh-seed#[B1645EA559BD4B3B]) [    ] o.a.s.c.c.SolrZkClient Using default ZkCredentialsProvider
   [junit4]   2> 743755 INFO  (TEST-ZkStateReaderTest.testStateFormatUpdateWithExplicitRefresh-seed#[B1645EA559BD4B3B]) [    ] o.a.s.c.c.ConnectionManager Waiting for client to connect to ZooKeeper
   [junit4]   2> 743757 INFO  (zkCallback-915-thread-1) [    ] o.a.s.c.c.ConnectionManager Watcher org.apache.solr.common.cloud.ConnectionManager@476f9114 name:ZooKeeperConnection Watcher:127.0.0.1:37023 got event WatchedEvent state:SyncConnected type:None path:null path:null type:None
   [junit4]   2> 743757 INFO  (TEST-ZkStateReaderTest.testStateFormatUpdateWithExplicitRefresh-seed#[B1645EA559BD4B3B]) [    ] o.a.s.c.c.ConnectionManager Client is connected to ZooKeeper
   [junit4]   2> 743758 INFO  (TEST-ZkStateReaderTest.testStateFormatUpdateWithExplicitRefresh-seed#[B1645EA559BD4B3B]) [    ] o.a.s.c.c.SolrZkClient Using default ZkACLProvider
   [junit4]   2> 743761 INFO  (TEST-ZkStateReaderTest.testStateFormatUpdateWithExplicitRefresh-seed#[B1645EA559BD4B3B]) [    ] o.a.s.c.c.SolrZkClient Using default ZkCredentialsProvider
   [junit4]   2> 743762 INFO  (TEST-ZkStateReaderTest.testStateFormatUpdateWithExplicitRefresh-seed#[B1645EA559BD4B3B]) [    ] o.a.s.c.c.ConnectionManager Waiting for client to connect to ZooKeeper
   [junit4]   2> 743768 INFO  (zkCallback-916-thread-1) [    ] o.a.s.c.c.ConnectionManager Watcher org.apache.solr.common.cloud.ConnectionManager@2bcf5063 name:ZooKeeperConnection Watcher:127.0.0.1:37023 got event WatchedEvent state:SyncConnected type:None path:null path:null type:None
   [junit4]   2> 743769 INFO  (TEST-ZkStateReaderTest.testStateFormatUpdateWithExplicitRefresh-seed#[B1645EA559BD4B3B]) [    ] o.a.s.c.c.ConnectionManager Client is connected to ZooKeeper
   [junit4]   2> 743769 INFO  (TEST-ZkStateReaderTest.testStateFormatUpdateWithExplicitRefresh-seed#[B1645EA559BD4B3B]) [    ] o.a.s.c.c.SolrZkClient Using default ZkACLProvider
   [junit4]   2> 743769 INFO  (TEST-ZkStateReaderTest.testStateFormatUpdateWithExplicitRefresh-seed#[B1645EA559BD4B3B]) [    ] o.a.s.c.c.SolrZkClient makePath: /solr
   [junit4]   2> 743773 INFO  (TEST-ZkStateReaderTest.testStateFormatUpdateWithExplicitRefresh-seed#[B1645EA559BD4B3B]) [    ] o.a.s.c.c.SolrZkClient Using default ZkCredentialsProvider
   [junit4]   2> 743776 INFO  (TEST-ZkStateReaderTest.testStateFormatUpdateWithExplicitRefresh-seed#[B1645EA559BD4B3B]) [    ] o.a.s.c.c.ConnectionManager Waiting for client to connect to ZooKeeper
   [junit4]   2> 743777 INFO  (zkCallback-917-thread-1) [    ] o.a.s.c.c.ConnectionManager Watcher org.apache.solr.common.cloud.ConnectionManager@3c04e648 name:ZooKeeperConnection Watcher:127.0.0.1:37023/solr got event WatchedEvent state:SyncConnected type:None path:null path:null type:None
   [junit4]   2> 743777 INFO  (TEST-ZkStateReaderTest.testStateFormatUpdateWithExplicitRefresh-seed#[B1645EA559BD4B3B]) [    ] o.a.s.c.c.ConnectionManager Client is connected to ZooKeeper
   [junit4]   2> 743777 INFO  (TEST-ZkStateReaderTest.testStateFormatUpdateWithExplicitRefresh-seed#[B1645EA559BD4B3B]) [    ] o.a.s.c.c.SolrZkClient Using default ZkACLProvider
   [junit4]   2> 743777 INFO  (TEST-ZkStateReaderTest.testStateFormatUpdateWithExplicitRefresh-seed#[B1645EA559BD4B3B]) [    ] o.a.s.c.c.SolrZkClient makePath: /live_nodes
   [junit4]   2> 743778 INFO  (TEST-ZkStateReaderTest.testStateFormatUpdateWithExplicitRefresh-seed#[B1645EA559BD4B3B]) [    ] o.a.s.c.c.SolrZkClient makePath: /collections
   [junit4]   2> 743779 INFO  (TEST-ZkStateReaderTest.testStateFormatUpdateWithExplicitRefresh-seed#[B1645EA559BD4B3B]) [    ] o.a.s.c.c.SolrZkClient makePath: /aliases.json
   [junit4]   2> 743780 INFO  (TEST-ZkStateReaderTest.testStateFormatUpdateWithExplicitRefresh-seed#[B1645EA559BD4B3B]) [    ] o.a.s.c.c.SolrZkClient makePath: /clusterstate.json
   [junit4]   2> 743783 INFO  (TEST-ZkStateReaderTest.testStateFormatUpdateWithExplicitRefresh-seed#[B1645EA559BD4B3B]) [    ] o.a.s.c.c.SolrZkClient makePath: /security.json
   [junit4]   2> 743787 INFO  (TEST-ZkStateReaderTest.testStateFormatUpdateWithExplicitRefresh-seed#[B1645EA559BD4B3B]) [    ] o.a.s.c.c.ZkStateReader Updating cluster state from ZooKeeper... 
   [junit4]   2> 743788 INFO  (TEST-ZkStateReaderTest.testStateFormatUpdateWithExplicitRefresh-seed#[B1645EA559BD4B3B]) [    ] o.a.s.c.c.ZkStateReader Updated live nodes from ZooKeeper... (0) -> (0)
   [junit4]   2> 743788 INFO  (TEST-ZkStateReaderTest.testStateFormatUpdateWithExplicitRefresh-seed#[B1645EA559BD4B3B]) [    ] o.a.s.c.c.ZkStateReader addZkWatch [c1]
   [junit4]   2> 743788 INFO  (TEST-ZkStateReaderTest.testStateFormatUpdateWithExplicitRefresh-seed#[B1645EA559BD4B3B]) [    ] o.a.s.c.c.ZkStateReader Deleting data for [c1]
   [junit4]   2> 743788 INFO  (TEST-ZkStateReaderTest.testStateFormatUpdateWithExplicitRefresh-seed#[B1645EA559BD4B3B]) [    ] o.a.s.c.c.SolrZkClient makePath: /collections/c1
   [junit4]   2> 743790 INFO  (TEST-ZkStateReaderTest.testStateFormatUpdateWithExplicitRefresh-seed#[B1645EA559BD4B3B]) [    ] o.a.s.c.o.ZkStateWriter going to create_collection /collections/c1/state.json
   [junit4]   2> 743795 WARN  (NIOServerCxn.Factory:0.0.0.0/0.0.0.0:0) [    ] o.a.z.s.NIOServerCnxn caught end of stream exception
   [junit4]   2> EndOfStreamException: Unable to read additional data from client sessionid 0x154335b4e0d0002, likely client has closed socket
   [junit4]   2> 	at org.apache.zookeeper.server.NIOServerCnxn.doIO(NIOServerCnxn.java:228)
   [junit4]   2> 	at org.apache.zookeeper.server.NIOServerCnxnFactory.run(NIOServerCnxnFactory.java:208)
   [junit4]   2> 	at java.lang.Thread.run(Thread.java:745)
   [junit4]   2> 743795 INFO  (TEST-ZkStateReaderTest.testStateFormatUpdateWithExplicitRefresh-seed#[B1645EA559BD4B3B]) [    ] o.a.s.c.ZkTestServer connecting to 127.0.0.1:37023 37023
   [junit4]   2> 743795 ERROR (TEST-ZkStateReaderTest.testStateFormatUpdateWithExplicitRefresh-seed#[B1645EA559BD4B3B]-EventThread) [    ] o.a.z.ClientCnxn Error while calling watcher 
   [junit4]   2> java.util.concurrent.RejectedExecutionException: Task org.apache.solr.common.util.ExecutorUtil$MDCAwareThreadPoolExecutor$$Lambda$6/1865406022@6a9b5cfe rejected from org.apache.solr.common.util.ExecutorUtil$MDCAwareThreadPoolExecutor@6ea4d575[Terminated, pool size = 0, active threads = 0, queued tasks = 0, completed tasks = 1]
   [junit4]   2> 	at java.util.concurrent.ThreadPoolExecutor$AbortPolicy.rejectedExecution(ThreadPoolExecutor.java:2047)
   [junit4]   2> 	at java.util.concurrent.ThreadPoolExecutor.reject(ThreadPoolExecutor.java:823)
   [junit4]   2> 	at java.util.concurrent.ThreadPoolExecutor.execute(ThreadPoolExecutor.java:1369)
   [junit4]   2> 	at org.apache.solr.common.util.ExecutorUtil$MDCAwareThreadPoolExecutor.execute(ExecutorUtil.java:214)
   [junit4]   2> 	at java.util.concurrent.AbstractExecutorService.submit(AbstractExecutorService.java:112)
   [junit4]   2> 	at org.apache.solr.common.cloud.SolrZkClient$3.process(SolrZkClient.java:266)
   [junit4]   2> 	at org.apache.zookeeper.ClientCnxn$EventThread.processEvent(ClientCnxn.java:522)
   [junit4]   2> 	at org.apache.zookeeper.ClientCnxn$EventThread.run(ClientCnxn.java:498)
   [junit4]   2> 743797 ERROR (TEST-ZkStateReaderTest.testStateFormatUpdateWithExplicitRefresh-seed#[B1645EA559BD4B3B]-EventThread) [    ] o.a.z.ClientCnxn Error while calling watcher 
   [junit4]   2> java.util.concurrent.RejectedExecutionException: Task org.apache.solr.common.util.ExecutorUtil$MDCAwareThreadPoolExecutor$$Lambda$6/1865406022@2a0b6922 rejected from org.apache.solr.common.util.ExecutorUtil$MDCAwareThreadPoolExecutor@6ea4d575[Terminated, pool size = 0, active threads = 0, queued tasks = 0, completed tasks = 1]
   [junit4]   2> 	at java.util.concurrent.ThreadPoolExecutor$AbortPolicy.rejectedExecution(ThreadPoolExecutor.java:2047)
   [junit4]   2> 	at java.util.concurrent.ThreadPoolExecutor.reject(ThreadPoolExecutor.java:823)
   [junit4]   2> 	at java.util.concurrent.ThreadPoolExecutor.execute(ThreadPoolExecutor.java:1369)
   [junit4]   2> 	at org.apache.solr.common.util.ExecutorUtil$MDCAwareThreadPoolExecutor.execute(ExecutorUtil.java:214)
   [junit4]   2> 	at java.util.concurrent.AbstractExecutorService.submit(AbstractExecutorService.java:112)
   [junit4]   2> 	at org.apache.solr.common.cloud.SolrZkClient$3.process(SolrZkClient.java:266)
   [junit4]   2> 	at org.apache.zookeeper.ClientCnxn$EventThread.processEvent(ClientCnxn.java:522)
   [junit4]   2> 	at org.apache.zookeeper.ClientCnxn$EventThread.run(ClientCnxn.java:498)
   [junit4]   2> 743797 ERROR (TEST-ZkStateReaderTest.testStateFormatUpdateWithExplicitRefresh-seed#[B1645EA559BD4B3B]-EventThread) [    ] o.a.z.ClientCnxn Error while calling watcher 
   [junit4]   2> java.util.concurrent.RejectedExecutionException: Task org.apache.solr.common.util.ExecutorUtil$MDCAwareThreadPoolExecutor$$Lambda$6/1865406022@5280dd61 rejected from org.apache.solr.common.util.ExecutorUtil$MDCAwareThreadPoolExecutor@6ea4d575[Terminated, pool size = 0, active threads = 0, queued tasks = 0, completed tasks = 1]
   [junit4]   2> 	at java.util.concurrent.ThreadPoolExecutor$AbortPolicy.rejectedExecution(ThreadPoolExecutor.java:2047)
   [junit4]   2> 	at java.util.concurrent.ThreadPoolExecutor.reject(ThreadPoolExecutor.java:823)
   [junit4]   2> 	at java.util.concurrent.ThreadPoolExecutor.execute(ThreadPoolExecutor.java:1369)
   [junit4]   2> 	at org.apache.solr.common.util.ExecutorUtil$MDCAwareThreadPoolExecutor.execute(ExecutorUtil.java:214)
   [junit4]   2> 	at java.util.concurrent.AbstractExecutorService.submit(AbstractExecutorService.java:112)
   [junit4]   2> 	at org.apache.solr.common.cloud.SolrZkClient$3.process(SolrZkClient.java:266)
   [junit4]   2> 	at org.apache.zookeeper.ClientCnxn$EventThread.processEvent(ClientCnxn.java:522)
   [junit4]   2> 	at org.apache.zookeeper.ClientCnxn$EventThread.run(ClientCnxn.java:498)
   [junit4]   2> 743829 INFO  (Thread-2285) [    ] o.a.s.c.ZkTestServer connecting to 127.0.0.1:37023 37023
   [junit4]   2> 743833 INFO  (TEST-ZkStateReaderTest.testStateFormatUpdateWithExplicitRefresh-seed#[B1645EA559BD4B3B]) [    ] o.a.s.SolrTestCaseJ4 ###Ending testStateFormatUpdateWithExplicitRefresh
   [junit4]   2> NOTE: reproduce with: ant test  -Dtestcase=ZkStateReaderTest -Dtests.method=testStateFormatUpdateWithExplicitRefresh -Dtests.seed=B1645EA559BD4B3B -Dtests.multiplier=3 -Dtests.slow=true -Dtests.locale=lt-LT -Dtests.timezone=Asia/Baghdad -Dtests.asserts=true -Dtests.file.encoding=ISO-8859-1
   [junit4] ERROR   0.19s J0 | ZkStateReaderTest.testStateFormatUpdateWithExplicitRefresh <<<
   [junit4]    > Throwable #1: org.apache.solr.common.SolrException: Could not find collection : c1
   [junit4]    > 	at __randomizedtesting.SeedInfo.seed([B1645EA559BD4B3B:AEDE2F5289DD8DFE]:0)
   [junit4]    > 	at org.apache.solr.common.cloud.ClusterState.getCollection(ClusterState.java:170)
   [junit4]    > 	at org.apache.solr.cloud.overseer.ZkStateReaderTest.testStateFormatUpdate(ZkStateReaderTest.java:135)
   [junit4]    > 	at org.apache.solr.cloud.overseer.ZkStateReaderTest.testStateFormatUpdateWithExplicitRefresh(ZkStateReaderTest.java:41)
   [junit4]    > 	at java.lang.Thread.run(Thread.java:745)
   [junit4]   2> 743836 INFO  (SUITE-ZkStateReaderTest-seed#[B1645EA559BD4B3B]-worker) [    ] o.a.s.SolrTestCaseJ4 ###deleteCore
   [junit4]   2> NOTE: leaving temporary files on disk at: /home/jenkins/workspace/Lucene-Solr-master-Linux/solr/build/solr-core/test/J0/temp/solr.cloud.overseer.ZkStateReaderTest_B1645EA559BD4B3B-001
   [junit4]   2> Apr 20, 2016 11:08:22 AM com.carrotsearch.randomizedtesting.ThreadLeakControl checkThreadLeaks
   [junit4]   2> WARNING: Will linger awaiting termination of 6 leaked thread(s).
   [junit4]   2> NOTE: test params are: codec=Asserting(Lucene60): {}, docValues:{}, maxPointsInLeafNode=511, maxMBSortInHeap=6.075018162881241, sim=RandomSimilarity(queryNorm=true,coord=no): {}, locale=lt-LT, timezone=Asia/Baghdad
   [junit4]   2> NOTE: Linux 4.2.0-34-generic amd64/Oracle Corporation 1.8.0_72 (64-bit)/cpus=12,threads=1,free=205278552,total=536870912
   [junit4]   2> NOTE: All tests run in this JVM: [PrimUtilsTest, FileBasedSpellCheckerTest, BufferStoreTest, AsyncCallRequestStatusResponseTest, TestFastOutputStream, TestRangeQuery, ReturnFieldsTest, BigEndianAscendingWordDeserializerTest, TestQueryWrapperFilter, AnalysisAfterCoreReloadTest, DistributedFacetPivotSmallAdvancedTest, ConcurrentDeleteAndCreateCollectionTest, SharedFSAutoReplicaFailoverTest, RAMDirectoryFactoryTest, SecurityConfHandlerTest, BasicZkTest, TestRandomRequestDistribution, TestDynamicFieldCollectionResource, DistributedSpellCheckComponentTest, JsonLoaderTest, DeleteStatusTest, TestTolerantUpdateProcessorCloud, TestIBSimilarityFactory, CopyFieldTest, CacheHeaderTest, CdcrVersionReplicationTest, DistributedQueryElevationComponentTest, CloudMLTQParserTest, TestMergePolicyConfig, TestCollectionAPI, CollectionTooManyReplicasTest, DocExpirationUpdateProcessorFactoryTest, TestLRUCache, HdfsCollectionsAPIDistributedZkTest, TestExactSharedStatsCache, MultiThreadedOCPTest, ForceLeaderTest, TestLMDirichletSimilarityFactory, TestPKIAuthenticationPlugin, TestReplicationHandler, TestStressUserVersions, ExternalFileFieldSortTest, SolrCoreTest, HLLUtilTest, TestHighlightDedupGrouping, TestPseudoReturnFields, TestReloadAndDeleteDocs, TestAnalyzedSuggestions, QueryElevationComponentTest, PreAnalyzedUpdateProcessorTest, TestCustomSort, DateRangeFieldTest, TestConfig, StandardRequestHandlerTest, PathHierarchyTokenizerFactoryTest, ZkNodePropsTest, SpatialRPTFieldTypeTest, RuleEngineTest, TestSchemaVersionResource, HdfsThreadLeakTest, SolrRequestParserTest, SynonymTokenizerTest, AtomicUpdatesTest, UUIDUpdateProcessorFallbackTest, TestHashQParserPlugin, TestBadConfig, HdfsBasicDistributedZkTest, OutputWriterTest, LeaderElectionIntegrationTest, TestSolrDynamicMBean, TestConfigSets, TestManagedSchema, ReplicationFactorTest, TestCSVLoader, TestCrossCoreJoin, TestSolr4Spatial2, TestBinaryField, TestRandomFaceting, SOLR749Test, TestRTGBase, CloudExitableDirectoryReaderTest, ZkStateReaderTest]
   [junit4] Completed [198/590 (1!)] on J0 in 1.98s, 6 tests, 1 error <<< FAILURES!

[...truncated 1275 lines...]
BUILD FAILED
/home/jenkins/workspace/Lucene-Solr-master-Linux/build.xml:740: The following error occurred while executing this line:
/home/jenkins/workspace/Lucene-Solr-master-Linux/build.xml:684: The following error occurred while executing this line:
/home/jenkins/workspace/Lucene-Solr-master-Linux/build.xml:59: The following error occurred while executing this line:
/home/jenkins/workspace/Lucene-Solr-master-Linux/solr/build.xml:233: The following error occurred while executing this line:
/home/jenkins/workspace/Lucene-Solr-master-Linux/solr/common-build.xml:529: The following error occurred while executing this line:
/home/jenkins/workspace/Lucene-Solr-master-Linux/lucene/common-build.xml:1457: The following error occurred while executing this line:
/home/jenkins/workspace/Lucene-Solr-master-Linux/lucene/common-build.xml:1014: There were test failures: 590 suites (10 ignored), 2373 tests, 1 error, 114 ignored (70 assumptions) [seed: B1645EA559BD4B3B]

Total time: 57 minutes 41 seconds
Build step 'Invoke Ant' marked build as failure
Archiving artifacts
[WARNINGS] Skipping publisher since build result is FAILURE
Recording test results
Email was triggered for: Failure - Any
Sending email for trigger: Failure - Any



Mime
View raw message