lucene-dev mailing list archives

Site index · List index
Message view « Date » · « Thread »
Top « Date » · « Thread »
From Policeman Jenkins Server <jenk...@thetaphi.de>
Subject [JENKINS] Lucene-Solr-master-MacOSX (64bit/jdk1.8.0) - Build # 3237 - Failure!
Date Fri, 29 Apr 2016 03:52:41 GMT
Build: http://jenkins.thetaphi.de/job/Lucene-Solr-master-MacOSX/3237/
Java: 64bit/jdk1.8.0 -XX:+UseCompressedOops -XX:+UseParallelGC

1 tests failed.
FAILED:  org.apache.solr.handler.TestReqParamsAPI.test

Error Message:
Could not get expected value  'null' for path 'response/params/y/p' full output: {   "responseHeader":{     "status":0,     "QTime":0},   "response":{     "znodeVersion":4,     "params":{       "x":{         "a":"A val",         "b":"B val",         "_appends_":{"add":"first"},         "_invariants_":{"fixed":"f"},         "":{"v":1}},       "y":{         "p":"P val",         "q":"Q val",         "":{"v":2}}}}},  from server:  http://127.0.0.1:54137/collection1

Stack Trace:
java.lang.AssertionError: Could not get expected value  'null' for path 'response/params/y/p' full output: {
  "responseHeader":{
    "status":0,
    "QTime":0},
  "response":{
    "znodeVersion":4,
    "params":{
      "x":{
        "a":"A val",
        "b":"B val",
        "_appends_":{"add":"first"},
        "_invariants_":{"fixed":"f"},
        "":{"v":1}},
      "y":{
        "p":"P val",
        "q":"Q val",
        "":{"v":2}}}}},  from server:  http://127.0.0.1:54137/collection1
	at __randomizedtesting.SeedInfo.seed([2AF64E9075DE3853:A2A2714ADB2255AB]:0)
	at org.junit.Assert.fail(Assert.java:93)
	at org.junit.Assert.assertTrue(Assert.java:43)
	at org.apache.solr.core.TestSolrConfigHandler.testForResponseElement(TestSolrConfigHandler.java:457)
	at org.apache.solr.handler.TestReqParamsAPI.testReqParams(TestReqParamsAPI.java:259)
	at org.apache.solr.handler.TestReqParamsAPI.test(TestReqParamsAPI.java:62)
	at sun.reflect.NativeMethodAccessorImpl.invoke0(Native Method)
	at sun.reflect.NativeMethodAccessorImpl.invoke(NativeMethodAccessorImpl.java:62)
	at sun.reflect.DelegatingMethodAccessorImpl.invoke(DelegatingMethodAccessorImpl.java:43)
	at java.lang.reflect.Method.invoke(Method.java:498)
	at com.carrotsearch.randomizedtesting.RandomizedRunner.invoke(RandomizedRunner.java:1764)
	at com.carrotsearch.randomizedtesting.RandomizedRunner$8.evaluate(RandomizedRunner.java:871)
	at com.carrotsearch.randomizedtesting.RandomizedRunner$9.evaluate(RandomizedRunner.java:907)
	at com.carrotsearch.randomizedtesting.RandomizedRunner$10.evaluate(RandomizedRunner.java:921)
	at org.apache.solr.BaseDistributedSearchTestCase$ShardsRepeatRule$ShardsFixedStatement.callStatement(BaseDistributedSearchTestCase.java:985)
	at org.apache.solr.BaseDistributedSearchTestCase$ShardsRepeatRule$ShardsStatement.evaluate(BaseDistributedSearchTestCase.java:960)
	at com.carrotsearch.randomizedtesting.rules.SystemPropertiesRestoreRule$1.evaluate(SystemPropertiesRestoreRule.java:57)
	at org.apache.lucene.util.TestRuleSetupTeardownChained$1.evaluate(TestRuleSetupTeardownChained.java:49)
	at org.apache.lucene.util.AbstractBeforeAfterRule$1.evaluate(AbstractBeforeAfterRule.java:45)
	at org.apache.lucene.util.TestRuleThreadAndTestName$1.evaluate(TestRuleThreadAndTestName.java:48)
	at org.apache.lucene.util.TestRuleIgnoreAfterMaxFailures$1.evaluate(TestRuleIgnoreAfterMaxFailures.java:64)
	at org.apache.lucene.util.TestRuleMarkFailure$1.evaluate(TestRuleMarkFailure.java:47)
	at com.carrotsearch.randomizedtesting.rules.StatementAdapter.evaluate(StatementAdapter.java:36)
	at com.carrotsearch.randomizedtesting.ThreadLeakControl$StatementRunner.run(ThreadLeakControl.java:367)
	at com.carrotsearch.randomizedtesting.ThreadLeakControl.forkTimeoutingTask(ThreadLeakControl.java:809)
	at com.carrotsearch.randomizedtesting.ThreadLeakControl$3.evaluate(ThreadLeakControl.java:460)
	at com.carrotsearch.randomizedtesting.RandomizedRunner.runSingleTest(RandomizedRunner.java:880)
	at com.carrotsearch.randomizedtesting.RandomizedRunner$5.evaluate(RandomizedRunner.java:781)
	at com.carrotsearch.randomizedtesting.RandomizedRunner$6.evaluate(RandomizedRunner.java:816)
	at com.carrotsearch.randomizedtesting.RandomizedRunner$7.evaluate(RandomizedRunner.java:827)
	at com.carrotsearch.randomizedtesting.rules.StatementAdapter.evaluate(StatementAdapter.java:36)
	at com.carrotsearch.randomizedtesting.rules.SystemPropertiesRestoreRule$1.evaluate(SystemPropertiesRestoreRule.java:57)
	at org.apache.lucene.util.AbstractBeforeAfterRule$1.evaluate(AbstractBeforeAfterRule.java:45)
	at com.carrotsearch.randomizedtesting.rules.StatementAdapter.evaluate(StatementAdapter.java:36)
	at org.apache.lucene.util.TestRuleStoreClassName$1.evaluate(TestRuleStoreClassName.java:41)
	at com.carrotsearch.randomizedtesting.rules.NoShadowingOrOverridesOnMethodsRule$1.evaluate(NoShadowingOrOverridesOnMethodsRule.java:40)
	at com.carrotsearch.randomizedtesting.rules.NoShadowingOrOverridesOnMethodsRule$1.evaluate(NoShadowingOrOverridesOnMethodsRule.java:40)
	at com.carrotsearch.randomizedtesting.rules.StatementAdapter.evaluate(StatementAdapter.java:36)
	at com.carrotsearch.randomizedtesting.rules.StatementAdapter.evaluate(StatementAdapter.java:36)
	at com.carrotsearch.randomizedtesting.rules.StatementAdapter.evaluate(StatementAdapter.java:36)
	at org.apache.lucene.util.TestRuleAssertionsRequired$1.evaluate(TestRuleAssertionsRequired.java:53)
	at org.apache.lucene.util.TestRuleMarkFailure$1.evaluate(TestRuleMarkFailure.java:47)
	at org.apache.lucene.util.TestRuleIgnoreAfterMaxFailures$1.evaluate(TestRuleIgnoreAfterMaxFailures.java:64)
	at org.apache.lucene.util.TestRuleIgnoreTestSuites$1.evaluate(TestRuleIgnoreTestSuites.java:54)
	at com.carrotsearch.randomizedtesting.rules.StatementAdapter.evaluate(StatementAdapter.java:36)
	at com.carrotsearch.randomizedtesting.ThreadLeakControl$StatementRunner.run(ThreadLeakControl.java:367)
	at java.lang.Thread.run(Thread.java:745)




Build Log:
[...truncated 12056 lines...]
   [junit4] Suite: org.apache.solr.handler.TestReqParamsAPI
   [junit4]   2> Creating dataDir: /Users/jenkins/workspace/Lucene-Solr-master-MacOSX/solr/build/solr-core/test/J0/temp/solr.handler.TestReqParamsAPI_2AF64E9075DE3853-001/init-core-data-001
   [junit4]   2> 3140156 INFO  (SUITE-TestReqParamsAPI-seed#[2AF64E9075DE3853]-worker) [    ] o.a.s.SolrTestCaseJ4 Randomized ssl (false) and clientAuth (false)
   [junit4]   2> 3140156 INFO  (SUITE-TestReqParamsAPI-seed#[2AF64E9075DE3853]-worker) [    ] o.a.s.BaseDistributedSearchTestCase Setting hostContext system property: /
   [junit4]   2> 3140158 INFO  (TEST-TestReqParamsAPI.test-seed#[2AF64E9075DE3853]) [    ] o.a.s.c.ZkTestServer STARTING ZK TEST SERVER
   [junit4]   2> 3140158 INFO  (Thread-6591) [    ] o.a.s.c.ZkTestServer client port:0.0.0.0/0.0.0.0:0
   [junit4]   2> 3140158 INFO  (Thread-6591) [    ] o.a.s.c.ZkTestServer Starting server
   [junit4]   2> 3140268 INFO  (TEST-TestReqParamsAPI.test-seed#[2AF64E9075DE3853]) [    ] o.a.s.c.ZkTestServer start zk server on port:54102
   [junit4]   2> 3140269 INFO  (TEST-TestReqParamsAPI.test-seed#[2AF64E9075DE3853]) [    ] o.a.s.c.c.SolrZkClient Using default ZkCredentialsProvider
   [junit4]   2> 3140269 INFO  (TEST-TestReqParamsAPI.test-seed#[2AF64E9075DE3853]) [    ] o.a.s.c.c.ConnectionManager Waiting for client to connect to ZooKeeper
   [junit4]   2> 3140585 INFO  (zkCallback-3239-thread-1) [    ] o.a.s.c.c.ConnectionManager Watcher org.apache.solr.common.cloud.ConnectionManager@4350a87 name:ZooKeeperConnection Watcher:127.0.0.1:54102 got event WatchedEvent state:SyncConnected type:None path:null path:null type:None
   [junit4]   2> 3140585 INFO  (TEST-TestReqParamsAPI.test-seed#[2AF64E9075DE3853]) [    ] o.a.s.c.c.ConnectionManager Client is connected to ZooKeeper
   [junit4]   2> 3140585 INFO  (TEST-TestReqParamsAPI.test-seed#[2AF64E9075DE3853]) [    ] o.a.s.c.c.SolrZkClient Using default ZkACLProvider
   [junit4]   2> 3140585 INFO  (TEST-TestReqParamsAPI.test-seed#[2AF64E9075DE3853]) [    ] o.a.s.c.c.SolrZkClient makePath: /solr
   [junit4]   2> 3140590 INFO  (TEST-TestReqParamsAPI.test-seed#[2AF64E9075DE3853]) [    ] o.a.s.c.c.SolrZkClient Using default ZkCredentialsProvider
   [junit4]   2> 3140590 INFO  (TEST-TestReqParamsAPI.test-seed#[2AF64E9075DE3853]) [    ] o.a.s.c.c.ConnectionManager Waiting for client to connect to ZooKeeper
   [junit4]   2> 3140591 INFO  (zkCallback-3240-thread-1) [    ] o.a.s.c.c.ConnectionManager Watcher org.apache.solr.common.cloud.ConnectionManager@110f9db4 name:ZooKeeperConnection Watcher:127.0.0.1:54102/solr got event WatchedEvent state:SyncConnected type:None path:null path:null type:None
   [junit4]   2> 3140592 INFO  (TEST-TestReqParamsAPI.test-seed#[2AF64E9075DE3853]) [    ] o.a.s.c.c.ConnectionManager Client is connected to ZooKeeper
   [junit4]   2> 3140592 INFO  (TEST-TestReqParamsAPI.test-seed#[2AF64E9075DE3853]) [    ] o.a.s.c.c.SolrZkClient Using default ZkACLProvider
   [junit4]   2> 3140592 INFO  (TEST-TestReqParamsAPI.test-seed#[2AF64E9075DE3853]) [    ] o.a.s.c.c.SolrZkClient makePath: /collections/collection1
   [junit4]   2> 3140598 INFO  (TEST-TestReqParamsAPI.test-seed#[2AF64E9075DE3853]) [    ] o.a.s.c.c.SolrZkClient makePath: /collections/collection1/shards
   [junit4]   2> 3140600 INFO  (TEST-TestReqParamsAPI.test-seed#[2AF64E9075DE3853]) [    ] o.a.s.c.c.SolrZkClient makePath: /collections/control_collection
   [junit4]   2> 3140603 INFO  (TEST-TestReqParamsAPI.test-seed#[2AF64E9075DE3853]) [    ] o.a.s.c.c.SolrZkClient makePath: /collections/control_collection/shards
   [junit4]   2> 3140606 INFO  (TEST-TestReqParamsAPI.test-seed#[2AF64E9075DE3853]) [    ] o.a.s.c.AbstractZkTestCase put /Users/jenkins/workspace/Lucene-Solr-master-MacOSX/solr/core/src/test-files/solr/collection1/conf/solrconfig-tlog.xml to /configs/conf1/solrconfig.xml
   [junit4]   2> 3140612 INFO  (TEST-TestReqParamsAPI.test-seed#[2AF64E9075DE3853]) [    ] o.a.s.c.c.SolrZkClient makePath: /configs/conf1/solrconfig.xml
   [junit4]   2> 3140616 INFO  (TEST-TestReqParamsAPI.test-seed#[2AF64E9075DE3853]) [    ] o.a.s.c.AbstractZkTestCase put /Users/jenkins/workspace/Lucene-Solr-master-MacOSX/solr/core/src/test-files/solr/collection1/conf/schema.xml to /configs/conf1/schema.xml
   [junit4]   2> 3140625 INFO  (TEST-TestReqParamsAPI.test-seed#[2AF64E9075DE3853]) [    ] o.a.s.c.c.SolrZkClient makePath: /configs/conf1/schema.xml
   [junit4]   2> 3140629 INFO  (TEST-TestReqParamsAPI.test-seed#[2AF64E9075DE3853]) [    ] o.a.s.c.AbstractZkTestCase put /Users/jenkins/workspace/Lucene-Solr-master-MacOSX/solr/core/src/test-files/solr/collection1/conf/solrconfig.snippet.randomindexconfig.xml to /configs/conf1/solrconfig.snippet.randomindexconfig.xml
   [junit4]   2> 3140629 INFO  (TEST-TestReqParamsAPI.test-seed#[2AF64E9075DE3853]) [    ] o.a.s.c.c.SolrZkClient makePath: /configs/conf1/solrconfig.snippet.randomindexconfig.xml
   [junit4]   2> 3140634 INFO  (TEST-TestReqParamsAPI.test-seed#[2AF64E9075DE3853]) [    ] o.a.s.c.AbstractZkTestCase put /Users/jenkins/workspace/Lucene-Solr-master-MacOSX/solr/core/src/test-files/solr/collection1/conf/stopwords.txt to /configs/conf1/stopwords.txt
   [junit4]   2> 3140640 INFO  (TEST-TestReqParamsAPI.test-seed#[2AF64E9075DE3853]) [    ] o.a.s.c.c.SolrZkClient makePath: /configs/conf1/stopwords.txt
   [junit4]   2> 3140643 INFO  (TEST-TestReqParamsAPI.test-seed#[2AF64E9075DE3853]) [    ] o.a.s.c.AbstractZkTestCase put /Users/jenkins/workspace/Lucene-Solr-master-MacOSX/solr/core/src/test-files/solr/collection1/conf/protwords.txt to /configs/conf1/protwords.txt
   [junit4]   2> 3140644 INFO  (TEST-TestReqParamsAPI.test-seed#[2AF64E9075DE3853]) [    ] o.a.s.c.c.SolrZkClient makePath: /configs/conf1/protwords.txt
   [junit4]   2> 3140647 INFO  (TEST-TestReqParamsAPI.test-seed#[2AF64E9075DE3853]) [    ] o.a.s.c.AbstractZkTestCase put /Users/jenkins/workspace/Lucene-Solr-master-MacOSX/solr/core/src/test-files/solr/collection1/conf/currency.xml to /configs/conf1/currency.xml
   [junit4]   2> 3140648 INFO  (TEST-TestReqParamsAPI.test-seed#[2AF64E9075DE3853]) [    ] o.a.s.c.c.SolrZkClient makePath: /configs/conf1/currency.xml
   [junit4]   2> 3140650 INFO  (TEST-TestReqParamsAPI.test-seed#[2AF64E9075DE3853]) [    ] o.a.s.c.AbstractZkTestCase put /Users/jenkins/workspace/Lucene-Solr-master-MacOSX/solr/core/src/test-files/solr/collection1/conf/enumsConfig.xml to /configs/conf1/enumsConfig.xml
   [junit4]   2> 3140651 INFO  (TEST-TestReqParamsAPI.test-seed#[2AF64E9075DE3853]) [    ] o.a.s.c.c.SolrZkClient makePath: /configs/conf1/enumsConfig.xml
   [junit4]   2> 3140654 INFO  (TEST-TestReqParamsAPI.test-seed#[2AF64E9075DE3853]) [    ] o.a.s.c.AbstractZkTestCase put /Users/jenkins/workspace/Lucene-Solr-master-MacOSX/solr/core/src/test-files/solr/collection1/conf/open-exchange-rates.json to /configs/conf1/open-exchange-rates.json
   [junit4]   2> 3140661 INFO  (TEST-TestReqParamsAPI.test-seed#[2AF64E9075DE3853]) [    ] o.a.s.c.c.SolrZkClient makePath: /configs/conf1/open-exchange-rates.json
   [junit4]   2> 3140664 INFO  (TEST-TestReqParamsAPI.test-seed#[2AF64E9075DE3853]) [    ] o.a.s.c.AbstractZkTestCase put /Users/jenkins/workspace/Lucene-Solr-master-MacOSX/solr/core/src/test-files/solr/collection1/conf/mapping-ISOLatin1Accent.txt to /configs/conf1/mapping-ISOLatin1Accent.txt
   [junit4]   2> 3140665 INFO  (TEST-TestReqParamsAPI.test-seed#[2AF64E9075DE3853]) [    ] o.a.s.c.c.SolrZkClient makePath: /configs/conf1/mapping-ISOLatin1Accent.txt
   [junit4]   2> 3140667 INFO  (TEST-TestReqParamsAPI.test-seed#[2AF64E9075DE3853]) [    ] o.a.s.c.AbstractZkTestCase put /Users/jenkins/workspace/Lucene-Solr-master-MacOSX/solr/core/src/test-files/solr/collection1/conf/old_synonyms.txt to /configs/conf1/old_synonyms.txt
   [junit4]   2> 3140669 INFO  (TEST-TestReqParamsAPI.test-seed#[2AF64E9075DE3853]) [    ] o.a.s.c.c.SolrZkClient makePath: /configs/conf1/old_synonyms.txt
   [junit4]   2> 3140671 INFO  (TEST-TestReqParamsAPI.test-seed#[2AF64E9075DE3853]) [    ] o.a.s.c.AbstractZkTestCase put /Users/jenkins/workspace/Lucene-Solr-master-MacOSX/solr/core/src/test-files/solr/collection1/conf/synonyms.txt to /configs/conf1/synonyms.txt
   [junit4]   2> 3140672 INFO  (TEST-TestReqParamsAPI.test-seed#[2AF64E9075DE3853]) [    ] o.a.s.c.c.SolrZkClient makePath: /configs/conf1/synonyms.txt
   [junit4]   2> 3144188 INFO  (TEST-TestReqParamsAPI.test-seed#[2AF64E9075DE3853]) [    ] o.a.s.SolrTestCaseJ4 Writing core.properties file to /Users/jenkins/workspace/Lucene-Solr-master-MacOSX/solr/build/solr-core/test/J0/temp/solr.handler.TestReqParamsAPI_2AF64E9075DE3853-001/control-001/cores/collection1
   [junit4]   2> 3144190 INFO  (TEST-TestReqParamsAPI.test-seed#[2AF64E9075DE3853]) [    ] o.e.j.s.Server jetty-9.3.8.v20160314
   [junit4]   2> 3144192 INFO  (TEST-TestReqParamsAPI.test-seed#[2AF64E9075DE3853]) [    ] o.e.j.s.h.ContextHandler Started o.e.j.s.ServletContextHandler@661410fa{/,null,AVAILABLE}
   [junit4]   2> 3144192 INFO  (TEST-TestReqParamsAPI.test-seed#[2AF64E9075DE3853]) [    ] o.e.j.s.ServerConnector Started ServerConnector@36aa6db7{HTTP/1.1,[http/1.1]}{127.0.0.1:54118}
   [junit4]   2> 3144193 INFO  (TEST-TestReqParamsAPI.test-seed#[2AF64E9075DE3853]) [    ] o.e.j.s.Server Started @3149303ms
   [junit4]   2> 3144193 INFO  (TEST-TestReqParamsAPI.test-seed#[2AF64E9075DE3853]) [    ] o.a.s.c.s.e.JettySolrRunner Jetty properties: {solr.data.dir=/Users/jenkins/workspace/Lucene-Solr-master-MacOSX/solr/build/solr-core/test/J0/temp/solr.handler.TestReqParamsAPI_2AF64E9075DE3853-001/tempDir-001/control/data, hostContext=/, hostPort=54118, coreRootDirectory=/Users/jenkins/workspace/Lucene-Solr-master-MacOSX/solr/build/solr-core/test/J0/temp/solr.handler.TestReqParamsAPI_2AF64E9075DE3853-001/control-001/cores}
   [junit4]   2> 3144193 INFO  (TEST-TestReqParamsAPI.test-seed#[2AF64E9075DE3853]) [    ] o.a.s.s.SolrDispatchFilter SolrDispatchFilter.init(): sun.misc.Launcher$AppClassLoader@4554617c
   [junit4]   2> 3144193 INFO  (TEST-TestReqParamsAPI.test-seed#[2AF64E9075DE3853]) [    ] o.a.s.c.SolrResourceLoader new SolrResourceLoader for directory: '/Users/jenkins/workspace/Lucene-Solr-master-MacOSX/solr/build/solr-core/test/J0/temp/solr.handler.TestReqParamsAPI_2AF64E9075DE3853-001/control-001'
   [junit4]   2> 3144193 INFO  (TEST-TestReqParamsAPI.test-seed#[2AF64E9075DE3853]) [    ] o.a.s.c.SolrResourceLoader JNDI not configured for solr (NoInitialContextEx)
   [junit4]   2> 3144193 INFO  (TEST-TestReqParamsAPI.test-seed#[2AF64E9075DE3853]) [    ] o.a.s.c.SolrResourceLoader solr home defaulted to 'solr/' (could not find system property or JNDI)
   [junit4]   2> 3144194 INFO  (TEST-TestReqParamsAPI.test-seed#[2AF64E9075DE3853]) [    ] o.a.s.c.c.SolrZkClient Using default ZkCredentialsProvider
   [junit4]   2> 3144194 INFO  (TEST-TestReqParamsAPI.test-seed#[2AF64E9075DE3853]) [    ] o.a.s.c.c.ConnectionManager Waiting for client to connect to ZooKeeper
   [junit4]   2> 3144196 INFO  (zkCallback-3241-thread-1) [    ] o.a.s.c.c.ConnectionManager Watcher org.apache.solr.common.cloud.ConnectionManager@7ebf1315 name:ZooKeeperConnection Watcher:127.0.0.1:54102/solr got event WatchedEvent state:SyncConnected type:None path:null path:null type:None
   [junit4]   2> 3144196 INFO  (TEST-TestReqParamsAPI.test-seed#[2AF64E9075DE3853]) [    ] o.a.s.c.c.ConnectionManager Client is connected to ZooKeeper
   [junit4]   2> 3144196 INFO  (TEST-TestReqParamsAPI.test-seed#[2AF64E9075DE3853]) [    ] o.a.s.c.c.SolrZkClient Using default ZkACLProvider
   [junit4]   2> 3144198 INFO  (TEST-TestReqParamsAPI.test-seed#[2AF64E9075DE3853]) [    ] o.a.s.s.SolrDispatchFilter Loading solr.xml from SolrHome (not found in ZooKeeper)
   [junit4]   2> 3144198 INFO  (TEST-TestReqParamsAPI.test-seed#[2AF64E9075DE3853]) [    ] o.a.s.c.SolrXmlConfig Loading container configuration from /Users/jenkins/workspace/Lucene-Solr-master-MacOSX/solr/build/solr-core/test/J0/temp/solr.handler.TestReqParamsAPI_2AF64E9075DE3853-001/control-001/solr.xml
   [junit4]   2> 3144204 INFO  (TEST-TestReqParamsAPI.test-seed#[2AF64E9075DE3853]) [    ] o.a.s.c.CorePropertiesLocator Config-defined core root directory: /Users/jenkins/workspace/Lucene-Solr-master-MacOSX/solr/build/solr-core/test/J0/temp/solr.handler.TestReqParamsAPI_2AF64E9075DE3853-001/control-001/cores
   [junit4]   2> 3144204 INFO  (TEST-TestReqParamsAPI.test-seed#[2AF64E9075DE3853]) [    ] o.a.s.c.CoreContainer New CoreContainer 1309801255
   [junit4]   2> 3144204 INFO  (TEST-TestReqParamsAPI.test-seed#[2AF64E9075DE3853]) [    ] o.a.s.c.CoreContainer Loading cores into CoreContainer [instanceDir=/Users/jenkins/workspace/Lucene-Solr-master-MacOSX/solr/build/solr-core/test/J0/temp/solr.handler.TestReqParamsAPI_2AF64E9075DE3853-001/control-001]
   [junit4]   2> 3144204 WARN  (TEST-TestReqParamsAPI.test-seed#[2AF64E9075DE3853]) [    ] o.a.s.c.CoreContainer Couldn't add files from /Users/jenkins/workspace/Lucene-Solr-master-MacOSX/solr/build/solr-core/test/J0/temp/solr.handler.TestReqParamsAPI_2AF64E9075DE3853-001/control-001/lib to classpath: /Users/jenkins/workspace/Lucene-Solr-master-MacOSX/solr/build/solr-core/test/J0/temp/solr.handler.TestReqParamsAPI_2AF64E9075DE3853-001/control-001/lib
   [junit4]   2> 3144204 INFO  (TEST-TestReqParamsAPI.test-seed#[2AF64E9075DE3853]) [    ] o.a.s.h.c.HttpShardHandlerFactory created with socketTimeout : 90000,urlScheme : ,connTimeout : 15000,maxConnectionsPerHost : 20,maxConnections : 10000,corePoolSize : 0,maximumPoolSize : 2147483647,maxThreadIdleTime : 5,sizeOfQueue : -1,fairnessPolicy : false,
   [junit4]   2> 3144207 INFO  (TEST-TestReqParamsAPI.test-seed#[2AF64E9075DE3853]) [    ] o.a.s.u.UpdateShardHandler Creating UpdateShardHandler HTTP client with params: 
   [junit4]   2> 3144208 INFO  (TEST-TestReqParamsAPI.test-seed#[2AF64E9075DE3853]) [    ] o.a.s.l.LogWatcher SLF4J impl is org.slf4j.impl.Log4jLoggerFactory
   [junit4]   2> 3144208 INFO  (TEST-TestReqParamsAPI.test-seed#[2AF64E9075DE3853]) [    ] o.a.s.l.LogWatcher Registering Log Listener [Log4j (org.slf4j.impl.Log4jLoggerFactory)]
   [junit4]   2> 3144208 INFO  (TEST-TestReqParamsAPI.test-seed#[2AF64E9075DE3853]) [    ] o.a.s.c.ZkContainer Zookeeper client=127.0.0.1:54102/solr
   [junit4]   2> 3144208 INFO  (TEST-TestReqParamsAPI.test-seed#[2AF64E9075DE3853]) [    ] o.a.s.c.ZkController zkHost includes chroot
   [junit4]   2> 3144208 INFO  (TEST-TestReqParamsAPI.test-seed#[2AF64E9075DE3853]) [    ] o.a.s.c.c.SolrZkClient Using default ZkCredentialsProvider
   [junit4]   2> 3144209 INFO  (TEST-TestReqParamsAPI.test-seed#[2AF64E9075DE3853]) [    ] o.a.s.c.c.ConnectionManager Waiting for client to connect to ZooKeeper
   [junit4]   2> 3144210 INFO  (zkCallback-3244-thread-1) [    ] o.a.s.c.c.ConnectionManager Watcher org.apache.solr.common.cloud.ConnectionManager@62c7ed66 name:ZooKeeperConnection Watcher:127.0.0.1:54102 got event WatchedEvent state:SyncConnected type:None path:null path:null type:None
   [junit4]   2> 3144210 INFO  (TEST-TestReqParamsAPI.test-seed#[2AF64E9075DE3853]) [    ] o.a.s.c.c.ConnectionManager Client is connected to ZooKeeper
   [junit4]   2> 3144211 INFO  (TEST-TestReqParamsAPI.test-seed#[2AF64E9075DE3853]) [    ] o.a.s.c.c.SolrZkClient Using default ZkACLProvider
   [junit4]   2> 3144212 INFO  (TEST-TestReqParamsAPI.test-seed#[2AF64E9075DE3853]) [n:127.0.0.1:54118_    ] o.a.s.c.ZkController Added new OnReconnect listener org.apache.solr.cloud.ZkController$$Lambda$54/972089461@164ecee9
   [junit4]   2> 3144213 INFO  (TEST-TestReqParamsAPI.test-seed#[2AF64E9075DE3853]) [n:127.0.0.1:54118_    ] o.a.s.c.c.ConnectionManager Waiting for client to connect to ZooKeeper
   [junit4]   2> 3144214 INFO  (zkCallback-3245-thread-1-processing-n:127.0.0.1:54118_) [n:127.0.0.1:54118_    ] o.a.s.c.c.ConnectionManager Watcher org.apache.solr.common.cloud.ConnectionManager@3f015d46 name:ZooKeeperConnection Watcher:127.0.0.1:54102/solr got event WatchedEvent state:SyncConnected type:None path:null path:null type:None
   [junit4]   2> 3144214 INFO  (TEST-TestReqParamsAPI.test-seed#[2AF64E9075DE3853]) [n:127.0.0.1:54118_    ] o.a.s.c.c.ConnectionManager Client is connected to ZooKeeper
   [junit4]   2> 3144216 INFO  (TEST-TestReqParamsAPI.test-seed#[2AF64E9075DE3853]) [n:127.0.0.1:54118_    ] o.a.s.c.c.SolrZkClient makePath: /overseer/queue
   [junit4]   2> 3144219 INFO  (TEST-TestReqParamsAPI.test-seed#[2AF64E9075DE3853]) [n:127.0.0.1:54118_    ] o.a.s.c.c.SolrZkClient makePath: /overseer/collection-queue-work
   [junit4]   2> 3144224 INFO  (TEST-TestReqParamsAPI.test-seed#[2AF64E9075DE3853]) [n:127.0.0.1:54118_    ] o.a.s.c.c.SolrZkClient makePath: /overseer/collection-map-running
   [junit4]   2> 3144228 INFO  (TEST-TestReqParamsAPI.test-seed#[2AF64E9075DE3853]) [n:127.0.0.1:54118_    ] o.a.s.c.c.SolrZkClient makePath: /overseer/collection-map-completed
   [junit4]   2> 3144231 INFO  (TEST-TestReqParamsAPI.test-seed#[2AF64E9075DE3853]) [n:127.0.0.1:54118_    ] o.a.s.c.c.SolrZkClient makePath: /overseer/collection-map-failure
   [junit4]   2> 3144234 INFO  (TEST-TestReqParamsAPI.test-seed#[2AF64E9075DE3853]) [n:127.0.0.1:54118_    ] o.a.s.c.c.SolrZkClient makePath: /live_nodes
   [junit4]   2> 3144237 INFO  (TEST-TestReqParamsAPI.test-seed#[2AF64E9075DE3853]) [n:127.0.0.1:54118_    ] o.a.s.c.c.SolrZkClient makePath: /aliases.json
   [junit4]   2> 3144239 INFO  (TEST-TestReqParamsAPI.test-seed#[2AF64E9075DE3853]) [n:127.0.0.1:54118_    ] o.a.s.c.c.SolrZkClient makePath: /clusterstate.json
   [junit4]   2> 3144241 INFO  (TEST-TestReqParamsAPI.test-seed#[2AF64E9075DE3853]) [n:127.0.0.1:54118_    ] o.a.s.c.c.SolrZkClient makePath: /security.json
   [junit4]   2> 3144243 INFO  (TEST-TestReqParamsAPI.test-seed#[2AF64E9075DE3853]) [n:127.0.0.1:54118_    ] o.a.s.c.c.ZkStateReader Updating cluster state from ZooKeeper... 
   [junit4]   2> 3144245 INFO  (TEST-TestReqParamsAPI.test-seed#[2AF64E9075DE3853]) [n:127.0.0.1:54118_    ] o.a.s.c.c.ZkStateReader Updated live nodes from ZooKeeper... (0) -> (0)
   [junit4]   2> 3144249 INFO  (TEST-TestReqParamsAPI.test-seed#[2AF64E9075DE3853]) [n:127.0.0.1:54118_    ] o.a.s.c.c.SolrZkClient makePath: /overseer_elect
   [junit4]   2> 3144251 INFO  (TEST-TestReqParamsAPI.test-seed#[2AF64E9075DE3853]) [n:127.0.0.1:54118_    ] o.a.s.c.c.SolrZkClient makePath: /overseer_elect/election
   [junit4]   2> 3144253 INFO  (TEST-TestReqParamsAPI.test-seed#[2AF64E9075DE3853]) [n:127.0.0.1:54118_    ] o.a.s.c.Overseer Overseer (id=null) closing
   [junit4]   2> 3144253 INFO  (TEST-TestReqParamsAPI.test-seed#[2AF64E9075DE3853]) [n:127.0.0.1:54118_    ] o.a.s.c.LeaderElector Joined leadership election with path: /overseer_elect/election/95807183734505476-127.0.0.1:54118_-n_0000000000
   [junit4]   2> 3144254 INFO  (TEST-TestReqParamsAPI.test-seed#[2AF64E9075DE3853]) [n:127.0.0.1:54118_    ] o.a.s.c.OverseerElectionContext I am going to be the leader 127.0.0.1:54118_
   [junit4]   2> 3144254 INFO  (TEST-TestReqParamsAPI.test-seed#[2AF64E9075DE3853]) [n:127.0.0.1:54118_    ] o.a.s.c.c.SolrZkClient makePath: /overseer_elect/leader
   [junit4]   2> 3144257 INFO  (TEST-TestReqParamsAPI.test-seed#[2AF64E9075DE3853]) [n:127.0.0.1:54118_    ] o.a.s.c.Overseer Overseer (id=95807183734505476-127.0.0.1:54118_-n_0000000000) starting
   [junit4]   2> 3144260 INFO  (TEST-TestReqParamsAPI.test-seed#[2AF64E9075DE3853]) [n:127.0.0.1:54118_    ] o.a.s.c.c.SolrZkClient makePath: /overseer/queue-work
   [junit4]   2> 3144271 INFO  (TEST-TestReqParamsAPI.test-seed#[2AF64E9075DE3853]) [n:127.0.0.1:54118_    ] o.a.s.c.OverseerAutoReplicaFailoverThread Starting OverseerAutoReplicaFailoverThread autoReplicaFailoverWorkLoopDelay=10000 autoReplicaFailoverWaitAfterExpiration=30000 autoReplicaFailoverBadNodeExpiration=60000
   [junit4]   2> 3144271 INFO  (OverseerCollectionConfigSetProcessor-95807183734505476-127.0.0.1:54118_-n_0000000000) [n:127.0.0.1:54118_    ] o.a.s.c.OverseerTaskProcessor Process current queue of overseer operations
   [junit4]   2> 3144272 INFO  (OverseerStateUpdate-95807183734505476-127.0.0.1:54118_-n_0000000000) [n:127.0.0.1:54118_    ] o.a.s.c.Overseer Starting to work on the main queue
   [junit4]   2> 3144273 INFO  (TEST-TestReqParamsAPI.test-seed#[2AF64E9075DE3853]) [n:127.0.0.1:54118_    ] o.a.s.c.ZkController Register node as live in ZooKeeper:/live_nodes/127.0.0.1:54118_
   [junit4]   2> 3144274 INFO  (TEST-TestReqParamsAPI.test-seed#[2AF64E9075DE3853]) [n:127.0.0.1:54118_    ] o.a.s.c.c.SolrZkClient makePath: /live_nodes/127.0.0.1:54118_
   [junit4]   2> 3144276 INFO  (OverseerStateUpdate-95807183734505476-127.0.0.1:54118_-n_0000000000) [n:127.0.0.1:54118_    ] o.a.s.c.c.ZkStateReader Updated live nodes from ZooKeeper... (0) -> (0)
   [junit4]   2> 3144277 INFO  (zkCallback-3245-thread-1-processing-n:127.0.0.1:54118_) [n:127.0.0.1:54118_    ] o.a.s.c.c.ZkStateReader A live node change: [WatchedEvent state:SyncConnected type:NodeChildrenChanged path:/live_nodes], has occurred - updating... (live nodes size: [0])
   [junit4]   2> 3144278 INFO  (zkCallback-3245-thread-1-processing-n:127.0.0.1:54118_) [n:127.0.0.1:54118_    ] o.a.s.c.c.ZkStateReader Updated live nodes from ZooKeeper... (0) -> (1)
   [junit4]   2> 3144284 INFO  (TEST-TestReqParamsAPI.test-seed#[2AF64E9075DE3853]) [n:127.0.0.1:54118_    ] o.a.s.c.CoreContainer Security conf doesn't exist. Skipping setup for authorization module.
   [junit4]   2> 3144284 INFO  (TEST-TestReqParamsAPI.test-seed#[2AF64E9075DE3853]) [n:127.0.0.1:54118_    ] o.a.s.c.CoreContainer No authentication plugin used.
   [junit4]   2> 3144288 INFO  (TEST-TestReqParamsAPI.test-seed#[2AF64E9075DE3853]) [n:127.0.0.1:54118_    ] o.a.s.c.CorePropertiesLocator Looking for core definitions underneath /Users/jenkins/workspace/Lucene-Solr-master-MacOSX/solr/build/solr-core/test/J0/temp/solr.handler.TestReqParamsAPI_2AF64E9075DE3853-001/control-001/cores
   [junit4]   2> 3144289 INFO  (TEST-TestReqParamsAPI.test-seed#[2AF64E9075DE3853]) [n:127.0.0.1:54118_    ] o.a.s.c.CoreDescriptor Created CoreDescriptor: {name=collection1, config=solrconfig.xml, transient=false, schema=schema.xml, loadOnStartup=true, configSetProperties=configsetprops.json, collection=control_collection, coreNodeName=, dataDir=data/, shard=}
   [junit4]   2> 3144289 INFO  (TEST-TestReqParamsAPI.test-seed#[2AF64E9075DE3853]) [n:127.0.0.1:54118_    ] o.a.s.c.CorePropertiesLocator Found core collection1 in /Users/jenkins/workspace/Lucene-Solr-master-MacOSX/solr/build/solr-core/test/J0/temp/solr.handler.TestReqParamsAPI_2AF64E9075DE3853-001/control-001/cores/collection1
   [junit4]   2> 3144289 INFO  (TEST-TestReqParamsAPI.test-seed#[2AF64E9075DE3853]) [n:127.0.0.1:54118_    ] o.a.s.c.CorePropertiesLocator Found 1 core definitions
   [junit4]   2> 3144290 INFO  (TEST-TestReqParamsAPI.test-seed#[2AF64E9075DE3853]) [n:127.0.0.1:54118_    ] o.a.s.s.SolrDispatchFilter user.dir=/Users/jenkins/workspace/Lucene-Solr-master-MacOSX/solr/build/solr-core/test/J0
   [junit4]   2> 3144290 INFO  (TEST-TestReqParamsAPI.test-seed#[2AF64E9075DE3853]) [n:127.0.0.1:54118_    ] o.a.s.s.SolrDispatchFilter SolrDispatchFilter.init() done
   [junit4]   2> 3144291 INFO  (coreLoadExecutor-9715-thread-1-processing-n:127.0.0.1:54118_) [n:127.0.0.1:54118_ c:control_collection   x:collection1] o.a.s.c.ZkController publishing state=down
   [junit4]   2> 3144291 INFO  (coreLoadExecutor-9715-thread-1-processing-n:127.0.0.1:54118_) [n:127.0.0.1:54118_ c:control_collection   x:collection1] o.a.s.c.ZkController numShards not found on descriptor - reading it from system property
   [junit4]   2> 3144292 INFO  (coreLoadExecutor-9715-thread-1-processing-n:127.0.0.1:54118_) [n:127.0.0.1:54118_ c:control_collection   x:collection1] o.a.s.c.ZkController Collection control_collection not visible yet, but flagging it so a watch is registered when it becomes visible
   [junit4]   2> 3144293 INFO  (coreLoadExecutor-9715-thread-1-processing-n:127.0.0.1:54118_) [n:127.0.0.1:54118_ c:control_collection   x:collection1] o.a.s.c.c.ZkStateReader addZkWatch [control_collection]
   [junit4]   2> 3144293 INFO  (OverseerStateUpdate-95807183734505476-127.0.0.1:54118_-n_0000000000) [n:127.0.0.1:54118_    ] o.a.s.c.Overseer processMessage: queueSize: 1, message = {
   [junit4]   2>   "core":"collection1",
   [junit4]   2>   "roles":null,
   [junit4]   2>   "base_url":"http://127.0.0.1:54118",
   [junit4]   2>   "node_name":"127.0.0.1:54118_",
   [junit4]   2>   "numShards":"1",
   [junit4]   2>   "state":"down",
   [junit4]   2>   "shard":null,
   [junit4]   2>   "collection":"control_collection",
   [junit4]   2>   "operation":"state"} current state version: 0
   [junit4]   2> 3144294 INFO  (OverseerStateUpdate-95807183734505476-127.0.0.1:54118_-n_0000000000) [n:127.0.0.1:54118_    ] o.a.s.c.o.ReplicaMutator Update state numShards=1 message={
   [junit4]   2>   "core":"collection1",
   [junit4]   2>   "roles":null,
   [junit4]   2>   "base_url":"http://127.0.0.1:54118",
   [junit4]   2>   "node_name":"127.0.0.1:54118_",
   [junit4]   2>   "numShards":"1",
   [junit4]   2>   "state":"down",
   [junit4]   2>   "shard":null,
   [junit4]   2>   "collection":"control_collection",
   [junit4]   2>   "operation":"state"}
   [junit4]   2> 3144294 INFO  (coreLoadExecutor-9715-thread-1-processing-n:127.0.0.1:54118_) [n:127.0.0.1:54118_ c:control_collection   x:collection1] o.a.s.c.c.ZkStateReader Deleting data for [control_collection]
   [junit4]   2> 3144295 INFO  (OverseerStateUpdate-95807183734505476-127.0.0.1:54118_-n_0000000000) [n:127.0.0.1:54118_    ] o.a.s.c.o.ClusterStateMutator building a new cName: control_collection
   [junit4]   2> 3144296 INFO  (coreLoadExecutor-9715-thread-1-processing-n:127.0.0.1:54118_) [n:127.0.0.1:54118_ c:control_collection   x:collection1] o.a.s.c.ZkController look for our core node name
   [junit4]   2> 3144296 INFO  (OverseerStateUpdate-95807183734505476-127.0.0.1:54118_-n_0000000000) [n:127.0.0.1:54118_    ] o.a.s.c.o.ReplicaMutator Assigning new node to shard shard=shard1
   [junit4]   2> 3144299 INFO  (zkCallback-3245-thread-1-processing-n:127.0.0.1:54118_) [n:127.0.0.1:54118_    ] o.a.s.c.c.ZkStateReader A cluster state change: [WatchedEvent state:SyncConnected type:NodeDataChanged path:/clusterstate.json], has occurred - updating... (live nodes size: [1])
   [junit4]   2> 3145304 INFO  (coreLoadExecutor-9715-thread-1-processing-n:127.0.0.1:54118_) [n:127.0.0.1:54118_ c:control_collection   x:collection1] o.a.s.c.ZkController waiting to find shard id in clusterstate for collection1
   [junit4]   2> 3145304 INFO  (coreLoadExecutor-9715-thread-1-processing-n:127.0.0.1:54118_) [n:127.0.0.1:54118_ c:control_collection   x:collection1] o.a.s.c.ZkController Check for collection zkNode:control_collection
   [junit4]   2> 3145305 INFO  (coreLoadExecutor-9715-thread-1-processing-n:127.0.0.1:54118_) [n:127.0.0.1:54118_ c:control_collection   x:collection1] o.a.s.c.ZkController Collection zkNode exists
   [junit4]   2> 3145305 INFO  (coreLoadExecutor-9715-thread-1-processing-n:127.0.0.1:54118_) [n:127.0.0.1:54118_ c:control_collection   x:collection1] o.a.s.c.c.ZkStateReader Load collection config from: [/collections/control_collection]
   [junit4]   2> 3145306 INFO  (coreLoadExecutor-9715-thread-1-processing-n:127.0.0.1:54118_) [n:127.0.0.1:54118_ c:control_collection   x:collection1] o.a.s.c.c.ZkStateReader path=[/collections/control_collection] [configName]=[conf1] specified config exists in ZooKeeper
   [junit4]   2> 3145306 INFO  (coreLoadExecutor-9715-thread-1-processing-n:127.0.0.1:54118_) [n:127.0.0.1:54118_ c:control_collection   x:collection1] o.a.s.c.SolrResourceLoader new SolrResourceLoader for directory: '/Users/jenkins/workspace/Lucene-Solr-master-MacOSX/solr/build/solr-core/test/J0/temp/solr.handler.TestReqParamsAPI_2AF64E9075DE3853-001/control-001/cores/collection1'
   [junit4]   2> 3145306 INFO  (coreLoadExecutor-9715-thread-1-processing-n:127.0.0.1:54118_) [n:127.0.0.1:54118_ c:control_collection   x:collection1] o.a.s.c.SolrResourceLoader JNDI not configured for solr (NoInitialContextEx)
   [junit4]   2> 3145306 INFO  (coreLoadExecutor-9715-thread-1-processing-n:127.0.0.1:54118_) [n:127.0.0.1:54118_ c:control_collection   x:collection1] o.a.s.c.SolrResourceLoader solr home defaulted to 'solr/' (could not find system property or JNDI)
   [junit4]   2> 3145308 INFO  (coreLoadExecutor-9715-thread-1-processing-n:127.0.0.1:54118_) [n:127.0.0.1:54118_ c:control_collection   x:collection1] o.a.s.c.Config loaded config solrconfig.xml with version 0 
   [junit4]   2> 3145314 INFO  (coreLoadExecutor-9715-thread-1-processing-n:127.0.0.1:54118_) [n:127.0.0.1:54118_ c:control_collection   x:collection1] o.a.s.c.SolrConfig current version of requestparams : -1
   [junit4]   2> 3145316 INFO  (coreLoadExecutor-9715-thread-1-processing-n:127.0.0.1:54118_) [n:127.0.0.1:54118_ c:control_collection   x:collection1] o.a.s.c.SolrConfig Using Lucene MatchVersion: 7.0.0
   [junit4]   2> 3145321 INFO  (coreLoadExecutor-9715-thread-1-processing-n:127.0.0.1:54118_) [n:127.0.0.1:54118_ c:control_collection   x:collection1] o.a.s.c.SolrConfig Loaded SolrConfig: solrconfig.xml
   [junit4]   2> 3145326 INFO  (coreLoadExecutor-9715-thread-1-processing-n:127.0.0.1:54118_) [n:127.0.0.1:54118_ c:control_collection   x:collection1] o.a.s.s.IndexSchema [collection1] Schema name=test
   [junit4]   2> 3145409 INFO  (coreLoadExecutor-9715-thread-1-processing-n:127.0.0.1:54118_) [n:127.0.0.1:54118_ c:control_collection   x:collection1] o.a.s.s.OpenExchangeRatesOrgProvider Initialized with rates=open-exchange-rates.json, refreshInterval=1440.
   [junit4]   2> 3145415 INFO  (coreLoadExecutor-9715-thread-1-processing-n:127.0.0.1:54118_) [n:127.0.0.1:54118_ c:control_collection   x:collection1] o.a.s.s.IndexSchema default search field in schema is text
   [junit4]   2> 3145415 INFO  (coreLoadExecutor-9715-thread-1-processing-n:127.0.0.1:54118_) [n:127.0.0.1:54118_ c:control_collection   x:collection1] o.a.s.s.IndexSchema unique key field: id
   [junit4]   2> 3145429 INFO  (coreLoadExecutor-9715-thread-1-processing-n:127.0.0.1:54118_) [n:127.0.0.1:54118_ c:control_collection   x:collection1] o.a.s.s.FileExchangeRateProvider Reloading exchange rates from file currency.xml
   [junit4]   2> 3145431 INFO  (coreLoadExecutor-9715-thread-1-processing-n:127.0.0.1:54118_) [n:127.0.0.1:54118_ c:control_collection   x:collection1] o.a.s.s.FileExchangeRateProvider Reloading exchange rates from file currency.xml
   [junit4]   2> 3145434 INFO  (coreLoadExecutor-9715-thread-1-processing-n:127.0.0.1:54118_) [n:127.0.0.1:54118_ c:control_collection   x:collection1] o.a.s.s.OpenExchangeRatesOrgProvider Reloading exchange rates from open-exchange-rates.json
   [junit4]   2> 3145435 INFO  (coreLoadExecutor-9715-thread-1-processing-n:127.0.0.1:54118_) [n:127.0.0.1:54118_ c:control_collection   x:collection1] o.a.s.s.OpenExchangeRatesOrgProvider Reloading exchange rates from open-exchange-rates.json
   [junit4]   2> 3145438 INFO  (coreLoadExecutor-9715-thread-1-processing-n:127.0.0.1:54118_) [n:127.0.0.1:54118_ c:control_collection   x:collection1] o.a.s.c.ConfigSetProperties Did not find ConfigSet properties, assuming default properties: Can't find resource 'configsetprops.json' in classpath or '/configs/conf1', cwd=/Users/jenkins/workspace/Lucene-Solr-master-MacOSX/solr/build/solr-core/test/J0
   [junit4]   2> 3145438 INFO  (coreLoadExecutor-9715-thread-1-processing-n:127.0.0.1:54118_) [n:127.0.0.1:54118_ c:control_collection   x:collection1] o.a.s.c.CoreContainer Creating SolrCore 'collection1' using configuration from collection control_collection
   [junit4]   2> 3145438 INFO  (coreLoadExecutor-9715-thread-1-processing-n:127.0.0.1:54118_) [n:127.0.0.1:54118_ c:control_collection s:shard1 r:core_node1 x:collection1] o.a.s.c.SolrCore org.apache.solr.core.MockDirectoryFactory
   [junit4]   2> 3145438 INFO  (coreLoadExecutor-9715-thread-1-processing-n:127.0.0.1:54118_) [n:127.0.0.1:54118_ c:control_collection s:shard1 r:core_node1 x:collection1] o.a.s.c.SolrCore [[collection1] ] Opening new SolrCore at [/Users/jenkins/workspace/Lucene-Solr-master-MacOSX/solr/build/solr-core/test/J0/temp/solr.handler.TestReqParamsAPI_2AF64E9075DE3853-001/control-001/cores/collection1], dataDir=[/Users/jenkins/workspace/Lucene-Solr-master-MacOSX/solr/build/solr-core/test/J0/temp/solr.handler.TestReqParamsAPI_2AF64E9075DE3853-001/control-001/cores/collection1/data/]
   [junit4]   2> 3145438 INFO  (coreLoadExecutor-9715-thread-1-processing-n:127.0.0.1:54118_) [n:127.0.0.1:54118_ c:control_collection s:shard1 r:core_node1 x:collection1] o.a.s.c.JmxMonitoredMap JMX monitoring is enabled. Adding Solr mbeans to JMX Server: com.sun.jmx.mbeanserver.JmxMBeanServer@4a13ca7c
   [junit4]   2> 3145439 INFO  (coreLoadExecutor-9715-thread-1-processing-n:127.0.0.1:54118_) [n:127.0.0.1:54118_ c:control_collection s:shard1 r:core_node1 x:collection1] o.a.s.c.CachingDirectoryFactory return new directory for /Users/jenkins/workspace/Lucene-Solr-master-MacOSX/solr/build/solr-core/test/J0/temp/solr.handler.TestReqParamsAPI_2AF64E9075DE3853-001/control-001/cores/collection1/data
   [junit4]   2> 3145439 INFO  (coreLoadExecutor-9715-thread-1-processing-n:127.0.0.1:54118_) [n:127.0.0.1:54118_ c:control_collection s:shard1 r:core_node1 x:collection1] o.a.s.c.SolrCore New index directory detected: old=null new=/Users/jenkins/workspace/Lucene-Solr-master-MacOSX/solr/build/solr-core/test/J0/temp/solr.handler.TestReqParamsAPI_2AF64E9075DE3853-001/control-001/cores/collection1/data/index/
   [junit4]   2> 3145439 WARN  (coreLoadExecutor-9715-thread-1-processing-n:127.0.0.1:54118_) [n:127.0.0.1:54118_ c:control_collection s:shard1 r:core_node1 x:collection1] o.a.s.c.SolrCore [collection1] Solr index directory '/Users/jenkins/workspace/Lucene-Solr-master-MacOSX/solr/build/solr-core/test/J0/temp/solr.handler.TestReqParamsAPI_2AF64E9075DE3853-001/control-001/cores/collection1/data/index' doesn't exist. Creating new index...
   [junit4]   2> 3145439 INFO  (coreLoadExecutor-9715-thread-1-processing-n:127.0.0.1:54118_) [n:127.0.0.1:54118_ c:control_collection s:shard1 r:core_node1 x:collection1] o.a.s.c.CachingDirectoryFactory return new directory for /Users/jenkins/workspace/Lucene-Solr-master-MacOSX/solr/build/solr-core/test/J0/temp/solr.handler.TestReqParamsAPI_2AF64E9075DE3853-001/control-001/cores/collection1/data/index
   [junit4]   2> 3145439 INFO  (coreLoadExecutor-9715-thread-1-processing-n:127.0.0.1:54118_) [n:127.0.0.1:54118_ c:control_collection s:shard1 r:core_node1 x:collection1] o.a.s.u.RandomMergePolicy RandomMergePolicy wrapping class org.apache.lucene.index.LogByteSizeMergePolicy: [LogByteSizeMergePolicy: minMergeSize=1677721, mergeFactor=22, maxMergeSize=2147483648, maxMergeSizeForForcedMerge=9223372036854775807, calibrateSizeByDeletes=true, maxMergeDocs=2147483647, maxCFSSegmentSizeMB=8.796093022207999E12, noCFSRatio=0.0]
   [junit4]   2> 3145439 INFO  (coreLoadExecutor-9715-thread-1-processing-n:127.0.0.1:54118_) [n:127.0.0.1:54118_ c:control_collection s:shard1 r:core_node1 x:collection1] o.a.s.c.SolrDeletionPolicy SolrDeletionPolicy.onCommit: commits: num=1
   [junit4]   2> 	commit{dir=MockDirectoryWrapper(RAMDirectory@52088acf lockFactory=org.apache.lucene.store.SingleInstanceLockFactory@5b735f00),segFN=segments_1,generation=1}
   [junit4]   2> 3145439 INFO  (coreLoadExecutor-9715-thread-1-processing-n:127.0.0.1:54118_) [n:127.0.0.1:54118_ c:control_collection s:shard1 r:core_node1 x:collection1] o.a.s.c.SolrDeletionPolicy newest commit generation = 1
   [junit4]   2> 3145440 INFO  (OldIndexDirectoryCleanupThreadForCore-collection1) [n:127.0.0.1:54118_ c:control_collection s:shard1 r:core_node1 x:collection1] o.a.s.c.SolrCore Looking for old index directories to cleanup for core collection1 in /Users/jenkins/workspace/Lucene-Solr-master-MacOSX/solr/build/solr-core/test/J0/temp/solr.handler.TestReqParamsAPI_2AF64E9075DE3853-001/control-001/cores/collection1/data/
   [junit4]   2> 3145440 WARN  (OldIndexDirectoryCleanupThreadForCore-collection1) [n:127.0.0.1:54118_ c:control_collection s:shard1 r:core_node1 x:collection1] o.a.s.c.DirectoryFactory /Users/jenkins/workspace/Lucene-Solr-master-MacOSX/solr/build/solr-core/test/J0/temp/solr.handler.TestReqParamsAPI_2AF64E9075DE3853-001/control-001/cores/collection1/data/ does not point to a valid data directory; skipping clean-up of old index directories.
   [junit4]   2> 3145442 INFO  (coreLoadExecutor-9715-thread-1-processing-n:127.0.0.1:54118_) [n:127.0.0.1:54118_ c:control_collection s:shard1 r:core_node1 x:collection1] o.a.s.u.p.UpdateRequestProcessorChain creating updateRequestProcessorChain "nodistrib"
   [junit4]   2> 3145442 INFO  (coreLoadExecutor-9715-thread-1-processing-n:127.0.0.1:54118_) [n:127.0.0.1:54118_ c:control_collection s:shard1 r:core_node1 x:collection1] o.a.s.u.p.UpdateRequestProcessorChain creating updateRequestProcessorChain "dedupe"
   [junit4]   2> 3145442 INFO  (coreLoadExecutor-9715-thread-1-processing-n:127.0.0.1:54118_) [n:127.0.0.1:54118_ c:control_collection s:shard1 r:core_node1 x:collection1] o.a.s.u.p.UpdateRequestProcessorChain inserting DistributedUpdateProcessorFactory into updateRequestProcessorChain "dedupe"
   [junit4]   2> 3145442 INFO  (coreLoadExecutor-9715-thread-1-processing-n:127.0.0.1:54118_) [n:127.0.0.1:54118_ c:control_collection s:shard1 r:core_node1 x:collection1] o.a.s.u.p.UpdateRequestProcessorChain creating updateRequestProcessorChain "stored_sig"
   [junit4]   2> 3145443 INFO  (coreLoadExecutor-9715-thread-1-processing-n:127.0.0.1:54118_) [n:127.0.0.1:54118_ c:control_collection s:shard1 r:core_node1 x:collection1] o.a.s.u.p.UpdateRequestProcessorChain inserting DistributedUpdateProcessorFactory into updateRequestProcessorChain "stored_sig"
   [junit4]   2> 3145443 INFO  (coreLoadExecutor-9715-thread-1-processing-n:127.0.0.1:54118_) [n:127.0.0.1:54118_ c:control_collection s:shard1 r:core_node1 x:collection1] o.a.s.u.p.UpdateRequestProcessorChain creating updateRequestProcessorChain "distrib-dup-test-chain-explicit"
   [junit4]   2> 3145443 INFO  (coreLoadExecutor-9715-thread-1-processing-n:127.0.0.1:54118_) [n:127.0.0.1:54118_ c:control_collection s:shard1 r:core_node1 x:collection1] o.a.s.u.p.UpdateRequestProcessorChain creating updateRequestProcessorChain "distrib-dup-test-chain-implicit"
   [junit4]   2> 3145443 INFO  (coreLoadExecutor-9715-thread-1-processing-n:127.0.0.1:54118_) [n:127.0.0.1:54118_ c:control_collection s:shard1 r:core_node1 x:collection1] o.a.s.u.p.UpdateRequestProcessorChain inserting DistributedUpdateProcessorFactory into updateRequestProcessorChain "distrib-dup-test-chain-implicit"
   [junit4]   2> 3145443 INFO  (coreLoadExecutor-9715-thread-1-processing-n:127.0.0.1:54118_) [n:127.0.0.1:54118_ c:control_collection s:shard1 r:core_node1 x:collection1] o.a.s.c.SolrCore no updateRequestProcessorChain defined as default, creating implicit default
   [junit4]   2> 3145443 WARN  (coreLoadExecutor-9715-thread-1-processing-n:127.0.0.1:54118_) [n:127.0.0.1:54118_ c:control_collection s:shard1 r:core_node1 x:collection1] o.a.s.c.RequestHandlers INVALID paramSet a in requestHandler {type = requestHandler,name = /dump,class = DumpRequestHandler,args = {defaults={a=A,b=B}}}
   [junit4]   2> 3145448 INFO  (coreLoadExecutor-9715-thread-1-processing-n:127.0.0.1:54118_) [n:127.0.0.1:54118_ c:control_collection s:shard1 r:core_node1 x:collection1] o.a.s.h.l.XMLLoader xsltCacheLifetimeSeconds=60
   [junit4]   2> 3145449 INFO  (coreLoadExecutor-9715-thread-1-processing-n:127.0.0.1:54118_) [n:127.0.0.1:54118_ c:control_collection s:shard1 r:core_node1 x:collection1] o.a.s.h.l.XMLLoader xsltCacheLifetimeSeconds=60
   [junit4]   2> 3145450 INFO  (coreLoadExecutor-9715-thread-1-processing-n:127.0.0.1:54118_) [n:127.0.0.1:54118_ c:control_collection s:shard1 r:core_node1 x:collection1] o.a.s.h.l.XMLLoader xsltCacheLifetimeSeconds=60
   [junit4]   2> 3145450 INFO  (coreLoadExecutor-9715-thread-1-processing-n:127.0.0.1:54118_) [n:127.0.0.1:54118_ c:control_collection s:shard1 r:core_node1 x:collection1] o.a.s.h.l.XMLLoader xsltCacheLifetimeSeconds=60
   [junit4]   2> 3145455 INFO  (coreLoadExecutor-9715-thread-1-processing-n:127.0.0.1:54118_) [n:127.0.0.1:54118_ c:control_collection s:shard1 r:core_node1 x:collection1] o.a.s.c.RequestHandlers Registered paths: /admin/mbeans,standard,/dump,/update/csv,/sql,/update/json/docs,/admin/luke,/export,/admin/segments,/get,/admin/system,/replication,/admin/properties,/config,/stream,/schema,/admin/plugins,/admin/logging,/update/json,/admin/ping,/admin/threads,/update,/admin/file
   [junit4]   2> 3145455 INFO  (coreLoadExecutor-9715-thread-1-processing-n:127.0.0.1:54118_) [n:127.0.0.1:54118_ c:control_collection s:shard1 r:core_node1 x:collection1] o.a.s.c.SolrCore Using default statsCache cache: org.apache.solr.search.stats.LocalStatsCache
   [junit4]   2> 3145456 INFO  (coreLoadExecutor-9715-thread-1-processing-n:127.0.0.1:54118_) [n:127.0.0.1:54118_ c:control_collection s:shard1 r:core_node1 x:collection1] o.a.s.u.UpdateHandler Using UpdateLog implementation: org.apache.solr.update.UpdateLog
   [junit4]   2> 3145456 INFO  (coreLoadExecutor-9715-thread-1-processing-n:127.0.0.1:54118_) [n:127.0.0.1:54118_ c:control_collection s:shard1 r:core_node1 x:collection1] o.a.s.u.UpdateLog Initializing UpdateLog: dataDir= defaultSyncLevel=FLUSH numRecordsToKeep=100 maxNumLogsToKeep=10 numVersionBuckets=65536
   [junit4]   2> 3145457 INFO  (coreLoadExecutor-9715-thread-1-processing-n:127.0.0.1:54118_) [n:127.0.0.1:54118_ c:control_collection s:shard1 r:core_node1 x:collection1] o.a.s.u.CommitTracker Hard AutoCommit: disabled
   [junit4]   2> 3145457 INFO  (coreLoadExecutor-9715-thread-1-processing-n:127.0.0.1:54118_) [n:127.0.0.1:54118_ c:control_collection s:shard1 r:core_node1 x:collection1] o.a.s.u.CommitTracker Soft AutoCommit: disabled
   [junit4]   2> 3145457 INFO  (coreLoadExecutor-9715-thread-1-processing-n:127.0.0.1:54118_) [n:127.0.0.1:54118_ c:control_collection s:shard1 r:core_node1 x:collection1] o.a.s.u.RandomMergePolicy RandomMergePolicy wrapping class org.apache.lucene.index.TieredMergePolicy: [TieredMergePolicy: maxMergeAtOnce=10, maxMergeAtOnceExplicit=30, maxMergedSegmentMB=26.490234375, floorSegmentMB=0.6484375, forceMergeDeletesPctAllowed=27.560641650873272, segmentsPerTier=23.0, maxCFSSegmentSizeMB=8.796093022207999E12, noCFSRatio=0.0
   [junit4]   2> 3145458 INFO  (coreLoadExecutor-9715-thread-1-processing-n:127.0.0.1:54118_) [n:127.0.0.1:54118_ c:control_collection s:shard1 r:core_node1 x:collection1] o.a.s.c.SolrDeletionPolicy SolrDeletionPolicy.onInit: commits: num=1
   [junit4]   2> 	commit{dir=MockDirectoryWrapper(RAMDirectory@52088acf lockFactory=org.apache.lucene.store.SingleInstanceLockFactory@5b735f00),segFN=segments_1,generation=1}
   [junit4]   2> 3145458 INFO  (coreLoadExecutor-9715-thread-1-processing-n:127.0.0.1:54118_) [n:127.0.0.1:54118_ c:control_collection s:shard1 r:core_node1 x:collection1] o.a.s.c.SolrDeletionPolicy newest commit generation = 1
   [junit4]   2> 3145458 INFO  (coreLoadExecutor-9715-thread-1-processing-n:127.0.0.1:54118_) [n:127.0.0.1:54118_ c:control_collection s:shard1 r:core_node1 x:collection1] o.a.s.s.SolrIndexSearcher Opening [Searcher@6eb6ff57[collection1] main]
   [junit4]   2> 3145458 INFO  (coreLoadExecutor-9715-thread-1-processing-n:127.0.0.1:54118_) [n:127.0.0.1:54118_ c:control_collection s:shard1 r:core_node1 x:collection1] o.a.s.c.c.ZkStateReader Load collection config from: [/collections/control_collection]
   [junit4]   2> 3145459 INFO  (coreLoadExecutor-9715-thread-1-processing-n:127.0.0.1:54118_) [n:127.0.0.1:54118_ c:control_collection s:shard1 r:core_node1 x:collection1] o.a.s.c.c.ZkStateReader path=[/collections/control_collection] [configName]=[conf1] specified config exists in ZooKeeper
   [junit4]   2> 3145459 INFO  (coreLoadExecutor-9715-thread-1-processing-n:127.0.0.1:54118_) [n:127.0.0.1:54118_ c:control_collection s:shard1 r:core_node1 x:collection1] o.a.s.r.ManagedResourceStorage Setting up ZooKeeper-based storage for the RestManager with znodeBase: /configs/conf1
   [junit4]   2> 3145460 INFO  (coreLoadExecutor-9715-thread-1-processing-n:127.0.0.1:54118_) [n:127.0.0.1:54118_ c:control_collection s:shard1 r:core_node1 x:collection1] o.a.s.r.ManagedResourceStorage Configured ZooKeeperStorageIO with znodeBase: /configs/conf1
   [junit4]   2> 3145460 INFO  (coreLoadExecutor-9715-thread-1-processing-n:127.0.0.1:54118_) [n:127.0.0.1:54118_ c:control_collection s:shard1 r:core_node1 x:collection1] o.a.s.r.RestManager Initializing RestManager with initArgs: {}
   [junit4]   2> 3145460 INFO  (coreLoadExecutor-9715-thread-1-processing-n:127.0.0.1:54118_) [n:127.0.0.1:54118_ c:control_collection s:shard1 r:core_node1 x:collection1] o.a.s.r.ManagedResourceStorage Reading _rest_managed.json using ZooKeeperStorageIO:path=/configs/conf1
   [junit4]   2> 3145461 INFO  (coreLoadExecutor-9715-thread-1-processing-n:127.0.0.1:54118_) [n:127.0.0.1:54118_ c:control_collection s:shard1 r:core_node1 x:collection1] o.a.s.r.ManagedResourceStorage No data found for znode /configs/conf1/_rest_managed.json
   [junit4]   2> 3145461 INFO  (coreLoadExecutor-9715-thread-1-processing-n:127.0.0.1:54118_) [n:127.0.0.1:54118_ c:control_collection s:shard1 r:core_node1 x:collection1] o.a.s.r.ManagedResourceStorage Loaded null at path _rest_managed.json using ZooKeeperStorageIO:path=/configs/conf1
   [junit4]   2> 3145461 INFO  (coreLoadExecutor-9715-thread-1-processing-n:127.0.0.1:54118_) [n:127.0.0.1:54118_ c:control_collection s:shard1 r:core_node1 x:collection1] o.a.s.r.RestManager Initializing 0 registered ManagedResources
   [junit4]   2> 3145461 INFO  (coreLoadExecutor-9715-thread-1-processing-n:127.0.0.1:54118_) [n:127.0.0.1:54118_ c:control_collection s:shard1 r:core_node1 x:collection1] o.a.s.h.ReplicationHandler Commits will be reserved for  10000
   [junit4]   2> 3145462 INFO  (searcherExecutor-9716-thread-1-processing-n:127.0.0.1:54118_ x:collection1 s:shard1 c:control_collection r:core_node1) [n:127.0.0.1:54118_ c:control_collection s:shard1 r:core_node1 x:collection1] o.a.s.c.SolrCore [collection1] Registered new searcher Searcher@6eb6ff57[collection1] main{ExitableDirectoryReader(UninvertingDirectoryReader())}
   [junit4]   2> 3145462 INFO  (coreLoadExecutor-9715-thread-1-processing-n:127.0.0.1:54118_) [n:127.0.0.1:54118_ c:control_collection s:shard1 r:core_node1 x:collection1] o.a.s.u.UpdateLog Looking up max value of version field to seed version buckets
   [junit4]   2> 3145462 INFO  (coreLoadExecutor-9715-thread-1-processing-n:127.0.0.1:54118_) [n:127.0.0.1:54118_ c:control_collection s:shard1 r:core_node1 x:collection1] o.a.s.u.VersionInfo Refreshing highest value of _version_ for 65536 version buckets from index
   [junit4]   2> 3145462 INFO  (coreLoadExecutor-9715-thread-1-processing-n:127.0.0.1:54118_) [n:127.0.0.1:54118_ c:control_collection s:shard1 r:core_node1 x:collection1] o.a.s.u.VersionInfo No terms found for _version_, cannot seed version bucket highest value from index
   [junit4]   2> 3145462 INFO  (coreLoadExecutor-9715-thread-1-processing-n:127.0.0.1:54118_) [n:127.0.0.1:54118_ c:control_collection s:shard1 r:core_node1 x:collection1] o.a.s.u.UpdateLog Could not find max version in index or recent updates, using new clock 1532914945310588928
   [junit4]   2> 3145464 INFO  (coreLoadExecutor-9715-thread-1-processing-n:127.0.0.1:54118_) [n:127.0.0.1:54118_ c:control_collection s:shard1 r:core_node1 x:collection1] o.a.s.u.UpdateLog Took 1.0ms to seed version buckets with highest version 1532914945310588928
   [junit4]   2> 3145464 INFO  (coreLoadExecutor-9715-thread-1-processing-n:127.0.0.1:54118_) [n:127.0.0.1:54118_ c:control_collection s:shard1 r:core_node1 x:collection1] o.a.s.c.ZkController watch zkdir /configs/conf1
   [junit4]   2> 3145467 INFO  (coreLoadExecutor-9715-thread-1-processing-n:127.0.0.1:54118_) [n:127.0.0.1:54118_ c:control_collection s:shard1 r:core_node1 x:collection1] o.a.s.c.CoreContainer registering core: collection1
   [junit4]   2> 3145467 INFO  (coreZkRegister-9709-thread-1-processing-n:127.0.0.1:54118_ x:collection1 s:shard1 c:control_collection r:core_node1) [n:127.0.0.1:54118_ c:control_collection s:shard1 r:core_node1 x:collection1] o.a.s.c.ZkController Register replica - core:collection1 address:http://127.0.0.1:54118 collection:control_collection shard:shard1
   [junit4]   2> 3145469 INFO  (coreZkRegister-9709-thread-1-processing-n:127.0.0.1:54118_ x:collection1 s:shard1 c:control_collection r:core_node1) [n:127.0.0.1:54118_ c:control_collection s:shard1 r:core_node1 x:collection1] o.a.s.c.c.SolrZkClient makePath: /collections/control_collection/leader_elect/shard1/election
   [junit4]   2> 3145474 INFO  (coreZkRegister-9709-thread-1-processing-n:127.0.0.1:54118_ x:collection1 s:shard1 c:control_collection r:core_node1) [n:127.0.0.1:54118_ c:control_collection s:shard1 r:core_node1 x:collection1] o.a.s.c.LeaderElector Joined leadership election with path: /collections/control_collection/leader_elect/shard1/election/95807183734505476-core_node1-n_0000000000
   [junit4]   2> 3145474 INFO  (coreZkRegister-9709-thread-1-processing-n:127.0.0.1:54118_ x:collection1 s:shard1 c:control_collection r:core_node1) [n:127.0.0.1:54118_ c:control_collection s:shard1 r:core_node1 x:collection1] o.a.s.c.ShardLeaderElectionContext Running the leader process for shard=shard1 and weAreReplacement=false and leaderVoteWait=10000
   [junit4]   2> 3145479 INFO  (coreZkRegister-9709-thread-1-processing-n:127.0.0.1:54118_ x:collection1 s:shard1 c:control_collection r:core_node1) [n:127.0.0.1:54118_ c:control_collection s:shard1 r:core_node1 x:collection1] o.a.s.c.ShardLeaderElectionContext Enough replicas found to continue.
   [junit4]   2> 3145479 INFO  (coreZkRegister-9709-thread-1-processing-n:127.0.0.1:54118_ x:collection1 s:shard1 c:control_collection r:core_node1) [n:127.0.0.1:54118_ c:control_collection s:shard1 r:core_node1 x:collection1] o.a.s.c.ShardLeaderElectionContext I may be the new leader - try and sync
   [junit4]   2> 3145479 INFO  (coreZkRegister-9709-thread-1-processing-n:127.0.0.1:54118_ x:collection1 s:shard1 c:control_collection r:core_node1) [n:127.0.0.1:54118_ c:control_collection s:shard1 r:core_node1 x:collection1] o.a.s.c.SyncStrategy Sync replicas to http://127.0.0.1:54118/collection1/
   [junit4]   2> 3145479 INFO  (coreZkRegister-9709-thread-1-processing-n:127.0.0.1:54118_ x:collection1 s:shard1 c:control_collection r:core_node1) [n:127.0.0.1:54118_ c:control_collection s:shard1 r:core_node1 x:collection1] o.a.s.c.SyncStrategy Sync Success - now sync replicas to me
   [junit4]   2> 3145479 INFO  (coreZkRegister-9709-thread-1-processing-n:127.0.0.1:54118_ x:collection1 s:shard1 c:control_collection r:core_node1) [n:127.0.0.1:54118_ c:control_collection s:shard1 r:core_node1 x:collection1] o.a.s.c.SyncStrategy http://127.0.0.1:54118/collection1/ has no replicas
   [junit4]   2> 3145481 INFO  (OverseerStateUpdate-95807183734505476-127.0.0.1:54118_-n_0000000000) [n:127.0.0.1:54118_    ] o.a.s.c.Overseer processMessage: queueSize: 1, message = {
   [junit4]   2>   "operation":"leader",
   [junit4]   2>   "shard":"shard1",
   [junit4]   2>   "collection":"control_collection"} current state version: 1
   [junit4]   2> 3145482 INFO  (coreZkRegister-9709-thread-1-processing-n:127.0.0.1:54118_ x:collection1 s:shard1 c:control_collection r:core_node1) [n:127.0.0.1:54118_ c:control_collection s:shard1 r:core_node1 x:collection1] o.a.s.c.c.SolrZkClient makePath: /collections/control_collection/leaders/shard1
   [junit4]   2> 3145486 INFO  (coreZkRegister-9709-thread-1-processing-n:127.0.0.1:54118_ x:collection1 s:shard1 c:control_collection r:core_node1) [n:127.0.0.1:54118_ c:control_collection s:shard1 r:core_node1 x:collection1] o.a.s.c.ShardLeaderElectionContextBase Creating leader registration node /collections/control_collection/leaders/shard1/leader after winning as /collections/control_collection/leader_elect/shard1/election/95807183734505476-core_node1-n_0000000000
   [junit4]   2> 3145488 INFO  (coreZkRegister-9709-thread-1-processing-n:127.0.0.1:54118_ x:collection1 s:shard1 c:control_collection r:core_node1) [n:127.0.0.1:54118_ c:control_collection s:shard1 r:core_node1 x:collection1] o.a.s.c.ShardLeaderElectionContext I am the new leader: http://127.0.0.1:54118/collection1/ shard1
   [junit4]   2> 3145489 INFO  (OverseerStateUpdate-95807183734505476-127.0.0.1:54118_-n_0000000000) [n:127.0.0.1:54118_    ] o.a.s.c.Overseer processMessage: queueSize: 1, message = {
   [junit4]   2>   "operation":"leader",
   [junit4]   2>   "shard":"shard1",
   [junit4]   2>   "collection":"control_collection",
   [junit4]   2>   "base_url":"http://127.0.0.1:54118",
   [junit4]   2>   "core":"collection1",
   [junit4]   2>   "state":"active"} current state version: 1
   [junit4]   2> 3145596 INFO  (zkCallback-3245-thread-1-processing-n:127.0.0.1:54118_) [n:127.0.0.1:54118_    ] o.a.s.c.c.ZkStateReader A cluster state change: [WatchedEvent state:SyncConnected type:NodeDataChanged path:/clusterstate.json], has occurred - updating... (live nodes size: [1])
   [junit4]   2> 3145600 INFO  (coreZkRegister-9709-thread-1-processing-n:127.0.0.1:54118_ x:collection1 s:shard1 c:control_collection r:core_node1) [n:127.0.0.1:54118_ c:control_collection s:shard1 r:core_node1 x:collection1] o.a.s.c.ZkController We are http://127.0.0.1:54118/collection1/ and leader is http://127.0.0.1:54118/collection1/
   [junit4]   2> 3145600 INFO  (coreZkRegister-9709-thread-1-processing-n:127.0.0.1:54118_ x:collection1 s:shard1 c:control_collection r:core_node1) [n:127.0.0.1:54118_ c:control_collection s:shard1 r:core_node1 x:collection1] o.a.s.c.ZkController No LogReplay needed for core=collection1 baseURL=http://127.0.0.1:54118
   [junit4]   2> 3145600 INFO  (coreZkRegister-9709-thread-1-processing-n:127.0.0.1:54118_ x:collection1 s:shard1 c:control_collection r:core_node1) [n:127.0.0.1:54118_ c:control_collection s:shard1 r:core_node1 x:collection1] o.a.s.c.ZkController I am the leader, no recovery necessary
   [junit4]   2> 3145600 INFO  (coreZkRegister-9709-thread-1-processing-n:127.0.0.1:54118_ x:collection1 s:shard1 c:control_collection r:core_node1) [n:127.0.0.1:54118_ c:control_collection s:shard1 r:core_node1 x:collection1] o.a.s.c.ZkController publishing state=active
   [junit4]   2> 3145600 INFO  (coreZkRegister-9709-thread-1-processing-n:127.0.0.1:54118_ x:collection1 s:shard1 c:control_collection r:core_node1) [n:127.0.0.1:54118_ c:control_collection s:shard1 r:core_node1 x:collection1] o.a.s.c.ZkController numShards not found on descriptor - reading it from system property
   [junit4]   2> 3145604 INFO  (OverseerStateUpdate-95807183734505476-127.0.0.1:54118_-n_0000000000) [n:127.0.0.1:54118_    ] o.a.s.c.Overseer processMessage: queueSize: 1, message = {
   [junit4]   2>   "core":"collection1",
   [junit4]   2>   "core_node_name":"core_node1",
   [junit4]   2>   "roles":null,
   [junit4]   2>   "base_url":"http://127.0.0.1:54118",
   [junit4]   2>   "node_name":"127.0.0.1:54118_",
   [junit4]   2>   "numShards":"1",
   [junit4]   2>   "state":"active",
   [junit4]   2>   "shard":"shard1",
   [junit4]   2>   "collection":"control_collection",
   [junit4]   2>   "operation":"state"} current state version: 2
   [junit4]   2> 3145605 INFO  (OverseerStateUpdate-95807183734505476-127.0.0.1:54118_-n_0000000000) [n:127.0.0.1:54118_    ] o.a.s.c.o.ReplicaMutator Update state numShards=1 message={
   [junit4]   2>   "core":"collection1",
   [junit4]   2>   "core_node_name":"core_node1",
   [junit4]   2>   "roles":null,
   [junit4]   2>   "base_url":"http://127.0.0.1:54118",
   [junit4]   2>   "node_name":"127.0.0.1:54118_",
   [junit4]   2>   "numShards":"1",
   [junit4]   2>   "state":"active",
   [junit4]   2>   "shard":"shard1",
   [junit4]   2>   "collection":"control_collection",
   [junit4]   2>   "operation":"state"}
   [junit4]   2> 3145716 INFO  (zkCallback-3245-thread-1-processing-n:127.0.0.1:54118_) [n:127.0.0.1:54118_    ] o.a.s.c.c.ZkStateReader A cluster state change: [WatchedEvent state:SyncConnected type:NodeDataChanged path:/clusterstate.json], has occurred - updating... (live nodes size: [1])
   [junit4]   2> 3145812 INFO  (TEST-TestReqParamsAPI.test-seed#[2AF64E9075DE3853]) [    ] o.a.s.c.s.i.CloudSolrClient Final constructed zkHost string: 127.0.0.1:54102/solr
   [junit4]   2> 3145813 INFO  (TEST-TestReqParamsAPI.test-seed#[2AF64E9075DE3853]) [    ] o.a.s.c.c.SolrZkClient Using default ZkCredentialsProvider
   [junit4]   2> 3145813 INFO  (TEST-TestReqParamsAPI.test-seed#[2AF64E9075DE3853]) [    ] o.a.s.c.c.ConnectionManager Waiting for client to connect to ZooKeeper
   [junit4]   2> 3145815 INFO  (zkCallback-3247-thread-1) [    ] o.a.s.c.c.ConnectionManager Watcher org.apache.solr.common.cloud.ConnectionManager@dc45f54 name:ZooKeeperConnection Watcher:127.0.0.1:54102/solr got event WatchedEvent state:SyncConnected type:None path:null path:null type:None
   [junit4]   2> 3145815 INFO  (TEST-TestReqParamsAPI.test-seed#[2AF64E9075DE3853]) [    ] o.a.s.c.c.ConnectionManager Client is connected to ZooKeeper
   [junit4]   2> 3145815 INFO  (TEST-TestReqParamsAPI.test-seed#[2AF64E9075DE3853]) [    ] o.a.s.c.c.SolrZkClient Using default ZkACLProvider
   [junit4]   2> 3145815 INFO  (TEST-TestReqParamsAPI.test-seed#[2AF64E9075DE3853]) [    ] o.a.s.c.c.ZkStateReader Updating cluster state from ZooKeeper... 
   [junit4]   2> 3145818 INFO  (TEST-TestReqParamsAPI.test-seed#[2AF64E9075DE3853]) [    ] o.a.s.c.c.ZkStateReader Updated live nodes from ZooKeeper... (0) -> (1)
   [junit4]   2> 3145819 INFO  (TEST-TestReqParamsAPI.test-seed#[2AF64E9075DE3853]) [    ] o.a.s.c.ChaosMonkey monkey: init - expire sessions:false cause connection loss:false
   [junit4]   2> 3146199 INFO  (TEST-TestReqParamsAPI.test-seed#[2AF64E9075DE3853]) [    ] o.a.s.SolrTestCaseJ4 Writing core.properties file to /Users/jenkins/workspace/Lucene-Solr-master-MacOSX/solr/build/solr-core/test/J0/temp/solr.handler.TestReqParamsAPI_2AF64E9075DE3853-001/shard-1-001/cores/collection1
   [junit4]   2> 3146200 INFO  (TEST-TestReqParamsAPI.test-seed#[2AF64E9075DE3853]) [    ] o.a.s.c.AbstractFullDistribZkTestBase create jetty 1 in directory /Users/jenkins/workspace/Lucene-Solr-master-MacOSX/solr/build/solr-core/test/J0/temp/solr.handler.TestReqParamsAPI_2AF64E9075DE3853-001/shard-1-001
   [junit4]   2> 3146201 INFO  (TEST-TestReqParamsAPI.test-seed#[2AF64E9075DE3853]) [    ] o.e.j.s.Server jetty-9.3.8.v20160314
   [junit4]   2> 3146203 INFO  (TEST-TestReqParamsAPI.test-seed#[2AF64E9075DE3853]) [    ] o.e.j.s.h.ContextHandler Started o.e.j.s.ServletContextHandler@5e5d3772{/,null,AVAILABLE}
   [junit4]   2> 3146203 INFO  (TEST-TestReqParamsAPI.test-seed#[2AF64E9075DE3853]) [    ] o.e.j.s.ServerConnector Started ServerConnector@5800beca{HTTP/1.1,[http/1.1]}{127.0.0.1:54123}
   [junit4]   2> 3146203 INFO  (TEST-TestReqParamsAPI.test-seed#[2AF64E9075DE3853]) [    ] o.e.j.s.Server Started @3151313ms
   [junit4]   2> 3146203 INFO  (TEST-TestReqParamsAPI.test-seed#[2AF64E9075DE3853]) [    ] o.a.s.c.s.e.JettySolrRunner Jetty properties: {solr.data.dir=/Users/jenkins/workspace/Lucene-Solr-master-MacOSX/solr/build/solr-core/test/J0/temp/solr.handler.TestReqParamsAPI_2AF64E9075DE3853-001/tempDir-001/jetty1, solrconfig=solrconfig.xml, hostContext=/, hostPort=54123, coreRootDirectory=/Users/jenkins/workspace/Lucene-Solr-master-MacOSX/solr/build/solr-core/test/J0/temp/solr.handler.TestReqParamsAPI_2AF64E9075DE3853-001/shard-1-001/cores}
   [junit4]   2> 3146204 INFO  (TEST-TestReqParamsAPI.test-seed#[2AF64E9075DE3853]) [    ] o.a.s.s.SolrDispatchFilter SolrDispatchFilter.init(): sun.misc.Launcher$AppClassLoader@4554617c
   [junit4]   2> 3146204 INFO  (TEST-TestReqParamsAPI.test-seed#[2AF64E9075DE3853]) [    ] o.a.s.c.SolrResourceLoader new SolrResourceLoader for directory: '/Users/jenkins/workspace/Lucene-Solr-master-MacOSX/solr/build/solr-core/test/J0/temp/solr.handler.TestReqParamsAPI_2AF64E9075DE3853-001/shard-1-001'
   [junit4]   2> 3146205 INFO  (TEST-TestReqParamsAPI.test-seed#[2AF64E9075DE3853]) [    ] o.a.s.c.SolrResourceLoader JNDI not configured for solr (NoInitialContextEx)
   [junit4]   2> 3146205 INFO  (TEST-TestReqParamsAPI.test-seed#[2AF64E9075DE3853]) [    ] o.a.s.c.SolrResourceLoader solr home defaulted to 'solr/' (could not find system property or JNDI)
   [junit4]   2> 3146205 INFO  (TEST-TestReqParamsAPI.test-seed#[2AF64E9075DE3853]) [    ] o.a.s.c.c.SolrZkClient Using default ZkCredentialsProvider
   [junit4]   2> 3146205 INFO  (TEST-TestReqParamsAPI.test-seed#[2AF64E9075DE3853]) [    ] o.a.s.c.c.ConnectionManager Waiting for client to connect to ZooKeeper
   [junit4]   2> 3146210 INFO  (zkCallback-3248-thread-1) [    ] o.a.s.c.c.ConnectionManager Watcher org.apache.solr.common.cloud.ConnectionManager@6d731561 name:ZooKeeperConnection Watcher:127.0.0.1:54102/solr got event WatchedEvent state:SyncConnected type:None path:null path:null type:None
   [junit4]   2> 3146210 INFO  (TEST-TestReqParamsAPI.test-seed#[2AF64E9075DE3853]) [    ] o.a.s.c.c.ConnectionManager Client is connected to ZooKeeper
   [junit4]   2> 3146210 INFO  (TEST-TestReqParamsAPI.test-seed#[2AF64E9075DE3853]) [    ] o.a.s.c.c.SolrZkClient Using default ZkACLProvider
   [junit4]   2> 3146212 INFO  (TEST-TestReqParamsAPI.test-seed#[2AF64E9075DE3853]) [    ] o.a.s.s.SolrDispatchFilter Loading solr.xml from SolrHome (not found in ZooKeeper)
   [junit4]   2> 3146213 INFO  (TEST-TestReqParamsAPI.test-seed#[2AF64E9075DE3853]) [    ] o.a.s.c.SolrXmlConfig Loading container configuration from /Users/jenkins/workspace/Lucene-Solr-master-MacOSX/solr/build/solr-core/test/J0/temp/solr.handler.TestReqParamsAPI_2AF64E9075DE3853-001/shard-1-001/solr.xml
   [junit4]   2> 3146334 INFO  (TEST-TestReqParamsAPI.test-seed#[2AF64E9075DE3853]) [    ] o.a.s.c.CorePropertiesLocator Config-defined core root directory: /Users/jenkins/workspace/Lucene-Solr-master-MacOSX/solr/build/solr-core/test/J0/temp/solr.handler.TestReqParamsAPI_2AF64E9075DE3853-001/shard-1-001/cores
   [junit4]   2> 3146334 INFO  (TEST-TestReqParamsAPI.test-seed#[2AF64E9075DE3853]) [    ] o.a.s.c.CoreContainer New CoreContainer 504076600
   [junit4]   2> 3146334 INFO  (TEST-TestReqParamsAPI.test-seed#[2AF64E9075DE3853]) [    ] o.a.s.c.CoreContainer Loading cores into CoreContainer [instanceDir=/Users/jenkins/workspace/Lucene-Solr-master-MacOSX/solr/build/solr-core/test/J0/temp/solr.handler.TestReqParamsAPI_2AF64E9075DE3853-001/shard-1-001]
   [junit4]   2> 3146334 WARN  (TEST-TestReqParamsAPI.test-seed#[2AF64E9075DE3853]) [    ] o.a.s.c.CoreContainer Couldn't add files from /Users/jenkins/workspace/Lucene-Solr-master-MacOSX/solr/build/solr-core/test/J0/temp/solr.handler.TestReqParamsAPI_2AF64E9075DE3853-001/shard-1-001/lib to classpath: /Users/jenkins/workspace/Lucene-Solr-master-MacOSX/solr/build/solr-core/test/J0/temp/solr.handler.TestReqParamsAPI_2AF64E9075DE3853-001/shard-1-001/lib
   [junit4]   2> 3146334 INFO  (TEST-TestReqParamsAPI.test-seed#[2AF64E9075DE3853]) [    ] o.a.s.h.c.HttpShardHandlerFactory created with socketTimeout : 90000,urlScheme : ,connTimeout : 15000,maxConnectionsPerHost : 20,maxConnections : 10000,corePoolSize : 0,maximumPoolSize : 2147483647,maxThreadIdleTime : 5,sizeOfQueue : -1,fairnessPolicy : false,
   [junit4]   2> 3146337 INFO  (TEST-TestReqParamsAPI.test-seed#[2AF64E9075DE3853]) [    ] o.a.s.u.UpdateShardHandler Creating UpdateShardHandler HTTP client with params: 
   [junit4]   2> 3146338 INFO  (TEST-TestReqParamsAPI.test-seed#[2AF64E9075DE3853]) [    ] o.a.s.l.LogWatcher SLF4J impl is org.slf4j.impl.Log4jLoggerFactory
   [junit4]   2> 3146338 INFO  (TEST-TestReqParamsAPI.test-seed#[2AF64E9075DE3853]) [    ] o.a.s.l.LogWatcher Registering Log Listener [Log4j (org.slf4j.impl.Log4jLoggerFactory)]
   [junit4]   2> 3146338 INFO  (TEST-TestReqParamsAPI.test-seed#[2AF64E9075DE3853]) [    ] o.a.s.c.ZkContainer Zookeeper client=127.0.0.1:54102/solr
   [junit4]   2> 3146338 INFO  (TEST-TestReqParamsAPI.test-seed#[2AF64E9075DE3853]) [    ] o.a.s.c.ZkController zkHost includes chroot
   [junit4]   2> 3146338 INFO  (TEST-TestReqParamsAPI.test-seed#[2AF64E9075DE3853]) [    ] o.a.s.c.c.SolrZkClient Using default ZkCredentialsProvider
   [junit4]   2> 3146339 INFO  (TEST-TestReqParamsAPI.test-seed#[2AF64E9075DE3853]) [    ] o.a.s.c.c.ConnectionManager Waiting for client to connect to ZooKeeper
   [junit4]   2> 3146340 INFO  (zkCallback-3251-thread-1) [    ] o.a.s.c.c.ConnectionManager Watcher org.apache.solr.common.cloud.ConnectionManager@465f015a name:ZooKeeperConnection Watcher:127.0.0.1:54102 got event WatchedEvent state:SyncConnected type:None path:null path:null type:None
   [junit4]   2> 3146340 INFO  (TEST-TestReqParamsAPI.test-seed#[2AF64E9075DE3853]) [    ] o.a.s.c.c.ConnectionManager Client is connected to ZooKeeper
   [junit4]   2> 3146340 INFO  (TEST-TestReqParamsAPI.test-seed#[2AF64E9075DE3853]) [    ] o.a.s.c.c.SolrZkClient Using default ZkACLProvider
   [junit4]   2> 3146342 INFO  (TEST-TestReqParamsAPI.test-seed#[2AF64E9075DE3853]) [n:127.0.0.1:54123_    ] o.a.s.c.ZkController Added new OnReconnect listener org.apache.solr.cloud.ZkController$$Lambda$54/972089461@79f71cb6
   [junit4]   2> 3146342 INFO  (TEST-TestReqParamsAPI.test-seed#[2AF64E9075DE3853]) [n:127.0.0.1:54123_    ] o.a.s.c.c.ConnectionManager Waiting for client to connect to ZooKeeper
   [junit4]   2> 3146344 INFO  (zkCallback-3252-thread-1-processing-n:127.0.0.1:54123_) [n:127.0.0.1:54123_    ] o.a.s.c.c.ConnectionManager Watcher org.apache.solr.common.cloud.ConnectionManager@2336093 name:ZooKeeperConnection Watcher:127.0.0.1:54102/solr got event WatchedEvent state:SyncConnected type:None path:null path:null type:None
   [junit4]   2> 3146344 INFO  (TEST-TestReqParamsAPI.test-seed#[2AF64E9075DE3853]) [n:127.0.0.1:54123_    ] o.a.s.c.c.ConnectionManager Client is connected to ZooKeeper
   [junit4]   2> 3146357 INFO  (TEST-TestReqParamsAPI.test-seed#[2AF64E9075DE3853]) [n:127.0.0.1:54123_    ] o.a.s.c.c.ZkStateReader Updating cluster state from ZooKeeper... 
   [junit4]   2> 3146359 INFO  (TEST-TestReqParamsAPI.test-seed#[2AF64E9075DE3853]) [n:127.0.0.1:54123_    ] o.a.s.c.c.ZkStateReader Updated live nodes from ZooKeeper... (0) -> (1)
   [junit4]   2> 3146363 INFO  (TEST-TestReqParamsAPI.test-seed#[2AF64E9075DE3853]) [n:127.0.0.1:54123_    ] o.a.s.c.Overseer Overseer (id=null) closing
   [junit4]   2> 3146364 INFO  (TEST-TestReqParamsAPI.test-seed#[2AF64E9075DE3853]) [n:127.0.0.1:54123_    ] o.a.s.c.LeaderElector Joined leadership election with path: /overseer_elect/election/95807183734505480-127.0.0.1:54123_-n_0000000001
   [junit4]   2> 3146365 INFO  (TEST-TestReqParamsAPI.test-seed#[2AF64E9075DE3853]) [n:127.0.0.1:54123_    ] o.a.s.c.LeaderElector Watching path /overseer_elect/election/95807183734505476-127.0.0.1:54118_-n_0000000000 to know if I could be the leader
   [junit4]   2> 3146365 INFO  (TEST-TestReqParamsAPI.test-seed#[2AF64E9075DE3853]) [n:127.0.0.1:54123_    ] o.a.s.c.ZkController Publish node=127.0.0.1:54123_ as DOWN
   [junit4]   2> 3146369 INFO  (OverseerStateUpdate-95807183734505476-127.0.0.1:54118_-n_0000000000) [n:127.0.0.1:54118_    ] o.a.s.c.Overseer processMessage: queueSize: 1, message = {
   [junit4]   2>   "operation":"downnode",
   [junit4]   2>   "node_name":"127.0.0.1:54123_"} current state version: 3
   [junit4]   2> 3146369 INFO  (OverseerStateUpdate-95807183734505476-127.0.0.1:54118_-n_0000000000) [n:127.0.0.1:54118_    ] o.a.s.c.o.NodeMutator DownNode state invoked for node: 127.0.0.1:54123_
   [junit4]   2> 3146485 INFO  (zkCallback-3247-thread-1) [    ] o.a.s.c.c.ZkStateReader A cluster state change: [WatchedEvent state:SyncConnected type:NodeDataChanged path:/clusterstate.json], has occurred - updating... (live nodes size: [1])
   [junit4]   2> 3146485 INFO  (zkCallback-3245-thread-1-processing-n:127.0.0.1:54118_) [n:127.0.0.1:54118_    ] o.a.s.c.c.ZkStateReader A cluster state change: [WatchedEvent state:SyncConnected type:NodeDataChanged path:/clusterstate.json], has occurred - updating... (live nodes size: [1])
   [junit4]   2> 3146485 INFO  (zkCallback-3252-thread-1-processing-n:127.0.0.1:54123_) [n:127.0.0.1:54123_    ] o.a.s.c.c.ZkStateReader A cluster state change: [WatchedEvent state:SyncConnected type:NodeDataChanged path:/clusterstate.json], has occurred - updating... (live nodes size: [1])
   [junit4]   2> 3147379 INFO  (TEST-TestReqParamsAPI.test-seed#[2AF64E9075DE3853]) [n:127.0.0.1:54123_    ] o.a.s.c.ZkController Register node as live in ZooKeeper:/live_nodes/127.0.0.1:54123_
   [junit4]   2> 3147380 INFO  (TEST-TestReqParamsAPI.test-seed#[2AF64E9075DE3853]) [n:127.0.0.1:54123_    ] o.a.s.c.c.SolrZkClient makePath: /live_nodes/127.0.0.1:54123_
   [junit4]   2> 3147382 INFO  (zkCallback-3245-thread-1-processing-n:127.0.0.1:54118_) [n:127.0.0.1:54118_    ] o.a.s.c.c.ZkStateReader A live node change: [WatchedEvent state:SyncConnected type:NodeChildrenChanged path:/live_nodes], has occurred - updating... (live nodes size: [1])
   [junit4]   2> 3147382 INFO  (zkCallback-3247-thread-1) [    ] o.a.s.c.c.ZkStateReader A live node change: [WatchedEvent state:SyncConnected type:NodeChildrenChanged path:/live_nodes], has occurred - updating... (live nodes size: [1])
   [junit4]   2> 3147382 INFO  (zkCallback-3252-thread-1-processing-n:127.0.0.1:54123_) [n:127.0.0.1:54123_    ] o.a.s.c.c.ZkStateReader A live node change: [WatchedEvent state:SyncConnected type:NodeChildrenChanged path:/live_nodes], has occurred - updating... (live nodes size: [1])
   [junit4]   2> 3147383 INFO  (zkCallback-3245-thread-1-processing-n:127.0.0.1:54118_) [n:127.0.0.1:54118_    ] o.a.s.c.c.ZkStateReader Updated live nodes from ZooKeeper... (1) -> (2)
   [junit4]   2> 3147383 INFO  (zkCallback-3247-thread-1) [    ] o.a.s.c.c.ZkStateReader Updated live nodes from ZooKeeper... (1) -> (2)
   [junit4]   2> 3147383 INFO  (zkCallback-3252-thread-1-processing-n:127.0.0.1:54123_) [n:127.0.0.1:54123_    ] o.a.s.c.c.ZkStateReader Updated live nodes from ZooKeeper... (1) -> (2)
   [junit4]   2> 3147390 INFO  (TEST-TestReqParamsAPI.test-seed#[2AF64E9075DE3853]) [n:127.0.0.1:54123_    ] o.a.s.c.CoreContainer Security conf doesn't exist. Skipping setup for authorization module.
   [junit4]   2> 3147390 INFO  (TEST-TestReqParamsAPI.test-seed#[2AF64E9075DE3853]) [n:127.0.0.1:54123_    ] o.a.s.c.CoreContainer No authentication plugin used.
   [junit4]   2> 3147391 INFO  (TEST-TestReqParamsAPI.test-seed#[2AF64E9075DE3853]) [n:127.0.0.1:54123_    ] o.a.s.c.CorePropertiesLocator Looking for core definitions underneath /Users/jenkins/workspace/Lucene-Solr-master-MacOSX/solr/build/solr-core/test/J0/temp/solr.handler.TestReqParamsAPI_2AF64E9075DE3853-001/shard-1-001/cores
   [junit4]   2> 3147399 INFO  (TEST-TestReqParamsAPI.test-seed#[2AF64E9075DE3853]) [n:127.0.0.1:54123_    ] o.a.s.c.CoreDescriptor Created CoreDescriptor: {name=collection1, config=solrconfig.xml, transient=false, schema=schema.xml, loadOnStartup=true, configSetProperties=configsetprops.json, collection=collection1, coreNodeName=, dataDir=data/, shard=}
   [junit4]   2> 3147399 INFO  (TEST-TestReqParamsAPI.test-seed#[2AF64E9075DE3853]) [n:127.0.0.1:54123_    ] o.a.s.c.CorePropertiesLocator Found core collection1 in /Users/jenkins/workspace/Lucene-Solr-master-MacOSX/solr/build/solr-core/test/J0/temp/solr.handler.TestReqParamsAPI_2AF64E9075DE3853-001/shard-1-001/cores/collection1
   [junit4]   2> 3147399 INFO  (TEST-TestReqParamsAPI.test-seed#[2AF64E9075DE3853]) [n:127.0.0.1:54123_    ] o.a.s.c.CorePropertiesLocator Found 1 core definitions
   [junit4]   2> 3147401 INFO  (TEST-TestReqParamsAPI.test-seed#[2AF64E9075DE3853]) [n:127.0.0.1:54123_    ] o.a.s.s.SolrDispatchFilter user.dir=/Users/jenkins/workspace/Lucene-Solr-master-MacOSX/solr/build/solr-core/test/J0
   [junit4]   2> 3147401 INFO  (TEST-TestReqParamsAPI.test-seed#[2AF64E9075DE3853]) [n:127.0.0.1:54123_    ] o.a.s.s.SolrDispatchFilter SolrDispatchFilter.init() done
   [junit4]   2> 3147401 INFO  (coreLoadExecutor-9726-thread-1-processing-n:127.0.0.1:54123_) [n:127.0.0.1:54123_ c:collection1   x:collection1] o.a.s.c.ZkController publishing state=down
   [junit4]   2> 3147401 INFO  (coreLoadExecutor-9726-thread-1-processing-n:127.0.0.1:54123_) [n:127.0.0.1:54123_ c:collection1   x:collection1] o.a.s.c.ZkController numShards not found on descriptor - reading it from system property
   [junit4]   2> 3147403 INFO  (coreLoadExecutor-9726-thread-1-processing-n:127.0.0.1:54123_) [n:127.0.0.1:54123_ c:collection1   x:collection1] o.a.s.c.ZkController Collection collection1 not visible yet, but flagging it so a watch is registered when it becomes visible
   [junit4]   2> 3147403 INFO  (coreLoadExecutor-9726-thread-1-processing-n:127.0.0.1:54123_) [n:127.0.0.1:54123_ c:collection1   x:collection1] o.a.s.c.c.ZkStateReader addZkWatch [collection1]
   [junit4]   2> 3147403 INFO  (OverseerStateUpdate-95807183734505476-127.0.0.1:54118_-n_0000000000) [n:127.0.0.1:54118_    ] o.a.s.c.Overseer processMessage: queueSize: 1, message = {
   [junit4]   2>   "core":"collection1",
   [junit4]   2>   "roles":null,
   [junit4]   2>   "base_url":"http://127.0.0.1:54123",
   [junit4]   2>   "node_name":"127.0.0.1:54123_",
   [junit4]   2>   "numShards":"2",
   [junit4]   2>   "state":"down",
   [junit4]   2>   "shard":null,
   [junit4]   2>   "collection":"collection1",
   [junit4]   2>   "operation":"state"} current state version: 4
   [junit4]   2> 3147404 INFO  (coreLoadExecutor-9726-thread-1-processing-n:127.0.0.1:54123_) [n:127.0.0.1:54123_ c:collection1   x:collection1] o.a.s.c.c.ZkStateReader Deleting data for [collection1]
   [junit4]   2> 3147404 INFO  (OverseerStateUpdate-95807183734505476-127.0.0.1:54118_-n_0000000000) [n:127.0.0.1:54118_    ] o.a.s.c.o.ReplicaMutator Update state numShards=2 message={
   [junit4]   2>   "core":"collection1",
   [junit4]   2>   "roles":null,
   [junit4]   2>   "base_url":"http://127.0.0.1:54123",
   [junit4]   2>   "node_name":"127.0.0.1:54123_",
   [junit4]   2>   "numShards":"2",
   [junit4]   2>   "state":"down",
   [junit4]   2>   "shard":null,
   [junit4]   2>   "collection":"collection1",
   [junit4]   2>   "operation":"state"}
   [junit4]   2> 3147404 INFO  (OverseerStateUpdate-95807183734505476-127.0.0.1:54118_-n_0000000000) [n:127.0.0.1:54118_    ] o.a.s.c.o.ClusterStateMutator building a new cName: collection1
   [junit4]   2> 3147404 INFO  (OverseerStateUpdate-95807183734505476-127.0.0.1:54118_-n_0000000000) [n:127.0.0.1:54118_    ] o.a.s.c.o.ReplicaMutator Assigning new node to shard shard=shard2
   [junit4]   2> 3147405 INFO  (coreLoadExecutor-9726-thread-1-processing-n:127.0.0.1:54123_) [n:127.0.0.1:54123_ c:collection1   x:collection1] o.a.s.c.ZkController look for our core node name
   [junit4]   2> 3147513 INFO  (zkCallback-3245-thread-1-processing-n:127.0.0.1:54118_) [n:127.0.0.1:54118_    ] o.a.s.c.c.ZkStateReader A cluster state change: [WatchedEvent state:SyncConnected type:NodeDataChanged path:/clusterstate.json], has occurred - updating... (live nodes size: [2])
   [junit4]   2> 3147513 INFO  (zkCallback-3252-thread-1-processing-n:127.0.0.1:54123_) [n:127.0.0.1:54123_    ] o.a.s.c.c.ZkStateReader A cluster state change: [WatchedEvent state:SyncConnected type:NodeDataChanged path:/clusterstate.json], has occurred - updating... (live nodes size: [2])
   [junit4]   2> 3147513 INFO  (zkCallback-3247-thread-1) [    ] o.a.s.c.c.ZkStateReader A cluster state change: [WatchedEvent state:SyncConnected type:NodeDataChanged path:/clusterstate.json], has occurred - updating... (live nodes size: [2])
   [junit4]   2> 3148406 INFO  (coreLoadExecutor-9726-thread-1-processing-n:127.0.0.1:54123_) [n:127.0.0.1:54123_ c:collection1   x:collection1] o.a.s.c.ZkController waiting to find shard id in clusterstate for collection1
   [junit4]   2> 3148406 INFO  (coreLoadExecutor-9726-thread-1-processing-n:127.0.0.1:54123_) [n:127.0.0.1:54123_ c:collection1   x:collection1] o.a.s.c.ZkController Check for collection zkNode:collection1
   [junit4]   2> 3148406 INFO  (coreLoadExecutor-9726-thread-1-processing-n:127.0.0.1:54123_) [n:127.0.0.1:54123_ c:collection1   x:collection1] o.a.s.c.ZkController Collection zkNode exists
   [junit4]   2> 3148407 INFO  (coreLoadExecutor-9726-thread-1-processing-n:127.0.0.1:54123_) [n:127.0.0.1:54123_ c:collection1   x:collection1] o.a.s.c.c.ZkStateReader Load collection config from: [/collections/collection1]
   [junit4]   2> 3148408 INFO  (coreLoadExecutor-9726-thread-1-processing-n:127.0.0.1:54123_) [n:127.0.0.1:54123_ c:collection1   x:collection1] o.a.s.c.c.ZkStateReader path=[/collections/collection1] [configName]=[conf1] specified config exists in ZooKeeper
   [junit4]   2> 3148408 INFO  (coreLoadExecutor-9726-thread-1-processing-n:127.0.0.1:54123_) [n:127.0.0.1:54123_ c:collection1   x:collection1] o.a.s.c.SolrResourceLoader new SolrResourceLoader for directory: '/Users/jenkins/workspace/Lucene-Solr-master-MacOSX/solr/build/solr-core/test/J0/temp/solr.handler.TestReqParamsAPI_2AF64E9075DE3853-001/shard-1-001/cores/collection1'
   [junit4]   2> 3148408 INFO  (coreLoadExecutor-9726-thread-1-processing-n:127.0.0.1:54123_) [n:127.0.0.1:54123_ c:collection1   x:collection1] o.a.s.c.SolrResourceLoader JNDI not configured for solr (NoInitialContextEx)
   [junit4]   2> 3148408 INFO  (coreLoadExecutor-9726-thread-1-processing-n:127.0.0.1:54123_) [n:127.0.0.1:54123_ c:collection1   x:collection1] o.a.s.c.SolrResourceLoader solr home defaulted to 'solr/' (could not find system property or JNDI)
   [junit4]   2> 3148411 INFO  (coreLoadExecutor-9726-thread-1-processing-n:127.0.0.1:54123_) [n:127.0.0.1:54123_ c:collection1   x:collection1] o.a.s.c.Config loaded config solrconfig.xml with version 0 
   [junit4]   2> 3148417 INFO  (coreLoadExecutor-9726-thread-1-processing-n:127.0.0.1:54123_) [n:127.0.0.1:54123_ c:collection1   x:collection1] o.a.s.c.SolrConfig current version of requestparams : -1
   [junit4]   2> 3148420 INFO  (coreLoadExecutor-9726-thread-1-processing-n:127.0.0.1:54123_) [n:127.0.0.1:54123_ c:collection1   x:collection1] o.a.s.c.SolrConfig Using Lucene MatchVersion: 7.0.0
   [junit4]   2> 3148428 INFO  (coreLoadExecutor-9726-thread-1-processing-n:127.0.0.1:54123_) [n:127.0.0.1:54123_ c:collection1   x:collection1] o.a.s.c.SolrConfig Loaded SolrConfig: solrconfig.xml
   [junit4]   2> 3148433 INFO  (coreLoadExecutor-9726-thread-1-processing-n:127.0.0.1:54123_) [n:127.0.0.1:54123_ c:collection1   x:collection1] o.a.s.s.IndexSchema [collection1] Schema name=test
   [junit4]   2> 3148503 INFO  (coreLoadExecutor-9726-thread-1-processing-n:127.0.0.1:54123_) [n:127.0.0.1:54123_ c:collection1   x:collection1] o.a.s.s.OpenExchangeRatesOrgProvider Initialized with rates=open-exchange-rates.json, refreshInterval=1440.
   [junit4]   2> 3148512 INFO  (coreLoadExecutor-9726-thread-1-processing-n:127.0.0.1:54123_) [n:127.0.0.1:54123_ c:collection1   x:collection1] o.a.s.s.IndexSchema default search field in schema is text
   [junit4]   2> 3148513 INFO  (coreLoadExecutor-9726-thread-1-processing-n:127.0.0.1:54123_) [n:127.0.0.1:54123_ c:collection1   x:collection1] o.a.s.s.IndexSchema unique key field: id
   [junit4]   2> 3148526 INFO  (coreLoadExecutor-9726-thread-1-processing-n:127.0.0.1:54123_) [n:127.0.0.1:54123_ c:collection1   x:collection1] o.a.s.s.FileExchangeRateProvider Reloading exchange rates from file currency.xml
   [junit4]   2> 3148529 INFO  (coreLoadExecutor-9726-thread-1-processing-n:127.0.0.1:54123_) [n:127.0.0.1:54123_ c:collection1   x:collection1] o.a.s.s.FileExchangeRateProvider Reloading exchange rates from file currency.xml
   [junit4]   2> 3148531 INFO  (coreLoadExecutor-9726-thread-1-processing-n:127.0.0.1:54123_) [n:127.0.0.1:54123_ c:collection1   x:collection1] o.a.s.s.OpenExchangeRatesOrgProvider Reloading exchange rates from open-exchange-rates.json
   [junit4]   2> 3148532 INFO  (coreLoadExecutor-9726-thread-1-processing-n:127.0.0.1:54123_) [n:127.0.0.1:54123_ c:collection1   x:collection1] o.a.s.s.OpenExchangeRatesOrgProvider Reloading exchange rates from open-exchange-rates.json
   [junit4]   2> 3148535 INFO  (coreLoadExecutor-9726-thread-1-processing-n:127.0.0.1:54123_) [n:127.0.0.1:54123_ c:collection1   x:collection1] o.a.s.c.ConfigSetProperties Did not find ConfigSet properties, assuming default properties: Can't find resource 'configsetprops.json' in classpath or '/configs/conf1', cwd=/Users/jenkins/workspace/Lucene-Solr-master-MacOSX/solr/build/solr-core/test/J0
   [junit4]   2> 3148535 INFO  (coreLoadExecutor-9726-thread-1-processing-n:127.0.0.1:54123_) [n:127.0.0.1:54123_ c:collection1   x:collection1] o.a.s.c.CoreContainer Creating SolrCore 'collection1' using configuration from collection collection1
   [junit4]   2> 3148535 INFO  (coreLoadExecutor-9726-thread-1-processing-n:127.0.0.1:54123_) [n:127.0.0.1:54123_ c:collection1 s:shard2 r:core_node1 x:collection1] o.a.s.c.SolrCore org.apache.solr.core.MockDirectoryFactory
   [junit4]   2> 3148536 INFO  (coreLoadExecutor-9726-thread-1-processing-n:127.0.0.1:54123_) [n:127.0.0.1:54123_ c:collection1 s:shard2 r:core_node1 x:collection1] o.a.s.c.SolrCore [[collection1] ] Opening new SolrCore at [/Users/jenkins/workspace/Lucene-Solr-master-MacOSX/solr/build/solr-core/test/J0/temp/solr.handler.TestReqParamsAPI_2AF64E9075DE3853-001/shard-1-001/cores/collection1], dataDir=[/Users/jenkins/workspace/Lucene-Solr-master-MacOSX/solr/build/solr-core/test/J0/temp/solr.handler.TestReqParamsAPI_2AF64E9075DE3853-001/shard-1-001/cores/collection1/data/]
   [junit4]   2> 3148536 INFO  (coreLoadExecutor-9726-thread-1-processing-n:127.0.0.1:54123_) [n:127.0.0.1:54123_ c:collection1 s:shard2 r:core_node1 x:collection1] o.a.s.c.JmxMonitoredMap JMX monitoring is enabled. Adding Solr mbeans to JMX Server: com.sun.jmx.mbeanserver.JmxMBeanServer@4a13ca7c
   [junit4]   2> 3148537 INFO  (coreLoadExecutor-9726-thread-1-processing-n:127.0.0.1:54123_) [n:127.0.0.1:54123_ c:collection1 s:shard2 r:core_node1 x:collection1] o.a.s.c.CachingDirectoryFactory return new directory for /Users/jenkins/workspace/Lucene-Solr-master-MacOSX/solr/build/solr-core/test/J0/temp/solr.handler.TestReqParamsAPI_2AF64E9075DE3853-001/shard-1-001/cores/collection1/data
   [junit4]   2> 3148537 INFO  (coreLoadExecutor-9726-thread-1-processing-n:127.0.0.1:54123_) [n:127.0.0.1:54123_ c:collection1 s:shard2 r:core_node1 x:collection1] o.a.s.c.SolrCore New index directory detected: old=null new=/Users/jenkins/workspace/Lucene-Solr-master-MacOSX/solr/build/solr-core/test/J0/temp/solr.handler.TestReqParamsAPI_2AF64E9075DE3853-001/shard-1-001/cores/collection1/data/index/
   [junit4]   2> 3148537 WARN  (coreLoadExecutor-9726-thread-1-processing-n:127.0.0.1:54123_) [n:127.0.0.1:54123_ c:collection1 s:shard2 r:core_node1 x:collection1] o.a.s.c.SolrCore [collection1] Solr index directory '/Users/jenkins/workspace/Lucene-Solr-master-MacOSX/solr/build/solr-core/test/J0/temp/solr.handler.TestReqParamsAPI_2AF64E9075DE3853-001/shard-1-001/cores/collection1/data/index' doesn't exist. Creating new index...
   [junit4]   2> 3148537 INFO  (coreLoadExecutor-9726-thread-1-processing-n:127.0.0.1:54123_) [n:127.0.0.1:54123_ c:collection1 s:shard2 r:core_node1 x:collection1] o.a.s.c.CachingDirectoryFactory return new directory for /Users/jenkins/workspace/Lucene-Solr-master-MacOSX/solr/build/solr-core/test/J0/temp/solr.handler.TestReqParamsAPI_2AF64E9075DE3853-001/shard-1-001/cores/collection1/data/index
   [junit4]   2> 3148537 INFO  (coreLoadExecutor-9726-thread-1-processing-n:127.0.0.1:54123_) [n:127.0.0.1:54123_ c:collection1 s:shard2 r:core_node1 x:collection1] o.a.s.u.RandomMergePolicy RandomMergePolicy wrapping class org.apache.lucene.index.LogByteSizeMergePolicy: [LogByteSizeMergePolicy: minMergeSize=1677721, mergeFactor=22, maxMergeSize=2147483648, maxMergeSizeForForcedMerge=9223372036854775807, calibrateSizeByDeletes=true, maxMergeDocs=2147483647, maxCFSSe

[...truncated too long message...]

collections
   [junit4]   2> 	3	/solr/overseer/queue
   [junit4]   2> 	3	/solr/overseer/collection-queue-work
   [junit4]   2> 	2	/solr/overseer/queue-work
   [junit4]   2> 
   [junit4]   2> NOTE: reproduce with: ant test  -Dtestcase=TestReqParamsAPI -Dtests.method=test -Dtests.seed=2AF64E9075DE3853 -Dtests.slow=true -Dtests.locale=lv -Dtests.timezone=Africa/Monrovia -Dtests.asserts=true -Dtests.file.encoding=ISO-8859-1
   [junit4] FAILURE 36.7s J0 | TestReqParamsAPI.test <<<
   [junit4]    > Throwable #1: java.lang.AssertionError: Could not get expected value  'null' for path 'response/params/y/p' full output: {
   [junit4]    >   "responseHeader":{
   [junit4]    >     "status":0,
   [junit4]    >     "QTime":0},
   [junit4]    >   "response":{
   [junit4]    >     "znodeVersion":4,
   [junit4]    >     "params":{
   [junit4]    >       "x":{
   [junit4]    >         "a":"A val",
   [junit4]    >         "b":"B val",
   [junit4]    >         "_appends_":{"add":"first"},
   [junit4]    >         "_invariants_":{"fixed":"f"},
   [junit4]    >         "":{"v":1}},
   [junit4]    >       "y":{
   [junit4]    >         "p":"P val",
   [junit4]    >         "q":"Q val",
   [junit4]    >         "":{"v":2}}}}},  from server:  http://127.0.0.1:54137/collection1
   [junit4]    > 	at __randomizedtesting.SeedInfo.seed([2AF64E9075DE3853:A2A2714ADB2255AB]:0)
   [junit4]    > 	at org.apache.solr.core.TestSolrConfigHandler.testForResponseElement(TestSolrConfigHandler.java:457)
   [junit4]    > 	at org.apache.solr.handler.TestReqParamsAPI.testReqParams(TestReqParamsAPI.java:259)
   [junit4]    > 	at org.apache.solr.handler.TestReqParamsAPI.test(TestReqParamsAPI.java:62)
   [junit4]    > 	at org.apache.solr.BaseDistributedSearchTestCase$ShardsRepeatRule$ShardsFixedStatement.callStatement(BaseDistributedSearchTestCase.java:985)
   [junit4]    > 	at org.apache.solr.BaseDistributedSearchTestCase$ShardsRepeatRule$ShardsStatement.evaluate(BaseDistributedSearchTestCase.java:960)
   [junit4]    > 	at java.lang.Thread.run(Thread.java:745)
   [junit4]   2> 3176852 INFO  (SUITE-TestReqParamsAPI-seed#[2AF64E9075DE3853]-worker) [    ] o.a.s.SolrTestCaseJ4 ###deleteCore
   [junit4]   2> NOTE: leaving temporary files on disk at: /Users/jenkins/workspace/Lucene-Solr-master-MacOSX/solr/build/solr-core/test/J0/temp/solr.handler.TestReqParamsAPI_2AF64E9075DE3853-001
   [junit4]   2> NOTE: test params are: codec=Lucene60, sim=RandomSimilarity(queryNorm=false,coord=yes): {}, locale=lv, timezone=Africa/Monrovia
   [junit4]   2> NOTE: Mac OS X 10.11.4 x86_64/Oracle Corporation 1.8.0_72 (64-bit)/cpus=3,threads=1,free=117396288,total=530579456
   [junit4]   2> NOTE: All tests run in this JVM: [ExternalFileFieldSortTest, DocValuesTest, PolyFieldTest, DocValuesMultiTest, TestSweetSpotSimilarityFactory, TestComponentsName, TestLazyCores, SpatialFilterTest, TestSolrConfigHandlerCloud, IgnoreCommitOptimizeUpdateProcessorFactoryTest, TestPostingsSolrHighlighter, TestUpdate, TestCollationFieldDocValues, CdcrReplicationDistributedZkTest, TestAddFieldRealTimeGet, TestPhraseSuggestions, TestStressReorder, TestCloudPivotFacet, RequiredFieldsTest, DistribJoinFromCollectionTest, FastVectorHighlighterTest, TestAnalyzedSuggestions, TestChildDocTransformer, DistributedDebugComponentTest, TestDistributedStatsComponentCardinality, RankQueryTest, AsyncMigrateRouteKeyTest, RecoveryZkTest, EnumFieldTest, AnalysisAfterCoreReloadTest, XsltUpdateRequestHandlerTest, TestConfigSetImmutable, URLClassifyProcessorTest, VMParamsZkACLAndCredentialsProvidersTest, TestIntervalFaceting, TestCodecSupport, TestCollapseQParserPlugin, CloudExitableDirectoryReaderTest, TestMiniSolrCloudClusterSSL, TestBlendedInfixSuggestions, UnloadDistributedZkTest, AnalysisErrorHandlingTest, TestMergePolicyConfig, TestMaxScoreQueryParser, TestDynamicFieldCollectionResource, TestSerializedLuceneMatchVersion, TestLeaderInitiatedRecoveryThread, DistributedFacetPivotLargeTest, TestImplicitCoreProperties, TestJmxIntegration, QueryResultKeyTest, TestConfig, TestSortByMinMaxFunction, SuggestComponentContextFilterQueryTest, ExplicitHLLTest, TestRecoveryHdfs, CustomCollectionTest, SyncSliceTest, ZkStateWriterTest, SolrTestCaseJ4Test, DistributedSpellCheckComponentTest, DistanceUnitsTest, CursorMarkTest, TestCloudDeleteByQuery, SolrXmlInZkTest, LeaderInitiatedRecoveryOnCommitTest, TestPartialUpdateDeduplication, TestScoreJoinQPNoScore, CoreAdminCreateDiscoverTest, TestEmbeddedSolrServerConstructors, HttpPartitionTest, TestRequestStatusCollectionAPI, TestConfigSetsAPIZkFailure, TestQuerySenderNoQuery, BigEndianAscendingWordSerializerTest, TestReplicationHandler, DistributedFacetPivotWhiteBoxTest, ZkControllerTest, TestSchemaSimilarityResource, SimplePostToolTest, PreAnalyzedUpdateProcessorTest, JavabinLoaderTest, BlockJoinFacetSimpleTest, TestMiniSolrCloudClusterBase, TestDocumentBuilder, TestShortCircuitedRequests, TestPerFieldSimilarityWithDefaultOverride, TestJsonRequest, TestFieldTypeCollectionResource, DirectSolrSpellCheckerTest, HdfsTlogReplayBufferedWhileIndexingTest, AnalyticsMergeStrategyTest, ConjunctionSolrSpellCheckerTest, BadComponentTest, VersionInfoTest, WrapperMergePolicyFactoryTest, PrimitiveFieldTypeTest, PeerSyncTest, IndexBasedSpellCheckerTest, ClusterStateTest, TestReloadAndDeleteDocs, DistributedFacetPivotSmallAdvancedTest, TestXIncludeConfig, PreAnalyzedFieldTest, TestStressUserVersions, TestRandomRequestDistribution, HdfsSyncSliceTest, TestLFUCache, TestWordDelimiterFilterFactory, CoreMergeIndexesAdminHandlerTest, TestReplicationHandlerBackup, RollingRestartTest, BlockCacheTest, ExitableDirectoryReaderTest, HighlighterTest, SampleTest, DistributedVersionInfoTest, HdfsWriteToMultipleCollectionsTest, MigrateRouteKeyTest, SOLR749Test, TestReplicaProperties, HdfsLockFactoryTest, LeaderElectionTest, TestRTimerTree, SchemaVersionSpecificBehaviorTest, SliceStateTest, TestLRUStatsCache, TestSolrDeletionPolicy1, TestFilteredDocIdSet, StatelessScriptUpdateProcessorFactoryTest, DistributedQueryElevationComponentTest, SecurityConfHandlerTest, TestDefaultStatsCache, TestTolerantSearch, StandardRequestHandlerTest, DirectUpdateHandlerTest, ShardRoutingTest, SharedFSAutoReplicaFailoverTest, DateRangeFieldTest, TestElisionMultitermQuery, SuggesterFSTTest, TestTolerantUpdateProcessorCloud, TestIBSimilarityFactory, BasicDistributedZkTest, ChaosMonkeySafeLeaderTest, CollectionsAPIDistributedZkTest, ClusterStateUpdateTest, ZkCLITest, AutoCommitTest, TestDistributedGrouping, TestFaceting, TestHashPartitioner, HardAutoCommitTest, TestRangeQuery, TestCoreContainer, SimpleFacetsTest, SolrCoreTest, TestGroupingSearch, QueryElevationComponentTest, ConvertedLegacyTest, TestFiltering, SoftAutoCommitTest, CoreAdminHandlerTest, TestCSVLoader, TestPseudoReturnFields, QueryEqualityTest, SortByFunctionTest, TestSurroundQueryParser, TestQueryUtils, TestReversedWildcardFilterFactory, DocumentAnalysisRequestHandlerTest, TestQueryTypes, TermsComponentTest, XmlUpdateRequestHandlerTest, TestValueSourceCache, MoreLikeThisHandlerTest, IndexSchemaRuntimeFieldTest, RegexBoostProcessorTest, IndexSchemaTest, UpdateRequestProcessorFactoryTest, JSONWriterTest, QueryParsingTest, PingRequestHandlerTest, MultiTermTest, TestDocSet, TestSearchPerf, OutputWriterTest, TestSolrCoreProperties, NotRequiredUniqueKeyTest, TestLuceneMatchVersion, SpellPossibilityIteratorTest, TestDFRSimilarityFactory, TestLMDirichletSimilarityFactory, TestFastWriter, TestJmxMonitoredMap, TimeZoneUtilsTest, ResourceLoaderTest, ScriptEngineTest, TestFastLRUCache, ChaosMonkeyNothingIsSafeTest, TestHighlightDedupGrouping, ConnectionReuseTest, AssignTest, BaseCdcrDistributedZkTest, CdcrRequestHandlerTest, CleanupOldIndexTest, CollectionStateFormat2Test, CollectionTooManyReplicasTest, ConnectionManagerTest, DeleteInactiveReplicaTest, DistribCursorPagingTest, LeaderInitiatedRecoveryOnShardRestartTest, MultiThreadedOCPTest, OverseerCollectionConfigSetProcessorTest, OverseerStatusTest, ReplicationFactorTest, RestartWhileUpdatingTest, SaslZkACLProviderTest, ShardSplitTest, TestSolrCloudWithKerberosAlt, TestTolerantUpdateProcessorRandomCloud, TlogReplayBufferedWhileIndexingTest, TriLevelCompositeIdRoutingTest, HdfsBasicDistributedZk2Test, HdfsBasicDistributedZkTest, HdfsChaosMonkeySafeLeaderTest, HdfsCollectionsAPIDistributedZkTest, HdfsNNFailoverTest, HdfsRecoverLeaseTest, HdfsRecoveryZkTest, HdfsRestartWhileUpdatingTest, HdfsThreadLeakTest, TestClusterStateMutator, BlobRepositoryCloudTest, TestInitParams, TestNRTOpen, TestShardHandlerFactory, TestSolrConfigHandler, TestSolrXml, RequestLoggingTest, TestBlobHandler, TestReqParamsAPI]
   [junit4] Completed [496/592 (1!)] on J0 in 36.72s, 1 test, 1 failure <<< FAILURES!

[...truncated 309 lines...]
BUILD FAILED
/Users/jenkins/workspace/Lucene-Solr-master-MacOSX/build.xml:740: The following error occurred while executing this line:
/Users/jenkins/workspace/Lucene-Solr-master-MacOSX/build.xml:684: The following error occurred while executing this line:
/Users/jenkins/workspace/Lucene-Solr-master-MacOSX/build.xml:59: The following error occurred while executing this line:
/Users/jenkins/workspace/Lucene-Solr-master-MacOSX/solr/build.xml:233: The following error occurred while executing this line:
/Users/jenkins/workspace/Lucene-Solr-master-MacOSX/solr/common-build.xml:529: The following error occurred while executing this line:
/Users/jenkins/workspace/Lucene-Solr-master-MacOSX/lucene/common-build.xml:1457: The following error occurred while executing this line:
/Users/jenkins/workspace/Lucene-Solr-master-MacOSX/lucene/common-build.xml:1014: There were test failures: 592 suites (10 ignored), 2394 tests, 1 failure, 120 ignored (70 assumptions) [seed: 2AF64E9075DE3853]

Total time: 81 minutes 46 seconds
Build step 'Invoke Ant' marked build as failure
Archiving artifacts
[WARNINGS] Skipping publisher since build result is FAILURE
Recording test results
Email was triggered for: Failure - Any
Sending email for trigger: Failure - Any



Mime
View raw message