lucene-dev mailing list archives

Site index · List index
Message view « Date » · « Thread »
Top « Date » · « Thread »
From Apache Jenkins Server <jenk...@builds.apache.org>
Subject [JENKINS] Lucene-Solr-Tests-6.x - Build # 161 - Still Failing
Date Sat, 23 Apr 2016 01:50:20 GMT
Build: https://builds.apache.org/job/Lucene-Solr-Tests-6.x/161/

4 tests failed.
FAILED:  junit.framework.TestSuite.org.apache.solr.core.TestCoreDiscovery

Error Message:
ObjectTracker found 4 object(s) that were not released!!! [MockDirectoryWrapper, SolrCore, MockDirectoryWrapper, MDCAwareThreadPoolExecutor]

Stack Trace:
java.lang.AssertionError: ObjectTracker found 4 object(s) that were not released!!! [MockDirectoryWrapper, SolrCore, MockDirectoryWrapper, MDCAwareThreadPoolExecutor]
	at __randomizedtesting.SeedInfo.seed([BD62CC45597DEBC2]:0)
	at org.junit.Assert.fail(Assert.java:93)
	at org.junit.Assert.assertTrue(Assert.java:43)
	at org.junit.Assert.assertNull(Assert.java:551)
	at org.apache.solr.SolrTestCaseJ4.afterClass(SolrTestCaseJ4.java:256)
	at sun.reflect.GeneratedMethodAccessor22.invoke(Unknown Source)
	at sun.reflect.DelegatingMethodAccessorImpl.invoke(DelegatingMethodAccessorImpl.java:43)
	at java.lang.reflect.Method.invoke(Method.java:498)
	at com.carrotsearch.randomizedtesting.RandomizedRunner.invoke(RandomizedRunner.java:1764)
	at com.carrotsearch.randomizedtesting.RandomizedRunner$7.evaluate(RandomizedRunner.java:834)
	at com.carrotsearch.randomizedtesting.rules.StatementAdapter.evaluate(StatementAdapter.java:36)
	at com.carrotsearch.randomizedtesting.rules.SystemPropertiesRestoreRule$1.evaluate(SystemPropertiesRestoreRule.java:57)
	at org.apache.lucene.util.AbstractBeforeAfterRule$1.evaluate(AbstractBeforeAfterRule.java:45)
	at com.carrotsearch.randomizedtesting.rules.StatementAdapter.evaluate(StatementAdapter.java:36)
	at org.apache.lucene.util.TestRuleStoreClassName$1.evaluate(TestRuleStoreClassName.java:41)
	at com.carrotsearch.randomizedtesting.rules.NoShadowingOrOverridesOnMethodsRule$1.evaluate(NoShadowingOrOverridesOnMethodsRule.java:40)
	at com.carrotsearch.randomizedtesting.rules.NoShadowingOrOverridesOnMethodsRule$1.evaluate(NoShadowingOrOverridesOnMethodsRule.java:40)
	at com.carrotsearch.randomizedtesting.rules.StatementAdapter.evaluate(StatementAdapter.java:36)
	at com.carrotsearch.randomizedtesting.rules.StatementAdapter.evaluate(StatementAdapter.java:36)
	at com.carrotsearch.randomizedtesting.rules.StatementAdapter.evaluate(StatementAdapter.java:36)
	at org.apache.lucene.util.TestRuleAssertionsRequired$1.evaluate(TestRuleAssertionsRequired.java:53)
	at org.apache.lucene.util.TestRuleMarkFailure$1.evaluate(TestRuleMarkFailure.java:47)
	at org.apache.lucene.util.TestRuleIgnoreAfterMaxFailures$1.evaluate(TestRuleIgnoreAfterMaxFailures.java:64)
	at org.apache.lucene.util.TestRuleIgnoreTestSuites$1.evaluate(TestRuleIgnoreTestSuites.java:54)
	at com.carrotsearch.randomizedtesting.rules.StatementAdapter.evaluate(StatementAdapter.java:36)
	at com.carrotsearch.randomizedtesting.ThreadLeakControl$StatementRunner.run(ThreadLeakControl.java:367)
	at java.lang.Thread.run(Thread.java:745)


FAILED:  junit.framework.TestSuite.org.apache.solr.core.TestCoreDiscovery

Error Message:
1 thread leaked from SUITE scope at org.apache.solr.core.TestCoreDiscovery:     1) Thread[id=58658, name=searcherExecutor-5293-thread-1, state=WAITING, group=TGRP-TestCoreDiscovery]         at sun.misc.Unsafe.park(Native Method)         at java.util.concurrent.locks.LockSupport.park(LockSupport.java:175)         at java.util.concurrent.locks.AbstractQueuedSynchronizer$ConditionObject.await(AbstractQueuedSynchronizer.java:2039)         at java.util.concurrent.LinkedBlockingQueue.take(LinkedBlockingQueue.java:442)         at java.util.concurrent.ThreadPoolExecutor.getTask(ThreadPoolExecutor.java:1067)         at java.util.concurrent.ThreadPoolExecutor.runWorker(ThreadPoolExecutor.java:1127)         at java.util.concurrent.ThreadPoolExecutor$Worker.run(ThreadPoolExecutor.java:617)         at java.lang.Thread.run(Thread.java:745)

Stack Trace:
com.carrotsearch.randomizedtesting.ThreadLeakError: 1 thread leaked from SUITE scope at org.apache.solr.core.TestCoreDiscovery: 
   1) Thread[id=58658, name=searcherExecutor-5293-thread-1, state=WAITING, group=TGRP-TestCoreDiscovery]
        at sun.misc.Unsafe.park(Native Method)
        at java.util.concurrent.locks.LockSupport.park(LockSupport.java:175)
        at java.util.concurrent.locks.AbstractQueuedSynchronizer$ConditionObject.await(AbstractQueuedSynchronizer.java:2039)
        at java.util.concurrent.LinkedBlockingQueue.take(LinkedBlockingQueue.java:442)
        at java.util.concurrent.ThreadPoolExecutor.getTask(ThreadPoolExecutor.java:1067)
        at java.util.concurrent.ThreadPoolExecutor.runWorker(ThreadPoolExecutor.java:1127)
        at java.util.concurrent.ThreadPoolExecutor$Worker.run(ThreadPoolExecutor.java:617)
        at java.lang.Thread.run(Thread.java:745)
	at __randomizedtesting.SeedInfo.seed([BD62CC45597DEBC2]:0)


FAILED:  junit.framework.TestSuite.org.apache.solr.core.TestCoreDiscovery

Error Message:
There are still zombie threads that couldn't be terminated:    1) Thread[id=58658, name=searcherExecutor-5293-thread-1, state=WAITING, group=TGRP-TestCoreDiscovery]         at sun.misc.Unsafe.park(Native Method)         at java.util.concurrent.locks.LockSupport.park(LockSupport.java:175)         at java.util.concurrent.locks.AbstractQueuedSynchronizer$ConditionObject.await(AbstractQueuedSynchronizer.java:2039)         at java.util.concurrent.LinkedBlockingQueue.take(LinkedBlockingQueue.java:442)         at java.util.concurrent.ThreadPoolExecutor.getTask(ThreadPoolExecutor.java:1067)         at java.util.concurrent.ThreadPoolExecutor.runWorker(ThreadPoolExecutor.java:1127)         at java.util.concurrent.ThreadPoolExecutor$Worker.run(ThreadPoolExecutor.java:617)         at java.lang.Thread.run(Thread.java:745)

Stack Trace:
com.carrotsearch.randomizedtesting.ThreadLeakError: There are still zombie threads that couldn't be terminated:
   1) Thread[id=58658, name=searcherExecutor-5293-thread-1, state=WAITING, group=TGRP-TestCoreDiscovery]
        at sun.misc.Unsafe.park(Native Method)
        at java.util.concurrent.locks.LockSupport.park(LockSupport.java:175)
        at java.util.concurrent.locks.AbstractQueuedSynchronizer$ConditionObject.await(AbstractQueuedSynchronizer.java:2039)
        at java.util.concurrent.LinkedBlockingQueue.take(LinkedBlockingQueue.java:442)
        at java.util.concurrent.ThreadPoolExecutor.getTask(ThreadPoolExecutor.java:1067)
        at java.util.concurrent.ThreadPoolExecutor.runWorker(ThreadPoolExecutor.java:1127)
        at java.util.concurrent.ThreadPoolExecutor$Worker.run(ThreadPoolExecutor.java:617)
        at java.lang.Thread.run(Thread.java:745)
	at __randomizedtesting.SeedInfo.seed([BD62CC45597DEBC2]:0)


FAILED:  org.apache.solr.handler.TestReqParamsAPI.test

Error Message:
Could not get expected value  'P val' for path 'response/params/y/p' full output: {   "responseHeader":{     "status":0,     "QTime":0},   "response":{     "znodeVersion":2,     "params":{       "x":{         "a":"A val",         "b":"B val",         "":{"v":0}},       "y":{         "c":"CY val modified",         "b":"BY val",         "i":20,         "d":[           "val 1",           "val 2"],         "e":"EY val",         "":{"v":1}}}}},  from server:  http://127.0.0.1:54712/collection1

Stack Trace:
java.lang.AssertionError: Could not get expected value  'P val' for path 'response/params/y/p' full output: {
  "responseHeader":{
    "status":0,
    "QTime":0},
  "response":{
    "znodeVersion":2,
    "params":{
      "x":{
        "a":"A val",
        "b":"B val",
        "":{"v":0}},
      "y":{
        "c":"CY val modified",
        "b":"BY val",
        "i":20,
        "d":[
          "val 1",
          "val 2"],
        "e":"EY val",
        "":{"v":1}}}}},  from server:  http://127.0.0.1:54712/collection1
	at __randomizedtesting.SeedInfo.seed([BD62CC45597DEBC2:3536F39FF781863A]:0)
	at org.junit.Assert.fail(Assert.java:93)
	at org.junit.Assert.assertTrue(Assert.java:43)
	at org.apache.solr.core.TestSolrConfigHandler.testForResponseElement(TestSolrConfigHandler.java:457)
	at org.apache.solr.handler.TestReqParamsAPI.testReqParams(TestReqParamsAPI.java:216)
	at org.apache.solr.handler.TestReqParamsAPI.test(TestReqParamsAPI.java:62)
	at sun.reflect.NativeMethodAccessorImpl.invoke0(Native Method)
	at sun.reflect.NativeMethodAccessorImpl.invoke(NativeMethodAccessorImpl.java:62)
	at sun.reflect.DelegatingMethodAccessorImpl.invoke(DelegatingMethodAccessorImpl.java:43)
	at java.lang.reflect.Method.invoke(Method.java:498)
	at com.carrotsearch.randomizedtesting.RandomizedRunner.invoke(RandomizedRunner.java:1764)
	at com.carrotsearch.randomizedtesting.RandomizedRunner$8.evaluate(RandomizedRunner.java:871)
	at com.carrotsearch.randomizedtesting.RandomizedRunner$9.evaluate(RandomizedRunner.java:907)
	at com.carrotsearch.randomizedtesting.RandomizedRunner$10.evaluate(RandomizedRunner.java:921)
	at org.apache.solr.BaseDistributedSearchTestCase$ShardsRepeatRule$ShardsFixedStatement.callStatement(BaseDistributedSearchTestCase.java:992)
	at org.apache.solr.BaseDistributedSearchTestCase$ShardsRepeatRule$ShardsStatement.evaluate(BaseDistributedSearchTestCase.java:967)
	at com.carrotsearch.randomizedtesting.rules.SystemPropertiesRestoreRule$1.evaluate(SystemPropertiesRestoreRule.java:57)
	at org.apache.lucene.util.TestRuleSetupTeardownChained$1.evaluate(TestRuleSetupTeardownChained.java:49)
	at org.apache.lucene.util.AbstractBeforeAfterRule$1.evaluate(AbstractBeforeAfterRule.java:45)
	at org.apache.lucene.util.TestRuleThreadAndTestName$1.evaluate(TestRuleThreadAndTestName.java:48)
	at org.apache.lucene.util.TestRuleIgnoreAfterMaxFailures$1.evaluate(TestRuleIgnoreAfterMaxFailures.java:64)
	at org.apache.lucene.util.TestRuleMarkFailure$1.evaluate(TestRuleMarkFailure.java:47)
	at com.carrotsearch.randomizedtesting.rules.StatementAdapter.evaluate(StatementAdapter.java:36)
	at com.carrotsearch.randomizedtesting.ThreadLeakControl$StatementRunner.run(ThreadLeakControl.java:367)
	at com.carrotsearch.randomizedtesting.ThreadLeakControl.forkTimeoutingTask(ThreadLeakControl.java:809)
	at com.carrotsearch.randomizedtesting.ThreadLeakControl$3.evaluate(ThreadLeakControl.java:460)
	at com.carrotsearch.randomizedtesting.RandomizedRunner.runSingleTest(RandomizedRunner.java:880)
	at com.carrotsearch.randomizedtesting.RandomizedRunner$5.evaluate(RandomizedRunner.java:781)
	at com.carrotsearch.randomizedtesting.RandomizedRunner$6.evaluate(RandomizedRunner.java:816)
	at com.carrotsearch.randomizedtesting.RandomizedRunner$7.evaluate(RandomizedRunner.java:827)
	at com.carrotsearch.randomizedtesting.rules.StatementAdapter.evaluate(StatementAdapter.java:36)
	at com.carrotsearch.randomizedtesting.rules.SystemPropertiesRestoreRule$1.evaluate(SystemPropertiesRestoreRule.java:57)
	at org.apache.lucene.util.AbstractBeforeAfterRule$1.evaluate(AbstractBeforeAfterRule.java:45)
	at com.carrotsearch.randomizedtesting.rules.StatementAdapter.evaluate(StatementAdapter.java:36)
	at org.apache.lucene.util.TestRuleStoreClassName$1.evaluate(TestRuleStoreClassName.java:41)
	at com.carrotsearch.randomizedtesting.rules.NoShadowingOrOverridesOnMethodsRule$1.evaluate(NoShadowingOrOverridesOnMethodsRule.java:40)
	at com.carrotsearch.randomizedtesting.rules.NoShadowingOrOverridesOnMethodsRule$1.evaluate(NoShadowingOrOverridesOnMethodsRule.java:40)
	at com.carrotsearch.randomizedtesting.rules.StatementAdapter.evaluate(StatementAdapter.java:36)
	at com.carrotsearch.randomizedtesting.rules.StatementAdapter.evaluate(StatementAdapter.java:36)
	at com.carrotsearch.randomizedtesting.rules.StatementAdapter.evaluate(StatementAdapter.java:36)
	at org.apache.lucene.util.TestRuleAssertionsRequired$1.evaluate(TestRuleAssertionsRequired.java:53)
	at org.apache.lucene.util.TestRuleMarkFailure$1.evaluate(TestRuleMarkFailure.java:47)
	at org.apache.lucene.util.TestRuleIgnoreAfterMaxFailures$1.evaluate(TestRuleIgnoreAfterMaxFailures.java:64)
	at org.apache.lucene.util.TestRuleIgnoreTestSuites$1.evaluate(TestRuleIgnoreTestSuites.java:54)
	at com.carrotsearch.randomizedtesting.rules.StatementAdapter.evaluate(StatementAdapter.java:36)
	at com.carrotsearch.randomizedtesting.ThreadLeakControl$StatementRunner.run(ThreadLeakControl.java:367)
	at java.lang.Thread.run(Thread.java:745)




Build Log:
[...truncated 10553 lines...]
   [junit4] Suite: org.apache.solr.handler.TestReqParamsAPI
   [junit4]   2> Creating dataDir: /x1/jenkins/jenkins-slave/workspace/Lucene-Solr-Tests-6.x/solr/build/solr-core/test/J0/temp/solr.handler.TestReqParamsAPI_BD62CC45597DEBC2-001/init-core-data-001
   [junit4]   2> 34352 INFO  (SUITE-TestReqParamsAPI-seed#[BD62CC45597DEBC2]-worker) [    ] o.a.s.SolrTestCaseJ4 Randomized ssl (false) and clientAuth (false)
   [junit4]   2> 34352 INFO  (SUITE-TestReqParamsAPI-seed#[BD62CC45597DEBC2]-worker) [    ] o.a.s.BaseDistributedSearchTestCase Setting hostContext system property: /
   [junit4]   2> 34361 INFO  (TEST-TestReqParamsAPI.test-seed#[BD62CC45597DEBC2]) [    ] o.a.s.c.ZkTestServer STARTING ZK TEST SERVER
   [junit4]   2> 34366 INFO  (Thread-143) [    ] o.a.s.c.ZkTestServer client port:0.0.0.0/0.0.0.0:0
   [junit4]   2> 34367 INFO  (Thread-143) [    ] o.a.s.c.ZkTestServer Starting server
   [junit4]   2> 34689 INFO  (TEST-TestReqParamsAPI.test-seed#[BD62CC45597DEBC2]) [    ] o.a.s.c.ZkTestServer start zk server on port:58561
   [junit4]   2> 34728 INFO  (TEST-TestReqParamsAPI.test-seed#[BD62CC45597DEBC2]) [    ] o.a.s.c.c.SolrZkClient Using default ZkCredentialsProvider
   [junit4]   2> 34758 INFO  (TEST-TestReqParamsAPI.test-seed#[BD62CC45597DEBC2]) [    ] o.a.s.c.c.ConnectionManager Waiting for client to connect to ZooKeeper
   [junit4]   2> 34802 WARN  (NIOServerCxn.Factory:0.0.0.0/0.0.0.0:0) [    ] o.a.z.s.NIOServerCnxn Exception causing close of session 0x0 due to java.io.IOException: ZooKeeperServer not running
   [junit4]   2> 36652 INFO  (zkCallback-95-thread-1) [    ] o.a.s.c.c.ConnectionManager Watcher org.apache.solr.common.cloud.ConnectionManager@57e90575 name:ZooKeeperConnection Watcher:127.0.0.1:58561 got event WatchedEvent state:SyncConnected type:None path:null path:null type:None
   [junit4]   2> 36653 INFO  (TEST-TestReqParamsAPI.test-seed#[BD62CC45597DEBC2]) [    ] o.a.s.c.c.ConnectionManager Client is connected to ZooKeeper
   [junit4]   2> 36653 INFO  (TEST-TestReqParamsAPI.test-seed#[BD62CC45597DEBC2]) [    ] o.a.s.c.c.SolrZkClient Using default ZkACLProvider
   [junit4]   2> 36655 INFO  (TEST-TestReqParamsAPI.test-seed#[BD62CC45597DEBC2]) [    ] o.a.s.c.c.SolrZkClient makePath: /solr
   [junit4]   2> 36700 INFO  (TEST-TestReqParamsAPI.test-seed#[BD62CC45597DEBC2]) [    ] o.a.s.c.c.SolrZkClient Using default ZkCredentialsProvider
   [junit4]   2> 36701 INFO  (TEST-TestReqParamsAPI.test-seed#[BD62CC45597DEBC2]) [    ] o.a.s.c.c.ConnectionManager Waiting for client to connect to ZooKeeper
   [junit4]   2> 36717 INFO  (zkCallback-96-thread-1) [    ] o.a.s.c.c.ConnectionManager Watcher org.apache.solr.common.cloud.ConnectionManager@2fc6d2ea name:ZooKeeperConnection Watcher:127.0.0.1:58561/solr got event WatchedEvent state:SyncConnected type:None path:null path:null type:None
   [junit4]   2> 36718 INFO  (TEST-TestReqParamsAPI.test-seed#[BD62CC45597DEBC2]) [    ] o.a.s.c.c.ConnectionManager Client is connected to ZooKeeper
   [junit4]   2> 36718 INFO  (TEST-TestReqParamsAPI.test-seed#[BD62CC45597DEBC2]) [    ] o.a.s.c.c.SolrZkClient Using default ZkACLProvider
   [junit4]   2> 36718 INFO  (TEST-TestReqParamsAPI.test-seed#[BD62CC45597DEBC2]) [    ] o.a.s.c.c.SolrZkClient makePath: /collections/collection1
   [junit4]   2> 36725 INFO  (TEST-TestReqParamsAPI.test-seed#[BD62CC45597DEBC2]) [    ] o.a.s.c.c.SolrZkClient makePath: /collections/collection1/shards
   [junit4]   2> 36731 INFO  (TEST-TestReqParamsAPI.test-seed#[BD62CC45597DEBC2]) [    ] o.a.s.c.c.SolrZkClient makePath: /collections/control_collection
   [junit4]   2> 36735 INFO  (TEST-TestReqParamsAPI.test-seed#[BD62CC45597DEBC2]) [    ] o.a.s.c.c.SolrZkClient makePath: /collections/control_collection/shards
   [junit4]   2> 36740 INFO  (TEST-TestReqParamsAPI.test-seed#[BD62CC45597DEBC2]) [    ] o.a.s.c.AbstractZkTestCase put /x1/jenkins/jenkins-slave/workspace/Lucene-Solr-Tests-6.x/solr/core/src/test-files/solr/collection1/conf/solrconfig-tlog.xml to /configs/conf1/solrconfig.xml
   [junit4]   2> 36741 INFO  (TEST-TestReqParamsAPI.test-seed#[BD62CC45597DEBC2]) [    ] o.a.s.c.c.SolrZkClient makePath: /configs/conf1/solrconfig.xml
   [junit4]   2> 36748 INFO  (TEST-TestReqParamsAPI.test-seed#[BD62CC45597DEBC2]) [    ] o.a.s.c.AbstractZkTestCase put /x1/jenkins/jenkins-slave/workspace/Lucene-Solr-Tests-6.x/solr/core/src/test-files/solr/collection1/conf/schema.xml to /configs/conf1/schema.xml
   [junit4]   2> 36749 INFO  (TEST-TestReqParamsAPI.test-seed#[BD62CC45597DEBC2]) [    ] o.a.s.c.c.SolrZkClient makePath: /configs/conf1/schema.xml
   [junit4]   2> 36754 INFO  (TEST-TestReqParamsAPI.test-seed#[BD62CC45597DEBC2]) [    ] o.a.s.c.AbstractZkTestCase put /x1/jenkins/jenkins-slave/workspace/Lucene-Solr-Tests-6.x/solr/core/src/test-files/solr/collection1/conf/solrconfig.snippet.randomindexconfig.xml to /configs/conf1/solrconfig.snippet.randomindexconfig.xml
   [junit4]   2> 36754 INFO  (TEST-TestReqParamsAPI.test-seed#[BD62CC45597DEBC2]) [    ] o.a.s.c.c.SolrZkClient makePath: /configs/conf1/solrconfig.snippet.randomindexconfig.xml
   [junit4]   2> 36758 INFO  (TEST-TestReqParamsAPI.test-seed#[BD62CC45597DEBC2]) [    ] o.a.s.c.AbstractZkTestCase put /x1/jenkins/jenkins-slave/workspace/Lucene-Solr-Tests-6.x/solr/core/src/test-files/solr/collection1/conf/stopwords.txt to /configs/conf1/stopwords.txt
   [junit4]   2> 36759 INFO  (TEST-TestReqParamsAPI.test-seed#[BD62CC45597DEBC2]) [    ] o.a.s.c.c.SolrZkClient makePath: /configs/conf1/stopwords.txt
   [junit4]   2> 36798 INFO  (TEST-TestReqParamsAPI.test-seed#[BD62CC45597DEBC2]) [    ] o.a.s.c.AbstractZkTestCase put /x1/jenkins/jenkins-slave/workspace/Lucene-Solr-Tests-6.x/solr/core/src/test-files/solr/collection1/conf/protwords.txt to /configs/conf1/protwords.txt
   [junit4]   2> 36798 INFO  (TEST-TestReqParamsAPI.test-seed#[BD62CC45597DEBC2]) [    ] o.a.s.c.c.SolrZkClient makePath: /configs/conf1/protwords.txt
   [junit4]   2> 36801 INFO  (TEST-TestReqParamsAPI.test-seed#[BD62CC45597DEBC2]) [    ] o.a.s.c.AbstractZkTestCase put /x1/jenkins/jenkins-slave/workspace/Lucene-Solr-Tests-6.x/solr/core/src/test-files/solr/collection1/conf/currency.xml to /configs/conf1/currency.xml
   [junit4]   2> 36801 INFO  (TEST-TestReqParamsAPI.test-seed#[BD62CC45597DEBC2]) [    ] o.a.s.c.c.SolrZkClient makePath: /configs/conf1/currency.xml
   [junit4]   2> 36813 INFO  (TEST-TestReqParamsAPI.test-seed#[BD62CC45597DEBC2]) [    ] o.a.s.c.AbstractZkTestCase put /x1/jenkins/jenkins-slave/workspace/Lucene-Solr-Tests-6.x/solr/core/src/test-files/solr/collection1/conf/enumsConfig.xml to /configs/conf1/enumsConfig.xml
   [junit4]   2> 36813 INFO  (TEST-TestReqParamsAPI.test-seed#[BD62CC45597DEBC2]) [    ] o.a.s.c.c.SolrZkClient makePath: /configs/conf1/enumsConfig.xml
   [junit4]   2> 36827 INFO  (TEST-TestReqParamsAPI.test-seed#[BD62CC45597DEBC2]) [    ] o.a.s.c.AbstractZkTestCase put /x1/jenkins/jenkins-slave/workspace/Lucene-Solr-Tests-6.x/solr/core/src/test-files/solr/collection1/conf/open-exchange-rates.json to /configs/conf1/open-exchange-rates.json
   [junit4]   2> 36827 INFO  (TEST-TestReqParamsAPI.test-seed#[BD62CC45597DEBC2]) [    ] o.a.s.c.c.SolrZkClient makePath: /configs/conf1/open-exchange-rates.json
   [junit4]   2> 36837 INFO  (TEST-TestReqParamsAPI.test-seed#[BD62CC45597DEBC2]) [    ] o.a.s.c.AbstractZkTestCase put /x1/jenkins/jenkins-slave/workspace/Lucene-Solr-Tests-6.x/solr/core/src/test-files/solr/collection1/conf/mapping-ISOLatin1Accent.txt to /configs/conf1/mapping-ISOLatin1Accent.txt
   [junit4]   2> 36837 INFO  (TEST-TestReqParamsAPI.test-seed#[BD62CC45597DEBC2]) [    ] o.a.s.c.c.SolrZkClient makePath: /configs/conf1/mapping-ISOLatin1Accent.txt
   [junit4]   2> 36839 INFO  (TEST-TestReqParamsAPI.test-seed#[BD62CC45597DEBC2]) [    ] o.a.s.c.AbstractZkTestCase put /x1/jenkins/jenkins-slave/workspace/Lucene-Solr-Tests-6.x/solr/core/src/test-files/solr/collection1/conf/old_synonyms.txt to /configs/conf1/old_synonyms.txt
   [junit4]   2> 36840 INFO  (TEST-TestReqParamsAPI.test-seed#[BD62CC45597DEBC2]) [    ] o.a.s.c.c.SolrZkClient makePath: /configs/conf1/old_synonyms.txt
   [junit4]   2> 37110 INFO  (TEST-TestReqParamsAPI.test-seed#[BD62CC45597DEBC2]) [    ] o.a.s.c.AbstractZkTestCase put /x1/jenkins/jenkins-slave/workspace/Lucene-Solr-Tests-6.x/solr/core/src/test-files/solr/collection1/conf/synonyms.txt to /configs/conf1/synonyms.txt
   [junit4]   2> 37110 INFO  (TEST-TestReqParamsAPI.test-seed#[BD62CC45597DEBC2]) [    ] o.a.s.c.c.SolrZkClient makePath: /configs/conf1/synonyms.txt
   [junit4]   2> 37424 INFO  (TEST-TestReqParamsAPI.test-seed#[BD62CC45597DEBC2]) [    ] o.a.s.SolrTestCaseJ4 Writing core.properties file to /x1/jenkins/jenkins-slave/workspace/Lucene-Solr-Tests-6.x/solr/build/solr-core/test/J0/temp/solr.handler.TestReqParamsAPI_BD62CC45597DEBC2-001/control-001/cores/collection1
   [junit4]   2> 38250 INFO  (TEST-TestReqParamsAPI.test-seed#[BD62CC45597DEBC2]) [    ] o.e.j.s.Server jetty-9.3.8.v20160314
   [junit4]   2> 38386 INFO  (TEST-TestReqParamsAPI.test-seed#[BD62CC45597DEBC2]) [    ] o.e.j.s.h.ContextHandler Started o.e.j.s.ServletContextHandler@708b8655{/,null,AVAILABLE}
   [junit4]   2> 38402 INFO  (TEST-TestReqParamsAPI.test-seed#[BD62CC45597DEBC2]) [    ] o.e.j.s.ServerConnector Started ServerConnector@5f6f1edf{HTTP/1.1,[http/1.1]}{127.0.0.1:34468}
   [junit4]   2> 38402 INFO  (TEST-TestReqParamsAPI.test-seed#[BD62CC45597DEBC2]) [    ] o.e.j.s.Server Started @44343ms
   [junit4]   2> 38402 INFO  (TEST-TestReqParamsAPI.test-seed#[BD62CC45597DEBC2]) [    ] o.a.s.c.s.e.JettySolrRunner Jetty properties: {solr.data.dir=/x1/jenkins/jenkins-slave/workspace/Lucene-Solr-Tests-6.x/solr/build/solr-core/test/J0/temp/solr.handler.TestReqParamsAPI_BD62CC45597DEBC2-001/tempDir-001/control/data, hostContext=/, hostPort=34468, coreRootDirectory=/x1/jenkins/jenkins-slave/workspace/Lucene-Solr-Tests-6.x/solr/build/solr-core/test/J0/../../../../../../../../../../x1/jenkins/jenkins-slave/workspace/Lucene-Solr-Tests-6.x/solr/build/solr-core/test/J0/temp/solr.handler.TestReqParamsAPI_BD62CC45597DEBC2-001/control-001/cores}
   [junit4]   2> 38419 INFO  (TEST-TestReqParamsAPI.test-seed#[BD62CC45597DEBC2]) [    ] o.a.s.s.SolrDispatchFilter SolrDispatchFilter.init(): sun.misc.Launcher$AppClassLoader@73d16e93
   [junit4]   2> 38420 INFO  (TEST-TestReqParamsAPI.test-seed#[BD62CC45597DEBC2]) [    ] o.a.s.c.SolrResourceLoader new SolrResourceLoader for directory: '/x1/jenkins/jenkins-slave/workspace/Lucene-Solr-Tests-6.x/solr/build/solr-core/test/J0/temp/solr.handler.TestReqParamsAPI_BD62CC45597DEBC2-001/control-001'
   [junit4]   2> 38420 INFO  (TEST-TestReqParamsAPI.test-seed#[BD62CC45597DEBC2]) [    ] o.a.s.c.SolrResourceLoader JNDI not configured for solr (NoInitialContextEx)
   [junit4]   2> 38420 INFO  (TEST-TestReqParamsAPI.test-seed#[BD62CC45597DEBC2]) [    ] o.a.s.c.SolrResourceLoader solr home defaulted to 'solr/' (could not find system property or JNDI)
   [junit4]   2> 38423 INFO  (TEST-TestReqParamsAPI.test-seed#[BD62CC45597DEBC2]) [    ] o.a.s.c.c.SolrZkClient Using default ZkCredentialsProvider
   [junit4]   2> 38424 INFO  (TEST-TestReqParamsAPI.test-seed#[BD62CC45597DEBC2]) [    ] o.a.s.c.c.ConnectionManager Waiting for client to connect to ZooKeeper
   [junit4]   2> 38480 INFO  (zkCallback-97-thread-1) [    ] o.a.s.c.c.ConnectionManager Watcher org.apache.solr.common.cloud.ConnectionManager@3cdf8466 name:ZooKeeperConnection Watcher:127.0.0.1:58561/solr got event WatchedEvent state:SyncConnected type:None path:null path:null type:None
   [junit4]   2> 38480 INFO  (TEST-TestReqParamsAPI.test-seed#[BD62CC45597DEBC2]) [    ] o.a.s.c.c.ConnectionManager Client is connected to ZooKeeper
   [junit4]   2> 38480 INFO  (TEST-TestReqParamsAPI.test-seed#[BD62CC45597DEBC2]) [    ] o.a.s.c.c.SolrZkClient Using default ZkACLProvider
   [junit4]   2> 38496 INFO  (TEST-TestReqParamsAPI.test-seed#[BD62CC45597DEBC2]) [    ] o.a.s.s.SolrDispatchFilter Loading solr.xml from SolrHome (not found in ZooKeeper)
   [junit4]   2> 38498 INFO  (TEST-TestReqParamsAPI.test-seed#[BD62CC45597DEBC2]) [    ] o.a.s.c.SolrXmlConfig Loading container configuration from /x1/jenkins/jenkins-slave/workspace/Lucene-Solr-Tests-6.x/solr/build/solr-core/test/J0/temp/solr.handler.TestReqParamsAPI_BD62CC45597DEBC2-001/control-001/solr.xml
   [junit4]   2> 38537 INFO  (TEST-TestReqParamsAPI.test-seed#[BD62CC45597DEBC2]) [    ] o.a.s.c.CorePropertiesLocator Config-defined core root directory: /x1/jenkins/jenkins-slave/workspace/Lucene-Solr-Tests-6.x/solr/build/solr-core/test/J0/../../../../../../../../../../x1/jenkins/jenkins-slave/workspace/Lucene-Solr-Tests-6.x/solr/build/solr-core/test/J0/temp/solr.handler.TestReqParamsAPI_BD62CC45597DEBC2-001/control-001/cores
   [junit4]   2> 38538 INFO  (TEST-TestReqParamsAPI.test-seed#[BD62CC45597DEBC2]) [    ] o.a.s.c.CoreContainer New CoreContainer 955389814
   [junit4]   2> 38538 INFO  (TEST-TestReqParamsAPI.test-seed#[BD62CC45597DEBC2]) [    ] o.a.s.c.CoreContainer Loading cores into CoreContainer [instanceDir=/x1/jenkins/jenkins-slave/workspace/Lucene-Solr-Tests-6.x/solr/build/solr-core/test/J0/temp/solr.handler.TestReqParamsAPI_BD62CC45597DEBC2-001/control-001]
   [junit4]   2> 38538 WARN  (TEST-TestReqParamsAPI.test-seed#[BD62CC45597DEBC2]) [    ] o.a.s.c.CoreContainer Couldn't add files from /x1/jenkins/jenkins-slave/workspace/Lucene-Solr-Tests-6.x/solr/build/solr-core/test/J0/temp/solr.handler.TestReqParamsAPI_BD62CC45597DEBC2-001/control-001/lib to classpath: /x1/jenkins/jenkins-slave/workspace/Lucene-Solr-Tests-6.x/solr/build/solr-core/test/J0/temp/solr.handler.TestReqParamsAPI_BD62CC45597DEBC2-001/control-001/lib
   [junit4]   2> 38568 INFO  (TEST-TestReqParamsAPI.test-seed#[BD62CC45597DEBC2]) [    ] o.a.s.h.c.HttpShardHandlerFactory created with socketTimeout : 90000,urlScheme : ,connTimeout : 15000,maxConnectionsPerHost : 20,maxConnections : 10000,corePoolSize : 0,maximumPoolSize : 2147483647,maxThreadIdleTime : 5,sizeOfQueue : -1,fairnessPolicy : false,useRetries : false,
   [junit4]   2> 38569 INFO  (TEST-TestReqParamsAPI.test-seed#[BD62CC45597DEBC2]) [    ] o.a.s.u.UpdateShardHandler Creating UpdateShardHandler HTTP client with params: socketTimeout=340000&connTimeout=45000&retry=true
   [junit4]   2> 38570 INFO  (TEST-TestReqParamsAPI.test-seed#[BD62CC45597DEBC2]) [    ] o.a.s.l.LogWatcher SLF4J impl is org.slf4j.impl.Log4jLoggerFactory
   [junit4]   2> 38570 INFO  (TEST-TestReqParamsAPI.test-seed#[BD62CC45597DEBC2]) [    ] o.a.s.l.LogWatcher Registering Log Listener [Log4j (org.slf4j.impl.Log4jLoggerFactory)]
   [junit4]   2> 38570 INFO  (TEST-TestReqParamsAPI.test-seed#[BD62CC45597DEBC2]) [    ] o.a.s.c.ZkContainer Zookeeper client=127.0.0.1:58561/solr
   [junit4]   2> 38604 INFO  (TEST-TestReqParamsAPI.test-seed#[BD62CC45597DEBC2]) [    ] o.a.s.c.ZkController zkHost includes chroot
   [junit4]   2> 38604 INFO  (TEST-TestReqParamsAPI.test-seed#[BD62CC45597DEBC2]) [    ] o.a.s.c.c.SolrZkClient Using default ZkCredentialsProvider
   [junit4]   2> 38613 INFO  (TEST-TestReqParamsAPI.test-seed#[BD62CC45597DEBC2]) [    ] o.a.s.c.c.ConnectionManager Waiting for client to connect to ZooKeeper
   [junit4]   2> 38628 INFO  (zkCallback-100-thread-1) [    ] o.a.s.c.c.ConnectionManager Watcher org.apache.solr.common.cloud.ConnectionManager@18afa0e4 name:ZooKeeperConnection Watcher:127.0.0.1:58561 got event WatchedEvent state:SyncConnected type:None path:null path:null type:None
   [junit4]   2> 38629 INFO  (TEST-TestReqParamsAPI.test-seed#[BD62CC45597DEBC2]) [    ] o.a.s.c.c.ConnectionManager Client is connected to ZooKeeper
   [junit4]   2> 38630 INFO  (TEST-TestReqParamsAPI.test-seed#[BD62CC45597DEBC2]) [    ] o.a.s.c.c.SolrZkClient Using default ZkACLProvider
   [junit4]   2> 38644 INFO  (TEST-TestReqParamsAPI.test-seed#[BD62CC45597DEBC2]) [n:127.0.0.1:34468_    ] o.a.s.c.ZkController Added new OnReconnect listener org.apache.solr.cloud.ZkController$$Lambda$23/1701008330@6055988a
   [junit4]   2> 38666 INFO  (TEST-TestReqParamsAPI.test-seed#[BD62CC45597DEBC2]) [n:127.0.0.1:34468_    ] o.a.s.c.c.ConnectionManager Waiting for client to connect to ZooKeeper
   [junit4]   2> 38672 INFO  (zkCallback-101-thread-1-processing-n:127.0.0.1:34468_) [n:127.0.0.1:34468_    ] o.a.s.c.c.ConnectionManager Watcher org.apache.solr.common.cloud.ConnectionManager@4078bcdb name:ZooKeeperConnection Watcher:127.0.0.1:58561/solr got event WatchedEvent state:SyncConnected type:None path:null path:null type:None
   [junit4]   2> 38672 INFO  (TEST-TestReqParamsAPI.test-seed#[BD62CC45597DEBC2]) [n:127.0.0.1:34468_    ] o.a.s.c.c.ConnectionManager Client is connected to ZooKeeper
   [junit4]   2> 38681 INFO  (TEST-TestReqParamsAPI.test-seed#[BD62CC45597DEBC2]) [n:127.0.0.1:34468_    ] o.a.s.c.c.SolrZkClient makePath: /overseer/queue
   [junit4]   2> 38689 INFO  (TEST-TestReqParamsAPI.test-seed#[BD62CC45597DEBC2]) [n:127.0.0.1:34468_    ] o.a.s.c.c.SolrZkClient makePath: /overseer/collection-queue-work
   [junit4]   2> 38693 INFO  (TEST-TestReqParamsAPI.test-seed#[BD62CC45597DEBC2]) [n:127.0.0.1:34468_    ] o.a.s.c.c.SolrZkClient makePath: /overseer/collection-map-running
   [junit4]   2> 38695 INFO  (TEST-TestReqParamsAPI.test-seed#[BD62CC45597DEBC2]) [n:127.0.0.1:34468_    ] o.a.s.c.c.SolrZkClient makePath: /overseer/collection-map-completed
   [junit4]   2> 38699 INFO  (TEST-TestReqParamsAPI.test-seed#[BD62CC45597DEBC2]) [n:127.0.0.1:34468_    ] o.a.s.c.c.SolrZkClient makePath: /overseer/collection-map-failure
   [junit4]   2> 38712 INFO  (TEST-TestReqParamsAPI.test-seed#[BD62CC45597DEBC2]) [n:127.0.0.1:34468_    ] o.a.s.c.c.SolrZkClient makePath: /live_nodes
   [junit4]   2> 38714 INFO  (TEST-TestReqParamsAPI.test-seed#[BD62CC45597DEBC2]) [n:127.0.0.1:34468_    ] o.a.s.c.c.SolrZkClient makePath: /aliases.json
   [junit4]   2> 38716 INFO  (TEST-TestReqParamsAPI.test-seed#[BD62CC45597DEBC2]) [n:127.0.0.1:34468_    ] o.a.s.c.c.SolrZkClient makePath: /clusterstate.json
   [junit4]   2> 38720 INFO  (TEST-TestReqParamsAPI.test-seed#[BD62CC45597DEBC2]) [n:127.0.0.1:34468_    ] o.a.s.c.c.SolrZkClient makePath: /security.json
   [junit4]   2> 38722 INFO  (TEST-TestReqParamsAPI.test-seed#[BD62CC45597DEBC2]) [n:127.0.0.1:34468_    ] o.a.s.c.c.ZkStateReader Updating cluster state from ZooKeeper... 
   [junit4]   2> 38740 INFO  (TEST-TestReqParamsAPI.test-seed#[BD62CC45597DEBC2]) [n:127.0.0.1:34468_    ] o.a.s.c.c.ZkStateReader Updated live nodes from ZooKeeper... (0) -> (0)
   [junit4]   2> 38751 INFO  (TEST-TestReqParamsAPI.test-seed#[BD62CC45597DEBC2]) [n:127.0.0.1:34468_    ] o.a.s.c.c.SolrZkClient makePath: /overseer_elect
   [junit4]   2> 38752 INFO  (TEST-TestReqParamsAPI.test-seed#[BD62CC45597DEBC2]) [n:127.0.0.1:34468_    ] o.a.s.c.c.SolrZkClient makePath: /overseer_elect/election
   [junit4]   2> 38754 INFO  (TEST-TestReqParamsAPI.test-seed#[BD62CC45597DEBC2]) [n:127.0.0.1:34468_    ] o.a.s.c.Overseer Overseer (id=null) closing
   [junit4]   2> 38755 INFO  (TEST-TestReqParamsAPI.test-seed#[BD62CC45597DEBC2]) [n:127.0.0.1:34468_    ] o.a.s.c.LeaderElector Joined leadership election with path: /overseer_elect/election/95772595973390340-127.0.0.1:34468_-n_0000000000
   [junit4]   2> 38757 INFO  (TEST-TestReqParamsAPI.test-seed#[BD62CC45597DEBC2]) [n:127.0.0.1:34468_    ] o.a.s.c.OverseerElectionContext I am going to be the leader 127.0.0.1:34468_
   [junit4]   2> 38757 INFO  (TEST-TestReqParamsAPI.test-seed#[BD62CC45597DEBC2]) [n:127.0.0.1:34468_    ] o.a.s.c.c.SolrZkClient makePath: /overseer_elect/leader
   [junit4]   2> 38760 INFO  (TEST-TestReqParamsAPI.test-seed#[BD62CC45597DEBC2]) [n:127.0.0.1:34468_    ] o.a.s.c.Overseer Overseer (id=95772595973390340-127.0.0.1:34468_-n_0000000000) starting
   [junit4]   2> 38770 INFO  (TEST-TestReqParamsAPI.test-seed#[BD62CC45597DEBC2]) [n:127.0.0.1:34468_    ] o.a.s.c.c.SolrZkClient makePath: /overseer/queue-work
   [junit4]   2> 38827 INFO  (TEST-TestReqParamsAPI.test-seed#[BD62CC45597DEBC2]) [n:127.0.0.1:34468_    ] o.a.s.c.OverseerAutoReplicaFailoverThread Starting OverseerAutoReplicaFailoverThread autoReplicaFailoverWorkLoopDelay=10000 autoReplicaFailoverWaitAfterExpiration=30000 autoReplicaFailoverBadNodeExpiration=60000
   [junit4]   2> 38860 INFO  (OverseerCollectionConfigSetProcessor-95772595973390340-127.0.0.1:34468_-n_0000000000) [n:127.0.0.1:34468_    ] o.a.s.c.OverseerTaskProcessor Process current queue of overseer operations
   [junit4]   2> 38859 INFO  (OverseerStateUpdate-95772595973390340-127.0.0.1:34468_-n_0000000000) [n:127.0.0.1:34468_    ] o.a.s.c.Overseer Starting to work on the main queue
   [junit4]   2> 38896 INFO  (TEST-TestReqParamsAPI.test-seed#[BD62CC45597DEBC2]) [n:127.0.0.1:34468_    ] o.a.s.c.ZkController Register node as live in ZooKeeper:/live_nodes/127.0.0.1:34468_
   [junit4]   2> 39239 INFO  (TEST-TestReqParamsAPI.test-seed#[BD62CC45597DEBC2]) [n:127.0.0.1:34468_    ] o.a.s.c.c.SolrZkClient makePath: /live_nodes/127.0.0.1:34468_
   [junit4]   2> 39243 INFO  (OverseerStateUpdate-95772595973390340-127.0.0.1:34468_-n_0000000000) [n:127.0.0.1:34468_    ] o.a.s.c.c.ZkStateReader Updated live nodes from ZooKeeper... (0) -> (0)
   [junit4]   2> 39248 INFO  (zkCallback-101-thread-1-processing-n:127.0.0.1:34468_) [n:127.0.0.1:34468_    ] o.a.s.c.c.ZkStateReader A live node change: [WatchedEvent state:SyncConnected type:NodeChildrenChanged path:/live_nodes], has occurred - updating... (live nodes size: [0])
   [junit4]   2> 39249 INFO  (zkCallback-101-thread-1-processing-n:127.0.0.1:34468_) [n:127.0.0.1:34468_    ] o.a.s.c.c.ZkStateReader Updated live nodes from ZooKeeper... (0) -> (1)
   [junit4]   2> 39303 INFO  (TEST-TestReqParamsAPI.test-seed#[BD62CC45597DEBC2]) [n:127.0.0.1:34468_    ] o.a.s.c.CoreContainer Security conf doesn't exist. Skipping setup for authorization module.
   [junit4]   2> 39303 INFO  (TEST-TestReqParamsAPI.test-seed#[BD62CC45597DEBC2]) [n:127.0.0.1:34468_    ] o.a.s.c.CoreContainer No authentication plugin used.
   [junit4]   2> 39304 INFO  (TEST-TestReqParamsAPI.test-seed#[BD62CC45597DEBC2]) [n:127.0.0.1:34468_    ] o.a.s.c.CorePropertiesLocator Looking for core definitions underneath /x1/jenkins/jenkins-slave/workspace/Lucene-Solr-Tests-6.x/solr/build/solr-core/test/J0/../../../../../../../../../../x1/jenkins/jenkins-slave/workspace/Lucene-Solr-Tests-6.x/solr/build/solr-core/test/J0/temp/solr.handler.TestReqParamsAPI_BD62CC45597DEBC2-001/control-001/cores
   [junit4]   2> 39307 INFO  (TEST-TestReqParamsAPI.test-seed#[BD62CC45597DEBC2]) [n:127.0.0.1:34468_    ] o.a.s.c.CoreDescriptor Created CoreDescriptor: {name=collection1, config=solrconfig.xml, transient=false, schema=schema.xml, loadOnStartup=true, configSetProperties=configsetprops.json, collection=control_collection, coreNodeName=, dataDir=data/, shard=}
   [junit4]   2> 39307 INFO  (TEST-TestReqParamsAPI.test-seed#[BD62CC45597DEBC2]) [n:127.0.0.1:34468_    ] o.a.s.c.CorePropertiesLocator Found core collection1 in /x1/jenkins/jenkins-slave/workspace/Lucene-Solr-Tests-6.x/solr/build/solr-core/test/J0/../../../../../../../../../../x1/jenkins/jenkins-slave/workspace/Lucene-Solr-Tests-6.x/solr/build/solr-core/test/J0/temp/solr.handler.TestReqParamsAPI_BD62CC45597DEBC2-001/control-001/cores/collection1
   [junit4]   2> 39307 INFO  (TEST-TestReqParamsAPI.test-seed#[BD62CC45597DEBC2]) [n:127.0.0.1:34468_    ] o.a.s.c.CorePropertiesLocator Found 1 core definitions
   [junit4]   2> 39309 INFO  (coreLoadExecutor-587-thread-1-processing-n:127.0.0.1:34468_) [n:127.0.0.1:34468_ c:control_collection   x:collection1] o.a.s.c.ZkController publishing state=down
   [junit4]   2> 39316 INFO  (coreLoadExecutor-587-thread-1-processing-n:127.0.0.1:34468_) [n:127.0.0.1:34468_ c:control_collection   x:collection1] o.a.s.c.ZkController numShards not found on descriptor - reading it from system property
   [junit4]   2> 39320 INFO  (TEST-TestReqParamsAPI.test-seed#[BD62CC45597DEBC2]) [n:127.0.0.1:34468_    ] o.a.s.s.SolrDispatchFilter user.dir=/x1/jenkins/jenkins-slave/workspace/Lucene-Solr-Tests-6.x/solr/build/solr-core/test/J0
   [junit4]   2> 39320 INFO  (TEST-TestReqParamsAPI.test-seed#[BD62CC45597DEBC2]) [n:127.0.0.1:34468_    ] o.a.s.s.SolrDispatchFilter SolrDispatchFilter.init() done
   [junit4]   2> 39321 INFO  (OverseerStateUpdate-95772595973390340-127.0.0.1:34468_-n_0000000000) [n:127.0.0.1:34468_    ] o.a.s.c.Overseer processMessage: queueSize: 1, message = {
   [junit4]   2>   "core":"collection1",
   [junit4]   2>   "roles":null,
   [junit4]   2>   "base_url":"http://127.0.0.1:34468",
   [junit4]   2>   "node_name":"127.0.0.1:34468_",
   [junit4]   2>   "numShards":"1",
   [junit4]   2>   "state":"down",
   [junit4]   2>   "shard":null,
   [junit4]   2>   "collection":"control_collection",
   [junit4]   2>   "operation":"state"} current state version: 0
   [junit4]   2> 39328 INFO  (coreLoadExecutor-587-thread-1-processing-n:127.0.0.1:34468_) [n:127.0.0.1:34468_ c:control_collection   x:collection1] o.a.s.c.ZkController Collection control_collection not visible yet, but flagging it so a watch is registered when it becomes visible
   [junit4]   2> 39328 INFO  (coreLoadExecutor-587-thread-1-processing-n:127.0.0.1:34468_) [n:127.0.0.1:34468_ c:control_collection   x:collection1] o.a.s.c.c.ZkStateReader addZkWatch [control_collection]
   [junit4]   2> 39329 INFO  (coreLoadExecutor-587-thread-1-processing-n:127.0.0.1:34468_) [n:127.0.0.1:34468_ c:control_collection   x:collection1] o.a.s.c.c.ZkStateReader Deleting data for [control_collection]
   [junit4]   2> 39330 INFO  (coreLoadExecutor-587-thread-1-processing-n:127.0.0.1:34468_) [n:127.0.0.1:34468_ c:control_collection   x:collection1] o.a.s.c.ZkController look for our core node name
   [junit4]   2> 39332 INFO  (OverseerStateUpdate-95772595973390340-127.0.0.1:34468_-n_0000000000) [n:127.0.0.1:34468_    ] o.a.s.c.o.ReplicaMutator Update state numShards=1 message={
   [junit4]   2>   "core":"collection1",
   [junit4]   2>   "roles":null,
   [junit4]   2>   "base_url":"http://127.0.0.1:34468",
   [junit4]   2>   "node_name":"127.0.0.1:34468_",
   [junit4]   2>   "numShards":"1",
   [junit4]   2>   "state":"down",
   [junit4]   2>   "shard":null,
   [junit4]   2>   "collection":"control_collection",
   [junit4]   2>   "operation":"state"}
   [junit4]   2> 39334 INFO  (OverseerStateUpdate-95772595973390340-127.0.0.1:34468_-n_0000000000) [n:127.0.0.1:34468_    ] o.a.s.c.o.ClusterStateMutator building a new cName: control_collection
   [junit4]   2> 39344 INFO  (OverseerStateUpdate-95772595973390340-127.0.0.1:34468_-n_0000000000) [n:127.0.0.1:34468_    ] o.a.s.c.o.ReplicaMutator Assigning new node to shard shard=shard1
   [junit4]   2> 39352 INFO  (zkCallback-101-thread-1-processing-n:127.0.0.1:34468_) [n:127.0.0.1:34468_    ] o.a.s.c.c.ZkStateReader A cluster state change: [WatchedEvent state:SyncConnected type:NodeDataChanged path:/clusterstate.json], has occurred - updating... (live nodes size: [1])
   [junit4]   2> 40330 INFO  (coreLoadExecutor-587-thread-1-processing-n:127.0.0.1:34468_) [n:127.0.0.1:34468_ c:control_collection   x:collection1] o.a.s.c.ZkController waiting to find shard id in clusterstate for collection1
   [junit4]   2> 40331 INFO  (coreLoadExecutor-587-thread-1-processing-n:127.0.0.1:34468_) [n:127.0.0.1:34468_ c:control_collection   x:collection1] o.a.s.c.ZkController Check for collection zkNode:control_collection
   [junit4]   2> 40331 INFO  (coreLoadExecutor-587-thread-1-processing-n:127.0.0.1:34468_) [n:127.0.0.1:34468_ c:control_collection   x:collection1] o.a.s.c.ZkController Collection zkNode exists
   [junit4]   2> 40331 INFO  (coreLoadExecutor-587-thread-1-processing-n:127.0.0.1:34468_) [n:127.0.0.1:34468_ c:control_collection   x:collection1] o.a.s.c.c.ZkStateReader Load collection config from: [/collections/control_collection]
   [junit4]   2> 40333 INFO  (coreLoadExecutor-587-thread-1-processing-n:127.0.0.1:34468_) [n:127.0.0.1:34468_ c:control_collection   x:collection1] o.a.s.c.c.ZkStateReader path=[/collections/control_collection] [configName]=[conf1] specified config exists in ZooKeeper
   [junit4]   2> 40334 INFO  (coreLoadExecutor-587-thread-1-processing-n:127.0.0.1:34468_) [n:127.0.0.1:34468_ c:control_collection   x:collection1] o.a.s.c.SolrResourceLoader new SolrResourceLoader for directory: '/x1/jenkins/jenkins-slave/workspace/Lucene-Solr-Tests-6.x/solr/build/solr-core/test/J0/temp/solr.handler.TestReqParamsAPI_BD62CC45597DEBC2-001/control-001/cores/collection1'
   [junit4]   2> 40334 INFO  (coreLoadExecutor-587-thread-1-processing-n:127.0.0.1:34468_) [n:127.0.0.1:34468_ c:control_collection   x:collection1] o.a.s.c.SolrResourceLoader JNDI not configured for solr (NoInitialContextEx)
   [junit4]   2> 40334 INFO  (coreLoadExecutor-587-thread-1-processing-n:127.0.0.1:34468_) [n:127.0.0.1:34468_ c:control_collection   x:collection1] o.a.s.c.SolrResourceLoader solr home defaulted to 'solr/' (could not find system property or JNDI)
   [junit4]   2> 40392 INFO  (coreLoadExecutor-587-thread-1-processing-n:127.0.0.1:34468_) [n:127.0.0.1:34468_ c:control_collection   x:collection1] o.a.s.c.Config loaded config solrconfig.xml with version 0 
   [junit4]   2> 40438 INFO  (coreLoadExecutor-587-thread-1-processing-n:127.0.0.1:34468_) [n:127.0.0.1:34468_ c:control_collection   x:collection1] o.a.s.c.SolrConfig current version of requestparams : -1
   [junit4]   2> 40450 INFO  (coreLoadExecutor-587-thread-1-processing-n:127.0.0.1:34468_) [n:127.0.0.1:34468_ c:control_collection   x:collection1] o.a.s.c.SolrConfig Using Lucene MatchVersion: 6.1.0
   [junit4]   2> 40534 INFO  (coreLoadExecutor-587-thread-1-processing-n:127.0.0.1:34468_) [n:127.0.0.1:34468_ c:control_collection   x:collection1] o.a.s.c.SolrConfig Loaded SolrConfig: solrconfig.xml
   [junit4]   2> 40561 INFO  (coreLoadExecutor-587-thread-1-processing-n:127.0.0.1:34468_) [n:127.0.0.1:34468_ c:control_collection   x:collection1] o.a.s.s.IndexSchema [collection1] Schema name=test
   [junit4]   2> 41090 INFO  (coreLoadExecutor-587-thread-1-processing-n:127.0.0.1:34468_) [n:127.0.0.1:34468_ c:control_collection   x:collection1] o.a.s.s.OpenExchangeRatesOrgProvider Initialized with rates=open-exchange-rates.json, refreshInterval=1440.
   [junit4]   2> 41104 INFO  (coreLoadExecutor-587-thread-1-processing-n:127.0.0.1:34468_) [n:127.0.0.1:34468_ c:control_collection   x:collection1] o.a.s.s.IndexSchema default search field in schema is text
   [junit4]   2> 41120 INFO  (coreLoadExecutor-587-thread-1-processing-n:127.0.0.1:34468_) [n:127.0.0.1:34468_ c:control_collection   x:collection1] o.a.s.s.IndexSchema unique key field: id
   [junit4]   2> 41169 INFO  (coreLoadExecutor-587-thread-1-processing-n:127.0.0.1:34468_) [n:127.0.0.1:34468_ c:control_collection   x:collection1] o.a.s.s.FileExchangeRateProvider Reloading exchange rates from file currency.xml
   [junit4]   2> 41171 INFO  (coreLoadExecutor-587-thread-1-processing-n:127.0.0.1:34468_) [n:127.0.0.1:34468_ c:control_collection   x:collection1] o.a.s.s.FileExchangeRateProvider Reloading exchange rates from file currency.xml
   [junit4]   2> 41181 INFO  (coreLoadExecutor-587-thread-1-processing-n:127.0.0.1:34468_) [n:127.0.0.1:34468_ c:control_collection   x:collection1] o.a.s.s.OpenExchangeRatesOrgProvider Reloading exchange rates from open-exchange-rates.json
   [junit4]   2> 41183 INFO  (coreLoadExecutor-587-thread-1-processing-n:127.0.0.1:34468_) [n:127.0.0.1:34468_ c:control_collection   x:collection1] o.a.s.s.OpenExchangeRatesOrgProvider Reloading exchange rates from open-exchange-rates.json
   [junit4]   2> 41201 INFO  (coreLoadExecutor-587-thread-1-processing-n:127.0.0.1:34468_) [n:127.0.0.1:34468_ c:control_collection   x:collection1] o.a.s.c.ConfigSetProperties Did not find ConfigSet properties, assuming default properties: Can't find resource 'configsetprops.json' in classpath or '/configs/conf1', cwd=/x1/jenkins/jenkins-slave/workspace/Lucene-Solr-Tests-6.x/solr/build/solr-core/test/J0
   [junit4]   2> 41201 INFO  (coreLoadExecutor-587-thread-1-processing-n:127.0.0.1:34468_) [n:127.0.0.1:34468_ c:control_collection   x:collection1] o.a.s.c.CoreContainer Creating SolrCore 'collection1' using configuration from collection control_collection
   [junit4]   2> 41201 INFO  (coreLoadExecutor-587-thread-1-processing-n:127.0.0.1:34468_) [n:127.0.0.1:34468_ c:control_collection s:shard1 r:core_node1 x:collection1] o.a.s.c.SolrCore org.apache.solr.core.MockDirectoryFactory
   [junit4]   2> 41201 INFO  (coreLoadExecutor-587-thread-1-processing-n:127.0.0.1:34468_) [n:127.0.0.1:34468_ c:control_collection s:shard1 r:core_node1 x:collection1] o.a.s.c.SolrCore [[collection1] ] Opening new SolrCore at [/x1/jenkins/jenkins-slave/workspace/Lucene-Solr-Tests-6.x/solr/build/solr-core/test/J0/temp/solr.handler.TestReqParamsAPI_BD62CC45597DEBC2-001/control-001/cores/collection1], dataDir=[/x1/jenkins/jenkins-slave/workspace/Lucene-Solr-Tests-6.x/solr/build/solr-core/test/J0/../../../../../../../../../../x1/jenkins/jenkins-slave/workspace/Lucene-Solr-Tests-6.x/solr/build/solr-core/test/J0/temp/solr.handler.TestReqParamsAPI_BD62CC45597DEBC2-001/control-001/cores/collection1/data/]
   [junit4]   2> 41213 INFO  (coreLoadExecutor-587-thread-1-processing-n:127.0.0.1:34468_) [n:127.0.0.1:34468_ c:control_collection s:shard1 r:core_node1 x:collection1] o.a.s.c.JmxMonitoredMap JMX monitoring is enabled. Adding Solr mbeans to JMX Server: com.sun.jmx.mbeanserver.JmxMBeanServer@14882076
   [junit4]   2> 41257 INFO  (coreLoadExecutor-587-thread-1-processing-n:127.0.0.1:34468_) [n:127.0.0.1:34468_ c:control_collection s:shard1 r:core_node1 x:collection1] o.a.s.c.CachingDirectoryFactory return new directory for /x1/jenkins/jenkins-slave/workspace/Lucene-Solr-Tests-6.x/solr/build/solr-core/test/J0/../../../../../../../../../../x1/jenkins/jenkins-slave/workspace/Lucene-Solr-Tests-6.x/solr/build/solr-core/test/J0/temp/solr.handler.TestReqParamsAPI_BD62CC45597DEBC2-001/control-001/cores/collection1/data
   [junit4]   2> 41258 INFO  (coreLoadExecutor-587-thread-1-processing-n:127.0.0.1:34468_) [n:127.0.0.1:34468_ c:control_collection s:shard1 r:core_node1 x:collection1] o.a.s.c.SolrCore New index directory detected: old=null new=/x1/jenkins/jenkins-slave/workspace/Lucene-Solr-Tests-6.x/solr/build/solr-core/test/J0/../../../../../../../../../../x1/jenkins/jenkins-slave/workspace/Lucene-Solr-Tests-6.x/solr/build/solr-core/test/J0/temp/solr.handler.TestReqParamsAPI_BD62CC45597DEBC2-001/control-001/cores/collection1/data/index/
   [junit4]   2> 41258 WARN  (coreLoadExecutor-587-thread-1-processing-n:127.0.0.1:34468_) [n:127.0.0.1:34468_ c:control_collection s:shard1 r:core_node1 x:collection1] o.a.s.c.SolrCore [collection1] Solr index directory '/x1/jenkins/jenkins-slave/workspace/Lucene-Solr-Tests-6.x/solr/build/solr-core/test/J0/../../../../../../../../../../x1/jenkins/jenkins-slave/workspace/Lucene-Solr-Tests-6.x/solr/build/solr-core/test/J0/temp/solr.handler.TestReqParamsAPI_BD62CC45597DEBC2-001/control-001/cores/collection1/data/index' doesn't exist. Creating new index...
   [junit4]   2> 41258 INFO  (coreLoadExecutor-587-thread-1-processing-n:127.0.0.1:34468_) [n:127.0.0.1:34468_ c:control_collection s:shard1 r:core_node1 x:collection1] o.a.s.c.CachingDirectoryFactory return new directory for /x1/jenkins/jenkins-slave/workspace/Lucene-Solr-Tests-6.x/solr/build/solr-core/test/J0/../../../../../../../../../../x1/jenkins/jenkins-slave/workspace/Lucene-Solr-Tests-6.x/solr/build/solr-core/test/J0/temp/solr.handler.TestReqParamsAPI_BD62CC45597DEBC2-001/control-001/cores/collection1/data/index
   [junit4]   2> 41268 INFO  (coreLoadExecutor-587-thread-1-processing-n:127.0.0.1:34468_) [n:127.0.0.1:34468_ c:control_collection s:shard1 r:core_node1 x:collection1] o.a.s.u.RandomMergePolicy RandomMergePolicy wrapping class org.apache.lucene.index.TieredMergePolicy: [TieredMergePolicy: maxMergeAtOnce=46, maxMergeAtOnceExplicit=12, maxMergedSegmentMB=49.1748046875, floorSegmentMB=1.1591796875, forceMergeDeletesPctAllowed=11.25958520439818, segmentsPerTier=39.0, maxCFSSegmentSizeMB=8.796093022207999E12, noCFSRatio=0.22634518497750966
   [junit4]   2> 41269 INFO  (coreLoadExecutor-587-thread-1-processing-n:127.0.0.1:34468_) [n:127.0.0.1:34468_ c:control_collection s:shard1 r:core_node1 x:collection1] o.a.s.c.SolrDeletionPolicy SolrDeletionPolicy.onCommit: commits: num=1
   [junit4]   2> 	commit{dir=MockDirectoryWrapper(RAMDirectory@2a2d602d lockFactory=org.apache.lucene.store.SingleInstanceLockFactory@26fd9879),segFN=segments_1,generation=1}
   [junit4]   2> 41269 INFO  (coreLoadExecutor-587-thread-1-processing-n:127.0.0.1:34468_) [n:127.0.0.1:34468_ c:control_collection s:shard1 r:core_node1 x:collection1] o.a.s.c.SolrDeletionPolicy newest commit generation = 1
   [junit4]   2> 41279 INFO  (coreLoadExecutor-587-thread-1-processing-n:127.0.0.1:34468_) [n:127.0.0.1:34468_ c:control_collection s:shard1 r:core_node1 x:collection1] o.a.s.u.p.UpdateRequestProcessorChain creating updateRequestProcessorChain "nodistrib"
   [junit4]   2> 41292 INFO  (coreLoadExecutor-587-thread-1-processing-n:127.0.0.1:34468_) [n:127.0.0.1:34468_ c:control_collection s:shard1 r:core_node1 x:collection1] o.a.s.u.p.UpdateRequestProcessorChain creating updateRequestProcessorChain "dedupe"
   [junit4]   2> 41293 INFO  (coreLoadExecutor-587-thread-1-processing-n:127.0.0.1:34468_) [n:127.0.0.1:34468_ c:control_collection s:shard1 r:core_node1 x:collection1] o.a.s.u.p.UpdateRequestProcessorChain inserting DistributedUpdateProcessorFactory into updateRequestProcessorChain "dedupe"
   [junit4]   2> 41293 INFO  (coreLoadExecutor-587-thread-1-processing-n:127.0.0.1:34468_) [n:127.0.0.1:34468_ c:control_collection s:shard1 r:core_node1 x:collection1] o.a.s.u.p.UpdateRequestProcessorChain creating updateRequestProcessorChain "stored_sig"
   [junit4]   2> 41293 INFO  (coreLoadExecutor-587-thread-1-processing-n:127.0.0.1:34468_) [n:127.0.0.1:34468_ c:control_collection s:shard1 r:core_node1 x:collection1] o.a.s.u.p.UpdateRequestProcessorChain inserting DistributedUpdateProcessorFactory into updateRequestProcessorChain "stored_sig"
   [junit4]   2> 41293 INFO  (coreLoadExecutor-587-thread-1-processing-n:127.0.0.1:34468_) [n:127.0.0.1:34468_ c:control_collection s:shard1 r:core_node1 x:collection1] o.a.s.u.p.UpdateRequestProcessorChain creating updateRequestProcessorChain "distrib-dup-test-chain-explicit"
   [junit4]   2> 41293 INFO  (coreLoadExecutor-587-thread-1-processing-n:127.0.0.1:34468_) [n:127.0.0.1:34468_ c:control_collection s:shard1 r:core_node1 x:collection1] o.a.s.u.p.UpdateRequestProcessorChain creating updateRequestProcessorChain "distrib-dup-test-chain-implicit"
   [junit4]   2> 41293 INFO  (coreLoadExecutor-587-thread-1-processing-n:127.0.0.1:34468_) [n:127.0.0.1:34468_ c:control_collection s:shard1 r:core_node1 x:collection1] o.a.s.u.p.UpdateRequestProcessorChain inserting DistributedUpdateProcessorFactory into updateRequestProcessorChain "distrib-dup-test-chain-implicit"
   [junit4]   2> 41293 INFO  (coreLoadExecutor-587-thread-1-processing-n:127.0.0.1:34468_) [n:127.0.0.1:34468_ c:control_collection s:shard1 r:core_node1 x:collection1] o.a.s.c.SolrCore no updateRequestProcessorChain defined as default, creating implicit default
   [junit4]   2> 41293 INFO  (OldIndexDirectoryCleanupThreadForCore-collection1) [n:127.0.0.1:34468_ c:control_collection s:shard1 r:core_node1 x:collection1] o.a.s.c.SolrCore Looking for old index directories to cleanup for core collection1 in /x1/jenkins/jenkins-slave/workspace/Lucene-Solr-Tests-6.x/solr/build/solr-core/test/J0/../../../../../../../../../../x1/jenkins/jenkins-slave/workspace/Lucene-Solr-Tests-6.x/solr/build/solr-core/test/J0/temp/solr.handler.TestReqParamsAPI_BD62CC45597DEBC2-001/control-001/cores/collection1/data/
   [junit4]   2> 41293 WARN  (OldIndexDirectoryCleanupThreadForCore-collection1) [n:127.0.0.1:34468_ c:control_collection s:shard1 r:core_node1 x:collection1] o.a.s.c.DirectoryFactory /x1/jenkins/jenkins-slave/workspace/Lucene-Solr-Tests-6.x/solr/build/solr-core/test/J0/../../../../../../../../../../x1/jenkins/jenkins-slave/workspace/Lucene-Solr-Tests-6.x/solr/build/solr-core/test/J0/temp/solr.handler.TestReqParamsAPI_BD62CC45597DEBC2-001/control-001/cores/collection1/data/ does not point to a valid data directory; skipping clean-up of old index directories.
   [junit4]   2> 41295 WARN  (coreLoadExecutor-587-thread-1-processing-n:127.0.0.1:34468_) [n:127.0.0.1:34468_ c:control_collection s:shard1 r:core_node1 x:collection1] o.a.s.c.RequestHandlers INVALID paramSet a in requestHandler {type = requestHandler,name = /dump,class = DumpRequestHandler,args = {defaults={a=A,b=B}}}
   [junit4]   2> 41300 INFO  (coreLoadExecutor-587-thread-1-processing-n:127.0.0.1:34468_) [n:127.0.0.1:34468_ c:control_collection s:shard1 r:core_node1 x:collection1] o.a.s.h.l.XMLLoader xsltCacheLifetimeSeconds=60
   [junit4]   2> 41303 INFO  (coreLoadExecutor-587-thread-1-processing-n:127.0.0.1:34468_) [n:127.0.0.1:34468_ c:control_collection s:shard1 r:core_node1 x:collection1] o.a.s.h.l.XMLLoader xsltCacheLifetimeSeconds=60
   [junit4]   2> 41304 INFO  (coreLoadExecutor-587-thread-1-processing-n:127.0.0.1:34468_) [n:127.0.0.1:34468_ c:control_collection s:shard1 r:core_node1 x:collection1] o.a.s.h.l.XMLLoader xsltCacheLifetimeSeconds=60
   [junit4]   2> 41305 INFO  (coreLoadExecutor-587-thread-1-processing-n:127.0.0.1:34468_) [n:127.0.0.1:34468_ c:control_collection s:shard1 r:core_node1 x:collection1] o.a.s.h.l.XMLLoader xsltCacheLifetimeSeconds=60
   [junit4]   2> 41326 INFO  (coreLoadExecutor-587-thread-1-processing-n:127.0.0.1:34468_) [n:127.0.0.1:34468_ c:control_collection s:shard1 r:core_node1 x:collection1] o.a.s.c.RequestHandlers Registered paths: /admin/mbeans,standard,/dump,/update/csv,/sql,/update/json/docs,/admin/luke,/export,/admin/segments,/get,/admin/system,/replication,/admin/properties,/config,/stream,/schema,/admin/plugins,/admin/logging,/update/json,/admin/ping,/admin/threads,/update,/admin/file
   [junit4]   2> 41326 INFO  (coreLoadExecutor-587-thread-1-processing-n:127.0.0.1:34468_) [n:127.0.0.1:34468_ c:control_collection s:shard1 r:core_node1 x:collection1] o.a.s.c.SolrCore Using default statsCache cache: org.apache.solr.search.stats.LocalStatsCache
   [junit4]   2> 41326 INFO  (coreLoadExecutor-587-thread-1-processing-n:127.0.0.1:34468_) [n:127.0.0.1:34468_ c:control_collection s:shard1 r:core_node1 x:collection1] o.a.s.u.UpdateHandler Using UpdateLog implementation: org.apache.solr.update.UpdateLog
   [junit4]   2> 41327 INFO  (coreLoadExecutor-587-thread-1-processing-n:127.0.0.1:34468_) [n:127.0.0.1:34468_ c:control_collection s:shard1 r:core_node1 x:collection1] o.a.s.u.UpdateLog Initializing UpdateLog: dataDir= defaultSyncLevel=FLUSH numRecordsToKeep=100 maxNumLogsToKeep=10 numVersionBuckets=65536
   [junit4]   2> 41328 INFO  (coreLoadExecutor-587-thread-1-processing-n:127.0.0.1:34468_) [n:127.0.0.1:34468_ c:control_collection s:shard1 r:core_node1 x:collection1] o.a.s.u.CommitTracker Hard AutoCommit: disabled
   [junit4]   2> 41328 INFO  (coreLoadExecutor-587-thread-1-processing-n:127.0.0.1:34468_) [n:127.0.0.1:34468_ c:control_collection s:shard1 r:core_node1 x:collection1] o.a.s.u.CommitTracker Soft AutoCommit: disabled
   [junit4]   2> 41328 INFO  (coreLoadExecutor-587-thread-1-processing-n:127.0.0.1:34468_) [n:127.0.0.1:34468_ c:control_collection s:shard1 r:core_node1 x:collection1] o.a.s.u.RandomMergePolicy RandomMergePolicy wrapping class org.apache.lucene.index.LogByteSizeMergePolicy: [LogByteSizeMergePolicy: minMergeSize=1677721, mergeFactor=39, maxMergeSize=2147483648, maxMergeSizeForForcedMerge=9223372036854775807, calibrateSizeByDeletes=true, maxMergeDocs=2147483647, maxCFSSegmentSizeMB=8.796093022207999E12, noCFSRatio=0.0]
   [junit4]   2> 41329 INFO  (coreLoadExecutor-587-thread-1-processing-n:127.0.0.1:34468_) [n:127.0.0.1:34468_ c:control_collection s:shard1 r:core_node1 x:collection1] o.a.s.c.SolrDeletionPolicy SolrDeletionPolicy.onInit: commits: num=1
   [junit4]   2> 	commit{dir=MockDirectoryWrapper(RAMDirectory@2a2d602d lockFactory=org.apache.lucene.store.SingleInstanceLockFactory@26fd9879),segFN=segments_1,generation=1}
   [junit4]   2> 41329 INFO  (coreLoadExecutor-587-thread-1-processing-n:127.0.0.1:34468_) [n:127.0.0.1:34468_ c:control_collection s:shard1 r:core_node1 x:collection1] o.a.s.c.SolrDeletionPolicy newest commit generation = 1
   [junit4]   2> 41329 INFO  (coreLoadExecutor-587-thread-1-processing-n:127.0.0.1:34468_) [n:127.0.0.1:34468_ c:control_collection s:shard1 r:core_node1 x:collection1] o.a.s.s.SolrIndexSearcher Opening [Searcher@4480fb31[collection1] main]
   [junit4]   2> 41330 INFO  (coreLoadExecutor-587-thread-1-processing-n:127.0.0.1:34468_) [n:127.0.0.1:34468_ c:control_collection s:shard1 r:core_node1 x:collection1] o.a.s.c.c.ZkStateReader Load collection config from: [/collections/control_collection]
   [junit4]   2> 41333 INFO  (coreLoadExecutor-587-thread-1-processing-n:127.0.0.1:34468_) [n:127.0.0.1:34468_ c:control_collection s:shard1 r:core_node1 x:collection1] o.a.s.c.c.ZkStateReader path=[/collections/control_collection] [configName]=[conf1] specified config exists in ZooKeeper
   [junit4]   2> 41333 INFO  (coreLoadExecutor-587-thread-1-processing-n:127.0.0.1:34468_) [n:127.0.0.1:34468_ c:control_collection s:shard1 r:core_node1 x:collection1] o.a.s.r.ManagedResourceStorage Setting up ZooKeeper-based storage for the RestManager with znodeBase: /configs/conf1
   [junit4]   2> 41335 INFO  (coreLoadExecutor-587-thread-1-processing-n:127.0.0.1:34468_) [n:127.0.0.1:34468_ c:control_collection s:shard1 r:core_node1 x:collection1] o.a.s.r.ManagedResourceStorage Configured ZooKeeperStorageIO with znodeBase: /configs/conf1
   [junit4]   2> 41335 INFO  (coreLoadExecutor-587-thread-1-processing-n:127.0.0.1:34468_) [n:127.0.0.1:34468_ c:control_collection s:shard1 r:core_node1 x:collection1] o.a.s.r.RestManager Initializing RestManager with initArgs: {}
   [junit4]   2> 41335 INFO  (coreLoadExecutor-587-thread-1-processing-n:127.0.0.1:34468_) [n:127.0.0.1:34468_ c:control_collection s:shard1 r:core_node1 x:collection1] o.a.s.r.ManagedResourceStorage Reading _rest_managed.json using ZooKeeperStorageIO:path=/configs/conf1
   [junit4]   2> 41336 INFO  (coreLoadExecutor-587-thread-1-processing-n:127.0.0.1:34468_) [n:127.0.0.1:34468_ c:control_collection s:shard1 r:core_node1 x:collection1] o.a.s.r.ManagedResourceStorage No data found for znode /configs/conf1/_rest_managed.json
   [junit4]   2> 41336 INFO  (coreLoadExecutor-587-thread-1-processing-n:127.0.0.1:34468_) [n:127.0.0.1:34468_ c:control_collection s:shard1 r:core_node1 x:collection1] o.a.s.r.ManagedResourceStorage Loaded null at path _rest_managed.json using ZooKeeperStorageIO:path=/configs/conf1
   [junit4]   2> 41336 INFO  (coreLoadExecutor-587-thread-1-processing-n:127.0.0.1:34468_) [n:127.0.0.1:34468_ c:control_collection s:shard1 r:core_node1 x:collection1] o.a.s.r.RestManager Initializing 0 registered ManagedResources
   [junit4]   2> 41336 INFO  (coreLoadExecutor-587-thread-1-processing-n:127.0.0.1:34468_) [n:127.0.0.1:34468_ c:control_collection s:shard1 r:core_node1 x:collection1] o.a.s.h.ReplicationHandler Commits will be reserved for  10000
   [junit4]   2> 41336 INFO  (coreLoadExecutor-587-thread-1-processing-n:127.0.0.1:34468_) [n:127.0.0.1:34468_ c:control_collection s:shard1 r:core_node1 x:collection1] o.a.s.u.UpdateLog Looking up max value of version field to seed version buckets
   [junit4]   2> 41337 INFO  (coreLoadExecutor-587-thread-1-processing-n:127.0.0.1:34468_) [n:127.0.0.1:34468_ c:control_collection s:shard1 r:core_node1 x:collection1] o.a.s.u.VersionInfo Refreshing highest value of _version_ for 65536 version buckets from index
   [junit4]   2> 41337 INFO  (coreLoadExecutor-587-thread-1-processing-n:127.0.0.1:34468_) [n:127.0.0.1:34468_ c:control_collection s:shard1 r:core_node1 x:collection1] o.a.s.u.VersionInfo No terms found for _version_, cannot seed version bucket highest value from index
   [junit4]   2> 41337 INFO  (coreLoadExecutor-587-thread-1-processing-n:127.0.0.1:34468_) [n:127.0.0.1:34468_ c:control_collection s:shard1 r:core_node1 x:collection1] o.a.s.u.UpdateLog Could not find max version in index or recent updates, using new clock 1532361542549372928
   [junit4]   2> 41339 INFO  (coreLoadExecutor-587-thread-1-processing-n:127.0.0.1:34468_) [n:127.0.0.1:34468_ c:control_collection s:shard1 r:core_node1 x:collection1] o.a.s.u.UpdateLog Took 2.0ms to seed version buckets with highest version 1532361542549372928
   [junit4]   2> 41339 INFO  (searcherExecutor-588-thread-1-processing-n:127.0.0.1:34468_ x:collection1 s:shard1 c:control_collection r:core_node1) [n:127.0.0.1:34468_ c:control_collection s:shard1 r:core_node1 x:collection1] o.a.s.c.SolrCore [collection1] Registered new searcher Searcher@4480fb31[collection1] main{ExitableDirectoryReader(UninvertingDirectoryReader())}
   [junit4]   2> 41344 INFO  (coreLoadExecutor-587-thread-1-processing-n:127.0.0.1:34468_) [n:127.0.0.1:34468_ c:control_collection s:shard1 r:core_node1 x:collection1] o.a.s.c.ZkController watch zkdir /configs/conf1
   [junit4]   2> 41345 INFO  (coreLoadExecutor-587-thread-1-processing-n:127.0.0.1:34468_) [n:127.0.0.1:34468_ c:control_collection s:shard1 r:core_node1 x:collection1] o.a.s.c.CoreContainer registering core: collection1
   [junit4]   2> 41345 INFO  (coreZkRegister-581-thread-1-processing-n:127.0.0.1:34468_ x:collection1 s:shard1 c:control_collection r:core_node1) [n:127.0.0.1:34468_ c:control_collection s:shard1 r:core_node1 x:collection1] o.a.s.c.ZkController Register replica - core:collection1 address:http://127.0.0.1:34468 collection:control_collection shard:shard1
   [junit4]   2> 41355 INFO  (coreZkRegister-581-thread-1-processing-n:127.0.0.1:34468_ x:collection1 s:shard1 c:control_collection r:core_node1) [n:127.0.0.1:34468_ c:control_collection s:shard1 r:core_node1 x:collection1] o.a.s.c.c.SolrZkClient makePath: /collections/control_collection/leader_elect/shard1/election
   [junit4]   2> 41371 INFO  (coreZkRegister-581-thread-1-processing-n:127.0.0.1:34468_ x:collection1 s:shard1 c:control_collection r:core_node1) [n:127.0.0.1:34468_ c:control_collection s:shard1 r:core_node1 x:collection1] o.a.s.c.LeaderElector Joined leadership election with path: /collections/control_collection/leader_elect/shard1/election/95772595973390340-core_node1-n_0000000000
   [junit4]   2> 41372 INFO  (coreZkRegister-581-thread-1-processing-n:127.0.0.1:34468_ x:collection1 s:shard1 c:control_collection r:core_node1) [n:127.0.0.1:34468_ c:control_collection s:shard1 r:core_node1 x:collection1] o.a.s.c.ShardLeaderElectionContext Running the leader process for shard=shard1 and weAreReplacement=false and leaderVoteWait=10000
   [junit4]   2> 41375 INFO  (OverseerStateUpdate-95772595973390340-127.0.0.1:34468_-n_0000000000) [n:127.0.0.1:34468_    ] o.a.s.c.Overseer processMessage: queueSize: 1, message = {
   [junit4]   2>   "operation":"leader",
   [junit4]   2>   "shard":"shard1",
   [junit4]   2>   "collection":"control_collection"} current state version: 1
   [junit4]   2> 41378 INFO  (zkCallback-101-thread-1-processing-n:127.0.0.1:34468_) [n:127.0.0.1:34468_    ] o.a.s.c.c.ZkStateReader A cluster state change: [WatchedEvent state:SyncConnected type:NodeDataChanged path:/clusterstate.json], has occurred - updating... (live nodes size: [1])
   [junit4]   2> 41394 INFO  (coreZkRegister-581-thread-1-processing-n:127.0.0.1:34468_ x:collection1 s:shard1 c:control_collection r:core_node1) [n:127.0.0.1:34468_ c:control_collection s:shard1 r:core_node1 x:collection1] o.a.s.c.ShardLeaderElectionContext Enough replicas found to continue.
   [junit4]   2> 41395 INFO  (coreZkRegister-581-thread-1-processing-n:127.0.0.1:34468_ x:collection1 s:shard1 c:control_collection r:core_node1) [n:127.0.0.1:34468_ c:control_collection s:shard1 r:core_node1 x:collection1] o.a.s.c.ShardLeaderElectionContext I may be the new leader - try and sync
   [junit4]   2> 41395 INFO  (coreZkRegister-581-thread-1-processing-n:127.0.0.1:34468_ x:collection1 s:shard1 c:control_collection r:core_node1) [n:127.0.0.1:34468_ c:control_collection s:shard1 r:core_node1 x:collection1] o.a.s.c.SyncStrategy Sync replicas to http://127.0.0.1:34468/collection1/
   [junit4]   2> 41395 INFO  (coreZkRegister-581-thread-1-processing-n:127.0.0.1:34468_ x:collection1 s:shard1 c:control_collection r:core_node1) [n:127.0.0.1:34468_ c:control_collection s:shard1 r:core_node1 x:collection1] o.a.s.c.SyncStrategy Sync Success - now sync replicas to me
   [junit4]   2> 41395 INFO  (coreZkRegister-581-thread-1-processing-n:127.0.0.1:34468_ x:collection1 s:shard1 c:control_collection r:core_node1) [n:127.0.0.1:34468_ c:control_collection s:shard1 r:core_node1 x:collection1] o.a.s.c.SyncStrategy http://127.0.0.1:34468/collection1/ has no replicas
   [junit4]   2> 41402 INFO  (coreZkRegister-581-thread-1-processing-n:127.0.0.1:34468_ x:collection1 s:shard1 c:control_collection r:core_node1) [n:127.0.0.1:34468_ c:control_collection s:shard1 r:core_node1 x:collection1] o.a.s.c.c.SolrZkClient makePath: /collections/control_collection/leaders/shard1
   [junit4]   2> 41408 INFO  (coreZkRegister-581-thread-1-processing-n:127.0.0.1:34468_ x:collection1 s:shard1 c:control_collection r:core_node1) [n:127.0.0.1:34468_ c:control_collection s:shard1 r:core_node1 x:collection1] o.a.s.c.ShardLeaderElectionContextBase Creating leader registration node /collections/control_collection/leaders/shard1/leader after winning as /collections/control_collection/leader_elect/shard1/election/95772595973390340-core_node1-n_0000000000
   [junit4]   2> 41423 INFO  (OverseerStateUpdate-95772595973390340-127.0.0.1:34468_-n_0000000000) [n:127.0.0.1:34468_    ] o.a.s.c.Overseer processMessage: queueSize: 1, message = {
   [junit4]   2>   "operation":"leader",
   [junit4]   2>   "shard":"shard1",
   [junit4]   2>   "collection":"control_collection",
   [junit4]   2>   "base_url":"http://127.0.0.1:34468",
   [junit4]   2>   "core":"collection1",
   [junit4]   2>   "state":"active"} current state version: 2
   [junit4]   2> 41433 INFO  (coreZkRegister-581-thread-1-processing-n:127.0.0.1:34468_ x:collection1 s:shard1 c:control_collection r:core_node1) [n:127.0.0.1:34468_ c:control_collection s:shard1 r:core_node1 x:collection1] o.a.s.c.ShardLeaderElectionContext I am the new leader: http://127.0.0.1:34468/collection1/ shard1
   [junit4]   2> 41591 INFO  (zkCallback-101-thread-1-processing-n:127.0.0.1:34468_) [n:127.0.0.1:34468_    ] o.a.s.c.c.ZkStateReader A cluster state change: [WatchedEvent state:SyncConnected type:NodeDataChanged path:/clusterstate.json], has occurred - updating... (live nodes size: [1])
   [junit4]   2> 41641 INFO  (coreZkRegister-581-thread-1-processing-n:127.0.0.1:34468_ x:collection1 s:shard1 c:control_collection r:core_node1) [n:127.0.0.1:34468_ c:control_collection s:shard1 r:core_node1 x:collection1] o.a.s.c.ZkController We are http://127.0.0.1:34468/collection1/ and leader is http://127.0.0.1:34468/collection1/
   [junit4]   2> 41641 INFO  (coreZkRegister-581-thread-1-processing-n:127.0.0.1:34468_ x:collection1 s:shard1 c:control_collection r:core_node1) [n:127.0.0.1:34468_ c:control_collection s:shard1 r:core_node1 x:collection1] o.a.s.c.ZkController No LogReplay needed for core=collection1 baseURL=http://127.0.0.1:34468
   [junit4]   2> 41641 INFO  (coreZkRegister-581-thread-1-processing-n:127.0.0.1:34468_ x:collection1 s:shard1 c:control_collection r:core_node1) [n:127.0.0.1:34468_ c:control_collection s:shard1 r:core_node1 x:collection1] o.a.s.c.ZkController I am the leader, no recovery necessary
   [junit4]   2> 41641 INFO  (coreZkRegister-581-thread-1-processing-n:127.0.0.1:34468_ x:collection1 s:shard1 c:control_collection r:core_node1) [n:127.0.0.1:34468_ c:control_collection s:shard1 r:core_node1 x:collection1] o.a.s.c.ZkController publishing state=active
   [junit4]   2> 41641 INFO  (coreZkRegister-581-thread-1-processing-n:127.0.0.1:34468_ x:collection1 s:shard1 c:control_collection r:core_node1) [n:127.0.0.1:34468_ c:control_collection s:shard1 r:core_node1 x:collection1] o.a.s.c.ZkController numShards not found on descriptor - reading it from system property
   [junit4]   2> 41678 INFO  (OverseerStateUpdate-95772595973390340-127.0.0.1:34468_-n_0000000000) [n:127.0.0.1:34468_    ] o.a.s.c.Overseer processMessage: queueSize: 1, message = {
   [junit4]   2>   "core":"collection1",
   [junit4]   2>   "core_node_name":"core_node1",
   [junit4]   2>   "roles":null,
   [junit4]   2>   "base_url":"http://127.0.0.1:34468",
   [junit4]   2>   "node_name":"127.0.0.1:34468_",
   [junit4]   2>   "numShards":"1",
   [junit4]   2>   "state":"active",
   [junit4]   2>   "shard":"shard1",
   [junit4]   2>   "collection":"control_collection",
   [junit4]   2>   "operation":"state"} current state version: 3
   [junit4]   2> 41678 INFO  (OverseerStateUpdate-95772595973390340-127.0.0.1:34468_-n_0000000000) [n:127.0.0.1:34468_    ] o.a.s.c.o.ReplicaMutator Update state numShards=1 message={
   [junit4]   2>   "core":"collection1",
   [junit4]   2>   "core_node_name":"core_node1",
   [junit4]   2>   "roles":null,
   [junit4]   2>   "base_url":"http://127.0.0.1:34468",
   [junit4]   2>   "node_name":"127.0.0.1:34468_",
   [junit4]   2>   "numShards":"1",
   [junit4]   2>   "state":"active",
   [junit4]   2>   "shard":"shard1",
   [junit4]   2>   "collection":"control_collection",
   [junit4]   2>   "operation":"state"}
   [junit4]   2> 41802 INFO  (zkCallback-101-thread-1-processing-n:127.0.0.1:34468_) [n:127.0.0.1:34468_    ] o.a.s.c.c.ZkStateReader A cluster state change: [WatchedEvent state:SyncConnected type:NodeDataChanged path:/clusterstate.json], has occurred - updating... (live nodes size: [1])
   [junit4]   2> 41908 INFO  (TEST-TestReqParamsAPI.test-seed#[BD62CC45597DEBC2]) [    ] o.a.s.c.s.i.CloudSolrClient Final constructed zkHost string: 127.0.0.1:58561/solr
   [junit4]   2> 41909 INFO  (TEST-TestReqParamsAPI.test-seed#[BD62CC45597DEBC2]) [    ] o.a.s.c.c.SolrZkClient Using default ZkCredentialsProvider
   [junit4]   2> 41938 INFO  (TEST-TestReqParamsAPI.test-seed#[BD62CC45597DEBC2]) [    ] o.a.s.c.c.ConnectionManager Waiting for client to connect to ZooKeeper
   [junit4]   2> 41944 INFO  (zkCallback-103-thread-1) [    ] o.a.s.c.c.ConnectionManager Watcher org.apache.solr.common.cloud.ConnectionManager@504c0d80 name:ZooKeeperConnection Watcher:127.0.0.1:58561/solr got event WatchedEvent state:SyncConnected type:None path:null path:null type:None
   [junit4]   2> 41948 INFO  (TEST-TestReqParamsAPI.test-seed#[BD62CC45597DEBC2]) [    ] o.a.s.c.c.ConnectionManager Client is connected to ZooKeeper
   [junit4]   2> 41948 INFO  (TEST-TestReqParamsAPI.test-seed#[BD62CC45597DEBC2]) [    ] o.a.s.c.c.SolrZkClient Using default ZkACLProvider
   [junit4]   2> 41948 INFO  (TEST-TestReqParamsAPI.test-seed#[BD62CC45597DEBC2]) [    ] o.a.s.c.c.ZkStateReader Updating cluster state from ZooKeeper... 
   [junit4]   2> 41950 INFO  (TEST-TestReqParamsAPI.test-seed#[BD62CC45597DEBC2]) [    ] o.a.s.c.c.ZkStateReader Updated live nodes from ZooKeeper... (0) -> (1)
   [junit4]   2> 41980 INFO  (TEST-TestReqParamsAPI.test-seed#[BD62CC45597DEBC2]) [    ] o.a.s.c.ChaosMonkey monkey: init - expire sessions:false cause connection loss:false
   [junit4]   2> 42681 INFO  (TEST-TestReqParamsAPI.test-seed#[BD62CC45597DEBC2]) [    ] o.a.s.SolrTestCaseJ4 Writing core.properties file to /x1/jenkins/jenkins-slave/workspace/Lucene-Solr-Tests-6.x/solr/build/solr-core/test/J0/temp/solr.handler.TestReqParamsAPI_BD62CC45597DEBC2-001/shard-1-001/cores/collection1
   [junit4]   2> 42681 INFO  (TEST-TestReqParamsAPI.test-seed#[BD62CC45597DEBC2]) [    ] o.a.s.c.AbstractFullDistribZkTestBase create jetty 1 in directory /x1/jenkins/jenkins-slave/workspace/Lucene-Solr-Tests-6.x/solr/build/solr-core/test/J0/temp/solr.handler.TestReqParamsAPI_BD62CC45597DEBC2-001/shard-1-001
   [junit4]   2> 42688 INFO  (TEST-TestReqParamsAPI.test-seed#[BD62CC45597DEBC2]) [    ] o.e.j.s.Server jetty-9.3.8.v20160314
   [junit4]   2> 42707 INFO  (TEST-TestReqParamsAPI.test-seed#[BD62CC45597DEBC2]) [    ] o.e.j.s.h.ContextHandler Started o.e.j.s.ServletContextHandler@3f04e950{/,null,AVAILABLE}
   [junit4]   2> 42707 INFO  (TEST-TestReqParamsAPI.test-seed#[BD62CC45597DEBC2]) [    ] o.e.j.s.ServerConnector Started ServerConnector@13aa3f82{HTTP/1.1,[http/1.1]}{127.0.0.1:54712}
   [junit4]   2> 42707 INFO  (TEST-TestReqParamsAPI.test-seed#[BD62CC45597DEBC2]) [    ] o.e.j.s.Server Started @48648ms
   [junit4]   2> 42707 INFO  (TEST-TestReqParamsAPI.test-seed#[BD62CC45597DEBC2]) [    ] o.a.s.c.s.e.JettySolrRunner Jetty properties: {solr.data.dir=/x1/jenkins/jenkins-slave/workspace/Lucene-Solr-Tests-6.x/solr/build/solr-core/test/J0/temp/solr.handler.TestReqParamsAPI_BD62CC45597DEBC2-001/tempDir-001/jetty1, solrconfig=solrconfig.xml, hostContext=/, hostPort=54712, coreRootDirectory=/x1/jenkins/jenkins-slave/workspace/Lucene-Solr-Tests-6.x/solr/build/solr-core/test/J0/../../../../../../../../../../x1/jenkins/jenkins-slave/workspace/Lucene-Solr-Tests-6.x/solr/build/solr-core/test/J0/temp/solr.handler.TestReqParamsAPI_BD62CC45597DEBC2-001/shard-1-001/cores}
   [junit4]   2> 42708 INFO  (TEST-TestReqParamsAPI.test-seed#[BD62CC45597DEBC2]) [    ] o.a.s.s.SolrDispatchFilter SolrDispatchFilter.init(): sun.misc.Launcher$AppClassLoader@73d16e93
   [junit4]   2> 42708 INFO  (TEST-TestReqParamsAPI.test-seed#[BD62CC45597DEBC2]) [    ] o.a.s.c.SolrResourceLoader new SolrResourceLoader for directory: '/x1/jenkins/jenkins-slave/workspace/Lucene-Solr-Tests-6.x/solr/build/solr-core/test/J0/temp/solr.handler.TestReqParamsAPI_BD62CC45597DEBC2-001/shard-1-001'
   [junit4]   2> 42708 INFO  (TEST-TestReqParamsAPI.test-seed#[BD62CC45597DEBC2]) [    ] o.a.s.c.SolrResourceLoader JNDI not configured for solr (NoInitialContextEx)
   [junit4]   2> 42708 INFO  (TEST-TestReqParamsAPI.test-seed#[BD62CC45597DEBC2]) [    ] o.a.s.c.SolrResourceLoader solr home defaulted to 'solr/' (could not find system property or JNDI)
   [junit4]   2> 42708 INFO  (TEST-TestReqParamsAPI.test-seed#[BD62CC45597DEBC2]) [    ] o.a.s.c.c.SolrZkClient Using default ZkCredentialsProvider
   [junit4]   2> 42737 INFO  (TEST-TestReqParamsAPI.test-seed#[BD62CC45597DEBC2]) [    ] o.a.s.c.c.ConnectionManager Waiting for client to connect to ZooKeeper
   [junit4]   2> 42777 INFO  (zkCallback-104-thread-1) [    ] o.a.s.c.c.ConnectionManager Watcher org.apache.solr.common.cloud.ConnectionManager@275c58fd name:ZooKeeperConnection Watcher:127.0.0.1:58561/solr got event WatchedEvent state:SyncConnected type:None path:null path:null type:None
   [junit4]   2> 42780 INFO  (TEST-TestReqParamsAPI.test-seed#[BD62CC45597DEBC2]) [    ] o.a.s.c.c.ConnectionManager Client is connected to ZooKeeper
   [junit4]   2> 42780 INFO  (TEST-TestReqParamsAPI.test-seed#[BD62CC45597DEBC2]) [    ] o.a.s.c.c.SolrZkClient Using default ZkACLProvider
   [junit4]   2> 42789 INFO  (TEST-TestReqParamsAPI.test-seed#[BD62CC45597DEBC2]) [    ] o.a.s.s.SolrDispatchFilter Loading solr.xml from SolrHome (not found in ZooKeeper)
   [junit4]   2> 42789 INFO  (TEST-TestReqParamsAPI.test-seed#[BD62CC45597DEBC2]) [    ] o.a.s.c.SolrXmlConfig Loading container configuration from /x1/jenkins/jenkins-slave/workspace/Lucene-Solr-Tests-6.x/solr/build/solr-core/test/J0/temp/solr.handler.TestReqParamsAPI_BD62CC45597DEBC2-001/shard-1-001/solr.xml
   [junit4]   2> 42821 INFO  (TEST-TestReqParamsAPI.test-seed#[BD62CC45597DEBC2]) [    ] o.a.s.c.CorePropertiesLocator Config-defined core root directory: /x1/jenkins/jenkins-slave/workspace/Lucene-Solr-Tests-6.x/solr/build/solr-core/test/J0/../../../../../../../../../../x1/jenkins/jenkins-slave/workspace/Lucene-Solr-Tests-6.x/solr/build/solr-core/test/J0/temp/solr.handler.TestReqParamsAPI_BD62CC45597DEBC2-001/shard-1-001/cores
   [junit4]   2> 42821 INFO  (TEST-TestReqParamsAPI.test-seed#[BD62CC45597DEBC2]) [    ] o.a.s.c.CoreContainer New CoreContainer 326025178
   [junit4]   2> 42821 INFO  (TEST-TestReqParamsAPI.test-seed#[BD62CC45597DEBC2]) [    ] o.a.s.c.CoreContainer Loading cores into CoreContainer [instanceDir=/x1/jenkins/jenkins-slave/workspace/Lucene-Solr-Tests-6.x/solr/build/solr-core/test/J0/temp/solr.handler.TestReqParamsAPI_BD62CC45597DEBC2-001/shard-1-001]
   [junit4]   2> 42821 WARN  (TEST-TestReqParamsAPI.test-seed#[BD62CC45597DEBC2]) [    ] o.a.s.c.CoreContainer Couldn't add files from /x1/jenkins/jenkins-slave/workspace/Lucene-Solr-Tests-6.x/solr/build/solr-core/test/J0/temp/solr.handler.TestReqParamsAPI_BD62CC45597DEBC2-001/shard-1-001/lib to classpath: /x1/jenkins/jenkins-slave/workspace/Lucene-Solr-Tests-6.x/solr/build/solr-core/test/J0/temp/solr.handler.TestReqParamsAPI_BD62CC45597DEBC2-001/shard-1-001/lib
   [junit4]   2> 42821 INFO  (TEST-TestReqParamsAPI.test-seed#[BD62CC45597DEBC2]) [    ] o.a.s.h.c.HttpShardHandlerFactory created with socketTimeout : 90000,urlScheme : ,connTimeout : 15000,maxConnectionsPerHost : 20,maxConnections : 10000,corePoolSize : 0,maximumPoolSize : 2147483647,maxThreadIdleTime : 5,sizeOfQueue : -1,fairnessPolicy : false,useRetries : false,
   [junit4]   2> 42828 INFO  (TEST-TestReqParamsAPI.test-seed#[BD62CC45597DEBC2]) [    ] o.a.s.u.UpdateShardHandler Creating UpdateShardHandler HTTP client with params: socketTimeout=340000&connTimeout=45000&retry=true
   [junit4]   2> 42829 INFO  (TEST-TestReqParamsAPI.test-seed#[BD62CC45597DEBC2]) [    ] o.a.s.l.LogWatcher SLF4J impl is org.slf4j.impl.Log4jLoggerFactory
   [junit4]   2> 42829 INFO  (TEST-TestReqParamsAPI.test-seed#[BD62CC45597DEBC2]) [    ] o.a.s.l.LogWatcher Registering Log Listener [Log4j (org.slf4j.impl.Log4jLoggerFactory)]
   [junit4]   2> 42829 INFO  (TEST-TestReqParamsAPI.test-seed#[BD62CC45597DEBC2]) [    ] o.a.s.c.ZkContainer Zookeeper client=127.0.0.1:58561/solr
   [junit4]   2> 42829 INFO  (TEST-TestReqParamsAPI.test-seed#[BD62CC45597DEBC2]) [    ] o.a.s.c.ZkController zkHost includes chroot
   [junit4]   2> 42829 INFO  (TEST-TestReqParamsAPI.test-seed#[BD62CC45597DEBC2]) [    ] o.a.s.c.c.SolrZkClient Using default ZkCredentialsProvider
   [junit4]   2> 42868 INFO  (TEST-TestReqParamsAPI.test-seed#[BD62CC45597DEBC2]) [    ] o.a.s.c.c.ConnectionManager Waiting for client to connect to ZooKeeper
   [junit4]   2> 42912 INFO  (zkCallback-107-thread-1) [    ] o.a.s.c.c.ConnectionManager Watcher org.apache.solr.common.cloud.ConnectionManager@5e11a1c6 name:ZooKeeperConnection Watcher:127.0.0.1:58561 got event WatchedEvent state:SyncConnected type:None path:null path:null type:None
   [junit4]   2> 42916 INFO  (TEST-TestReqParamsAPI.test-seed#[BD62CC45597DEBC2]) [    ] o.a.s.c.c.ConnectionManager Client is connected to ZooKeeper
   [junit4]   2> 42916 INFO  (TEST-TestReqParamsAPI.test-seed#[BD62CC45597DEBC2]) [    ] o.a.s.c.c.SolrZkClient Using default ZkACLProvider
   [junit4]   2> 42952 INFO  (TEST-TestReqParamsAPI.test-seed#[BD62CC45597DEBC2]) [n:127.0.0.1:54712_    ] o.a.s.c.ZkController Added new OnReconnect listener org.apache.solr.cloud.ZkController$$Lambda$23/1701008330@1ab082aa
   [junit4]   2> 43242 INFO  (TEST-TestReqParamsAPI.test-seed#[BD62CC45597DEBC2]) [n:127.0.0.1:54712_    ] o.a.s.c.c.ConnectionManager Waiting for client to connect to ZooKeeper
   [junit4]   2> 43244 INFO  (zkCallback-108-thread-1-processing-n:127.0.0.1:54712_) [n:127.0.0.1:54712_    ] o.a.s.c.c.ConnectionManager Watcher org.apache.solr.common.cloud.ConnectionManager@28cb6bdc name:ZooKeeperConnection Watcher:127.0.0.1:58561/solr got event WatchedEvent state:SyncConnected type:None path:null path:null type:None
   [junit4]   2> 43244 INFO  (TEST-TestReqParamsAPI.test-seed#[BD62CC45597DEBC2]) [n:127.0.0.1:54712_    ] o.a.s.c.c.ConnectionManager Client is connected to ZooKeeper
   [junit4]   2> 43261 INFO  (TEST-TestReqParamsAPI.test-seed#[BD62CC45597DEBC2]) [n:127.0.0.1:54712_    ] o.a.s.c.c.ZkStateReader Updating cluster state from ZooKeeper... 
   [junit4]   2> 43262 INFO  (TEST-TestReqParamsAPI.test-seed#[BD62CC45597DEBC2]) [n:127.0.0.1:54712_    ] o.a.s.c.c.ZkStateReader Updated live nodes from ZooKeeper... (0) -> (1)
   [junit4]   2> 43301 INFO  (TEST-TestReqParamsAPI.test-seed#[BD62CC45597DEBC2]) [n:127.0.0.1:54712_    ] o.a.s.c.Overseer Overseer (id=null) closing
   [junit4]   2> 43302 INFO  (TEST-TestReqParamsAPI.test-seed#[BD62CC45597DEBC2]) [n:127.0.0.1:54712_    ] o.a.s.c.LeaderElector Joined leadership election with path: /overseer_elect/election/95772595973390344-127.0.0.1:54712_-n_0000000001
   [junit4]   2> 43303 INFO  (TEST-TestReqParamsAPI.test-seed#[BD62CC45597DEBC2]) [n:127.0.0.1:54712_    ] o.a.s.c.LeaderElector Watching path /overseer_elect/election/95772595973390340-127.0.0.1:34468_-n_0000000000 to know if I could be the leader
   [junit4]   2> 43304 INFO  (TEST-TestReqParamsAPI.test-seed#[BD62CC45597DEBC2]) [n:127.0.0.1:54712_    ] o.a.s.c.ZkController Publish node=127.0.0.1:54712_ as DOWN
   [junit4]   2> 43306 INFO  (OverseerStateUpdate-95772595973390340-127.0.0.1:34468_-n_0000000000) [n:127.0.0.1:34468_    ] o.a.s.c.Overseer processMessage: queueSize: 1, message = {
   [junit4]   2>   "operation":"downnode",
   [junit4]   2>   "node_name":"127.0.0.1:54712_"} current state version: 4
   [junit4]   2> 43307 INFO  (OverseerStateUpdate-95772595973390340-127.0.0.1:34468_-n_0000000000) [n:127.0.0.1:34468_    ] o.a.s.c.o.NodeMutator DownNode state invoked for node: 127.0.0.1:54712_
   [junit4]   2> 43308 INFO  (zkCallback-103-thread-1) [    ] o.a.s.c.c.ZkStateReader A cluster state change: [WatchedEvent state:SyncConnected type:NodeDataChanged path:/clusterstate.json], has occurred - updating... (live nodes size: [1])
   [junit4]   2> 43309 INFO  (zkCallback-101-thread-1-processing-n:127.0.0.1:34468_) [n:127.0.0.1:34468_    ] o.a.s.c.c.ZkStateReader A cluster state change: [WatchedEvent state:SyncConnected type:NodeDataChanged path:/clusterstate.json], has occurred - updating... (live nodes size: [1])
   [junit4]   2> 43318 INFO  (zkCallback-108-thread-1-processing-n:127.0.0.1:54712_) [n:127.0.0.1:54712_    ] o.a.s.c.c.ZkStateReader A cluster state change: [WatchedEvent state:SyncConnected type:NodeDataChanged path:/clusterstate.json], has occurred - updating... (live nodes size: [1])
   [junit4]   2> 44410 INFO  (TEST-TestReqParamsAPI.test-seed#[BD62CC45597DEBC2]) [n:127.0.0.1:54712_    ] o.a.s.c.ZkController Register node as live in ZooKeeper:/live_nodes/127.0.0.1:54712_
   [junit4]   2> 44411 INFO  (TEST-TestReqParamsAPI.test-seed#[BD62CC45597DEBC2]) [n:127.0.0.1:54712_    ] o.a.s.c.c.SolrZkClient makePath: /live_nodes/127.0.0.1:54712_
   [junit4]   2> 44412 INFO  (zkCallback-103-thread-1) [    ] o.a.s.c.c.ZkStateReader A live node change: [WatchedEvent state:SyncConnected type:NodeChildrenChanged path:/live_nodes], has occurred - updating... (live nodes size: [1])
   [junit4]   2> 44412 INFO  (zkCallback-101-thread-1-processing-n:127.0.0.1:34468_) [n:127.0.0.1:34468_    ] o.a.s.c.c.ZkStateReader A live node change: [WatchedEvent state:SyncConnected type:NodeChildrenChanged path:/live_nodes], has occurred - updating... (live nodes size: [1])
   [junit4]   2> 44412 INFO  (zkCallback-101-thread-1-processing-n:127.0.0.1:34468_) [n:127.0.0.1:34468_    ] o.a.s.c.c.ZkStateReader Updated live nodes from ZooKeeper... (1) -> (2)
   [junit4]   2> 44413 INFO  (zkCallback-103-thread-1) [    ] o.a.s.c.c.ZkStateReader Updated live nodes from ZooKeeper... (1) -> (2)
   [junit4]   2> 44413 INFO  (zkCallback-108-thread-1-processing-n:127.0.0.1:54712_) [n:127.0.0.1:54712_    ] o.a.s.c.c.ZkStateReader A live node change: [WatchedEvent state:SyncConnected type:NodeChildrenChanged path:/live_nodes], has occurred - updating... (live nodes size: [1])
   [junit4]   2> 44413 INFO  (zkCallback-108-thread-1-processing-n:127.0.0.1:54712_) [n:127.0.0.1:54712_    ] o.a.s.c.c.ZkStateReader Updated live nodes from ZooKeeper... (1) -> (2)
   [junit4]   2> 44620 INFO  (TEST-TestReqParamsAPI.test-seed#[BD62CC45597DEBC2]) [n:127.0.0.1:54712_    ] o.a.s.c.CoreContainer Security conf doesn't exist. Skipping setup for authorization module.
   [junit4]   2> 44620 INFO  (TEST-TestReqParamsAPI.test-seed#[BD62CC45597DEBC2]) [n:127.0.0.1:54712_    ] o.a.s.c.CoreContainer No authentication plugin used.
   [junit4]   2> 44629 INFO  (TEST-TestReqParamsAPI.test-seed#[BD62CC45597DEBC2]) [n:127.0.0.1:54712_    ] o.a.s.c.CorePropertiesLocator Looking for core definitions underneath /x1/jenkins/jenkins-slave/workspace/Lucene-Solr-Tests-6.x/solr/build/solr-core/test/J0/../../../../../../../../../../x1/jenkins/jenkins-slave/workspace/Lucene-Solr-Tests-6.x/solr/build/solr-core/test/J0/temp/solr.handler.TestReqParamsAPI_BD62CC45597DEBC2-001/shard-1-001/cores
   [junit4]   2> 44631 INFO  (TEST-TestReqParamsAPI.test-seed#[BD62CC45597DEBC2]) [n:127.0.0.1:54712_    ] o.a.s.c.CoreDescriptor Created CoreDescriptor: {name=collection1, config=solrconfig.xml, transient=false, schema=schema.xml, loadOnStartup=true, configSetProperties=configsetprops.json, collection=collection1, coreNodeName=, dataDir=data/, shard=}
   [junit4]   2> 44631 INFO  (TEST-TestReqParamsAPI.test-seed#[BD62CC45597DEBC2]) [n:127.0.0.1:54712_    ] o.a.s.c.CorePropertiesLocator Found core collection1 in /x1/jenkins/jenkins-slave/workspace/Lucene-Solr-Tests-6.x/solr/build/solr-core/test/J0/../../../../../../../../../../x1/jenkins/jenkins-slave/workspace/Lucene-Solr-Tests-6.x/solr/build/solr-core/test/J0/temp/solr.handler.TestReqParamsAPI_BD62CC45597DEBC2-001/shard-1-001/cores/collection1
   [junit4]   2> 44631 INFO  (TEST-TestReqParamsAPI.test-seed#[BD62CC45597DEBC2]) [n:127.0.0.1:54712_    ] o.a.s.c.CorePropertiesLocator Found 1 core definitions
   [junit4]   2> 44636 INFO  (coreLoadExecutor-598-thread-1-processing-n:127.0.0.1:54712_) [n:127.0.0.1:54712_ c:collection1   x:collection1] o.a.s.c.ZkController publishing state=down
   [junit4]   2> 44636 INFO  (coreLoadExecutor-598-thread-1-processing-n:127.0.0.1:54712_) [n:127.0.0.1:54712_ c:collection1   x:collection1] o.a.s.c.ZkController numShards not found on descriptor - reading it from system property
   [junit4]   2> 44638 INFO  (coreLoadExecutor-598-thread-1-processing-n:127.0.0.1:54712_) [n:127.0.0.1:54712_ c:collection1   x:collection1] o.a.s.c.ZkController Collection collection1 not visible yet, but flagging it so a watch is registered when it becomes visible
   [junit4]   2> 44638 INFO  (coreLoadExecutor-598-thread-1-processing-n:127.0.0.1:54712_) [n:127.0.0.1:54712_ c:collection1   x:collection1] o.a.s.c.c.ZkStateReader addZkWatch [collection1]
   [junit4]   2> 44639 INFO  (coreLoadExecutor-598-thread-1-processing-n:127.0.0.1:54712_) [n:127.0.0.1:54712_ c:collection1   x:collection1] o.a.s.c.c.ZkStateReader Deleting data for [collection1]
   [junit4]   2> 44639 INFO  (coreLoadExecutor-598-thread-1-processing-n:127.0.0.1:54712_) [n:127.0.0.1:54712_ c:collection1   x:collection1] o.a.s.c.ZkController look for our core node name
   [junit4]   2> 44647 INFO  (TEST-TestReqParamsAPI.test-seed#[BD62CC45597DEBC2]) [n:127.0.0.1:54712_    ] o.a.s.s.SolrDispatchFilter user.dir=/x1/jenkins/jenkins-slave/workspace/Lucene-Solr-Tests-6.x/solr/build/solr-core/test/J0
   [junit4]   2> 44648 INFO  (OverseerStateUpdate-95772595973390340-127.0.0.1:34468_-n_0000000000) [n:127.0.0.1:34468_    ] o.a.s.c.Overseer processMessage: queueSize: 1, message = {
   [junit4]   2>   "core":"collection1",
   [junit4]   2>   "roles":null,
   [junit4]   2>   "base_url":"http://127.0.0.1:54712",
   [junit4]   2>   "node_name":"127.0.0.1:54712_",
   [junit4]   2>   "numShards":"2",
   [junit4]   2>   "state":"down",
   [junit4]   2>   "shard":null,
   [junit4]   2>   "collection":"collection1",
   [junit4]   2>   "operation":"state"} current state version: 5
   [junit4]   2> 44648 INFO  (TEST-TestReqParamsAPI.test-seed#[BD62CC45597DEBC2]) [n:127.0.0.1:54712_    ] o.a.s.s.SolrDispatchFilter SolrDispatchFilter.init() done
   [junit4]   2> 44652 INFO  (OverseerStateUpdate-95772595973390340-127.0.0.1:34468_-n_0000000000) [n:127.0.0.1:34468_    ] o.a.s.c.o.ReplicaMutator Update state numShards=2 message={
   [junit4]   2>   "core":"collection1",
   [junit4]   2>   "roles":null,
   [junit4]   2>   "base_url":"http://127.0.0.1:54712",
   [junit4]   2>   "node_name":"127.0.0.1:54712_",
   [junit4]   2>   "numShards":"2",
   [junit4]   2>   "state":"down",
   [junit4]   2>   "shard":null,
   [junit4]   2>   "collection":"collection1",
   [junit4]   2>   "operation":"state"}
   [junit4]   2> 44652 INFO  (OverseerStateUpdate-95772595973390340-127.0.0.1:34468_-n_0000000000) [n:127.0.0.1:34468_    ] o.a.s.c.o.ClusterStateMutator building a new cName: collection1
   [junit4]   2> 44652 INFO  (OverseerStateUpdate-95772595973390340-127.0.0.1:34468_-n_0000000000) [n:127.0.0.1:34468_    ] o.a.s.c.o.ReplicaMutator Assigning new node to shard shard=shard2
   [junit4]   2> 44785 INFO  (zkCallback-108-thread-1-processing-n:127.0.0.1:54712_) [n:127.0.0.1:54712_    ] o.a.s.c.c.ZkStateReader A cluster state change: [WatchedEvent state:SyncConnected type:NodeDataChanged path:/clusterstate.json], has occurred - updating... (live nodes size: [2])
   [junit4]   2> 44785 INFO  (zkCallback-103-thread-1) [    ] o.a.s.c.c.ZkStateReader A cluster state change: [WatchedEvent state:SyncConnected type:NodeDataChanged path:/clusterstate.json], has occurred - updating... (live nodes size: [2])
   [junit4]   2> 44797 INFO  (zkCallback-101-thread-1-processing-n:127.0.0.1:34468_) [n:127.0.0.1:34468_    ] o.a.s.c.c.ZkStateReader A cluster state change: [WatchedEvent

[...truncated too long message...]

IgnoreAfterMaxFailures.java:64)
   [junit4]   2> 	at org.apache.lucene.util.TestRuleIgnoreTestSuites$1.evaluate(TestRuleIgnoreTestSuites.java:54)
   [junit4]   2> 	at com.carrotsearch.randomizedtesting.rules.StatementAdapter.evaluate(StatementAdapter.java:36)
   [junit4]   2> 	at com.carrotsearch.randomizedtesting.ThreadLeakControl$StatementRunner.run(ThreadLeakControl.java:367)
   [junit4]   2> 	at java.lang.Thread.run(Thread.java:745)
   [junit4]   2> 
   [junit4]   2> Apr 23, 2016 1:37:08 AM com.carrotsearch.randomizedtesting.ThreadLeakControl checkThreadLeaks
   [junit4]   2> WARNING: Will linger awaiting termination of 1 leaked thread(s).
   [junit4]   2> Apr 23, 2016 1:37:28 AM com.carrotsearch.randomizedtesting.ThreadLeakControl checkThreadLeaks
   [junit4]   2> SEVERE: 1 thread leaked from SUITE scope at org.apache.solr.core.TestCoreDiscovery: 
   [junit4]   2>    1) Thread[id=58658, name=searcherExecutor-5293-thread-1, state=WAITING, group=TGRP-TestCoreDiscovery]
   [junit4]   2>         at sun.misc.Unsafe.park(Native Method)
   [junit4]   2>         at java.util.concurrent.locks.LockSupport.park(LockSupport.java:175)
   [junit4]   2>         at java.util.concurrent.locks.AbstractQueuedSynchronizer$ConditionObject.await(AbstractQueuedSynchronizer.java:2039)
   [junit4]   2>         at java.util.concurrent.LinkedBlockingQueue.take(LinkedBlockingQueue.java:442)
   [junit4]   2>         at java.util.concurrent.ThreadPoolExecutor.getTask(ThreadPoolExecutor.java:1067)
   [junit4]   2>         at java.util.concurrent.ThreadPoolExecutor.runWorker(ThreadPoolExecutor.java:1127)
   [junit4]   2>         at java.util.concurrent.ThreadPoolExecutor$Worker.run(ThreadPoolExecutor.java:617)
   [junit4]   2>         at java.lang.Thread.run(Thread.java:745)
   [junit4]   2> Apr 23, 2016 1:37:28 AM com.carrotsearch.randomizedtesting.ThreadLeakControl tryToInterruptAll
   [junit4]   2> INFO: Starting to interrupt leaked threads:
   [junit4]   2>    1) Thread[id=58658, name=searcherExecutor-5293-thread-1, state=WAITING, group=TGRP-TestCoreDiscovery]
   [junit4]   2> Apr 23, 2016 1:37:31 AM com.carrotsearch.randomizedtesting.ThreadLeakControl tryToInterruptAll
   [junit4]   2> SEVERE: There are still zombie threads that couldn't be terminated:
   [junit4]   2>    1) Thread[id=58658, name=searcherExecutor-5293-thread-1, state=WAITING, group=TGRP-TestCoreDiscovery]
   [junit4]   2>         at sun.misc.Unsafe.park(Native Method)
   [junit4]   2>         at java.util.concurrent.locks.LockSupport.park(LockSupport.java:175)
   [junit4]   2>         at java.util.concurrent.locks.AbstractQueuedSynchronizer$ConditionObject.await(AbstractQueuedSynchronizer.java:2039)
   [junit4]   2>         at java.util.concurrent.LinkedBlockingQueue.take(LinkedBlockingQueue.java:442)
   [junit4]   2>         at java.util.concurrent.ThreadPoolExecutor.getTask(ThreadPoolExecutor.java:1067)
   [junit4]   2>         at java.util.concurrent.ThreadPoolExecutor.runWorker(ThreadPoolExecutor.java:1127)
   [junit4]   2>         at java.util.concurrent.ThreadPoolExecutor$Worker.run(ThreadPoolExecutor.java:617)
   [junit4]   2>         at java.lang.Thread.run(Thread.java:745)
   [junit4]   2> NOTE: test params are: codec=Asserting(Lucene60): {}, docValues:{}, maxPointsInLeafNode=1052, maxMBSortInHeap=5.4432719123739535, sim=ClassicSimilarity, locale=id-ID, timezone=America/Scoresbysund
   [junit4]   2> NOTE: Linux 3.13.0-52-generic amd64/Oracle Corporation 1.8.0_74 (64-bit)/cpus=4,threads=2,free=234401080,total=531103744
   [junit4]   2> NOTE: All tests run in this JVM: [HdfsRecoverLeaseTest, AnalyticsMergeStrategyTest, TestIndexSearcher, TestComplexPhraseQParserPlugin, BadComponentTest, TestSearchPerf, DateMathParserTest, MigrateRouteKeyTest, HardAutoCommitTest, TestFieldTypeResource, HighlighterConfigTest, TestShortCircuitedRequests, SolrCoreCheckLockOnStartupTest, TestStressReorder, TestOrdValues, TestRuleBasedAuthorizationPlugin, SimpleCollectionCreateDeleteTest, SuggesterTest, TestCollationField, CurrencyFieldXmlFileTest, TestBulkSchemaAPI, TestReloadDeadlock, ScriptEngineTest, TestDistribDocBasedVersion, TestPerFieldSimilarity, HdfsChaosMonkeySafeLeaderTest, TermVectorComponentDistributedTest, ShardSplitTest, TestReplicationHandlerBackup, DistributedSuggestComponentTest, TestImplicitCoreProperties, DistributedFacetPivotWhiteBoxTest, RequestLoggingTest, TestConfigSetsAPIExclusivity, RollingRestartTest, DistributedVersionInfoTest, UpdateParamsTest, TestDocBasedVersionConstraints, ChangedSchemaMergeTest, LukeRequestHandlerTest, DistributedFacetPivotLongTailTest, ConnectionManagerTest, TestSuggestSpellingConverter, LeaderElectionTest, TestClusterStateMutator, TestManagedStopFilterFactory, SearchHandlerTest, CircularListTest, TestIndexingPerformance, InfoHandlerTest, RemoteQueryErrorTest, HdfsBasicDistributedZk2Test, DirectSolrConnectionTest, TlogReplayBufferedWhileIndexingTest, TestFuzzyAnalyzedSuggestions, TestSolrQueryParserDefaultOperatorResource, CleanupOldIndexTest, BadIndexSchemaTest, DocValuesMultiTest, PKIAuthenticationIntegrationTest, EnumFieldTest, TestElisionMultitermQuery, TestSolrIndexConfig, TestConfigSetProperties, TestMaxScoreQueryParser, TestWriterPerf, TestStressLiveNodes, TestJmxMonitoredMap, TestCollationFieldDocValues, TestStandardQParsers, TestGroupingSearch, CollectionStateFormat2Test, TestSweetSpotSimilarityFactory, DistanceUnitsTest, BaseCdcrDistributedZkTest, TestPHPSerializedResponseWriter, BlockCacheTest, TestXmlQParser, CheckHdfsIndexTest, TestCloudPivotFacet, TestJsonRequest, TestIntervalFaceting, AutoCommitTest, TestCoreDiscovery]
   [junit4]   2> NOTE: reproduce with: ant test  -Dtestcase=TestCoreDiscovery -Dtests.seed=BD62CC45597DEBC2 -Dtests.multiplier=2 -Dtests.slow=true -Dtests.locale=id-ID -Dtests.timezone=America/Scoresbysund -Dtests.asserts=true -Dtests.file.encoding=UTF-8
   [junit4] ERROR   0.00s J2 | TestCoreDiscovery (suite) <<<
   [junit4]    > Throwable #1: java.lang.AssertionError: ObjectTracker found 4 object(s) that were not released!!! [MockDirectoryWrapper, SolrCore, MockDirectoryWrapper, MDCAwareThreadPoolExecutor]
   [junit4]    > 	at __randomizedtesting.SeedInfo.seed([BD62CC45597DEBC2]:0)
   [junit4]    > 	at org.apache.solr.SolrTestCaseJ4.afterClass(SolrTestCaseJ4.java:256)
   [junit4]    > 	at java.lang.Thread.run(Thread.java:745)Throwable #2: com.carrotsearch.randomizedtesting.ThreadLeakError: 1 thread leaked from SUITE scope at org.apache.solr.core.TestCoreDiscovery: 
   [junit4]    >    1) Thread[id=58658, name=searcherExecutor-5293-thread-1, state=WAITING, group=TGRP-TestCoreDiscovery]
   [junit4]    >         at sun.misc.Unsafe.park(Native Method)
   [junit4]    >         at java.util.concurrent.locks.LockSupport.park(LockSupport.java:175)
   [junit4]    >         at java.util.concurrent.locks.AbstractQueuedSynchronizer$ConditionObject.await(AbstractQueuedSynchronizer.java:2039)
   [junit4]    >         at java.util.concurrent.LinkedBlockingQueue.take(LinkedBlockingQueue.java:442)
   [junit4]    >         at java.util.concurrent.ThreadPoolExecutor.getTask(ThreadPoolExecutor.java:1067)
   [junit4]    >         at java.util.concurrent.ThreadPoolExecutor.runWorker(ThreadPoolExecutor.java:1127)
   [junit4]    >         at java.util.concurrent.ThreadPoolExecutor$Worker.run(ThreadPoolExecutor.java:617)
   [junit4]    >         at java.lang.Thread.run(Thread.java:745)
   [junit4]    > 	at __randomizedtesting.SeedInfo.seed([BD62CC45597DEBC2]:0)Throwable #3: com.carrotsearch.randomizedtesting.ThreadLeakError: There are still zombie threads that couldn't be terminated:
   [junit4]    >    1) Thread[id=58658, name=searcherExecutor-5293-thread-1, state=WAITING, group=TGRP-TestCoreDiscovery]
   [junit4]    >         at sun.misc.Unsafe.park(Native Method)
   [junit4]    >         at java.util.concurrent.locks.LockSupport.park(LockSupport.java:175)
   [junit4]    >         at java.util.concurrent.locks.AbstractQueuedSynchronizer$ConditionObject.await(AbstractQueuedSynchronizer.java:2039)
   [junit4]    >         at java.util.concurrent.LinkedBlockingQueue.take(LinkedBlockingQueue.java:442)
   [junit4]    >         at java.util.concurrent.ThreadPoolExecutor.getTask(ThreadPoolExecutor.java:1067)
   [junit4]    >         at java.util.concurrent.ThreadPoolExecutor.runWorker(ThreadPoolExecutor.java:1127)
   [junit4]    >         at java.util.concurrent.ThreadPoolExecutor$Worker.run(ThreadPoolExecutor.java:617)
   [junit4]    >         at java.lang.Thread.run(Thread.java:745)
   [junit4]    > 	at __randomizedtesting.SeedInfo.seed([BD62CC45597DEBC2]:0)
   [junit4] Completed [248/591 (2!)] on J2 in 147.61s, 12 tests, 1 failure, 2 errors <<< FAILURES!

[...truncated 1117 lines...]
BUILD FAILED
/x1/jenkins/jenkins-slave/workspace/Lucene-Solr-Tests-6.x/build.xml:740: The following error occurred while executing this line:
/x1/jenkins/jenkins-slave/workspace/Lucene-Solr-Tests-6.x/build.xml:684: The following error occurred while executing this line:
/x1/jenkins/jenkins-slave/workspace/Lucene-Solr-Tests-6.x/build.xml:59: The following error occurred while executing this line:
/x1/jenkins/jenkins-slave/workspace/Lucene-Solr-Tests-6.x/solr/build.xml:233: The following error occurred while executing this line:
/x1/jenkins/jenkins-slave/workspace/Lucene-Solr-Tests-6.x/solr/common-build.xml:529: The following error occurred while executing this line:
/x1/jenkins/jenkins-slave/workspace/Lucene-Solr-Tests-6.x/lucene/common-build.xml:1457: The following error occurred while executing this line:
/x1/jenkins/jenkins-slave/workspace/Lucene-Solr-Tests-6.x/lucene/common-build.xml:1014: There were test failures: 591 suites (10 ignored), 2381 tests, 3 suite-level errors, 1 failure, 1071 ignored (66 assumptions) [seed: BD62CC45597DEBC2]

Total time: 80 minutes 9 seconds
Build step 'Invoke Ant' marked build as failure
Archiving artifacts
Recording test results
Email was triggered for: Failure - Any
Sending email for trigger: Failure - Any




Mime
View raw message