lucene-dev mailing list archives

Site index · List index
Message view « Date » · « Thread »
Top « Date » · « Thread »
From Policeman Jenkins Server <jenk...@thetaphi.de>
Subject [JENKINS-EA] Lucene-Solr-master-Linux (32bit/jdk-9-ea+114) - Build # 16574 - Still Failing!
Date Sun, 24 Apr 2016 12:17:55 GMT
Build: http://jenkins.thetaphi.de/job/Lucene-Solr-master-Linux/16574/
Java: 32bit/jdk-9-ea+114 -client -XX:+UseConcMarkSweepGC

1 tests failed.
FAILED:  org.apache.solr.schema.TestManagedSchemaAPI.test

Error Message:
Error from server at http://127.0.0.1:42902/solr/testschemaapi_shard1_replica1: ERROR: [doc=2] unknown field 'myNewField1'

Stack Trace:
org.apache.solr.client.solrj.impl.CloudSolrClient$RouteException: Error from server at http://127.0.0.1:42902/solr/testschemaapi_shard1_replica1: ERROR: [doc=2] unknown field 'myNewField1'
	at __randomizedtesting.SeedInfo.seed([1FE198B03559C2C5:97B5A76A9BA5AF3D]:0)
	at org.apache.solr.client.solrj.impl.CloudSolrClient.directUpdate(CloudSolrClient.java:661)
	at org.apache.solr.client.solrj.impl.CloudSolrClient.sendRequest(CloudSolrClient.java:1073)
	at org.apache.solr.client.solrj.impl.CloudSolrClient.requestWithRetryOnStaleState(CloudSolrClient.java:962)
	at org.apache.solr.client.solrj.impl.CloudSolrClient.request(CloudSolrClient.java:898)
	at org.apache.solr.schema.TestManagedSchemaAPI.testAddFieldAndDocument(TestManagedSchemaAPI.java:86)
	at org.apache.solr.schema.TestManagedSchemaAPI.test(TestManagedSchemaAPI.java:55)
	at sun.reflect.NativeMethodAccessorImpl.invoke0(java.base@9-ea/Native Method)
	at sun.reflect.NativeMethodAccessorImpl.invoke(java.base@9-ea/NativeMethodAccessorImpl.java:62)
	at sun.reflect.DelegatingMethodAccessorImpl.invoke(java.base@9-ea/DelegatingMethodAccessorImpl.java:43)
	at java.lang.reflect.Method.invoke(java.base@9-ea/Method.java:531)
	at com.carrotsearch.randomizedtesting.RandomizedRunner.invoke(RandomizedRunner.java:1764)
	at com.carrotsearch.randomizedtesting.RandomizedRunner$8.evaluate(RandomizedRunner.java:871)
	at com.carrotsearch.randomizedtesting.RandomizedRunner$9.evaluate(RandomizedRunner.java:907)
	at com.carrotsearch.randomizedtesting.RandomizedRunner$10.evaluate(RandomizedRunner.java:921)
	at com.carrotsearch.randomizedtesting.rules.SystemPropertiesRestoreRule$1.evaluate(SystemPropertiesRestoreRule.java:57)
	at org.apache.lucene.util.TestRuleSetupTeardownChained$1.evaluate(TestRuleSetupTeardownChained.java:49)
	at org.apache.lucene.util.AbstractBeforeAfterRule$1.evaluate(AbstractBeforeAfterRule.java:45)
	at org.apache.lucene.util.TestRuleThreadAndTestName$1.evaluate(TestRuleThreadAndTestName.java:48)
	at org.apache.lucene.util.TestRuleIgnoreAfterMaxFailures$1.evaluate(TestRuleIgnoreAfterMaxFailures.java:64)
	at org.apache.lucene.util.TestRuleMarkFailure$1.evaluate(TestRuleMarkFailure.java:47)
	at com.carrotsearch.randomizedtesting.rules.StatementAdapter.evaluate(StatementAdapter.java:36)
	at com.carrotsearch.randomizedtesting.ThreadLeakControl$StatementRunner.run(ThreadLeakControl.java:367)
	at com.carrotsearch.randomizedtesting.ThreadLeakControl.forkTimeoutingTask(ThreadLeakControl.java:809)
	at com.carrotsearch.randomizedtesting.ThreadLeakControl$3.evaluate(ThreadLeakControl.java:460)
	at com.carrotsearch.randomizedtesting.RandomizedRunner.runSingleTest(RandomizedRunner.java:880)
	at com.carrotsearch.randomizedtesting.RandomizedRunner$5.evaluate(RandomizedRunner.java:781)
	at com.carrotsearch.randomizedtesting.RandomizedRunner$6.evaluate(RandomizedRunner.java:816)
	at com.carrotsearch.randomizedtesting.RandomizedRunner$7.evaluate(RandomizedRunner.java:827)
	at com.carrotsearch.randomizedtesting.rules.StatementAdapter.evaluate(StatementAdapter.java:36)
	at com.carrotsearch.randomizedtesting.rules.SystemPropertiesRestoreRule$1.evaluate(SystemPropertiesRestoreRule.java:57)
	at org.apache.lucene.util.AbstractBeforeAfterRule$1.evaluate(AbstractBeforeAfterRule.java:45)
	at com.carrotsearch.randomizedtesting.rules.StatementAdapter.evaluate(StatementAdapter.java:36)
	at org.apache.lucene.util.TestRuleStoreClassName$1.evaluate(TestRuleStoreClassName.java:41)
	at com.carrotsearch.randomizedtesting.rules.NoShadowingOrOverridesOnMethodsRule$1.evaluate(NoShadowingOrOverridesOnMethodsRule.java:40)
	at com.carrotsearch.randomizedtesting.rules.NoShadowingOrOverridesOnMethodsRule$1.evaluate(NoShadowingOrOverridesOnMethodsRule.java:40)
	at com.carrotsearch.randomizedtesting.rules.StatementAdapter.evaluate(StatementAdapter.java:36)
	at com.carrotsearch.randomizedtesting.rules.StatementAdapter.evaluate(StatementAdapter.java:36)
	at com.carrotsearch.randomizedtesting.rules.StatementAdapter.evaluate(StatementAdapter.java:36)
	at org.apache.lucene.util.TestRuleAssertionsRequired$1.evaluate(TestRuleAssertionsRequired.java:53)
	at org.apache.lucene.util.TestRuleMarkFailure$1.evaluate(TestRuleMarkFailure.java:47)
	at org.apache.lucene.util.TestRuleIgnoreAfterMaxFailures$1.evaluate(TestRuleIgnoreAfterMaxFailures.java:64)
	at org.apache.lucene.util.TestRuleIgnoreTestSuites$1.evaluate(TestRuleIgnoreTestSuites.java:54)
	at com.carrotsearch.randomizedtesting.rules.StatementAdapter.evaluate(StatementAdapter.java:36)
	at com.carrotsearch.randomizedtesting.ThreadLeakControl$StatementRunner.run(ThreadLeakControl.java:367)
	at java.lang.Thread.run(java.base@9-ea/Thread.java:804)
Caused by: org.apache.solr.client.solrj.impl.HttpSolrClient$RemoteSolrException: Error from server at http://127.0.0.1:42902/solr/testschemaapi_shard1_replica1: ERROR: [doc=2] unknown field 'myNewField1'
	at org.apache.solr.client.solrj.impl.HttpSolrClient.executeMethod(HttpSolrClient.java:606)
	at org.apache.solr.client.solrj.impl.HttpSolrClient.request(HttpSolrClient.java:259)
	at org.apache.solr.client.solrj.impl.HttpSolrClient.request(HttpSolrClient.java:248)
	at org.apache.solr.client.solrj.impl.LBHttpSolrClient.doRequest(LBHttpSolrClient.java:413)
	at org.apache.solr.client.solrj.impl.LBHttpSolrClient.request(LBHttpSolrClient.java:366)
	at org.apache.solr.client.solrj.impl.CloudSolrClient.lambda$directUpdate$0(CloudSolrClient.java:638)
	at java.util.concurrent.FutureTask.run(java.base@9-ea/FutureTask.java:266)
	at org.apache.solr.common.util.ExecutorUtil$MDCAwareThreadPoolExecutor.lambda$execute$0(ExecutorUtil.java:229)
	at java.util.concurrent.ThreadPoolExecutor.runWorker(java.base@9-ea/ThreadPoolExecutor.java:1158)
	at java.util.concurrent.ThreadPoolExecutor$Worker.run(java.base@9-ea/ThreadPoolExecutor.java:632)
	... 1 more




Build Log:
[...truncated 11418 lines...]
   [junit4] Suite: org.apache.solr.schema.TestManagedSchemaAPI
   [junit4]   2> Creating dataDir: /home/jenkins/workspace/Lucene-Solr-master-Linux/solr/build/solr-core/test/J1/temp/solr.schema.TestManagedSchemaAPI_1FE198B03559C2C5-001/init-core-data-001
   [junit4]   2> 1017164 INFO  (SUITE-TestManagedSchemaAPI-seed#[1FE198B03559C2C5]-worker) [    ] o.a.s.SolrTestCaseJ4 Randomized ssl (false) and clientAuth (false)
   [junit4]   2> 1017165 INFO  (SUITE-TestManagedSchemaAPI-seed#[1FE198B03559C2C5]-worker) [    ] o.a.s.c.ZkTestServer STARTING ZK TEST SERVER
   [junit4]   2> 1017165 INFO  (Thread-2734) [    ] o.a.s.c.ZkTestServer client port:0.0.0.0/0.0.0.0:0
   [junit4]   2> 1017165 INFO  (Thread-2734) [    ] o.a.s.c.ZkTestServer Starting server
   [junit4]   2> 1017265 INFO  (SUITE-TestManagedSchemaAPI-seed#[1FE198B03559C2C5]-worker) [    ] o.a.s.c.ZkTestServer start zk server on port:33939
   [junit4]   2> 1017265 INFO  (SUITE-TestManagedSchemaAPI-seed#[1FE198B03559C2C5]-worker) [    ] o.a.s.c.c.SolrZkClient Using default ZkCredentialsProvider
   [junit4]   2> 1017266 INFO  (SUITE-TestManagedSchemaAPI-seed#[1FE198B03559C2C5]-worker) [    ] o.a.s.c.c.ConnectionManager Waiting for client to connect to ZooKeeper
   [junit4]   2> 1017268 INFO  (zkCallback-1120-thread-1) [    ] o.a.s.c.c.ConnectionManager Watcher org.apache.solr.common.cloud.ConnectionManager@467276 name:ZooKeeperConnection Watcher:127.0.0.1:33939 got event WatchedEvent state:SyncConnected type:None path:null path:null type:None
   [junit4]   2> 1017268 INFO  (SUITE-TestManagedSchemaAPI-seed#[1FE198B03559C2C5]-worker) [    ] o.a.s.c.c.ConnectionManager Client is connected to ZooKeeper
   [junit4]   2> 1017268 INFO  (SUITE-TestManagedSchemaAPI-seed#[1FE198B03559C2C5]-worker) [    ] o.a.s.c.c.SolrZkClient Using default ZkACLProvider
   [junit4]   2> 1017268 INFO  (SUITE-TestManagedSchemaAPI-seed#[1FE198B03559C2C5]-worker) [    ] o.a.s.c.c.SolrZkClient makePath: /solr/solr.xml
   [junit4]   2> 1017272 INFO  (jetty-launcher-1119-thread-1) [    ] o.e.j.s.Server jetty-9.3.8.v20160314
   [junit4]   2> 1017272 INFO  (jetty-launcher-1119-thread-2) [    ] o.e.j.s.Server jetty-9.3.8.v20160314
   [junit4]   2> 1017273 INFO  (jetty-launcher-1119-thread-1) [    ] o.e.j.s.h.ContextHandler Started o.e.j.s.ServletContextHandler@144efc3{/solr,null,AVAILABLE}
   [junit4]   2> 1017273 INFO  (jetty-launcher-1119-thread-2) [    ] o.e.j.s.h.ContextHandler Started o.e.j.s.ServletContextHandler@1740275{/solr,null,AVAILABLE}
   [junit4]   2> 1017273 INFO  (jetty-launcher-1119-thread-2) [    ] o.e.j.s.ServerConnector Started ServerConnector@1f7ae3e{HTTP/1.1,[http/1.1]}{127.0.0.1:42902}
   [junit4]   2> 1017273 INFO  (jetty-launcher-1119-thread-2) [    ] o.e.j.s.Server Started @1018851ms
   [junit4]   2> 1017273 INFO  (jetty-launcher-1119-thread-2) [    ] o.a.s.c.s.e.JettySolrRunner Jetty properties: {hostContext=/solr, hostPort=42902}
   [junit4]   2> 1017273 INFO  (jetty-launcher-1119-thread-1) [    ] o.e.j.s.ServerConnector Started ServerConnector@1e93d2f{HTTP/1.1,[http/1.1]}{127.0.0.1:41496}
   [junit4]   2> 1017273 INFO  (jetty-launcher-1119-thread-1) [    ] o.e.j.s.Server Started @1018851ms
   [junit4]   2> 1017274 INFO  (jetty-launcher-1119-thread-1) [    ] o.a.s.c.s.e.JettySolrRunner Jetty properties: {hostContext=/solr, hostPort=41496}
   [junit4]   2> 1017274 INFO  (jetty-launcher-1119-thread-2) [    ] o.a.s.s.SolrDispatchFilter SolrDispatchFilter.init(): jdk.internal.loader.ClassLoaders$AppClassLoader@66d33a
   [junit4]   2> 1017274 INFO  (jetty-launcher-1119-thread-2) [    ] o.a.s.c.SolrResourceLoader new SolrResourceLoader for directory: '/home/jenkins/workspace/Lucene-Solr-master-Linux/solr/build/solr-core/test/J1/temp/solr.schema.TestManagedSchemaAPI_1FE198B03559C2C5-001/tempDir-001/node2'
   [junit4]   2> 1017274 INFO  (jetty-launcher-1119-thread-1) [    ] o.a.s.s.SolrDispatchFilter SolrDispatchFilter.init(): jdk.internal.loader.ClassLoaders$AppClassLoader@66d33a
   [junit4]   2> 1017274 INFO  (jetty-launcher-1119-thread-1) [    ] o.a.s.c.SolrResourceLoader new SolrResourceLoader for directory: '/home/jenkins/workspace/Lucene-Solr-master-Linux/solr/build/solr-core/test/J1/temp/solr.schema.TestManagedSchemaAPI_1FE198B03559C2C5-001/tempDir-001/node1'
   [junit4]   2> 1017274 INFO  (jetty-launcher-1119-thread-2) [    ] o.a.s.c.SolrResourceLoader JNDI not configured for solr (NoInitialContextEx)
   [junit4]   2> 1017274 INFO  (jetty-launcher-1119-thread-2) [    ] o.a.s.c.SolrResourceLoader solr home defaulted to 'solr/' (could not find system property or JNDI)
   [junit4]   2> 1017274 INFO  (jetty-launcher-1119-thread-1) [    ] o.a.s.c.SolrResourceLoader JNDI not configured for solr (NoInitialContextEx)
   [junit4]   2> 1017274 INFO  (jetty-launcher-1119-thread-1) [    ] o.a.s.c.SolrResourceLoader solr home defaulted to 'solr/' (could not find system property or JNDI)
   [junit4]   2> 1017274 INFO  (jetty-launcher-1119-thread-2) [    ] o.a.s.c.c.SolrZkClient Using default ZkCredentialsProvider
   [junit4]   2> 1017274 INFO  (jetty-launcher-1119-thread-1) [    ] o.a.s.c.c.SolrZkClient Using default ZkCredentialsProvider
   [junit4]   2> 1017274 INFO  (jetty-launcher-1119-thread-2) [    ] o.a.s.c.c.ConnectionManager Waiting for client to connect to ZooKeeper
   [junit4]   2> 1017275 INFO  (jetty-launcher-1119-thread-1) [    ] o.a.s.c.c.ConnectionManager Waiting for client to connect to ZooKeeper
   [junit4]   2> 1017276 INFO  (zkCallback-1121-thread-1) [    ] o.a.s.c.c.ConnectionManager Watcher org.apache.solr.common.cloud.ConnectionManager@15082f2 name:ZooKeeperConnection Watcher:127.0.0.1:33939/solr got event WatchedEvent state:SyncConnected type:None path:null path:null type:None
   [junit4]   2> 1017276 INFO  (jetty-launcher-1119-thread-2) [    ] o.a.s.c.c.ConnectionManager Client is connected to ZooKeeper
   [junit4]   2> 1017276 INFO  (zkCallback-1122-thread-1) [    ] o.a.s.c.c.ConnectionManager Watcher org.apache.solr.common.cloud.ConnectionManager@17c228c name:ZooKeeperConnection Watcher:127.0.0.1:33939/solr got event WatchedEvent state:SyncConnected type:None path:null path:null type:None
   [junit4]   2> 1017276 INFO  (jetty-launcher-1119-thread-1) [    ] o.a.s.c.c.ConnectionManager Client is connected to ZooKeeper
   [junit4]   2> 1017276 INFO  (jetty-launcher-1119-thread-2) [    ] o.a.s.c.c.SolrZkClient Using default ZkACLProvider
   [junit4]   2> 1017276 INFO  (jetty-launcher-1119-thread-1) [    ] o.a.s.c.c.SolrZkClient Using default ZkACLProvider
   [junit4]   2> 1017276 INFO  (jetty-launcher-1119-thread-2) [    ] o.a.s.s.SolrDispatchFilter solr.xml found in ZooKeeper. Loading...
   [junit4]   2> 1017276 INFO  (jetty-launcher-1119-thread-1) [    ] o.a.s.s.SolrDispatchFilter solr.xml found in ZooKeeper. Loading...
   [junit4]   2> 1017281 INFO  (jetty-launcher-1119-thread-1) [    ] o.a.s.c.CorePropertiesLocator Config-defined core root directory: /home/jenkins/workspace/Lucene-Solr-master-Linux/solr/build/solr-core/test/J1/temp/solr.schema.TestManagedSchemaAPI_1FE198B03559C2C5-001/tempDir-001/node1/.
   [junit4]   2> 1017281 WARN  (NIOServerCxn.Factory:0.0.0.0/0.0.0.0:0) [    ] o.a.z.s.NIOServerCnxn caught end of stream exception
   [junit4]   2> EndOfStreamException: Unable to read additional data from client sessionid 0x1544823822f0001, likely client has closed socket
   [junit4]   2> 	at org.apache.zookeeper.server.NIOServerCnxn.doIO(NIOServerCnxn.java:228)
   [junit4]   2> 	at org.apache.zookeeper.server.NIOServerCnxnFactory.run(NIOServerCnxnFactory.java:208)
   [junit4]   2> 	at java.lang.Thread.run(java.base@9-ea/Thread.java:804)
   [junit4]   2> 1017281 INFO  (jetty-launcher-1119-thread-2) [    ] o.a.s.c.CorePropertiesLocator Config-defined core root directory: /home/jenkins/workspace/Lucene-Solr-master-Linux/solr/build/solr-core/test/J1/temp/solr.schema.TestManagedSchemaAPI_1FE198B03559C2C5-001/tempDir-001/node2/.
   [junit4]   2> 1017281 INFO  (jetty-launcher-1119-thread-1) [    ] o.a.s.c.CoreContainer New CoreContainer 28296496
   [junit4]   2> 1017281 INFO  (jetty-launcher-1119-thread-2) [    ] o.a.s.c.CoreContainer New CoreContainer 10627091
   [junit4]   2> 1017281 INFO  (jetty-launcher-1119-thread-1) [    ] o.a.s.c.CoreContainer Loading cores into CoreContainer [instanceDir=/home/jenkins/workspace/Lucene-Solr-master-Linux/solr/build/solr-core/test/J1/temp/solr.schema.TestManagedSchemaAPI_1FE198B03559C2C5-001/tempDir-001/node1]
   [junit4]   2> 1017281 INFO  (jetty-launcher-1119-thread-2) [    ] o.a.s.c.CoreContainer Loading cores into CoreContainer [instanceDir=/home/jenkins/workspace/Lucene-Solr-master-Linux/solr/build/solr-core/test/J1/temp/solr.schema.TestManagedSchemaAPI_1FE198B03559C2C5-001/tempDir-001/node2]
   [junit4]   2> 1017282 WARN  (jetty-launcher-1119-thread-1) [    ] o.a.s.c.CoreContainer Couldn't add files from /home/jenkins/workspace/Lucene-Solr-master-Linux/solr/build/solr-core/test/J1/temp/solr.schema.TestManagedSchemaAPI_1FE198B03559C2C5-001/tempDir-001/node1/lib to classpath: /home/jenkins/workspace/Lucene-Solr-master-Linux/solr/build/solr-core/test/J1/temp/solr.schema.TestManagedSchemaAPI_1FE198B03559C2C5-001/tempDir-001/node1/lib
   [junit4]   2> 1017282 WARN  (jetty-launcher-1119-thread-2) [    ] o.a.s.c.CoreContainer Couldn't add files from /home/jenkins/workspace/Lucene-Solr-master-Linux/solr/build/solr-core/test/J1/temp/solr.schema.TestManagedSchemaAPI_1FE198B03559C2C5-001/tempDir-001/node2/lib to classpath: /home/jenkins/workspace/Lucene-Solr-master-Linux/solr/build/solr-core/test/J1/temp/solr.schema.TestManagedSchemaAPI_1FE198B03559C2C5-001/tempDir-001/node2/lib
   [junit4]   2> 1017282 INFO  (jetty-launcher-1119-thread-1) [    ] o.a.s.h.c.HttpShardHandlerFactory created with socketTimeout : 90000,urlScheme : ,connTimeout : 15000,maxConnectionsPerHost : 20,maxConnections : 10000,corePoolSize : 0,maximumPoolSize : 2147483647,maxThreadIdleTime : 5,sizeOfQueue : -1,fairnessPolicy : false,
   [junit4]   2> 1017282 INFO  (jetty-launcher-1119-thread-2) [    ] o.a.s.h.c.HttpShardHandlerFactory created with socketTimeout : 90000,urlScheme : ,connTimeout : 15000,maxConnectionsPerHost : 20,maxConnections : 10000,corePoolSize : 0,maximumPoolSize : 2147483647,maxThreadIdleTime : 5,sizeOfQueue : -1,fairnessPolicy : false,
   [junit4]   2> 1017283 INFO  (jetty-launcher-1119-thread-2) [    ] o.a.s.u.UpdateShardHandler Creating UpdateShardHandler HTTP client with params: 
   [junit4]   2> 1017283 INFO  (jetty-launcher-1119-thread-1) [    ] o.a.s.u.UpdateShardHandler Creating UpdateShardHandler HTTP client with params: 
   [junit4]   2> 1017284 INFO  (jetty-launcher-1119-thread-2) [    ] o.a.s.l.LogWatcher SLF4J impl is org.slf4j.impl.Log4jLoggerFactory
   [junit4]   2> 1017284 INFO  (jetty-launcher-1119-thread-2) [    ] o.a.s.l.LogWatcher Registering Log Listener [Log4j (org.slf4j.impl.Log4jLoggerFactory)]
   [junit4]   2> 1017284 INFO  (jetty-launcher-1119-thread-1) [    ] o.a.s.l.LogWatcher SLF4J impl is org.slf4j.impl.Log4jLoggerFactory
   [junit4]   2> 1017284 INFO  (jetty-launcher-1119-thread-1) [    ] o.a.s.l.LogWatcher Registering Log Listener [Log4j (org.slf4j.impl.Log4jLoggerFactory)]
   [junit4]   2> 1017284 INFO  (jetty-launcher-1119-thread-2) [    ] o.a.s.c.ZkContainer Zookeeper client=127.0.0.1:33939/solr
   [junit4]   2> 1017284 INFO  (jetty-launcher-1119-thread-2) [    ] o.a.s.c.ZkController zkHost includes chroot
   [junit4]   2> 1017284 INFO  (jetty-launcher-1119-thread-1) [    ] o.a.s.c.ZkContainer Zookeeper client=127.0.0.1:33939/solr
   [junit4]   2> 1017284 INFO  (jetty-launcher-1119-thread-2) [    ] o.a.s.c.c.SolrZkClient Using default ZkCredentialsProvider
   [junit4]   2> 1017284 INFO  (jetty-launcher-1119-thread-1) [    ] o.a.s.c.ZkController zkHost includes chroot
   [junit4]   2> 1017284 INFO  (jetty-launcher-1119-thread-1) [    ] o.a.s.c.c.SolrZkClient Using default ZkCredentialsProvider
   [junit4]   2> 1017284 INFO  (jetty-launcher-1119-thread-2) [    ] o.a.s.c.c.ConnectionManager Waiting for client to connect to ZooKeeper
   [junit4]   2> 1017284 INFO  (jetty-launcher-1119-thread-1) [    ] o.a.s.c.c.ConnectionManager Waiting for client to connect to ZooKeeper
   [junit4]   2> 1017285 INFO  (zkCallback-1127-thread-1) [    ] o.a.s.c.c.ConnectionManager Watcher org.apache.solr.common.cloud.ConnectionManager@1434f4b name:ZooKeeperConnection Watcher:127.0.0.1:33939 got event WatchedEvent state:SyncConnected type:None path:null path:null type:None
   [junit4]   2> 1017285 INFO  (jetty-launcher-1119-thread-2) [    ] o.a.s.c.c.ConnectionManager Client is connected to ZooKeeper
   [junit4]   2> 1017285 INFO  (zkCallback-1128-thread-1) [    ] o.a.s.c.c.ConnectionManager Watcher org.apache.solr.common.cloud.ConnectionManager@344cac name:ZooKeeperConnection Watcher:127.0.0.1:33939 got event WatchedEvent state:SyncConnected type:None path:null path:null type:None
   [junit4]   2> 1017285 INFO  (jetty-launcher-1119-thread-1) [    ] o.a.s.c.c.ConnectionManager Client is connected to ZooKeeper
   [junit4]   2> 1017285 INFO  (jetty-launcher-1119-thread-2) [    ] o.a.s.c.c.SolrZkClient Using default ZkACLProvider
   [junit4]   2> 1017286 INFO  (jetty-launcher-1119-thread-1) [    ] o.a.s.c.c.SolrZkClient Using default ZkACLProvider
   [junit4]   2> 1017286 INFO  (jetty-launcher-1119-thread-2) [    ] o.a.s.c.ZkController Added new OnReconnect listener org.apache.solr.cloud.ZkController$$Lambda$83/28796661@edb44a
   [junit4]   2> 1017286 INFO  (jetty-launcher-1119-thread-1) [    ] o.a.s.c.ZkController Added new OnReconnect listener org.apache.solr.cloud.ZkController$$Lambda$83/28796661@163802e
   [junit4]   2> 1017287 INFO  (jetty-launcher-1119-thread-2) [    ] o.a.s.c.c.ConnectionManager Waiting for client to connect to ZooKeeper
   [junit4]   2> 1017287 INFO  (jetty-launcher-1119-thread-1) [    ] o.a.s.c.c.ConnectionManager Waiting for client to connect to ZooKeeper
   [junit4]   2> 1017287 INFO  (zkCallback-1129-thread-1) [    ] o.a.s.c.c.ConnectionManager Watcher org.apache.solr.common.cloud.ConnectionManager@1f428bf name:ZooKeeperConnection Watcher:127.0.0.1:33939/solr got event WatchedEvent state:SyncConnected type:None path:null path:null type:None
   [junit4]   2> 1017287 INFO  (jetty-launcher-1119-thread-2) [    ] o.a.s.c.c.ConnectionManager Client is connected to ZooKeeper
   [junit4]   2> 1017288 INFO  (zkCallback-1130-thread-1) [    ] o.a.s.c.c.ConnectionManager Watcher org.apache.solr.common.cloud.ConnectionManager@1d6472d name:ZooKeeperConnection Watcher:127.0.0.1:33939/solr got event WatchedEvent state:SyncConnected type:None path:null path:null type:None
   [junit4]   2> 1017288 INFO  (jetty-launcher-1119-thread-1) [    ] o.a.s.c.c.ConnectionManager Client is connected to ZooKeeper
   [junit4]   2> 1017288 INFO  (jetty-launcher-1119-thread-2) [    ] o.a.s.c.c.SolrZkClient makePath: /overseer/queue
   [junit4]   2> 1017288 INFO  (jetty-launcher-1119-thread-1) [    ] o.a.s.c.c.SolrZkClient makePath: /overseer/queue
   [junit4]   2> 1017289 INFO  (jetty-launcher-1119-thread-1) [    ] o.a.s.c.c.SolrZkClient makePath: /overseer/collection-queue-work
   [junit4]   2> 1017289 INFO  (jetty-launcher-1119-thread-2) [    ] o.a.s.c.c.SolrZkClient makePath: /overseer/collection-queue-work
   [junit4]   2> 1017292 INFO  (jetty-launcher-1119-thread-2) [    ] o.a.s.c.c.SolrZkClient makePath: /overseer/collection-map-running
   [junit4]   2> 1017292 INFO  (jetty-launcher-1119-thread-1) [    ] o.a.s.c.c.SolrZkClient makePath: /overseer/collection-map-running
   [junit4]   2> 1017293 INFO  (jetty-launcher-1119-thread-1) [    ] o.a.s.c.c.SolrZkClient makePath: /overseer/collection-map-completed
   [junit4]   2> 1017293 INFO  (jetty-launcher-1119-thread-2) [    ] o.a.s.c.c.SolrZkClient makePath: /overseer/collection-map-completed
   [junit4]   2> 1017294 INFO  (jetty-launcher-1119-thread-1) [    ] o.a.s.c.c.SolrZkClient makePath: /overseer/collection-map-failure
   [junit4]   2> 1017294 INFO  (jetty-launcher-1119-thread-2) [    ] o.a.s.c.c.SolrZkClient makePath: /overseer/collection-map-failure
   [junit4]   2> 1017296 INFO  (jetty-launcher-1119-thread-2) [    ] o.a.s.c.c.SolrZkClient makePath: /live_nodes
   [junit4]   2> 1017296 INFO  (jetty-launcher-1119-thread-1) [    ] o.a.s.c.c.SolrZkClient makePath: /live_nodes
   [junit4]   2> 1017297 INFO  (jetty-launcher-1119-thread-1) [    ] o.a.s.c.c.SolrZkClient makePath: /collections
   [junit4]   2> 1017297 INFO  (jetty-launcher-1119-thread-2) [    ] o.a.s.c.c.SolrZkClient makePath: /collections
   [junit4]   2> 1017297 INFO  (jetty-launcher-1119-thread-2) [    ] o.a.s.c.c.SolrZkClient makePath: /aliases.json
   [junit4]   2> 1017297 INFO  (jetty-launcher-1119-thread-1) [    ] o.a.s.c.c.SolrZkClient makePath: /aliases.json
   [junit4]   2> 1017298 INFO  (jetty-launcher-1119-thread-1) [    ] o.a.s.c.c.SolrZkClient makePath: /clusterstate.json
   [junit4]   2> 1017298 INFO  (jetty-launcher-1119-thread-2) [    ] o.a.s.c.c.SolrZkClient makePath: /clusterstate.json
   [junit4]   2> 1017299 INFO  (jetty-launcher-1119-thread-2) [    ] o.a.s.c.c.SolrZkClient makePath: /security.json
   [junit4]   2> 1017299 INFO  (jetty-launcher-1119-thread-1) [    ] o.a.s.c.c.SolrZkClient makePath: /security.json
   [junit4]   2> 1017299 INFO  (jetty-launcher-1119-thread-2) [    ] o.a.s.c.c.ZkStateReader Updating cluster state from ZooKeeper... 
   [junit4]   2> 1017299 INFO  (jetty-launcher-1119-thread-1) [    ] o.a.s.c.c.ZkStateReader Updating cluster state from ZooKeeper... 
   [junit4]   2> 1017300 INFO  (jetty-launcher-1119-thread-2) [    ] o.a.s.c.c.ZkStateReader Updated live nodes from ZooKeeper... (0) -> (0)
   [junit4]   2> 1017300 INFO  (jetty-launcher-1119-thread-1) [    ] o.a.s.c.c.ZkStateReader Updated live nodes from ZooKeeper... (0) -> (0)
   [junit4]   2> 1017301 INFO  (jetty-launcher-1119-thread-2) [    ] o.a.s.c.c.SolrZkClient makePath: /overseer_elect
   [junit4]   2> 1017302 INFO  (jetty-launcher-1119-thread-1) [    ] o.a.s.c.c.SolrZkClient makePath: /overseer_elect
   [junit4]   2> 1017302 INFO  (jetty-launcher-1119-thread-1) [    ] o.a.s.c.c.SolrZkClient makePath: /overseer_elect/election
   [junit4]   2> 1017302 INFO  (jetty-launcher-1119-thread-2) [    ] o.a.s.c.c.SolrZkClient makePath: /overseer_elect/election
   [junit4]   2> 1017303 INFO  (jetty-launcher-1119-thread-2) [    ] o.a.s.c.Overseer Overseer (id=null) closing
   [junit4]   2> 1017303 INFO  (jetty-launcher-1119-thread-1) [    ] o.a.s.c.Overseer Overseer (id=null) closing
   [junit4]   2> 1017303 INFO  (jetty-launcher-1119-thread-2) [    ] o.a.s.c.LeaderElector Joined leadership election with path: /overseer_elect/election/95780809426796549-127.0.0.1:42902_solr-n_0000000000
   [junit4]   2> 1017303 INFO  (jetty-launcher-1119-thread-1) [    ] o.a.s.c.LeaderElector Joined leadership election with path: /overseer_elect/election/95780809426796550-127.0.0.1:41496_solr-n_0000000001
   [junit4]   2> 1017304 INFO  (jetty-launcher-1119-thread-2) [    ] o.a.s.c.OverseerElectionContext I am going to be the leader 127.0.0.1:42902_solr
   [junit4]   2> 1017304 INFO  (jetty-launcher-1119-thread-2) [    ] o.a.s.c.c.SolrZkClient makePath: /overseer_elect/leader
   [junit4]   2> 1017304 INFO  (jetty-launcher-1119-thread-1) [    ] o.a.s.c.LeaderElector Watching path /overseer_elect/election/95780809426796549-127.0.0.1:42902_solr-n_0000000000 to know if I could be the leader
   [junit4]   2> 1017304 INFO  (jetty-launcher-1119-thread-1) [    ] o.a.s.c.ZkController Register node as live in ZooKeeper:/live_nodes/127.0.0.1:41496_solr
   [junit4]   2> 1017304 INFO  (jetty-launcher-1119-thread-1) [    ] o.a.s.c.c.SolrZkClient makePath: /live_nodes/127.0.0.1:41496_solr
   [junit4]   2> 1017304 INFO  (jetty-launcher-1119-thread-2) [    ] o.a.s.c.Overseer Overseer (id=95780809426796549-127.0.0.1:42902_solr-n_0000000000) starting
   [junit4]   2> 1017305 INFO  (zkCallback-1130-thread-1) [    ] o.a.s.c.c.ZkStateReader A live node change: [WatchedEvent state:SyncConnected type:NodeChildrenChanged path:/live_nodes], has occurred - updating... (live nodes size: [0])
   [junit4]   2> 1017305 INFO  (zkCallback-1129-thread-1) [    ] o.a.s.c.c.ZkStateReader A live node change: [WatchedEvent state:SyncConnected type:NodeChildrenChanged path:/live_nodes], has occurred - updating... (live nodes size: [0])
   [junit4]   2> 1017306 INFO  (zkCallback-1130-thread-1) [    ] o.a.s.c.c.ZkStateReader Updated live nodes from ZooKeeper... (0) -> (1)
   [junit4]   2> 1017306 INFO  (zkCallback-1129-thread-1) [    ] o.a.s.c.c.ZkStateReader Updated live nodes from ZooKeeper... (0) -> (1)
   [junit4]   2> 1017306 INFO  (jetty-launcher-1119-thread-2) [    ] o.a.s.c.c.SolrZkClient makePath: /overseer/queue-work
   [junit4]   2> 1017310 INFO  (jetty-launcher-1119-thread-2) [    ] o.a.s.c.OverseerAutoReplicaFailoverThread Starting OverseerAutoReplicaFailoverThread autoReplicaFailoverWorkLoopDelay=10000 autoReplicaFailoverWaitAfterExpiration=30000 autoReplicaFailoverBadNodeExpiration=60000
   [junit4]   2> 1017311 INFO  (OverseerStateUpdate-95780809426796549-127.0.0.1:42902_solr-n_0000000000) [    ] o.a.s.c.Overseer Starting to work on the main queue
   [junit4]   2> 1017312 INFO  (OverseerStateUpdate-95780809426796549-127.0.0.1:42902_solr-n_0000000000) [    ] o.a.s.c.c.ZkStateReader Updated live nodes from ZooKeeper... (1) -> (1)
   [junit4]   2> 1017312 INFO  (jetty-launcher-1119-thread-2) [    ] o.a.s.c.ZkController Publish node=127.0.0.1:42902_solr as DOWN
   [junit4]   2> 1017313 INFO  (OverseerCollectionConfigSetProcessor-95780809426796549-127.0.0.1:42902_solr-n_0000000000) [    ] o.a.s.c.OverseerTaskProcessor Process current queue of overseer operations
   [junit4]   2> 1017313 INFO  (OverseerStateUpdate-95780809426796549-127.0.0.1:42902_solr-n_0000000000) [    ] o.a.s.c.Overseer processMessage: queueSize: 1, message = {
   [junit4]   2>   "operation":"downnode",
   [junit4]   2>   "node_name":"127.0.0.1:42902_solr"} current state version: 0
   [junit4]   2> 1017314 INFO  (OverseerStateUpdate-95780809426796549-127.0.0.1:42902_solr-n_0000000000) [    ] o.a.s.c.o.NodeMutator DownNode state invoked for node: 127.0.0.1:42902_solr
   [junit4]   2> 1017339 INFO  (jetty-launcher-1119-thread-1) [    ] o.a.s.c.CoreContainer Security conf doesn't exist. Skipping setup for authorization module.
   [junit4]   2> 1017339 INFO  (jetty-launcher-1119-thread-1) [    ] o.a.s.c.CoreContainer No authentication plugin used.
   [junit4]   2> 1017340 INFO  (jetty-launcher-1119-thread-1) [    ] o.a.s.c.CorePropertiesLocator Looking for core definitions underneath /home/jenkins/workspace/Lucene-Solr-master-Linux/solr/build/solr-core/test/J1/temp/solr.schema.TestManagedSchemaAPI_1FE198B03559C2C5-001/tempDir-001/node1/.
   [junit4]   2> 1017340 INFO  (jetty-launcher-1119-thread-1) [    ] o.a.s.c.CorePropertiesLocator Found 0 core definitions
   [junit4]   2> 1017341 INFO  (jetty-launcher-1119-thread-1) [    ] o.a.s.s.SolrDispatchFilter user.dir=/home/jenkins/workspace/Lucene-Solr-master-Linux/solr/build/solr-core/test/J1
   [junit4]   2> 1017341 INFO  (jetty-launcher-1119-thread-1) [    ] o.a.s.s.SolrDispatchFilter SolrDispatchFilter.init() done
   [junit4]   2> 1018313 INFO  (jetty-launcher-1119-thread-2) [    ] o.a.s.c.ZkController Register node as live in ZooKeeper:/live_nodes/127.0.0.1:42902_solr
   [junit4]   2> 1018314 INFO  (jetty-launcher-1119-thread-2) [    ] o.a.s.c.c.SolrZkClient makePath: /live_nodes/127.0.0.1:42902_solr
   [junit4]   2> 1018315 INFO  (zkCallback-1130-thread-1) [    ] o.a.s.c.c.ZkStateReader A live node change: [WatchedEvent state:SyncConnected type:NodeChildrenChanged path:/live_nodes], has occurred - updating... (live nodes size: [1])
   [junit4]   2> 1018315 INFO  (zkCallback-1129-thread-1) [    ] o.a.s.c.c.ZkStateReader A live node change: [WatchedEvent state:SyncConnected type:NodeChildrenChanged path:/live_nodes], has occurred - updating... (live nodes size: [1])
   [junit4]   2> 1018315 INFO  (zkCallback-1130-thread-1) [    ] o.a.s.c.c.ZkStateReader Updated live nodes from ZooKeeper... (1) -> (2)
   [junit4]   2> 1018315 INFO  (zkCallback-1129-thread-1) [    ] o.a.s.c.c.ZkStateReader Updated live nodes from ZooKeeper... (1) -> (2)
   [junit4]   2> 1018334 INFO  (jetty-launcher-1119-thread-2) [    ] o.a.s.c.CoreContainer Security conf doesn't exist. Skipping setup for authorization module.
   [junit4]   2> 1018334 INFO  (jetty-launcher-1119-thread-2) [    ] o.a.s.c.CoreContainer No authentication plugin used.
   [junit4]   2> 1018335 INFO  (jetty-launcher-1119-thread-2) [    ] o.a.s.c.CorePropertiesLocator Looking for core definitions underneath /home/jenkins/workspace/Lucene-Solr-master-Linux/solr/build/solr-core/test/J1/temp/solr.schema.TestManagedSchemaAPI_1FE198B03559C2C5-001/tempDir-001/node2/.
   [junit4]   2> 1018335 INFO  (jetty-launcher-1119-thread-2) [    ] o.a.s.c.CorePropertiesLocator Found 0 core definitions
   [junit4]   2> 1018335 INFO  (jetty-launcher-1119-thread-2) [    ] o.a.s.s.SolrDispatchFilter user.dir=/home/jenkins/workspace/Lucene-Solr-master-Linux/solr/build/solr-core/test/J1
   [junit4]   2> 1018335 INFO  (jetty-launcher-1119-thread-2) [    ] o.a.s.s.SolrDispatchFilter SolrDispatchFilter.init() done
   [junit4]   2> 1018336 INFO  (SUITE-TestManagedSchemaAPI-seed#[1FE198B03559C2C5]-worker) [    ] o.a.s.c.c.SolrZkClient Using default ZkCredentialsProvider
   [junit4]   2> 1018336 INFO  (SUITE-TestManagedSchemaAPI-seed#[1FE198B03559C2C5]-worker) [    ] o.a.s.c.c.ConnectionManager Waiting for client to connect to ZooKeeper
   [junit4]   2> 1018337 INFO  (zkCallback-1131-thread-1) [    ] o.a.s.c.c.ConnectionManager Watcher org.apache.solr.common.cloud.ConnectionManager@b1b748 name:ZooKeeperConnection Watcher:127.0.0.1:33939 got event WatchedEvent state:SyncConnected type:None path:null path:null type:None
   [junit4]   2> 1018337 INFO  (SUITE-TestManagedSchemaAPI-seed#[1FE198B03559C2C5]-worker) [    ] o.a.s.c.c.ConnectionManager Client is connected to ZooKeeper
   [junit4]   2> 1018337 INFO  (SUITE-TestManagedSchemaAPI-seed#[1FE198B03559C2C5]-worker) [    ] o.a.s.c.c.SolrZkClient Using default ZkACLProvider
   [junit4]   2> 1018338 INFO  (SUITE-TestManagedSchemaAPI-seed#[1FE198B03559C2C5]-worker) [    ] o.a.s.c.s.i.CloudSolrClient Final constructed zkHost string: 127.0.0.1:33939/solr
   [junit4]   2> 1018339 INFO  (SUITE-TestManagedSchemaAPI-seed#[1FE198B03559C2C5]-worker) [    ] o.a.s.c.c.SolrZkClient Using default ZkCredentialsProvider
   [junit4]   2> 1018340 INFO  (SUITE-TestManagedSchemaAPI-seed#[1FE198B03559C2C5]-worker) [    ] o.a.s.c.c.ConnectionManager Waiting for client to connect to ZooKeeper
   [junit4]   2> 1018340 INFO  (zkCallback-1133-thread-1) [    ] o.a.s.c.c.ConnectionManager Watcher org.apache.solr.common.cloud.ConnectionManager@1983ac5 name:ZooKeeperConnection Watcher:127.0.0.1:33939/solr got event WatchedEvent state:SyncConnected type:None path:null path:null type:None
   [junit4]   2> 1018340 INFO  (SUITE-TestManagedSchemaAPI-seed#[1FE198B03559C2C5]-worker) [    ] o.a.s.c.c.ConnectionManager Client is connected to ZooKeeper
   [junit4]   2> 1018341 INFO  (SUITE-TestManagedSchemaAPI-seed#[1FE198B03559C2C5]-worker) [    ] o.a.s.c.c.SolrZkClient Using default ZkACLProvider
   [junit4]   2> 1018341 INFO  (SUITE-TestManagedSchemaAPI-seed#[1FE198B03559C2C5]-worker) [    ] o.a.s.c.c.ZkStateReader Updating cluster state from ZooKeeper... 
   [junit4]   2> 1018341 INFO  (SUITE-TestManagedSchemaAPI-seed#[1FE198B03559C2C5]-worker) [    ] o.a.s.c.c.ZkStateReader Updated live nodes from ZooKeeper... (0) -> (2)
   [junit4]   2> 1018342 INFO  (SUITE-TestManagedSchemaAPI-seed#[1FE198B03559C2C5]-worker) [    ] o.a.s.c.c.SolrZkClient makePath: /configs/conf1/solrconfig.xml
   [junit4]   2> 1018343 INFO  (SUITE-TestManagedSchemaAPI-seed#[1FE198B03559C2C5]-worker) [    ] o.a.s.c.c.SolrZkClient makePath: /configs/conf1/managed-schema
   [junit4]   2> 1018355 INFO  (TEST-TestManagedSchemaAPI.test-seed#[1FE198B03559C2C5]) [    ] o.a.s.SolrTestCaseJ4 ###Starting test
   [junit4]   2> 1018362 INFO  (qtp4027376-8445) [    ] o.a.s.h.a.CollectionsHandler Invoked Collection Action :create with params replicationFactor=2&collection.configName=conf1&name=testschemaapi&action=CREATE&numShards=1&wt=javabin&version=2 and sendToOCPQueue=true
   [junit4]   2> 1018364 INFO  (OverseerCollectionConfigSetProcessor-95780809426796549-127.0.0.1:42902_solr-n_0000000000) [    ] o.a.s.c.OverseerTaskProcessor Overseer Collection Message Handler: Get the message id:/overseer/collection-queue-work/qn-0000000000 message:{
   [junit4]   2>   "name":"testschemaapi",
   [junit4]   2>   "fromApi":"true",
   [junit4]   2>   "replicationFactor":"2",
   [junit4]   2>   "collection.configName":"conf1",
   [junit4]   2>   "numShards":"1",
   [junit4]   2>   "stateFormat":"2",
   [junit4]   2>   "operation":"create"}
   [junit4]   2> 1018364 INFO  (OverseerThreadFactory-3202-thread-1) [    ] o.a.s.c.OverseerCollectionMessageHandler OverseerCollectionMessageHandler.processMessage : create , {
   [junit4]   2>   "name":"testschemaapi",
   [junit4]   2>   "fromApi":"true",
   [junit4]   2>   "replicationFactor":"2",
   [junit4]   2>   "collection.configName":"conf1",
   [junit4]   2>   "numShards":"1",
   [junit4]   2>   "stateFormat":"2",
   [junit4]   2>   "operation":"create"}
   [junit4]   2> 1018364 INFO  (OverseerThreadFactory-3202-thread-1) [    ] o.a.s.c.OverseerCollectionMessageHandler Create collection testschemaapi
   [junit4]   2> 1018365 INFO  (OverseerThreadFactory-3202-thread-1) [    ] o.a.s.c.OverseerCollectionMessageHandler creating collections conf node /collections/testschemaapi 
   [junit4]   2> 1018365 INFO  (OverseerThreadFactory-3202-thread-1) [    ] o.a.s.c.c.SolrZkClient makePath: /collections/testschemaapi
   [junit4]   2> 1018365 INFO  (zkCallback-1130-thread-1) [    ] o.a.s.c.c.ZkStateReader A collections change: [WatchedEvent state:SyncConnected type:NodeChildrenChanged path:/collections], has occurred - updating...
   [junit4]   2> 1018365 INFO  (zkCallback-1129-thread-1) [    ] o.a.s.c.c.ZkStateReader A collections change: [WatchedEvent state:SyncConnected type:NodeChildrenChanged path:/collections], has occurred - updating...
   [junit4]   2> 1018365 INFO  (zkCallback-1133-thread-1) [    ] o.a.s.c.c.ZkStateReader A collections change: [WatchedEvent state:SyncConnected type:NodeChildrenChanged path:/collections], has occurred - updating...
   [junit4]   2> 1018367 INFO  (OverseerStateUpdate-95780809426796549-127.0.0.1:42902_solr-n_0000000000) [    ] o.a.s.c.Overseer processMessage: queueSize: 1, message = {
   [junit4]   2>   "name":"testschemaapi",
   [junit4]   2>   "fromApi":"true",
   [junit4]   2>   "replicationFactor":"2",
   [junit4]   2>   "collection.configName":"conf1",
   [junit4]   2>   "numShards":"1",
   [junit4]   2>   "stateFormat":"2",
   [junit4]   2>   "operation":"create"} current state version: 0
   [junit4]   2> 1018367 INFO  (OverseerStateUpdate-95780809426796549-127.0.0.1:42902_solr-n_0000000000) [    ] o.a.s.c.o.ClusterStateMutator building a new cName: testschemaapi
   [junit4]   2> 1018368 INFO  (OverseerStateUpdate-95780809426796549-127.0.0.1:42902_solr-n_0000000000) [    ] o.a.s.c.o.ZkStateWriter going to create_collection /collections/testschemaapi/state.json
   [junit4]   2> 1018467 INFO  (OverseerThreadFactory-3202-thread-1) [    ] o.a.s.c.OverseerCollectionMessageHandler Creating SolrCores for new collection testschemaapi, shardNames [shard1] , replicationFactor : 2
   [junit4]   2> 1018467 INFO  (OverseerThreadFactory-3202-thread-1) [    ] o.a.s.c.OverseerCollectionMessageHandler Creating core testschemaapi_shard1_replica1 as part of shard shard1 of collection testschemaapi on 127.0.0.1:42902_solr
   [junit4]   2> 1018468 INFO  (OverseerThreadFactory-3202-thread-1) [    ] o.a.s.c.OverseerCollectionMessageHandler Creating core testschemaapi_shard1_replica2 as part of shard shard1 of collection testschemaapi on 127.0.0.1:41496_solr
   [junit4]   2> 1018469 INFO  (qtp4027376-8449) [    ] o.a.s.h.a.CoreAdminOperation core create command qt=/admin/cores&collection.configName=conf1&name=testschemaapi_shard1_replica1&action=CREATE&numShards=1&collection=testschemaapi&shard=shard1&wt=javabin&version=2
   [junit4]   2> 1018469 INFO  (qtp32644699-8444) [    ] o.a.s.h.a.CoreAdminOperation core create command qt=/admin/cores&collection.configName=conf1&name=testschemaapi_shard1_replica2&action=CREATE&numShards=1&collection=testschemaapi&shard=shard1&wt=javabin&version=2
   [junit4]   2> 1018470 INFO  (qtp4027376-8449) [    ] o.a.s.c.CoreDescriptor Created CoreDescriptor: {name=testschemaapi_shard1_replica1, collection.configName=conf1, config=solrconfig.xml, transient=false, schema=schema.xml, loadOnStartup=true, configSetProperties=configsetprops.json, collection=testschemaapi, numShards=1, dataDir=data/, shard=shard1}
   [junit4]   2> 1018470 INFO  (qtp32644699-8444) [    ] o.a.s.c.CoreDescriptor Created CoreDescriptor: {name=testschemaapi_shard1_replica2, collection.configName=conf1, config=solrconfig.xml, transient=false, schema=schema.xml, loadOnStartup=true, configSetProperties=configsetprops.json, collection=testschemaapi, numShards=1, dataDir=data/, shard=shard1}
   [junit4]   2> 1018470 INFO  (qtp32644699-8444) [    ] o.a.s.c.ZkController publishing state=down
   [junit4]   2> 1018470 INFO  (qtp4027376-8449) [    ] o.a.s.c.ZkController publishing state=down
   [junit4]   2> 1018471 INFO  (qtp32644699-8444) [    ] o.a.s.c.ZkController Registering watch for collection testschemaapi
   [junit4]   2> 1018472 INFO  (qtp32644699-8444) [    ] o.a.s.c.c.ZkStateReader addZkWatch [testschemaapi]
   [junit4]   2> 1018472 INFO  (qtp4027376-8449) [    ] o.a.s.c.ZkController Registering watch for collection testschemaapi
   [junit4]   2> 1018472 INFO  (qtp4027376-8449) [    ] o.a.s.c.c.ZkStateReader addZkWatch [testschemaapi]
   [junit4]   2> 1018472 INFO  (qtp32644699-8444) [    ] o.a.s.c.c.ZkStateReader Add data for [testschemaapi] ver [0]
   [junit4]   2> 1018472 INFO  (OverseerStateUpdate-95780809426796549-127.0.0.1:42902_solr-n_0000000000) [    ] o.a.s.c.Overseer processMessage: queueSize: 2, message = {
   [junit4]   2>   "core":"testschemaapi_shard1_replica2",
   [junit4]   2>   "roles":null,
   [junit4]   2>   "base_url":"http://127.0.0.1:41496/solr",
   [junit4]   2>   "node_name":"127.0.0.1:41496_solr",
   [junit4]   2>   "numShards":"1",
   [junit4]   2>   "state":"down",
   [junit4]   2>   "shard":"shard1",
   [junit4]   2>   "collection":"testschemaapi",
   [junit4]   2>   "operation":"state"} current state version: 0
   [junit4]   2> 1018472 INFO  (qtp4027376-8449) [    ] o.a.s.c.c.ZkStateReader Add data for [testschemaapi] ver [0]
   [junit4]   2> 1018472 INFO  (qtp32644699-8444) [    ] o.a.s.c.ZkController look for our core node name
   [junit4]   2> 1018472 INFO  (qtp4027376-8449) [    ] o.a.s.c.ZkController look for our core node name
   [junit4]   2> 1018472 INFO  (OverseerStateUpdate-95780809426796549-127.0.0.1:42902_solr-n_0000000000) [    ] o.a.s.c.o.ReplicaMutator Update state numShards=1 message={
   [junit4]   2>   "core":"testschemaapi_shard1_replica2",
   [junit4]   2>   "roles":null,
   [junit4]   2>   "base_url":"http://127.0.0.1:41496/solr",
   [junit4]   2>   "node_name":"127.0.0.1:41496_solr",
   [junit4]   2>   "numShards":"1",
   [junit4]   2>   "state":"down",
   [junit4]   2>   "shard":"shard1",
   [junit4]   2>   "collection":"testschemaapi",
   [junit4]   2>   "operation":"state"}
   [junit4]   2> 1018473 INFO  (OverseerStateUpdate-95780809426796549-127.0.0.1:42902_solr-n_0000000000) [    ] o.a.s.c.Overseer processMessage: queueSize: 2, message = {
   [junit4]   2>   "core":"testschemaapi_shard1_replica1",
   [junit4]   2>   "roles":null,
   [junit4]   2>   "base_url":"http://127.0.0.1:42902/solr",
   [junit4]   2>   "node_name":"127.0.0.1:42902_solr",
   [junit4]   2>   "numShards":"1",
   [junit4]   2>   "state":"down",
   [junit4]   2>   "shard":"shard1",
   [junit4]   2>   "collection":"testschemaapi",
   [junit4]   2>   "operation":"state"} current state version: 0
   [junit4]   2> 1018474 INFO  (OverseerStateUpdate-95780809426796549-127.0.0.1:42902_solr-n_0000000000) [    ] o.a.s.c.o.ReplicaMutator Update state numShards=1 message={
   [junit4]   2>   "core":"testschemaapi_shard1_replica1",
   [junit4]   2>   "roles":null,
   [junit4]   2>   "base_url":"http://127.0.0.1:42902/solr",
   [junit4]   2>   "node_name":"127.0.0.1:42902_solr",
   [junit4]   2>   "numShards":"1",
   [junit4]   2>   "state":"down",
   [junit4]   2>   "shard":"shard1",
   [junit4]   2>   "collection":"testschemaapi",
   [junit4]   2>   "operation":"state"}
   [junit4]   2> 1018575 INFO  (OverseerStateUpdate-95780809426796549-127.0.0.1:42902_solr-n_0000000000) [    ] o.a.s.c.o.ZkStateWriter going to update_collection /collections/testschemaapi/state.json version: 0
   [junit4]   2> 1018575 INFO  (zkCallback-1130-thread-1) [    ] o.a.s.c.c.ZkStateReader A cluster state change: [WatchedEvent state:SyncConnected type:NodeDataChanged path:/collections/testschemaapi/state.json] for collection [testschemaapi] has occurred - updating... (live nodes size: [2])
   [junit4]   2> 1018575 INFO  (zkCallback-1129-thread-1) [    ] o.a.s.c.c.ZkStateReader A cluster state change: [WatchedEvent state:SyncConnected type:NodeDataChanged path:/collections/testschemaapi/state.json] for collection [testschemaapi] has occurred - updating... (live nodes size: [2])
   [junit4]   2> 1018576 INFO  (zkCallback-1130-thread-1) [    ] o.a.s.c.c.ZkStateReader Updating data for [testschemaapi] from [0] to [1]
   [junit4]   2> 1018576 INFO  (zkCallback-1129-thread-1) [    ] o.a.s.c.c.ZkStateReader Updating data for [testschemaapi] from [0] to [1]
   [junit4]   2> 1019472 INFO  (qtp32644699-8444) [    ] o.a.s.c.ZkController waiting to find shard id in clusterstate for testschemaapi_shard1_replica2
   [junit4]   2> 1019472 INFO  (qtp4027376-8449) [    ] o.a.s.c.ZkController waiting to find shard id in clusterstate for testschemaapi_shard1_replica1
   [junit4]   2> 1019472 INFO  (qtp32644699-8444) [    ] o.a.s.c.ZkController Check for collection zkNode:testschemaapi
   [junit4]   2> 1019472 INFO  (qtp4027376-8449) [    ] o.a.s.c.ZkController Check for collection zkNode:testschemaapi
   [junit4]   2> 1019473 INFO  (qtp32644699-8444) [    ] o.a.s.c.ZkController Collection zkNode exists
   [junit4]   2> 1019473 INFO  (qtp4027376-8449) [    ] o.a.s.c.ZkController Collection zkNode exists
   [junit4]   2> 1019473 INFO  (qtp32644699-8444) [    ] o.a.s.c.c.ZkStateReader Load collection config from: [/collections/testschemaapi]
   [junit4]   2> 1019473 INFO  (qtp4027376-8449) [    ] o.a.s.c.c.ZkStateReader Load collection config from: [/collections/testschemaapi]
   [junit4]   2> 1019473 INFO  (qtp32644699-8444) [    ] o.a.s.c.c.ZkStateReader path=[/collections/testschemaapi] [configName]=[conf1] specified config exists in ZooKeeper
   [junit4]   2> 1019473 INFO  (qtp4027376-8449) [    ] o.a.s.c.c.ZkStateReader path=[/collections/testschemaapi] [configName]=[conf1] specified config exists in ZooKeeper
   [junit4]   2> 1019473 INFO  (qtp32644699-8444) [    ] o.a.s.c.SolrResourceLoader new SolrResourceLoader for directory: '/home/jenkins/workspace/Lucene-Solr-master-Linux/solr/build/solr-core/test/J1/temp/solr.schema.TestManagedSchemaAPI_1FE198B03559C2C5-001/tempDir-001/node1/testschemaapi_shard1_replica2'
   [junit4]   2> 1019473 INFO  (qtp4027376-8449) [    ] o.a.s.c.SolrResourceLoader new SolrResourceLoader for directory: '/home/jenkins/workspace/Lucene-Solr-master-Linux/solr/build/solr-core/test/J1/temp/solr.schema.TestManagedSchemaAPI_1FE198B03559C2C5-001/tempDir-001/node2/testschemaapi_shard1_replica1'
   [junit4]   2> 1019473 INFO  (qtp32644699-8444) [    ] o.a.s.c.SolrResourceLoader JNDI not configured for solr (NoInitialContextEx)
   [junit4]   2> 1019473 INFO  (qtp4027376-8449) [    ] o.a.s.c.SolrResourceLoader JNDI not configured for solr (NoInitialContextEx)
   [junit4]   2> 1019474 INFO  (qtp32644699-8444) [    ] o.a.s.c.SolrResourceLoader solr home defaulted to 'solr/' (could not find system property or JNDI)
   [junit4]   2> 1019474 INFO  (qtp4027376-8449) [    ] o.a.s.c.SolrResourceLoader solr home defaulted to 'solr/' (could not find system property or JNDI)
   [junit4]   2> 1019475 INFO  (qtp32644699-8444) [    ] o.a.s.c.Config loaded config solrconfig.xml with version 0 
   [junit4]   2> 1019475 INFO  (qtp4027376-8449) [    ] o.a.s.c.Config loaded config solrconfig.xml with version 0 
   [junit4]   2> 1019478 INFO  (qtp4027376-8449) [    ] o.a.s.c.SolrConfig current version of requestparams : -1
   [junit4]   2> 1019478 INFO  (qtp32644699-8444) [    ] o.a.s.c.SolrConfig current version of requestparams : -1
   [junit4]   2> 1019481 INFO  (qtp4027376-8449) [    ] o.a.s.c.SolrConfig Using Lucene MatchVersion: 7.0.0
   [junit4]   2> 1019482 INFO  (qtp32644699-8444) [    ] o.a.s.c.SolrConfig Using Lucene MatchVersion: 7.0.0
   [junit4]   2> 1019485 INFO  (qtp4027376-8449) [    ] o.a.s.c.SolrConfig Loaded SolrConfig: solrconfig.xml
   [junit4]   2> 1019488 INFO  (qtp32644699-8444) [    ] o.a.s.c.SolrConfig Loaded SolrConfig: solrconfig.xml
   [junit4]   2> 1019490 INFO  (qtp4027376-8449) [    ] o.a.s.s.IndexSchema [testschemaapi_shard1_replica1] Schema name=minimal
   [junit4]   2> 1019491 INFO  (qtp32644699-8444) [    ] o.a.s.s.IndexSchema [testschemaapi_shard1_replica2] Schema name=minimal
   [junit4]   2> 1019493 INFO  (qtp4027376-8449) [    ] o.a.s.s.IndexSchema unique key field: id
   [junit4]   2> 1019494 INFO  (qtp32644699-8444) [    ] o.a.s.s.IndexSchema unique key field: id
   [junit4]   2> 1019494 INFO  (qtp4027376-8449) [    ] o.a.s.c.ConfigSetProperties Did not find ConfigSet properties, assuming default properties: Can't find resource 'configsetprops.json' in classpath or '/configs/conf1', cwd=/home/jenkins/workspace/Lucene-Solr-master-Linux/solr/build/solr-core/test/J1
   [junit4]   2> 1019494 INFO  (qtp4027376-8449) [    ] o.a.s.c.CoreContainer Creating SolrCore 'testschemaapi_shard1_replica1' using configuration from collection testschemaapi
   [junit4]   2> 1019495 INFO  (qtp32644699-8444) [    ] o.a.s.c.ConfigSetProperties Did not find ConfigSet properties, assuming default properties: Can't find resource 'configsetprops.json' in classpath or '/configs/conf1', cwd=/home/jenkins/workspace/Lucene-Solr-master-Linux/solr/build/solr-core/test/J1
   [junit4]   2> 1019495 INFO  (qtp4027376-8449) [    ] o.a.s.c.SolrCore org.apache.solr.core.MockDirectoryFactory
   [junit4]   2> 1019495 INFO  (qtp32644699-8444) [    ] o.a.s.c.CoreContainer Creating SolrCore 'testschemaapi_shard1_replica2' using configuration from collection testschemaapi
   [junit4]   2> 1019495 INFO  (qtp4027376-8449) [    ] o.a.s.c.SolrCore [[testschemaapi_shard1_replica1] ] Opening new SolrCore at [/home/jenkins/workspace/Lucene-Solr-master-Linux/solr/build/solr-core/test/J1/temp/solr.schema.TestManagedSchemaAPI_1FE198B03559C2C5-001/tempDir-001/node2/testschemaapi_shard1_replica1], dataDir=[/home/jenkins/workspace/Lucene-Solr-master-Linux/solr/build/solr-core/test/J1/temp/solr.schema.TestManagedSchemaAPI_1FE198B03559C2C5-001/tempDir-001/node2/./testschemaapi_shard1_replica1/data/]
   [junit4]   2> 1019495 INFO  (qtp4027376-8449) [    ] o.a.s.c.SolrCore JMX monitoring not detected for core: testschemaapi_shard1_replica1
   [junit4]   2> 1019495 INFO  (qtp32644699-8444) [    ] o.a.s.c.SolrCore org.apache.solr.core.MockDirectoryFactory
   [junit4]   2> 1019495 INFO  (qtp32644699-8444) [    ] o.a.s.c.SolrCore [[testschemaapi_shard1_replica2] ] Opening new SolrCore at [/home/jenkins/workspace/Lucene-Solr-master-Linux/solr/build/solr-core/test/J1/temp/solr.schema.TestManagedSchemaAPI_1FE198B03559C2C5-001/tempDir-001/node1/testschemaapi_shard1_replica2], dataDir=[/home/jenkins/workspace/Lucene-Solr-master-Linux/solr/build/solr-core/test/J1/temp/solr.schema.TestManagedSchemaAPI_1FE198B03559C2C5-001/tempDir-001/node1/./testschemaapi_shard1_replica2/data/]
   [junit4]   2> 1019495 INFO  (qtp32644699-8444) [    ] o.a.s.c.SolrCore JMX monitoring not detected for core: testschemaapi_shard1_replica2
   [junit4]   2> 1019496 INFO  (qtp4027376-8449) [    ] o.a.s.c.CachingDirectoryFactory return new directory for /home/jenkins/workspace/Lucene-Solr-master-Linux/solr/build/solr-core/test/J1/temp/solr.schema.TestManagedSchemaAPI_1FE198B03559C2C5-001/tempDir-001/node2/./testschemaapi_shard1_replica1/data
   [junit4]   2> 1019496 INFO  (qtp4027376-8449) [    ] o.a.s.c.SolrCore New index directory detected: old=null new=/home/jenkins/workspace/Lucene-Solr-master-Linux/solr/build/solr-core/test/J1/temp/solr.schema.TestManagedSchemaAPI_1FE198B03559C2C5-001/tempDir-001/node2/./testschemaapi_shard1_replica1/data/index/
   [junit4]   2> 1019496 WARN  (qtp4027376-8449) [    ] o.a.s.c.SolrCore [testschemaapi_shard1_replica1] Solr index directory '/home/jenkins/workspace/Lucene-Solr-master-Linux/solr/build/solr-core/test/J1/temp/solr.schema.TestManagedSchemaAPI_1FE198B03559C2C5-001/tempDir-001/node2/./testschemaapi_shard1_replica1/data/index' doesn't exist. Creating new index...
   [junit4]   2> 1019496 INFO  (qtp32644699-8444) [    ] o.a.s.c.CachingDirectoryFactory return new directory for /home/jenkins/workspace/Lucene-Solr-master-Linux/solr/build/solr-core/test/J1/temp/solr.schema.TestManagedSchemaAPI_1FE198B03559C2C5-001/tempDir-001/node1/./testschemaapi_shard1_replica2/data
   [junit4]   2> 1019496 INFO  (qtp32644699-8444) [    ] o.a.s.c.SolrCore New index directory detected: old=null new=/home/jenkins/workspace/Lucene-Solr-master-Linux/solr/build/solr-core/test/J1/temp/solr.schema.TestManagedSchemaAPI_1FE198B03559C2C5-001/tempDir-001/node1/./testschemaapi_shard1_replica2/data/index/
   [junit4]   2> 1019496 INFO  (qtp4027376-8449) [    ] o.a.s.c.CachingDirectoryFactory return new directory for /home/jenkins/workspace/Lucene-Solr-master-Linux/solr/build/solr-core/test/J1/temp/solr.schema.TestManagedSchemaAPI_1FE198B03559C2C5-001/tempDir-001/node2/./testschemaapi_shard1_replica1/data/index
   [junit4]   2> 1019496 WARN  (qtp32644699-8444) [    ] o.a.s.c.SolrCore [testschemaapi_shard1_replica2] Solr index directory '/home/jenkins/workspace/Lucene-Solr-master-Linux/solr/build/solr-core/test/J1/temp/solr.schema.TestManagedSchemaAPI_1FE198B03559C2C5-001/tempDir-001/node1/./testschemaapi_shard1_replica2/data/index' doesn't exist. Creating new index...
   [junit4]   2> 1019497 INFO  (qtp4027376-8449) [    ] o.a.s.c.SolrDeletionPolicy SolrDeletionPolicy.onCommit: commits: num=1
   [junit4]   2> 	commit{dir=MockDirectoryWrapper(RAMDirectory@12dd8c0 lockFactory=org.apache.lucene.store.SingleInstanceLockFactory@149bc6),segFN=segments_1,generation=1}
   [junit4]   2> 1019497 INFO  (qtp4027376-8449) [    ] o.a.s.c.SolrDeletionPolicy newest commit generation = 1
   [junit4]   2> 1019497 INFO  (qtp32644699-8444) [    ] o.a.s.c.CachingDirectoryFactory return new directory for /home/jenkins/workspace/Lucene-Solr-master-Linux/solr/build/solr-core/test/J1/temp/solr.schema.TestManagedSchemaAPI_1FE198B03559C2C5-001/tempDir-001/node1/./testschemaapi_shard1_replica2/data/index
   [junit4]   2> 1019497 INFO  (OldIndexDirectoryCleanupThreadForCore-testschemaapi_shard1_replica1) [    ] o.a.s.c.SolrCore Looking for old index directories to cleanup for core testschemaapi_shard1_replica1 in /home/jenkins/workspace/Lucene-Solr-master-Linux/solr/build/solr-core/test/J1/temp/solr.schema.TestManagedSchemaAPI_1FE198B03559C2C5-001/tempDir-001/node2/./testschemaapi_shard1_replica1/data/
   [junit4]   2> 1019497 WARN  (OldIndexDirectoryCleanupThreadForCore-testschemaapi_shard1_replica1) [    ] o.a.s.c.DirectoryFactory /home/jenkins/workspace/Lucene-Solr-master-Linux/solr/build/solr-core/test/J1/temp/solr.schema.TestManagedSchemaAPI_1FE198B03559C2C5-001/tempDir-001/node2/./testschemaapi_shard1_replica1/data/ does not point to a valid data directory; skipping clean-up of old index directories.
   [junit4]   2> 1019497 INFO  (qtp32644699-8444) [    ] o.a.s.c.SolrDeletionPolicy SolrDeletionPolicy.onCommit: commits: num=1
   [junit4]   2> 	commit{dir=MockDirectoryWrapper(RAMDirectory@17724d lockFactory=org.apache.lucene.store.SingleInstanceLockFactory@f37f5),segFN=segments_1,generation=1}
   [junit4]   2> 1019498 INFO  (qtp32644699-8444) [    ] o.a.s.c.SolrDeletionPolicy newest commit generation = 1
   [junit4]   2> 1019498 INFO  (OldIndexDirectoryCleanupThreadForCore-testschemaapi_shard1_replica2) [    ] o.a.s.c.SolrCore Looking for old index directories to cleanup for core testschemaapi_shard1_replica2 in /home/jenkins/workspace/Lucene-Solr-master-Linux/solr/build/solr-core/test/J1/temp/solr.schema.TestManagedSchemaAPI_1FE198B03559C2C5-001/tempDir-001/node1/./testschemaapi_shard1_replica2/data/
   [junit4]   2> 1019498 WARN  (OldIndexDirectoryCleanupThreadForCore-testschemaapi_shard1_replica2) [    ] o.a.s.c.DirectoryFactory /home/jenkins/workspace/Lucene-Solr-master-Linux/solr/build/solr-core/test/J1/temp/solr.schema.TestManagedSchemaAPI_1FE198B03559C2C5-001/tempDir-001/node1/./testschemaapi_shard1_replica2/data/ does not point to a valid data directory; skipping clean-up of old index directories.
   [junit4]   2> 1019498 INFO  (qtp4027376-8449) [    ] o.a.s.c.SolrCore no updateRequestProcessorChain defined as default, creating implicit default
   [junit4]   2> 1019499 INFO  (qtp32644699-8444) [    ] o.a.s.c.SolrCore no updateRequestProcessorChain defined as default, creating implicit default
   [junit4]   2> 1019500 INFO  (qtp4027376-8449) [    ] o.a.s.h.l.XMLLoader xsltCacheLifetimeSeconds=60
   [junit4]   2> 1019500 INFO  (qtp32644699-8444) [    ] o.a.s.h.l.XMLLoader xsltCacheLifetimeSeconds=60
   [junit4]   2> 1019501 INFO  (qtp4027376-8449) [    ] o.a.s.h.l.XMLLoader xsltCacheLifetimeSeconds=60
   [junit4]   2> 1019502 INFO  (qtp32644699-8444) [    ] o.a.s.h.l.XMLLoader xsltCacheLifetimeSeconds=60
   [junit4]   2> 1019502 INFO  (qtp4027376-8449) [    ] o.a.s.h.l.XMLLoader xsltCacheLifetimeSeconds=60
   [junit4]   2> 1019503 INFO  (qtp32644699-8444) [    ] o.a.s.h.l.XMLLoader xsltCacheLifetimeSeconds=60
   [junit4]   2> 1019504 INFO  (qtp4027376-8449) [    ] o.a.s.h.l.XMLLoader xsltCacheLifetimeSeconds=60
   [junit4]   2> 1019505 INFO  (qtp4027376-8449) [    ] o.a.s.c.RequestHandlers Registered paths: /admin/mbeans,/update/csv,/sql,/update/json/docs,/admin/luke,/export,/select,/admin/segments,/get,/admin/system,/replication,/admin/properties,/config,/stream,/schema,/admin/plugins,/admin/logging,/update/json,/admin/ping,/admin/threads,/update,/admin/file
   [junit4]   2> 1019505 INFO  (qtp4027376-8449) [    ] o.a.s.c.SolrCore Using default statsCache cache: org.apache.solr.search.stats.LocalStatsCache
   [junit4]   2> 1019505 INFO  (qtp32644699-8444) [    ] o.a.s.h.l.XMLLoader xsltCacheLifetimeSeconds=60
   [junit4]   2> 1019505 INFO  (qtp4027376-8449) [    ] o.a.s.u.UpdateHandler Using UpdateLog implementation: org.apache.solr.update.UpdateLog
   [junit4]   2> 1019505 INFO  (qtp4027376-8449) [    ] o.a.s.u.UpdateLog Initializing UpdateLog: dataDir=null defaultSyncLevel=FLUSH numRecordsToKeep=100 maxNumLogsToKeep=10 numVersionBuckets=65536
   [junit4]   2> 1019506 INFO  (qtp32644699-8444) [    ] o.a.s.c.RequestHandlers Registered paths: /admin/mbeans,/update/csv,/sql,/update/json/docs,/admin/luke,/export,/select,/admin/segments,/get,/admin/system,/replication,/admin/properties,/config,/stream,/schema,/admin/plugins,/admin/logging,/update/json,/admin/ping,/admin/threads,/update,/admin/file
   [junit4]   2> 1019506 INFO  (qtp32644699-8444) [    ] o.a.s.c.SolrCore Using default statsCache cache: org.apache.solr.search.stats.LocalStatsCache
   [junit4]   2> 1019506 INFO  (qtp4027376-8449) [    ] o.a.s.u.CommitTracker Hard AutoCommit: disabled
   [junit4]   2> 1019506 INFO  (qtp4027376-8449) [    ] o.a.s.u.CommitTracker Soft AutoCommit: disabled
   [junit4]   2> 1019506 INFO  (qtp32644699-8444) [    ] o.a.s.u.UpdateHandler Using UpdateLog implementation: org.apache.solr.update.UpdateLog
   [junit4]   2> 1019506 INFO  (qtp32644699-8444) [    ] o.a.s.u.UpdateLog Initializing UpdateLog: dataDir=null defaultSyncLevel=FLUSH numRecordsToKeep=100 maxNumLogsToKeep=10 numVersionBuckets=65536
   [junit4]   2> 1019506 INFO  (qtp4027376-8449) [    ] o.a.s.c.SolrDeletionPolicy SolrDeletionPolicy.onInit: commits: num=1
   [junit4]   2> 	commit{dir=MockDirectoryWrapper(RAMDirectory@12dd8c0 lockFactory=org.apache.lucene.store.SingleInstanceLockFactory@149bc6),segFN=segments_1,generation=1}
   [junit4]   2> 1019507 INFO  (qtp4027376-8449) [    ] o.a.s.c.SolrDeletionPolicy newest commit generation = 1
   [junit4]   2> 1019507 INFO  (qtp4027376-8449) [    ] o.a.s.s.SolrIndexSearcher Opening [Searcher@1d083dd[testschemaapi_shard1_replica1] main]
   [junit4]   2> 1019507 INFO  (qtp4027376-8449) [    ] o.a.s.c.c.ZkStateReader Load collection config from: [/collections/testschemaapi]
   [junit4]   2> 1019507 INFO  (qtp4027376-8449) [    ] o.a.s.c.c.ZkStateReader path=[/collections/testschemaapi] [configName]=[conf1] specified config exists in ZooKeeper
   [junit4]   2> 1019507 INFO  (qtp4027376-8449) [    ] o.a.s.r.ManagedResourceStorage Setting up ZooKeeper-based storage for the RestManager with znodeBase: /configs/conf1
   [junit4]   2> 1019507 INFO  (qtp4027376-8449) [    ] o.a.s.r.ManagedResourceStorage Configured ZooKeeperStorageIO with znodeBase: /configs/conf1
   [junit4]   2> 1019507 INFO  (qtp4027376-8449) [    ] o.a.s.r.RestManager Initializing RestManager with initArgs: {}
   [junit4]   2> 1019507 INFO  (qtp4027376-8449) [    ] o.a.s.r.ManagedResourceStorage Reading _rest_managed.json using ZooKeeperStorageIO:path=/configs/conf1
   [junit4]   2> 1019508 INFO  (qtp4027376-8449) [    ] o.a.s.r.ManagedResourceStorage No data found for znode /configs/conf1/_rest_managed.json
   [junit4]   2> 1019508 INFO  (qtp4027376-8449) [    ] o.a.s.r.ManagedResourceStorage Loaded null at path _rest_managed.json using ZooKeeperStorageIO:path=/configs/conf1
   [junit4]   2> 1019508 INFO  (qtp4027376-8449) [    ] o.a.s.r.RestManager Initializing 0 registered ManagedResources
   [junit4]   2> 1019508 INFO  (qtp4027376-8449) [    ] o.a.s.s.ZkIndexSchemaReader Creating ZooKeeper watch for the managed schema at /configs/conf1/managed-schema
   [junit4]   2> 1019508 INFO  (qtp4027376-8449) [    ] o.a.s.c.ZkController Added new OnReconnect listener ZkIndexSchemaReader: /configs/conf1/managed-schema, uniqueCoreId: testschemaapi_shard1_replica1:228454231752972
   [junit4]   2> 1019508 INFO  (qtp4027376-8449) [    ] o.a.s.h.ReplicationHandler Commits will be reserved for  10000
   [junit4]   2> 1019508 INFO  (searcherExecutor-3207-thread-1) [    ] o.a.s.c.SolrCore [testschemaapi_shard1_replica1] Registered new searcher Searcher@1d083dd[testschemaapi_shard1_replica1] main{ExitableDirectoryReader(UninvertingDirectoryReader())}
   [junit4]   2> 1019508 INFO  (qtp32644699-8444) [    ] o.a.s.u.CommitTracker Hard AutoCommit: disabled
   [junit4]   2> 1019508 INFO  (qtp4027376-8449) [    ] o.a.s.u.UpdateLog Looking up max value of version field to seed version buckets
   [junit4]   2> 1019508 INFO  (qtp32644699-8444) [    ] o.a.s.u.CommitTracker Soft AutoCommit: disabled
   [junit4]   2> 1019508 INFO  (qtp4027376-8449) [    ] o.a.s.u.VersionInfo Refreshing highest value of _version_ for 65536 version buckets from index
   [junit4]   2> 1019508 INFO  (qtp4027376-8449) [    ] o.a.s.u.VersionInfo No terms found for _version_, cannot seed version bucket highest value from index
   [junit4]   2> 1019508 INFO  (qtp4027376-8449) [    ] o.a.s.u.UpdateLog Could not find max version in index or recent updates, using new clock 1532492953284509696
   [junit4]   2> 1019509 INFO  (qtp32644699-8444) [    ] o.a.s.c.SolrDeletionPolicy SolrDeletionPolicy.onInit: commits: num=1
   [junit4]   2> 	commit{dir=MockDirectoryWrapper(RAMDirectory@17724d lockFactory=org.apache.lucene.store.SingleInstanceLockFactory@f37f5),segFN=segments_1,generation=1}
   [junit4]   2> 1019509 INFO  (qtp32644699-8444) [    ] o.a.s.c.SolrDeletionPolicy newest commit generation = 1
   [junit4]   2> 1019509 INFO  (qtp32644699-8444) [    ] o.a.s.s.SolrIndexSearcher Opening [Searcher@1b6cb34[testschemaapi_shard1_replica2] main]
   [junit4]   2> 1019509 INFO  (qtp32644699-8444) [    ] o.a.s.c.c.ZkStateReader Load collection config from: [/collections/testschemaapi]
   [junit4]   2> 1019509 INFO  (qtp32644699-8444) [    ] o.a.s.c.c.ZkStateReader path=[/collections/testschemaapi] [configName]=[conf1] specified config exists in ZooKeeper
   [junit4]   2> 1019509 INFO  (qtp32644699-8444) [    ] o.a.s.r.ManagedResourceStorage Setting up ZooKeeper-based storage for the RestManager with znodeBase: /configs/conf1
   [junit4]   2> 1019510 INFO  (qtp32644699-8444) [    ] o.a.s.r.ManagedResourceStorage Configured ZooKeeperStorageIO with znodeBase: /configs/conf1
   [junit4]   2> 1019510 INFO  (qtp32644699-8444) [    ] o.a.s.r.RestManager Initializing RestManager with initArgs: {}
   [junit4]   2> 1019510 INFO  (qtp32644699-8444) [    ] o.a.s.r.ManagedResourceStorage Reading _rest_managed.json using ZooKeeperStorageIO:path=/configs/conf1
   [junit4]   2> 1019510 INFO  (qtp32644699-8444) [    ] o.a.s.r.ManagedResourceStorage No data found for znode /configs/conf1/_rest_managed.json
   [junit4]   2> 1019510 INFO  (qtp32644699-8444) [    ] o.a.s.r.ManagedResourceStorage Loaded null at path _rest_managed.json using ZooKeeperStorageIO:path=/configs/conf1
   [junit4]   2> 1019510 INFO  (qtp32644699-8444) [    ] o.a.s.r.RestManager Initializing 0 registered ManagedResources
   [junit4]   2> 1019510 INFO  (qtp32644699-8444) [    ] o.a.s.s.ZkIndexSchemaReader Creating ZooKeeper watch for the managed schema at /configs/conf1/managed-schema
   [junit4]   2> 1019510 INFO  (qtp4027376-8449) [    ] o.a.s.u.UpdateLog Took 1.0ms to seed version buckets with highest version 1532492953284509696
   [junit4]   2> 1019510 INFO  (qtp4027376-8449) [    ] o.a.s.c.ZkController watch zkdir /configs/conf1
   [junit4]   2> 1019510 INFO  (qtp32644699-8444) [    ] o.a.s.c.ZkController Added new OnReconnect listener ZkIndexSchemaReader: /configs/conf1/managed-schema, uniqueCoreId: testschemaapi_shard1_replica2:228454232347887
   [junit4]   2> 1019510 INFO  (qtp32644699-8444) [    ] o.a.s.h.ReplicationHandler Commits will be reserved for  10000
   [junit4]   2> 1019511 INFO  (searcherExecutor-3208-thread-1) [    ] o.a.s.c.SolrCore [testschemaapi_shard1_replica2] Registered new searcher Searcher@1b6cb34[testschemaapi_shard1_replica2] main{ExitableDirectoryReader(UninvertingDirectoryReader())}
   [junit4]   2> 1019511 INFO  (qtp32644699-8444) [    ] o.a.s.u.UpdateLog Looking up max value of version field to seed version buckets
   [junit4]   2> 1019511 INFO  (qtp32644699-8444) [    ] o.a.s.u.VersionInfo Refreshing highest value of _version_ for 65536 version buckets from index
   [junit4]   2> 1019511 INFO  (qtp32644699-8444) [    ] o.a.s.u.VersionInfo No terms found for _version_, cannot seed version bucket highest value from index
   [junit4]   2> 1019511 INFO  (qtp4027376-8449) [    ] o.a.s.c.CoreContainer registering core: testschemaapi_shard1_replica1
   [junit4]   2> 1019511 INFO  (qtp32644699-8444) [    ] o.a.s.u.UpdateLog Could not find max version in index or recent updates, using new clock 1532492953287655424
   [junit4]   2> 1019511 INFO  (qtp4027376-8449) [    ] o.a.s.c.ZkController Register replica - core:testschemaapi_shard1_replica1 address:http://127.0.0.1:42902/solr collection:testschemaapi shard:shard1
   [junit4]   2> 1019511 INFO  (qtp4027376-8449) [    ] o.a.s.c.c.SolrZkClient makePath: /collections/testschemaapi/leader_elect/shard1/election
   [junit4]   2> 1019513 INFO  (qtp32644699-8444) [    ] o.a.s.u.UpdateLog Took 2.0ms to seed version buckets with highest version 1532492953287655424
   [junit4]   2> 1019513 INFO  (qtp32644699-8444) [    ] o.a.s.c.ZkController watch zkdir /configs/conf1
   [junit4]   2> 1019513 INFO  (qtp4027376-8449) [    ] o.a.s.c.LeaderElector Joined leadership election with path: /collections/testschemaapi/leader_elect/shard1/election/95780809426796549-core_node2-n_0000000000
   [junit4]   2> 1019514 INFO  (qtp32644699-8444) [    ] o.a.s.c.CoreContainer registering core: testschemaapi_shard1_replica2
   [junit4]   2> 1019514 INFO  (qtp32644699-8444) [    ] o.a.s.c.ZkController Register replica - core:testschemaapi_shard1_replica2 address:http://127.0.0.1:41496/solr collection:testschemaapi shard:shard1
   [junit4]   2> 1019514 INFO  (qtp4027376-8449) [    ] o.a.s.c.ShardLeaderElectionContext Running the leader process for shard=shard1 and weAreReplacement=false and leaderVoteWait=10000
   [junit4]   2> 1019514 INFO  (qtp32644699-8444) [    ] o.a.s.c.LeaderElector Joined leadership election with path: /collections/testschemaapi/leader_elect/shard1/election/95780809426796550-core_node1-n_0000000001
   [junit4]   2> 1019515 INFO  (qtp4027376-8449) [    ] o.a.s.c.ShardLeaderElectionContext Enough replicas found to continue.
   [junit4]   2> 1019515 INFO  (qtp4027376-8449) [    ] o.a.s.c.ShardLeaderElectionContext I may be the new leader - try and sync
   [junit4]   2> 1019515 INFO  (qtp4027376-8449) [    ] o.a.s.c.SyncStrategy Sync replicas to http://127.0.0.1:42902/solr/testschemaapi_shard1_replica1/
   [junit4]   2> 1019515 INFO  (qtp32644699-8444) [    ] o.a.s.c.LeaderElector Watching path /collections/testschemaapi/leader_elect/shard1/election/95780809426796549-core_node2-n_0000000000 to know if I could be the leader
   [junit4]   2> 1019515 INFO  (qtp4027376-8449) [    ] o.a.s.u.PeerSync PeerSync: core=testschemaapi_shard1_replica1 url=http://127.0.0.1:42902/solr START replicas=[http://127.0.0.1:41496/solr/testschemaapi_shard1_replica2/] nUpdates=100
   [junit4]   2> 1019515 INFO  (OverseerStateUpdate-95780809426796549-127.0.0.1:42902_solr-n_0000000000) [    ] o.a.s.c.Overseer processMessage: queueSize: 1, message = {
   [junit4]   2>   "operation":"leader",
   [junit4]   2>   "shard":"shard1",
   [junit4]   2>   "collection":"testschemaapi"} current state version: 0
   [junit4]   2> 1019516 INFO  (qtp4027376-8449) [    ] o.a.s.u.PeerSync PeerSync: core=testschemaapi_shard1_replica1 url=http://127.0.0.1:42902/solr DONE.  We have no versions.  sync failed.
   [junit4]   2> 1019516 INFO  (qtp4027376-8449) [    ] o.a.s.c.SyncStrategy Leader's attempt to sync with shard failed, moving to the next candidate
   [junit4]   2> 1019516 INFO  (qtp4027376-8449) [    ] o.a.s.c.ShardLeaderElectionContext We failed sync, but we have no versions - we can't sync in that case - we were active before, so become leader anyway
   [junit4]   2> 1019516 INFO  (qtp4027376-8449) [    ] o.a.s.c.c.SolrZkClient makePath: /collections/testschemaapi/leaders/shard1
   [junit4]   2> 1019518 INFO  (qtp32644699-8448) [    ] o.a.s.c.S.Request [testschemaapi_shard1_replica2]  webapp=/solr path=/get params={distrib=false&qt=/get&fingerprint=false&getVersions=100&wt=javabin&version=2} status=0 QTime=1
   [junit4]   2> 1019518 INFO  (qtp4027376-8449) [    ] o.a.s.c.ShardLeaderElectionContextBase Creating leader registration node /collections/testschemaapi/leaders/shard1/leader after winning as /collections/testschemaapi/leader_elect/shard1/election/95780809426796549-core_node2-n_0000000000
   [junit4]   2> 1019520 INFO  (qtp4027376-8449) [    ] o.a.s.c.ShardLeaderElectionContext I am the new leader: http://127.0.0.1:42902/solr/testschemaapi_shard1_replica1/ shard1
   [junit4]   2> 1019520 INFO  (OverseerStateUpdate-95780809426796549-127.0.0.1:42902_solr-n_0000000000) [    ] o.a.s.c.Overseer processMessage: queueSize: 1, message = {
   [junit4]   2>   "operation":"leader",
   [junit4]   2>   "shard":"shard1",
   [junit4]   2>   "collection":"testschemaapi",
   [junit4]   2>   "base_url":"http://127.0.0.1:42902/solr",
   [junit4]   2>   "core":"testschemaapi_shard1_replica1",
   [junit4]   2>   "state":"active"} current state version: 0
   [junit4]   2> 1019621 INFO  (OverseerStateUpdate-95780809426796549-127.0.0.1:42902_solr-n_0000000000) [    ] o.a.s.c.o.ZkStateWriter going to update_collection /collections/testschemaapi/state.json version: 1
   [junit4]   2> 1019622 INFO  (zkCallback-1130-thread-1) [    ] o.a.s.c.c.ZkStateReader A cluster state change: [WatchedEvent state:SyncConnected type:NodeDataChanged path:/collections/testschemaapi/state.json] for collection [testschemaapi] has occurred - updating... (live nodes size: [2])
   [junit4]   2> 1019622 INFO  (zkCallback-1129-thread-1) [    ] o.a.s.c.c.ZkStateReader A cluster state change: [WatchedEvent state:SyncConnected type:NodeDataChanged path:/collections/testschemaapi/state.json] for collection [testschemaapi] has occurred - updating... (live nodes size: [2])
   [junit4]   2> 1019622 INFO  (zkCallback-1130-thread-1) [    ] o.a.s.c.c.ZkStateReader Updating data for [testschemaapi] from [1] to [2]
   [junit4]   2> 1019622 INFO  (zkCallback-1129-thread-1) [    ] o.a.s.c.c.ZkStateReader Updating data for [testschemaapi] from [1] to [2]
   [junit4]   2> 1019670 INFO  (qtp4027376-8449) [    ] o.a.s.c.ZkController We are http://127.0.0.1:42902/solr/testschemaapi_shard1_replica1/ and leader is http://127.0.0.1:42902/solr/testschemaapi_shard1_replica1/
   [junit4]   2> 1019670 INFO  (qtp4027376-8449) [    ] o.a.s.c.ZkController No LogReplay needed for core=testschemaapi_shard1_replica1 baseURL=http://127.0.0.1:42902/solr
   [junit4]   2> 1019671 INFO  (qtp4027376-8449) [    ] o.a.s.c.ZkController I am the leader, no recovery necessary
   [junit4]   2> 1019671 INFO  (qtp4027376-8449) [    ] o.a.s.c.ZkController publishing state=active
   [junit4]   2> 1019672 INFO  (OverseerStateUpdate-95780809426796549-127.0.0.1:42902_solr-n_0000000000) [    ] o.a.s.c.Overseer processMessage: queueSize: 1, message = {
   [junit4]   2>   "core":"testschemaapi_shard1_replica1",
   [junit4]   2>   "core_node_name":"core_node2",
   [junit4]   2>   "roles":null,
   [junit4]   2>   "base_url":"http://127.0.0.1:42902/solr",
   [junit4]   2>   "node_name":"127.0.0.1:42902_solr",
   [junit4]   2>   "numShards":"1",
   [junit4]   2>   "state":"active",
   [junit4]   2>   "shard":"shard1",
   [junit4]   2>   "collection":"testschemaapi",
   [junit4]   2>   "operation":"state"} current state version: 0
   [junit4]   2> 1019672 INFO  (OverseerStateUpdate-95780809426796549-127.0.0.1:42902_solr-n_0000000000) [    ] o.a.s.c.o.ReplicaMutator Update state numShards=1 message={
   [junit4]   2>   "core":"testschemaapi_shard1_replica1",
   [junit4]   2>   "core_node_name":"core_node2",
   [junit4]   2>   "roles":null,
   [junit4]   2>   "base_url":"http://127.0.0.1:42902/solr",
   [junit4]   2>   "node_name":"127.0.0.1:42902_solr",
   [junit4]   2>   "numShards":"1",
   [junit4]   2>   "state":"active",
   [junit4]   2>   "shard":"shard1",
   [junit4]   2>   "collection":"testschemaapi",
   [junit4]   2>   "operation":"state"}
   [junit4]   2> 1019672 INFO  (qtp4027376-8449) [    ] o.a.s.s.HttpSolrCall [admin] webapp=null path=/admin/cores params={qt=/admin/cores&collection.configName=conf1&name=testschemaapi_shard1_replica1&action=CREATE&numShards=1&collection=testschemaapi&shard=shard1&wt=javabin&version=2} status=0 QTime=1203
   [junit4]   2> 1019773 INFO  (OverseerStateUpdate-95780809426796549-127.0.0.1:42902_solr-n_0000000000) [    ] o.a.s.c.o.ZkStateWriter going to update_collection /collections/testschemaapi/state.json version: 2
   [junit4]   2> 1019774 INFO  (zkCallback-1129-thread-1) [    ] o.a.s.c.c.ZkStateReader A cluster state change: [WatchedEvent state:SyncConnected type:NodeDataChanged path:/collections/testschemaapi/state.json] for collection [testschemaapi] has occurred - updating... (live nodes size: [2])
   [junit4]   2> 1019774 INFO  (zkCallback-1130-thread-1) [    ] o.a.s.c.c.ZkStateReader A cluster state change: [WatchedEvent state:SyncConnected type:NodeDataChanged path:/collections/testschemaapi/state.json] for collection [testschemaapi] has occurred - updating... (live nodes size: [2])
   [junit4]   2> 1019774 INFO  (zkCallback-1129-thread-1) [    ] o.a.s.c.c.ZkStateReader Updating data for [testschemaapi] from [2] to [3]
   [junit4]   2> 1019774 INFO  (zkCallback-1130-thread-1) [    ] o.a.s.c.c.ZkStateReader Updating data for [testschemaapi] from [2] to [3]
   [junit4]   2> 1020516 INFO  (qtp32644699-8444) [    ] o.a.s.c.ZkController We are http://127.0.0.1:41496/solr/testschemaapi_shard1_replica2/ and leader is http://127.0.0.1:42902/solr/testschemaapi_shard1_replica1/
   [junit4]   2> 1020516 INFO  (qtp32644699-8444) [    ] o.a.s.c.ZkController No LogReplay needed for core=testschemaapi_shard1_replica2 baseURL=http://127.0.0.1:41496/solr
   [junit4]   2> 1020516 INFO  (qtp32644699-8444) [    ] o.a.s.c.ZkController Core needs to recover:testschemaapi_shard1_replica2
   [junit4]   2> 1020516 INFO  (updateExecutor-1123-thread-1) [    ] o.a.s.u.DefaultSolrCoreState Running recovery
   [junit4]   2> 1020517 INFO  (recoveryExecutor-1125-thread-1) [    ] o.a.s.c.RecoveryStrategy Starting recovery process. recoveringAfterStartup=true
   [junit4]   2> 1020517 INFO  (recoveryExecutor-1125-thread-1) [    ] o.a.s.c.RecoveryStrategy ###### startupVersions=[[]]
   [junit4]   2> 1020517 INFO  (recoveryExecutor-1125-thread-1) [    ] o.a.s.c.RecoveryStrategy Begin buffering updates. core=[testschemaapi_shard1_replica2]
   [junit4]   2> 1020517 INFO  (recoveryExecutor-1125-thread-1) [    ] o.a.s.u.UpdateLog Starting to buffer updates. FSUpdateLog{state=ACTIVE, tlog=null}
   [junit4]   2> 1020517 INFO  (recoveryExecutor-1125-thread-1) [    ] o.a.s.c.RecoveryStrategy Publishing state of core [testschemaapi_shard1_replica2] as recovering, leader is [http://127.0.0.1:42902/solr/testschemaapi_shard1_replica1/] and I am [http://127.0.0.1:41496/solr/testschemaapi_shard1_replica2/]
   [junit4]   2> 1020517 INFO  (recoveryExecutor-1125-thread-1) [    ] o.a.s.c.ZkController publishing state=recovering
   [junit4]   2> 1020517 INFO  (qtp32644699-8444) [    ] o.a.s.s.HttpSolrCall [admin] webapp=null path=/admin/cores params={qt=/admin/cores&collection.configName=conf1&name=testschemaapi_shard1_replica2&action=CREATE&numShards=1&collection=testschemaapi&shard=shard1&wt=javabin&version=2} status=0 QTime=2047
   [junit4]   2> 1020519 INFO  (OverseerThreadFactory-3202-thread-1) [    ] o.a.s.c.OverseerTaskProcessor Overseer Collection Message Handler: Message id:/overseer/collection-queue-work/qn-0000000000 complete, response:{success={127.0.0.1:42902_solr={responseHeader={status=0,QTime=1203},core=testschemaapi_shard1_replica1},127.0.0.1:41496_solr={responseHeader={status=0,QTime=2047},core=testschemaapi_shard1_replica2}}}
   [junit4]   2> 1020519 INFO  (OverseerStateUpdate-95780809426796549-127.0.0.1:42902_solr-n_0000000000) [    ] o.a.s.c.Overseer processMessage: queueSize: 1, message = {
   [junit4]   2>   "core":"testschemaapi_shard1_replica2",
   [junit4]   2>   "core_node_name":"core_node1",
   [junit4]   2>   "roles":null,
   [junit4]   2>   "base_url":"http://127.0.0.1:41496/solr",
   [junit4]   2>   "node_name":"127.0.0.1:41496_solr",
   [junit4]   2>   "numShards":"1",
   [junit4]   2>   "state":"recovering",
   [junit4]   2>   "shard":"shard1",
   [junit4]   2>   "collection":"testschemaapi",
   [junit4]   2>   "operation":"state"} current state version: 0
   [junit4]   2> 1020519 INFO  (OverseerStateUpdate-95780809426796549-127.0.0.1:42902_solr-n_0000000000) [    ] o.a.s.c.o.ReplicaMutator Update state numShards=1 message={
   [junit4]   2>   "core":"testschemaapi_shard1_replica2",
   [junit4]   2>   "core_node_name":"core_node1",
   [junit4]   2>   "roles":null,
   [junit4]   2>   "base_url":"http://127.0.0.1:41496/solr",
   [junit4]   2>   "node_name":"127.0.0.1:41496_solr",
   [junit4]   2>   "numShards":"1",
   [junit4]   2>   "state":"recovering",
   [junit4]   2>   "shard":"shard1",
   [junit4]   2>   "collection":"testschemaapi",
   [junit4]   2>   "operation":"state"}
   [junit4]   2> 1020520 INFO  (zkCallback-1129-thread-1) [    ] o.a.s.c.OverseerTaskQueue NodeDataChanged fired on path /overseer/collection-queue-work/qnr-0000000000 state SyncConnected latchEventType null
   [junit4]   2> 1020520 INFO  (recoveryExecutor-1125-thread-1) [    ] o.a.s.c.RecoveryStrategy Sending prep recovery command to [http://127.0.0.1:42902/solr]; [WaitForState: action=PREPRECOVERY&core=testschemaapi_shard1_replica1&nodeName=127.0.0.1:41496_solr&coreNodeName=core_node1&state=recovering&checkLive=true&onlyIfLeader=true&onlyIfLeaderActive=true]
   [junit4]   2> 1020521 INFO  (qtp4027376-8445) [    ] o.a.s.h.a.CollectionsHandler Wait for new collection to be active for at most 30 seconds. Check all shard replicas
   [junit4]   2> 1020521 INFO  (qtp4027376-8439) [    ] o.a.s.h.a.CoreAdminOperation Going to wait for coreNodeName: core_node1, state: recovering, checkLive: true, onlyIfLeader: true, onlyIfLeaderActive: true
   [junit4]   2> 1020521 INFO  (qtp4027376-8439) [    ] o.a.s.h.a.CoreAdminOperation Will wait a max of 183 seconds to see testschemaapi_shard1_replica1 (shard1 of testschemaapi) have state: recovering
   [junit4]   2> 1020521 INFO  (qtp4027376-8439) [    ] o.a.s.h.a.CoreAdminOperation In WaitForState(recovering): collection=testschemaapi, shard=shard1, thisCore=testschemaapi_shard1_replica1, leaderDoesNotNeedRecovery=false, isLeader? true, live=true, checkLive=true, currentState=down, localState=active, nodeName=127.0.0.1:41496_solr, coreNodeName=core_node1, onlyIfActiveCheckResult=false, nodeProps: core_node1:{"core":"testschemaapi_shard1_replica2","base_url":"http://127.0.0.1:41496/solr","node_name":"127.0.0.1:41496_solr","state":"down"}
   [junit4]   2> 1020621 INFO  (OverseerStateUpdate-95780809426796549-127.0.0.1:42902_solr-n_0000000000) [    ] o.a.s.c.o.ZkStateWriter going to update_collection /collections/testschemaapi/state.json version: 3
   [junit4]   2> 1020621 INFO  (zkCallback-1129-thread-1) [    ] o.a.s.c.c.ZkStateReader A cluster state change: [WatchedEvent state:SyncConnected type:NodeDataChanged path:/collections/testschemaapi/state.json] for collection [testschemaapi] has occurred - updating... (live nodes size: [2])
   [junit4]   2> 1020621 INFO  (zkCallback-1130-thread-1) [    ] o.a.s.c.c.ZkStateReader A cluster state change: [WatchedEvent state:SyncConnected type:NodeDataChanged path:/collections/testschemaapi/state.json] for collection [testschemaapi] has occurred - updating... (live nodes size: [2])
   [junit4]   2> 1020622 INFO  (zkCallback-1129-thread-1) [    ] o.a.s.c.c.ZkStateReader Updating data for [testschemaapi] from [3] to [4]
   [junit4]   2> 1020622 INFO  (zkCallback-1130-thread-1) [    ] o.a.s.c.c.ZkStateReader Updating data for [testschemaapi] from [3] to [4]
   [junit4]   2> 1021521 INFO  (qtp4027376-8439) [    ] o.a.s.h.a.CoreAdminOperation In WaitForState(recovering): collection=testschemaapi, shard=shard1, thisCore=testschemaapi_shard1_replica1, leaderDoesNotNeedRecovery=false, isLeader? true, live=true, checkLive=true, currentState=recovering, localState=active, nodeName=127.0.0.1:41496_solr, coreNodeName=core_node1, onlyIfActiveCheckResult=false, nodeProps: core_node1:{"core":"testschemaapi_shard1_replica2","base_url":"http://127.0.0.1:41496/solr","node_name":"127.0.0.1:41496_solr","state":"recovering"}
   [junit4]   2> 1021522 INFO  (qtp4027376-8439) [    ] o.a.s.h.a.CoreAdminOperation Waited coreNodeName: core_node1, state: recovering, checkLive: true, onlyIfLeader: true for: 1 seconds.
   [junit4]   2> 1021522 INFO  (qtp4027376-8439) [    ] o.a.s.s.HttpSolrCall [admin] webapp=null path=/admin/cores params={nodeName=127.0.0.1:41496_solr&onlyIfLeaderActive=true&core=testschemaapi_shard1_replica1&coreNodeName=core_node1&action=PREPRECOVERY&checkLive=true&state=recovering&onlyIfLeader=true&wt=javabin&version=2} status=0 QTime=1000
   [junit4]   2> 1028522 INFO  (recoveryExecutor-1125-thread-1) [    ] o.a.s.c.RecoveryStrategy Attempting to PeerSync from [http://127.0.0.1:42902/solr/testschemaapi_shard1_replica1/] - recoveringAfterStartup=[true]
   [junit4]   2> 1028522 INFO  (recoveryExecutor-1125-thread-1) [    ] o.a.s.u.PeerSync PeerSync: core=testschemaapi_shard1_replica2 url=http://127.0.0.1:41496/solr START replicas=[http://127.0.0.1:42902/solr/testschemaapi_shard1_replica1/] nUpdates=100
   [junit4]   2> 1028523 WARN  (recoveryExecutor-1125-thread-1) [    ] o.a.s.u.PeerSync no frame of reference to tell if we've missed updates
   [junit4]   2> 1028523 INFO  (recoveryExecutor-1125-thread-1) [    ] o.a.s.c.RecoveryStrategy PeerSync Recovery was not successful - trying replication.
   [junit4]   2> 1028523 INFO  (recoveryExecutor-1125-thread-1) [    ] o.a.s.c.RecoveryStrategy Starting Replication Recovery.
   [junit4]   2> 1028523 INFO  (recoveryExecutor-1125-thread-1) [    ] o.a.s.c.RecoveryStrategy Attempting to replicate from [http://127.0.0.1:42902/solr/testschemaapi_shard1_replica1/].
   [junit4]   2> 1028525 INFO  (qtp4027376-8437) [    ] o.a.s.u.IndexFingerprint IndexFingerprint millis:0.0 result:{maxVersionSpecified=9223372036854775807, maxVersionEncountered=0, maxInHash=0, versionsHash=0, numVersions=0, numDocs=0, maxDoc=0}
   [junit4]   2> 1028525 INFO  (qtp4027376-8437) [    ] o.a.s.c.S.Request [testschemaapi_shard1_replica1]  webapp=/solr path=/get params={distrib=false&qt=/get&fingerprint=true&getVersions=100&wt=javabin&version=2} status=0 QTime=1
   [junit4]   2> 1028525 INFO  (qtp4027376-8435) [    ] o.a.s.u.DirectUpdateHandler2 start commit{,optimize=false,openSearcher=false,waitSearcher=true,expungeDeletes=false,softCommit=false,prepareCommit=false}
   [junit4]   2> 1028525 INFO  (qtp4027376-8435) [    ] o.a.s.u.DirectUpdateHandler2 No uncommitted changes. Skipping IW.commit.
   [junit4]   2> 1028525 INFO  (qtp4027376-8435) [    ] o.a.s.u.DirectUpdateHandler2 end_commit_flush
   [junit4]   2> 1028526 INFO  (qtp4027376-8435) [    ] o.a.s.u.p.LogUpdateProcessorFactory [testschemaapi_shard1_replica1]  webapp=/solr path=/update params={waitSearcher=true&openSearcher=false&commit=true&softCommit=false&commit_end_point=true&wt=javabin&version=2}{commit=} 0 0
   [junit4]   2> 1028527 INFO  (qtp4027376-8449) [    ] o.a.s.c.S.Request [testschemaapi_shard1_replica1]  webapp=/solr path=/replication params={qt=/replication&wt=javabin&version=2&command=indexversion} status=0 QTime=0
   [junit4]   2> 1028527 INFO  (recoveryExecutor-1125-thread-1) [    ] o.a.s.c.RecoveryStrategy No replay needed.
   [junit4]   2> 1028527 INFO  (recoveryExecutor-1125-thread-1) [    ] o.a.s.c.RecoveryStrategy Replication Recovery was successful.
   [junit4]   2> 1028527 INFO  (recoveryExecutor-1125-thread-1) [    ] o.a.s.c.RecoveryStrategy Registering as Active after recovery.
   [junit4]   2> 1028527 INFO  (recoveryExecutor-1125-thread-1) [    ] o.a.s.c.ZkController publishing state=active
   [junit4]   2> 1028528 INFO  (recoveryExecutor-1125-thread-1) [    ] o.a.s.c.RecoveryStrategy Updating version bucket highest from index after successful recovery.
   [junit4]   2> 1028528 INFO  (recoveryExecutor-1125-thread-1) [    ] o.a.s.u.UpdateLog Looking up max value of version field to seed version buckets
   [junit4]   2> 1028528 INFO  (recoveryExecutor-1125-thread-1) [    ] o.a.s.u.VersionInfo Refreshing highest value of _version_ for 65536 version buckets from index
   [junit4]   2> 1028528 INFO  (recoveryExecutor-1125-thread-1) [    ] o.a.s.u.VersionInfo No terms found for _version_, cannot seed version bucket highest value from index
   [junit4]   2> 1028528 INFO  (recoveryExecutor-1125-thread-1) [    ] o.a.s.u.UpdateLog Could not find max version in index or recent updates, using new clock 1532492962742665216
   [junit4]   2> 1028528 INFO  (OverseerStateUpdate-95780809426796549-127.0.0.1:42902_solr-n_0000000000) [    ] o.a.s.c.Overseer processMessage: queueSize: 1, message = {
   [junit4]   2>   "core":"testschemaapi_shard1_replica2",
   [junit4]   2>   "core_node_name":"core_node1",
   [junit4]   2>   "roles":null,
   [junit4]   2>   "base_url":"http://127.0.0.1:41496/solr",
   [junit4]   2>   "node_name":"127.0.0.1:41496_solr",
   [junit4]   2>   "numShards":"1",
   [junit4]   2>   "state":"active",
   [junit4]   2>   "shard":"shard1",
   [junit4]   2>   "collection":"testschemaapi",
   [junit4]   2>   "operation":"state"} current state version: 0
   [junit4]   2> 1028529 INFO  (OverseerStateUpdate-95780809426796549-127.0.0.1:42902_solr-n_0000000000) [    ] o.a.s.c.o.ReplicaMutator Update state numShards=1 message={
   [junit4]   2>   "core":"testschemaapi_shard1_replica2",
   [junit4]   2>   "core_node_name":"core_node1",
   [junit4]   2>   "roles":null,
   [junit4]   2>   "base_url":"http://127.0.0.1:41496/solr",
   [junit4]   2>   "node_name":"127.0.0.1:41496_solr",
   [junit4]   2>   "numShards":"1",
   [junit4]   2>   "state":"active",
   [junit4]   2>   "shard":"shard1",
   [junit4]   2>   "collection":"testschemaapi",
   [junit4]   2>   "operation":"state"}
   [junit4]   2> 1028529 INFO  (OverseerStateUpdate-95780809426796549-127.0.0.1:42902_solr-n_0000000000) [    ] o.a.s.c.o.ZkStateWriter going to update_collection /collections/testschemaapi/state.json version: 4
   [junit4]   2> 1028529 INFO  (zkCallback-1129-thread-1) [    ] o.a.s.c.c.ZkStateReader A cluster state change: [WatchedEvent state:SyncConnected type:NodeDataChanged path:/collections/testschemaapi/state.json] for collection [testschemaapi] has occurred - updating... (live nodes size: [2])
   [junit4]   2> 1028529 INFO  (zkCallback-1130-thread-1) [    ] o.a.s.c.c.ZkStateReader A cluster state change: [WatchedEvent state:SyncConnected type:NodeDataChanged path:/collections/testschemaapi/state.json] for collection [testschemaapi] has occurred - updating... (live nodes size: [2])
   [junit4]   2> 1028530 INFO  (zkCallback-1129-thread-1) [    ] o.a.s.c.c.ZkStateReader Updating data for [testschemaapi] from [4] to [5]
   [junit4]   2> 1028530 INFO  (zkCallback-1130-thread-1) [    ] o.a.s.c.c.ZkStateReader Updating data for [testschemaapi] from [4] to [5]
   [junit4]   2> 1028530 INFO  (recoveryExecutor-1125-thread-1) [    ] o.a.s.u.UpdateLog Took 1.0ms to seed version buckets with highest version 1532492962742665216
   [junit4]   2> 1028530 INFO  (recoveryExecutor-1125-thread-1) [    ] o.a.s.c.RecoveryStrategy Finished recovery process, successful=[true]
   [junit4]   2> 1029522 INFO  (qtp4027376-8445) [    ] o.a.s.s.HttpSolrCall [admin] webapp=null path=/admin/collections params={replicationFactor=2&collection.configName=conf1&name=testschemaapi&action=CREATE&numShards=1&wt=javabin&version=2} status=0 QTime=11160
   [junit4]   2> 1029533 INFO  (qtp32644699-8436) [    ] o.a.s.s.SchemaManager managed schema loaded . version : 0 
   [junit4]   2> 1029536 INFO  (qtp32644699-8436) [    ] o.a.s.s.IndexSchema [testschemaapi_shard1_replica2] Schema name=minimal
   [junit4]   2> 1029538 INFO  (qtp32644699-8436) [    ] o.a.s.s.IndexSchema unique key field: id
   [junit4]   2> 1029545 INFO  (zkCallback-1130-thread-1) [    ] o.a.s.s.ZkIndexSchemaReader A schema change: WatchedEvent state:SyncConnected type:NodeDataChanged path:/configs/conf1/managed-schema, has occurred - updating schema from ZooKeeper ...
   [junit4]   2> 1029545 INFO  (zkCallback-1129-thread-1) [    ] o.a.s.s.ZkIndexSchemaReader A schema change: WatchedEvent state:SyncConnected type:NodeDataChanged path:/configs/conf1/managed-schema, has occurred - updating schema from ZooKeeper ...
   [junit4]   2> 1029545 INFO  (qtp32644699-8436) [    ] o.a.s.c.ZkController Persisted config data to node /configs/conf1/managed-

[...truncated too long message...]

/clusterstate.json
   [junit4]   2> 	2	/solr/collections/testschemaapi/state.json
   [junit4]   2> 
   [junit4]   2> Maximum concurrent children watches above limit:
   [junit4]   2> 
   [junit4]   2> 	3	/solr/live_nodes
   [junit4]   2> 	3	/solr/collections
   [junit4]   2> 
   [junit4]   2> 1029684 INFO  (SUITE-TestManagedSchemaAPI-seed#[1FE198B03559C2C5]-worker) [    ] o.a.s.SolrTestCaseJ4 ###deleteCore
   [junit4]   2> NOTE: leaving temporary files on disk at: /home/jenkins/workspace/Lucene-Solr-master-Linux/solr/build/solr-core/test/J1/temp/solr.schema.TestManagedSchemaAPI_1FE198B03559C2C5-001
   [junit4]   2> Apr 24, 2016 11:59:39 AM com.carrotsearch.randomizedtesting.ThreadLeakControl checkThreadLeaks
   [junit4]   2> WARNING: Will linger awaiting termination of 6 leaked thread(s).
   [junit4]   2> 1039669 WARN  (Thread-2770) [    ] o.a.s.c.ZkController listener throws error
   [junit4]   2> org.apache.solr.common.SolrException: Unable to reload core [testschemaapi_shard1_replica1]
   [junit4]   2> 	at org.apache.solr.core.CoreContainer.reload(CoreContainer.java:945)
   [junit4]   2> 	at org.apache.solr.core.SolrCore.lambda$getConfListener$6(SolrCore.java:2488)
   [junit4]   2> 	at org.apache.solr.cloud.ZkController$4.run(ZkController.java:2425)
   [junit4]   2> Caused by: org.apache.solr.common.SolrException: Could not load conf for core testschemaapi_shard1_replica1: Unable to load reader for ConfigSet properties: configsetprops.json
   [junit4]   2> 	at org.apache.solr.core.ConfigSetService.getConfig(ConfigSetService.java:86)
   [junit4]   2> 	at org.apache.solr.core.CoreContainer.reload(CoreContainer.java:937)
   [junit4]   2> 	... 2 more
   [junit4]   2> Caused by: org.apache.solr.common.SolrException: Unable to load reader for ConfigSet properties: configsetprops.json
   [junit4]   2> 	at org.apache.solr.core.ConfigSetProperties.readFromResourceLoader(ConfigSetProperties.java:57)
   [junit4]   2> 	at org.apache.solr.core.ConfigSetService.createConfigSetProperties(ConfigSetService.java:118)
   [junit4]   2> 	at org.apache.solr.core.ConfigSetService.getConfig(ConfigSetService.java:80)
   [junit4]   2> 	... 3 more
   [junit4]   2> Caused by: java.io.IOException: We re-tried 10 times but was still unable to fetch resource=configsetprops.json from ZK
   [junit4]   2> 	at org.apache.solr.cloud.ZkSolrResourceLoader.openResource(ZkSolrResourceLoader.java:116)
   [junit4]   2> 	at org.apache.solr.core.ConfigSetProperties.readFromResourceLoader(ConfigSetProperties.java:52)
   [junit4]   2> 	... 5 more
   [junit4]   2> Caused by: org.apache.zookeeper.KeeperException$SessionExpiredException: KeeperErrorCode = Session expired for /configs/conf1/configsetprops.json
   [junit4]   2> 	at org.apache.zookeeper.KeeperException.create(KeeperException.java:127)
   [junit4]   2> 	at org.apache.zookeeper.KeeperException.create(KeeperException.java:51)
   [junit4]   2> 	at org.apache.zookeeper.ZooKeeper.exists(ZooKeeper.java:1045)
   [junit4]   2> 	at org.apache.solr.common.cloud.SolrZkClient$5.execute(SolrZkClient.java:314)
   [junit4]   2> 	at org.apache.solr.common.cloud.SolrZkClient$5.execute(SolrZkClient.java:311)
   [junit4]   2> 	at org.apache.solr.common.cloud.ZkCmdExecutor.retryOperation(ZkCmdExecutor.java:60)
   [junit4]   2> 	at org.apache.solr.common.cloud.SolrZkClient.exists(SolrZkClient.java:311)
   [junit4]   2> 	at org.apache.solr.cloud.ZkController.pathExists(ZkController.java:800)
   [junit4]   2> 	at org.apache.solr.cloud.ZkSolrResourceLoader.openResource(ZkSolrResourceLoader.java:89)
   [junit4]   2> 	... 6 more
   [junit4]   2> 1039670 WARN  (Thread-2769) [    ] o.a.s.c.ZkController listener throws error
   [junit4]   2> org.apache.solr.common.SolrException: Unable to reload core [testschemaapi_shard1_replica2]
   [junit4]   2> 	at org.apache.solr.core.CoreContainer.reload(CoreContainer.java:945)
   [junit4]   2> 	at org.apache.solr.core.SolrCore.lambda$getConfListener$6(SolrCore.java:2488)
   [junit4]   2> 	at org.apache.solr.cloud.ZkController$4.run(ZkController.java:2425)
   [junit4]   2> Caused by: org.apache.solr.common.SolrException: Could not load conf for core testschemaapi_shard1_replica2: Unable to load reader for ConfigSet properties: configsetprops.json
   [junit4]   2> 	at org.apache.solr.core.ConfigSetService.getConfig(ConfigSetService.java:86)
   [junit4]   2> 	at org.apache.solr.core.CoreContainer.reload(CoreContainer.java:937)
   [junit4]   2> 	... 2 more
   [junit4]   2> Caused by: org.apache.solr.common.SolrException: Unable to load reader for ConfigSet properties: configsetprops.json
   [junit4]   2> 	at org.apache.solr.core.ConfigSetProperties.readFromResourceLoader(ConfigSetProperties.java:57)
   [junit4]   2> 	at org.apache.solr.core.ConfigSetService.createConfigSetProperties(ConfigSetService.java:118)
   [junit4]   2> 	at org.apache.solr.core.ConfigSetService.getConfig(ConfigSetService.java:80)
   [junit4]   2> 	... 3 more
   [junit4]   2> Caused by: java.io.IOException: We re-tried 10 times but was still unable to fetch resource=configsetprops.json from ZK
   [junit4]   2> 	at org.apache.solr.cloud.ZkSolrResourceLoader.openResource(ZkSolrResourceLoader.java:116)
   [junit4]   2> 	at org.apache.solr.core.ConfigSetProperties.readFromResourceLoader(ConfigSetProperties.java:52)
   [junit4]   2> 	... 5 more
   [junit4]   2> Caused by: org.apache.zookeeper.KeeperException$SessionExpiredException: KeeperErrorCode = Session expired for /configs/conf1/configsetprops.json
   [junit4]   2> 	at org.apache.zookeeper.KeeperException.create(KeeperException.java:127)
   [junit4]   2> 	at org.apache.zookeeper.KeeperException.create(KeeperException.java:51)
   [junit4]   2> 	at org.apache.zookeeper.ZooKeeper.exists(ZooKeeper.java:1045)
   [junit4]   2> 	at org.apache.solr.common.cloud.SolrZkClient$5.execute(SolrZkClient.java:314)
   [junit4]   2> 	at org.apache.solr.common.cloud.SolrZkClient$5.execute(SolrZkClient.java:311)
   [junit4]   2> 	at org.apache.solr.common.cloud.ZkCmdExecutor.retryOperation(ZkCmdExecutor.java:60)
   [junit4]   2> 	at org.apache.solr.common.cloud.SolrZkClient.exists(SolrZkClient.java:311)
   [junit4]   2> 	at org.apache.solr.cloud.ZkController.pathExists(ZkController.java:800)
   [junit4]   2> 	at org.apache.solr.cloud.ZkSolrResourceLoader.openResource(ZkSolrResourceLoader.java:89)
   [junit4]   2> 	... 6 more
   [junit4]   2> NOTE: test params are: codec=Asserting(Lucene60): {_version_=Lucene50(blocksize=128), id=FSTOrd50, myNewField=FST50}, docValues:{}, maxPointsInLeafNode=533, maxMBSortInHeap=6.137704258768796, sim=ClassicSimilarity, locale=fr-RE, timezone=Pacific/Norfolk
   [junit4]   2> NOTE: Linux 4.2.0-35-generic i386/Oracle Corporation 9-ea (32-bit)/cpus=12,threads=1,free=239757568,total=518979584
   [junit4]   2> NOTE: All tests run in this JVM: [TestCloudSchemaless, TestRebalanceLeaders, MinimalSchemaTest, HttpPartitionTest, TestConfigReload, DistributedQueryComponentOptimizationTest, TestBinaryResponseWriter, TestFiltering, TestConfigSetsAPI, TestScoreJoinQPScore, LeaderInitiatedRecoveryOnShardRestartTest, AnalysisErrorHandlingTest, DocumentBuilderTest, TestTrieFacet, TestSerializedLuceneMatchVersion, TestQuerySenderNoQuery, SimpleMLTQParserTest, UpdateRequestProcessorFactoryTest, TestSimpleTrackingShardHandler, TestTrackingShardHandlerFactory, PKIAuthenticationIntegrationTest, TestWordDelimiterFilterFactory, TestExclusionRuleCollectionAccess, CollectionReloadTest, TestFieldTypeCollectionResource, NotRequiredUniqueKeyTest, BigEndianAscendingWordSerializerTest, DirectSolrSpellCheckerTest, TestDocumentBuilder, TestInitQParser, WordBreakSolrSpellCheckerTest, ChaosMonkeySafeLeaderTest, RecoveryAfterSoftCommitTest, SolrIndexConfigTest, CoreMergeIndexesAdminHandlerTest, DistributedTermsComponentTest, WrapperMergePolicyFactoryTest, DistributedFacetPivotLargeTest, FullHLLTest, TestSolrFieldCacheMBean, CdcrReplicationHandlerTest, OverseerRolesTest, TestShardHandlerFactory, TestBM25SimilarityFactory, TestSolrCloudWithKerberosAlt, SortSpecParsingTest, AliasIntegrationTest, SolrIndexSplitterTest, ZkStateWriterTest, TestSortingResponseWriter, ConfigSetsAPITest, TestMinMaxOnMultiValuedField, TestDynamicFieldResource, SortByFunctionTest, ShardRoutingTest, OpenCloseCoreStressTest, SpatialHeatmapFacetsTest, DistributedFacetPivotSmallTest, TestEmbeddedSolrServerConstructors, TestQuerySenderListener, SolrXmlInZkTest, TestDynamicLoading, DOMUtilTest, RulesTest, BadCopyFieldTest, ZkControllerTest, TestSolrDeletionPolicy2, MBeansHandlerTest, TestSolrXml, TestQueryUtils, TestSchemaResource, HdfsDirectoryTest, DistributedQueueTest, TestManagedSchemaAPI]
   [junit4] Completed [271/590 (1!)] on J1 in 22.59s, 1 test, 1 error <<< FAILURES!

[...truncated 1023 lines...]
BUILD FAILED
/home/jenkins/workspace/Lucene-Solr-master-Linux/build.xml:740: The following error occurred while executing this line:
/home/jenkins/workspace/Lucene-Solr-master-Linux/build.xml:684: The following error occurred while executing this line:
/home/jenkins/workspace/Lucene-Solr-master-Linux/build.xml:59: The following error occurred while executing this line:
/home/jenkins/workspace/Lucene-Solr-master-Linux/solr/build.xml:233: The following error occurred while executing this line:
/home/jenkins/workspace/Lucene-Solr-master-Linux/solr/common-build.xml:529: The following error occurred while executing this line:
/home/jenkins/workspace/Lucene-Solr-master-Linux/lucene/common-build.xml:1457: The following error occurred while executing this line:
/home/jenkins/workspace/Lucene-Solr-master-Linux/lucene/common-build.xml:1014: There were test failures: 590 suites (10 ignored), 2384 tests, 1 error, 116 ignored (70 assumptions) [seed: 1FE198B03559C2C5]

Total time: 68 minutes 13 seconds
Build step 'Invoke Ant' marked build as failure
Archiving artifacts
[WARNINGS] Skipping publisher since build result is FAILURE
Recording test results
Email was triggered for: Failure - Any
Sending email for trigger: Failure - Any



Mime
View raw message