lucene-dev mailing list archives

Site index · List index
Message view « Date » · « Thread »
Top « Date » · « Thread »
From Policeman Jenkins Server <jenk...@thetaphi.de>
Subject [JENKINS] Lucene-Solr-6.0-Linux (32bit/jdk1.8.0_72) - Build # 144 - Failure!
Date Thu, 21 Apr 2016 19:25:32 GMT
Build: http://jenkins.thetaphi.de/job/Lucene-Solr-6.0-Linux/144/
Java: 32bit/jdk1.8.0_72 -server -XX:+UseG1GC

2 tests failed.
FAILED:  junit.framework.TestSuite.org.apache.solr.cloud.DistributedVersionInfoTest

Error Message:
Suite timeout exceeded (>= 7200000 msec).

Stack Trace:
java.lang.Exception: Suite timeout exceeded (>= 7200000 msec).
	at __randomizedtesting.SeedInfo.seed([37A3C47B137654BB]:0)


FAILED:  org.apache.solr.cloud.DistributedVersionInfoTest.test

Error Message:
Test abandoned because suite timeout was reached.

Stack Trace:
java.lang.Exception: Test abandoned because suite timeout was reached.
	at __randomizedtesting.SeedInfo.seed([37A3C47B137654BB]:0)




Build Log:
[...truncated 12481 lines...]
   [junit4] Suite: org.apache.solr.cloud.DistributedVersionInfoTest
   [junit4]   2> Creating dataDir: /home/jenkins/workspace/Lucene-Solr-6.0-Linux/solr/build/solr-core/test/J2/temp/solr.cloud.DistributedVersionInfoTest_37A3C47B137654BB-001/init-core-data-001
   [junit4]   2> 1463931 INFO  (SUITE-DistributedVersionInfoTest-seed#[37A3C47B137654BB]-worker) [    ] o.a.s.BaseDistributedSearchTestCase Setting hostContext system property: /
   [junit4]   2> 1463933 INFO  (TEST-DistributedVersionInfoTest.test-seed#[37A3C47B137654BB]) [    ] o.a.s.c.ZkTestServer STARTING ZK TEST SERVER
   [junit4]   2> 1463933 INFO  (Thread-3696) [    ] o.a.s.c.ZkTestServer client port:0.0.0.0/0.0.0.0:0
   [junit4]   2> 1463933 INFO  (Thread-3696) [    ] o.a.s.c.ZkTestServer Starting server
   [junit4]   2> 1464033 INFO  (TEST-DistributedVersionInfoTest.test-seed#[37A3C47B137654BB]) [    ] o.a.s.c.ZkTestServer start zk server on port:41790
   [junit4]   2> 1464034 INFO  (TEST-DistributedVersionInfoTest.test-seed#[37A3C47B137654BB]) [    ] o.a.s.c.c.SolrZkClient Using default ZkCredentialsProvider
   [junit4]   2> 1464034 INFO  (TEST-DistributedVersionInfoTest.test-seed#[37A3C47B137654BB]) [    ] o.a.s.c.c.ConnectionManager Waiting for client to connect to ZooKeeper
   [junit4]   2> 1464036 INFO  (zkCallback-1308-thread-1) [    ] o.a.s.c.c.ConnectionManager Watcher org.apache.solr.common.cloud.ConnectionManager@15345ac name:ZooKeeperConnection Watcher:127.0.0.1:41790 got event WatchedEvent state:SyncConnected type:None path:null path:null type:None
   [junit4]   2> 1464036 INFO  (TEST-DistributedVersionInfoTest.test-seed#[37A3C47B137654BB]) [    ] o.a.s.c.c.ConnectionManager Client is connected to ZooKeeper
   [junit4]   2> 1464037 INFO  (TEST-DistributedVersionInfoTest.test-seed#[37A3C47B137654BB]) [    ] o.a.s.c.c.SolrZkClient Using default ZkACLProvider
   [junit4]   2> 1464037 INFO  (TEST-DistributedVersionInfoTest.test-seed#[37A3C47B137654BB]) [    ] o.a.s.c.c.SolrZkClient makePath: /solr
   [junit4]   2> 1464039 INFO  (TEST-DistributedVersionInfoTest.test-seed#[37A3C47B137654BB]) [    ] o.a.s.c.c.SolrZkClient Using default ZkCredentialsProvider
   [junit4]   2> 1464040 INFO  (TEST-DistributedVersionInfoTest.test-seed#[37A3C47B137654BB]) [    ] o.a.s.c.c.ConnectionManager Waiting for client to connect to ZooKeeper
   [junit4]   2> 1464041 INFO  (zkCallback-1309-thread-1) [    ] o.a.s.c.c.ConnectionManager Watcher org.apache.solr.common.cloud.ConnectionManager@17167f2 name:ZooKeeperConnection Watcher:127.0.0.1:41790/solr got event WatchedEvent state:SyncConnected type:None path:null path:null type:None
   [junit4]   2> 1464041 INFO  (TEST-DistributedVersionInfoTest.test-seed#[37A3C47B137654BB]) [    ] o.a.s.c.c.ConnectionManager Client is connected to ZooKeeper
   [junit4]   2> 1464041 INFO  (TEST-DistributedVersionInfoTest.test-seed#[37A3C47B137654BB]) [    ] o.a.s.c.c.SolrZkClient Using default ZkACLProvider
   [junit4]   2> 1464041 INFO  (TEST-DistributedVersionInfoTest.test-seed#[37A3C47B137654BB]) [    ] o.a.s.c.c.SolrZkClient makePath: /collections/collection1
   [junit4]   2> 1464042 INFO  (TEST-DistributedVersionInfoTest.test-seed#[37A3C47B137654BB]) [    ] o.a.s.c.c.SolrZkClient makePath: /collections/collection1/shards
   [junit4]   2> 1464043 INFO  (TEST-DistributedVersionInfoTest.test-seed#[37A3C47B137654BB]) [    ] o.a.s.c.c.SolrZkClient makePath: /collections/control_collection
   [junit4]   2> 1464043 INFO  (TEST-DistributedVersionInfoTest.test-seed#[37A3C47B137654BB]) [    ] o.a.s.c.c.SolrZkClient makePath: /collections/control_collection/shards
   [junit4]   2> 1464044 INFO  (TEST-DistributedVersionInfoTest.test-seed#[37A3C47B137654BB]) [    ] o.a.s.c.AbstractZkTestCase put /home/jenkins/workspace/Lucene-Solr-6.0-Linux/solr/core/src/test-files/solr/collection1/conf/solrconfig-tlog.xml to /configs/conf1/solrconfig.xml
   [junit4]   2> 1464044 INFO  (TEST-DistributedVersionInfoTest.test-seed#[37A3C47B137654BB]) [    ] o.a.s.c.c.SolrZkClient makePath: /configs/conf1/solrconfig.xml
   [junit4]   2> 1464045 INFO  (TEST-DistributedVersionInfoTest.test-seed#[37A3C47B137654BB]) [    ] o.a.s.c.AbstractZkTestCase put /home/jenkins/workspace/Lucene-Solr-6.0-Linux/solr/core/src/test-files/solr/collection1/conf/schema.xml to /configs/conf1/schema.xml
   [junit4]   2> 1464045 INFO  (TEST-DistributedVersionInfoTest.test-seed#[37A3C47B137654BB]) [    ] o.a.s.c.c.SolrZkClient makePath: /configs/conf1/schema.xml
   [junit4]   2> 1464046 INFO  (TEST-DistributedVersionInfoTest.test-seed#[37A3C47B137654BB]) [    ] o.a.s.c.AbstractZkTestCase put /home/jenkins/workspace/Lucene-Solr-6.0-Linux/solr/core/src/test-files/solr/collection1/conf/solrconfig.snippet.randomindexconfig.xml to /configs/conf1/solrconfig.snippet.randomindexconfig.xml
   [junit4]   2> 1464046 INFO  (TEST-DistributedVersionInfoTest.test-seed#[37A3C47B137654BB]) [    ] o.a.s.c.c.SolrZkClient makePath: /configs/conf1/solrconfig.snippet.randomindexconfig.xml
   [junit4]   2> 1464047 INFO  (TEST-DistributedVersionInfoTest.test-seed#[37A3C47B137654BB]) [    ] o.a.s.c.AbstractZkTestCase put /home/jenkins/workspace/Lucene-Solr-6.0-Linux/solr/core/src/test-files/solr/collection1/conf/stopwords.txt to /configs/conf1/stopwords.txt
   [junit4]   2> 1464047 INFO  (TEST-DistributedVersionInfoTest.test-seed#[37A3C47B137654BB]) [    ] o.a.s.c.c.SolrZkClient makePath: /configs/conf1/stopwords.txt
   [junit4]   2> 1464048 INFO  (TEST-DistributedVersionInfoTest.test-seed#[37A3C47B137654BB]) [    ] o.a.s.c.AbstractZkTestCase put /home/jenkins/workspace/Lucene-Solr-6.0-Linux/solr/core/src/test-files/solr/collection1/conf/protwords.txt to /configs/conf1/protwords.txt
   [junit4]   2> 1464048 INFO  (TEST-DistributedVersionInfoTest.test-seed#[37A3C47B137654BB]) [    ] o.a.s.c.c.SolrZkClient makePath: /configs/conf1/protwords.txt
   [junit4]   2> 1464048 INFO  (TEST-DistributedVersionInfoTest.test-seed#[37A3C47B137654BB]) [    ] o.a.s.c.AbstractZkTestCase put /home/jenkins/workspace/Lucene-Solr-6.0-Linux/solr/core/src/test-files/solr/collection1/conf/currency.xml to /configs/conf1/currency.xml
   [junit4]   2> 1464048 INFO  (TEST-DistributedVersionInfoTest.test-seed#[37A3C47B137654BB]) [    ] o.a.s.c.c.SolrZkClient makePath: /configs/conf1/currency.xml
   [junit4]   2> 1464049 INFO  (TEST-DistributedVersionInfoTest.test-seed#[37A3C47B137654BB]) [    ] o.a.s.c.AbstractZkTestCase put /home/jenkins/workspace/Lucene-Solr-6.0-Linux/solr/core/src/test-files/solr/collection1/conf/enumsConfig.xml to /configs/conf1/enumsConfig.xml
   [junit4]   2> 1464049 INFO  (TEST-DistributedVersionInfoTest.test-seed#[37A3C47B137654BB]) [    ] o.a.s.c.c.SolrZkClient makePath: /configs/conf1/enumsConfig.xml
   [junit4]   2> 1464050 INFO  (TEST-DistributedVersionInfoTest.test-seed#[37A3C47B137654BB]) [    ] o.a.s.c.AbstractZkTestCase put /home/jenkins/workspace/Lucene-Solr-6.0-Linux/solr/core/src/test-files/solr/collection1/conf/open-exchange-rates.json to /configs/conf1/open-exchange-rates.json
   [junit4]   2> 1464050 INFO  (TEST-DistributedVersionInfoTest.test-seed#[37A3C47B137654BB]) [    ] o.a.s.c.c.SolrZkClient makePath: /configs/conf1/open-exchange-rates.json
   [junit4]   2> 1464051 INFO  (TEST-DistributedVersionInfoTest.test-seed#[37A3C47B137654BB]) [    ] o.a.s.c.AbstractZkTestCase put /home/jenkins/workspace/Lucene-Solr-6.0-Linux/solr/core/src/test-files/solr/collection1/conf/mapping-ISOLatin1Accent.txt to /configs/conf1/mapping-ISOLatin1Accent.txt
   [junit4]   2> 1464051 INFO  (TEST-DistributedVersionInfoTest.test-seed#[37A3C47B137654BB]) [    ] o.a.s.c.c.SolrZkClient makePath: /configs/conf1/mapping-ISOLatin1Accent.txt
   [junit4]   2> 1464052 INFO  (TEST-DistributedVersionInfoTest.test-seed#[37A3C47B137654BB]) [    ] o.a.s.c.AbstractZkTestCase put /home/jenkins/workspace/Lucene-Solr-6.0-Linux/solr/core/src/test-files/solr/collection1/conf/old_synonyms.txt to /configs/conf1/old_synonyms.txt
   [junit4]   2> 1464052 INFO  (TEST-DistributedVersionInfoTest.test-seed#[37A3C47B137654BB]) [    ] o.a.s.c.c.SolrZkClient makePath: /configs/conf1/old_synonyms.txt
   [junit4]   2> 1464052 INFO  (TEST-DistributedVersionInfoTest.test-seed#[37A3C47B137654BB]) [    ] o.a.s.c.AbstractZkTestCase put /home/jenkins/workspace/Lucene-Solr-6.0-Linux/solr/core/src/test-files/solr/collection1/conf/synonyms.txt to /configs/conf1/synonyms.txt
   [junit4]   2> 1464052 INFO  (TEST-DistributedVersionInfoTest.test-seed#[37A3C47B137654BB]) [    ] o.a.s.c.c.SolrZkClient makePath: /configs/conf1/synonyms.txt
   [junit4]   2> 1464115 INFO  (TEST-DistributedVersionInfoTest.test-seed#[37A3C47B137654BB]) [    ] o.a.s.SolrTestCaseJ4 Writing core.properties file to /home/jenkins/workspace/Lucene-Solr-6.0-Linux/solr/build/solr-core/test/J2/temp/solr.cloud.DistributedVersionInfoTest_37A3C47B137654BB-001/control-001/cores/collection1
   [junit4]   2> 1464117 INFO  (TEST-DistributedVersionInfoTest.test-seed#[37A3C47B137654BB]) [    ] o.e.j.s.Server jetty-9.3.8.v20160314
   [junit4]   2> 1464117 INFO  (TEST-DistributedVersionInfoTest.test-seed#[37A3C47B137654BB]) [    ] o.e.j.s.h.ContextHandler Started o.e.j.s.ServletContextHandler@450325{/,null,AVAILABLE}
   [junit4]   2> 1464119 INFO  (TEST-DistributedVersionInfoTest.test-seed#[37A3C47B137654BB]) [    ] o.e.j.s.ServerConnector Started ServerConnector@82cdb1{HTTP/1.1,[http/1.1]}{127.0.0.1:42837}
   [junit4]   2> 1464119 INFO  (TEST-DistributedVersionInfoTest.test-seed#[37A3C47B137654BB]) [    ] o.e.j.s.Server Started @1466207ms
   [junit4]   2> 1464119 INFO  (TEST-DistributedVersionInfoTest.test-seed#[37A3C47B137654BB]) [    ] o.a.s.c.s.e.JettySolrRunner Jetty properties: {solr.data.dir=/home/jenkins/workspace/Lucene-Solr-6.0-Linux/solr/build/solr-core/test/J2/temp/solr.cloud.DistributedVersionInfoTest_37A3C47B137654BB-001/tempDir-001/control/data, hostContext=/, hostPort=42837, coreRootDirectory=/home/jenkins/workspace/Lucene-Solr-6.0-Linux/solr/build/solr-core/test/J2/temp/solr.cloud.DistributedVersionInfoTest_37A3C47B137654BB-001/control-001/cores}
   [junit4]   2> 1464119 INFO  (TEST-DistributedVersionInfoTest.test-seed#[37A3C47B137654BB]) [    ] o.a.s.s.SolrDispatchFilter SolrDispatchFilter.init(): sun.misc.Launcher$AppClassLoader@1d16e93
   [junit4]   2> 1464119 INFO  (TEST-DistributedVersionInfoTest.test-seed#[37A3C47B137654BB]) [    ] o.a.s.c.SolrResourceLoader new SolrResourceLoader for directory: '/home/jenkins/workspace/Lucene-Solr-6.0-Linux/solr/build/solr-core/test/J2/temp/solr.cloud.DistributedVersionInfoTest_37A3C47B137654BB-001/control-001'
   [junit4]   2> 1464120 INFO  (TEST-DistributedVersionInfoTest.test-seed#[37A3C47B137654BB]) [    ] o.a.s.c.SolrResourceLoader JNDI not configured for solr (NoInitialContextEx)
   [junit4]   2> 1464120 INFO  (TEST-DistributedVersionInfoTest.test-seed#[37A3C47B137654BB]) [    ] o.a.s.c.SolrResourceLoader solr home defaulted to 'solr/' (could not find system property or JNDI)
   [junit4]   2> 1464120 INFO  (TEST-DistributedVersionInfoTest.test-seed#[37A3C47B137654BB]) [    ] o.a.s.c.c.SolrZkClient Using default ZkCredentialsProvider
   [junit4]   2> 1464120 INFO  (TEST-DistributedVersionInfoTest.test-seed#[37A3C47B137654BB]) [    ] o.a.s.c.c.ConnectionManager Waiting for client to connect to ZooKeeper
   [junit4]   2> 1464121 INFO  (zkCallback-1310-thread-1) [    ] o.a.s.c.c.ConnectionManager Watcher org.apache.solr.common.cloud.ConnectionManager@6db4a3 name:ZooKeeperConnection Watcher:127.0.0.1:41790/solr got event WatchedEvent state:SyncConnected type:None path:null path:null type:None
   [junit4]   2> 1464121 INFO  (TEST-DistributedVersionInfoTest.test-seed#[37A3C47B137654BB]) [    ] o.a.s.c.c.ConnectionManager Client is connected to ZooKeeper
   [junit4]   2> 1464121 INFO  (TEST-DistributedVersionInfoTest.test-seed#[37A3C47B137654BB]) [    ] o.a.s.c.c.SolrZkClient Using default ZkACLProvider
   [junit4]   2> 1464122 INFO  (TEST-DistributedVersionInfoTest.test-seed#[37A3C47B137654BB]) [    ] o.a.s.s.SolrDispatchFilter Loading solr.xml from SolrHome (not found in ZooKeeper)
   [junit4]   2> 1464122 INFO  (TEST-DistributedVersionInfoTest.test-seed#[37A3C47B137654BB]) [    ] o.a.s.c.SolrXmlConfig Loading container configuration from /home/jenkins/workspace/Lucene-Solr-6.0-Linux/solr/build/solr-core/test/J2/temp/solr.cloud.DistributedVersionInfoTest_37A3C47B137654BB-001/control-001/solr.xml
   [junit4]   2> 1464126 INFO  (TEST-DistributedVersionInfoTest.test-seed#[37A3C47B137654BB]) [    ] o.a.s.c.CorePropertiesLocator Config-defined core root directory: /home/jenkins/workspace/Lucene-Solr-6.0-Linux/solr/build/solr-core/test/J2/temp/solr.cloud.DistributedVersionInfoTest_37A3C47B137654BB-001/control-001/cores
   [junit4]   2> 1464126 INFO  (TEST-DistributedVersionInfoTest.test-seed#[37A3C47B137654BB]) [    ] o.a.s.c.CoreContainer New CoreContainer 14029029
   [junit4]   2> 1464126 INFO  (TEST-DistributedVersionInfoTest.test-seed#[37A3C47B137654BB]) [    ] o.a.s.c.CoreContainer Loading cores into CoreContainer [instanceDir=/home/jenkins/workspace/Lucene-Solr-6.0-Linux/solr/build/solr-core/test/J2/temp/solr.cloud.DistributedVersionInfoTest_37A3C47B137654BB-001/control-001]
   [junit4]   2> 1464126 WARN  (TEST-DistributedVersionInfoTest.test-seed#[37A3C47B137654BB]) [    ] o.a.s.c.CoreContainer Couldn't add files from /home/jenkins/workspace/Lucene-Solr-6.0-Linux/solr/build/solr-core/test/J2/temp/solr.cloud.DistributedVersionInfoTest_37A3C47B137654BB-001/control-001/lib to classpath: /home/jenkins/workspace/Lucene-Solr-6.0-Linux/solr/build/solr-core/test/J2/temp/solr.cloud.DistributedVersionInfoTest_37A3C47B137654BB-001/control-001/lib
   [junit4]   2> 1464126 INFO  (TEST-DistributedVersionInfoTest.test-seed#[37A3C47B137654BB]) [    ] o.a.s.h.c.HttpShardHandlerFactory created with socketTimeout : 90000,urlScheme : ,connTimeout : 15000,maxConnectionsPerHost : 20,maxConnections : 10000,corePoolSize : 0,maximumPoolSize : 2147483647,maxThreadIdleTime : 5,sizeOfQueue : -1,fairnessPolicy : false,useRetries : false,
   [junit4]   2> 1464127 INFO  (TEST-DistributedVersionInfoTest.test-seed#[37A3C47B137654BB]) [    ] o.a.s.u.UpdateShardHandler Creating UpdateShardHandler HTTP client with params: socketTimeout=340000&connTimeout=45000&retry=true
   [junit4]   2> 1464128 INFO  (TEST-DistributedVersionInfoTest.test-seed#[37A3C47B137654BB]) [    ] o.a.s.l.LogWatcher SLF4J impl is org.slf4j.impl.Log4jLoggerFactory
   [junit4]   2> 1464128 INFO  (TEST-DistributedVersionInfoTest.test-seed#[37A3C47B137654BB]) [    ] o.a.s.l.LogWatcher Registering Log Listener [Log4j (org.slf4j.impl.Log4jLoggerFactory)]
   [junit4]   2> 1464128 INFO  (TEST-DistributedVersionInfoTest.test-seed#[37A3C47B137654BB]) [    ] o.a.s.c.ZkContainer Zookeeper client=127.0.0.1:41790/solr
   [junit4]   2> 1464128 INFO  (TEST-DistributedVersionInfoTest.test-seed#[37A3C47B137654BB]) [    ] o.a.s.c.ZkController zkHost includes chroot
   [junit4]   2> 1464128 INFO  (TEST-DistributedVersionInfoTest.test-seed#[37A3C47B137654BB]) [    ] o.a.s.c.c.SolrZkClient Using default ZkCredentialsProvider
   [junit4]   2> 1464128 INFO  (TEST-DistributedVersionInfoTest.test-seed#[37A3C47B137654BB]) [    ] o.a.s.c.c.ConnectionManager Waiting for client to connect to ZooKeeper
   [junit4]   2> 1464129 INFO  (zkCallback-1313-thread-1) [    ] o.a.s.c.c.ConnectionManager Watcher org.apache.solr.common.cloud.ConnectionManager@1c56f0f name:ZooKeeperConnection Watcher:127.0.0.1:41790 got event WatchedEvent state:SyncConnected type:None path:null path:null type:None
   [junit4]   2> 1464129 INFO  (TEST-DistributedVersionInfoTest.test-seed#[37A3C47B137654BB]) [    ] o.a.s.c.c.ConnectionManager Client is connected to ZooKeeper
   [junit4]   2> 1464129 INFO  (TEST-DistributedVersionInfoTest.test-seed#[37A3C47B137654BB]) [    ] o.a.s.c.c.SolrZkClient Using default ZkACLProvider
   [junit4]   2> 1464130 INFO  (TEST-DistributedVersionInfoTest.test-seed#[37A3C47B137654BB]) [n:127.0.0.1:42837_    ] o.a.s.c.c.ConnectionManager Waiting for client to connect to ZooKeeper
   [junit4]   2> 1464131 INFO  (zkCallback-1314-thread-1-processing-n:127.0.0.1:42837_) [n:127.0.0.1:42837_    ] o.a.s.c.c.ConnectionManager Watcher org.apache.solr.common.cloud.ConnectionManager@19cf3e2 name:ZooKeeperConnection Watcher:127.0.0.1:41790/solr got event WatchedEvent state:SyncConnected type:None path:null path:null type:None
   [junit4]   2> 1464131 INFO  (TEST-DistributedVersionInfoTest.test-seed#[37A3C47B137654BB]) [n:127.0.0.1:42837_    ] o.a.s.c.c.ConnectionManager Client is connected to ZooKeeper
   [junit4]   2> 1464132 INFO  (TEST-DistributedVersionInfoTest.test-seed#[37A3C47B137654BB]) [n:127.0.0.1:42837_    ] o.a.s.c.c.SolrZkClient makePath: /overseer/queue
   [junit4]   2> 1464132 INFO  (TEST-DistributedVersionInfoTest.test-seed#[37A3C47B137654BB]) [n:127.0.0.1:42837_    ] o.a.s.c.c.SolrZkClient makePath: /overseer/collection-queue-work
   [junit4]   2> 1464133 INFO  (TEST-DistributedVersionInfoTest.test-seed#[37A3C47B137654BB]) [n:127.0.0.1:42837_    ] o.a.s.c.c.SolrZkClient makePath: /overseer/collection-map-running
   [junit4]   2> 1464134 INFO  (TEST-DistributedVersionInfoTest.test-seed#[37A3C47B137654BB]) [n:127.0.0.1:42837_    ] o.a.s.c.c.SolrZkClient makePath: /overseer/collection-map-completed
   [junit4]   2> 1464135 INFO  (TEST-DistributedVersionInfoTest.test-seed#[37A3C47B137654BB]) [n:127.0.0.1:42837_    ] o.a.s.c.c.SolrZkClient makePath: /overseer/collection-map-failure
   [junit4]   2> 1464136 INFO  (TEST-DistributedVersionInfoTest.test-seed#[37A3C47B137654BB]) [n:127.0.0.1:42837_    ] o.a.s.c.c.SolrZkClient makePath: /live_nodes
   [junit4]   2> 1464136 INFO  (TEST-DistributedVersionInfoTest.test-seed#[37A3C47B137654BB]) [n:127.0.0.1:42837_    ] o.a.s.c.c.SolrZkClient makePath: /aliases.json
   [junit4]   2> 1464137 INFO  (TEST-DistributedVersionInfoTest.test-seed#[37A3C47B137654BB]) [n:127.0.0.1:42837_    ] o.a.s.c.c.SolrZkClient makePath: /clusterstate.json
   [junit4]   2> 1464137 INFO  (TEST-DistributedVersionInfoTest.test-seed#[37A3C47B137654BB]) [n:127.0.0.1:42837_    ] o.a.s.c.c.SolrZkClient makePath: /security.json
   [junit4]   2> 1464137 INFO  (TEST-DistributedVersionInfoTest.test-seed#[37A3C47B137654BB]) [n:127.0.0.1:42837_    ] o.a.s.c.c.ZkStateReader Updating cluster state from ZooKeeper... 
   [junit4]   2> 1464138 INFO  (TEST-DistributedVersionInfoTest.test-seed#[37A3C47B137654BB]) [n:127.0.0.1:42837_    ] o.a.s.c.c.ZkStateReader Updated live nodes from ZooKeeper... (0) -> (0)
   [junit4]   2> 1464139 INFO  (TEST-DistributedVersionInfoTest.test-seed#[37A3C47B137654BB]) [n:127.0.0.1:42837_    ] o.a.s.c.c.SolrZkClient makePath: /overseer_elect
   [junit4]   2> 1464139 INFO  (TEST-DistributedVersionInfoTest.test-seed#[37A3C47B137654BB]) [n:127.0.0.1:42837_    ] o.a.s.c.c.SolrZkClient makePath: /overseer_elect/election
   [junit4]   2> 1464140 INFO  (TEST-DistributedVersionInfoTest.test-seed#[37A3C47B137654BB]) [n:127.0.0.1:42837_    ] o.a.s.c.Overseer Overseer (id=null) closing
   [junit4]   2> 1464140 INFO  (TEST-DistributedVersionInfoTest.test-seed#[37A3C47B137654BB]) [n:127.0.0.1:42837_    ] o.a.s.c.LeaderElector Joined leadership election with path: /overseer_elect/election/95765101894959108-127.0.0.1:42837_-n_0000000000
   [junit4]   2> 1464140 INFO  (TEST-DistributedVersionInfoTest.test-seed#[37A3C47B137654BB]) [n:127.0.0.1:42837_    ] o.a.s.c.OverseerElectionContext I am going to be the leader 127.0.0.1:42837_
   [junit4]   2> 1464140 INFO  (TEST-DistributedVersionInfoTest.test-seed#[37A3C47B137654BB]) [n:127.0.0.1:42837_    ] o.a.s.c.c.SolrZkClient makePath: /overseer_elect/leader
   [junit4]   2> 1464140 INFO  (TEST-DistributedVersionInfoTest.test-seed#[37A3C47B137654BB]) [n:127.0.0.1:42837_    ] o.a.s.c.Overseer Overseer (id=95765101894959108-127.0.0.1:42837_-n_0000000000) starting
   [junit4]   2> 1464141 INFO  (TEST-DistributedVersionInfoTest.test-seed#[37A3C47B137654BB]) [n:127.0.0.1:42837_    ] o.a.s.c.c.SolrZkClient makePath: /overseer/queue-work
   [junit4]   2> 1464143 INFO  (TEST-DistributedVersionInfoTest.test-seed#[37A3C47B137654BB]) [n:127.0.0.1:42837_    ] o.a.s.c.OverseerAutoReplicaFailoverThread Starting OverseerAutoReplicaFailoverThread autoReplicaFailoverWorkLoopDelay=10000 autoReplicaFailoverWaitAfterExpiration=30000 autoReplicaFailoverBadNodeExpiration=60000
   [junit4]   2> 1464144 INFO  (OverseerCollectionConfigSetProcessor-95765101894959108-127.0.0.1:42837_-n_0000000000) [n:127.0.0.1:42837_    ] o.a.s.c.OverseerTaskProcessor Process current queue of overseer operations
   [junit4]   2> 1464144 INFO  (OverseerStateUpdate-95765101894959108-127.0.0.1:42837_-n_0000000000) [n:127.0.0.1:42837_    ] o.a.s.c.Overseer Starting to work on the main queue
   [junit4]   2> 1464144 INFO  (TEST-DistributedVersionInfoTest.test-seed#[37A3C47B137654BB]) [n:127.0.0.1:42837_    ] o.a.s.c.ZkController Register node as live in ZooKeeper:/live_nodes/127.0.0.1:42837_
   [junit4]   2> 1464145 INFO  (TEST-DistributedVersionInfoTest.test-seed#[37A3C47B137654BB]) [n:127.0.0.1:42837_    ] o.a.s.c.c.SolrZkClient makePath: /live_nodes/127.0.0.1:42837_
   [junit4]   2> 1464145 INFO  (OverseerStateUpdate-95765101894959108-127.0.0.1:42837_-n_0000000000) [n:127.0.0.1:42837_    ] o.a.s.c.c.ZkStateReader Updated live nodes from ZooKeeper... (0) -> (0)
   [junit4]   2> 1464146 INFO  (zkCallback-1314-thread-1-processing-n:127.0.0.1:42837_) [n:127.0.0.1:42837_    ] o.a.s.c.c.ZkStateReader A live node change: [WatchedEvent state:SyncConnected type:NodeChildrenChanged path:/live_nodes], has occurred - updating... (live nodes size: [0])
   [junit4]   2> 1464150 INFO  (zkCallback-1314-thread-1-processing-n:127.0.0.1:42837_) [n:127.0.0.1:42837_    ] o.a.s.c.c.ZkStateReader Updated live nodes from ZooKeeper... (0) -> (1)
   [junit4]   2> 1464167 INFO  (TEST-DistributedVersionInfoTest.test-seed#[37A3C47B137654BB]) [n:127.0.0.1:42837_    ] o.a.s.c.CoreContainer Security conf doesn't exist. Skipping setup for authorization module.
   [junit4]   2> 1464167 INFO  (TEST-DistributedVersionInfoTest.test-seed#[37A3C47B137654BB]) [n:127.0.0.1:42837_    ] o.a.s.c.CoreContainer No authentication plugin used.
   [junit4]   2> 1464168 INFO  (TEST-DistributedVersionInfoTest.test-seed#[37A3C47B137654BB]) [n:127.0.0.1:42837_    ] o.a.s.c.CorePropertiesLocator Looking for core definitions underneath /home/jenkins/workspace/Lucene-Solr-6.0-Linux/solr/build/solr-core/test/J2/temp/solr.cloud.DistributedVersionInfoTest_37A3C47B137654BB-001/control-001/cores
   [junit4]   2> 1464168 INFO  (TEST-DistributedVersionInfoTest.test-seed#[37A3C47B137654BB]) [n:127.0.0.1:42837_    ] o.a.s.c.CoreDescriptor Created CoreDescriptor: {name=collection1, config=solrconfig.xml, transient=false, schema=schema.xml, loadOnStartup=true, configSetProperties=configsetprops.json, collection=control_collection, coreNodeName=, dataDir=data/, shard=}
   [junit4]   2> 1464168 INFO  (TEST-DistributedVersionInfoTest.test-seed#[37A3C47B137654BB]) [n:127.0.0.1:42837_    ] o.a.s.c.CorePropertiesLocator Found core collection1 in /home/jenkins/workspace/Lucene-Solr-6.0-Linux/solr/build/solr-core/test/J2/temp/solr.cloud.DistributedVersionInfoTest_37A3C47B137654BB-001/control-001/cores/collection1
   [junit4]   2> 1464168 INFO  (TEST-DistributedVersionInfoTest.test-seed#[37A3C47B137654BB]) [n:127.0.0.1:42837_    ] o.a.s.c.CorePropertiesLocator Found 1 core definitions
   [junit4]   2> 1464169 INFO  (TEST-DistributedVersionInfoTest.test-seed#[37A3C47B137654BB]) [n:127.0.0.1:42837_    ] o.a.s.s.SolrDispatchFilter user.dir=/home/jenkins/workspace/Lucene-Solr-6.0-Linux/solr/build/solr-core/test/J2
   [junit4]   2> 1464169 INFO  (coreLoadExecutor-5902-thread-1-processing-n:127.0.0.1:42837_) [n:127.0.0.1:42837_ c:control_collection   x:collection1] o.a.s.c.ZkController publishing state=down
   [junit4]   2> 1464169 INFO  (TEST-DistributedVersionInfoTest.test-seed#[37A3C47B137654BB]) [n:127.0.0.1:42837_    ] o.a.s.s.SolrDispatchFilter SolrDispatchFilter.init() done
   [junit4]   2> 1464169 INFO  (coreLoadExecutor-5902-thread-1-processing-n:127.0.0.1:42837_) [n:127.0.0.1:42837_ c:control_collection   x:collection1] o.a.s.c.ZkController numShards not found on descriptor - reading it from system property
   [junit4]   2> 1464171 INFO  (coreLoadExecutor-5902-thread-1-processing-n:127.0.0.1:42837_) [n:127.0.0.1:42837_ c:control_collection   x:collection1] o.a.s.c.ZkController look for our core node name
   [junit4]   2> 1464171 INFO  (OverseerStateUpdate-95765101894959108-127.0.0.1:42837_-n_0000000000) [n:127.0.0.1:42837_    ] o.a.s.c.Overseer processMessage: queueSize: 1, message = {
   [junit4]   2>   "core":"collection1",
   [junit4]   2>   "roles":null,
   [junit4]   2>   "base_url":"http://127.0.0.1:42837",
   [junit4]   2>   "node_name":"127.0.0.1:42837_",
   [junit4]   2>   "numShards":"1",
   [junit4]   2>   "state":"down",
   [junit4]   2>   "shard":null,
   [junit4]   2>   "collection":"control_collection",
   [junit4]   2>   "operation":"state"} current state version: 0
   [junit4]   2> 1464171 INFO  (OverseerStateUpdate-95765101894959108-127.0.0.1:42837_-n_0000000000) [n:127.0.0.1:42837_    ] o.a.s.c.o.ReplicaMutator Update state numShards=1 message={
   [junit4]   2>   "core":"collection1",
   [junit4]   2>   "roles":null,
   [junit4]   2>   "base_url":"http://127.0.0.1:42837",
   [junit4]   2>   "node_name":"127.0.0.1:42837_",
   [junit4]   2>   "numShards":"1",
   [junit4]   2>   "state":"down",
   [junit4]   2>   "shard":null,
   [junit4]   2>   "collection":"control_collection",
   [junit4]   2>   "operation":"state"}
   [junit4]   2> 1464171 INFO  (OverseerStateUpdate-95765101894959108-127.0.0.1:42837_-n_0000000000) [n:127.0.0.1:42837_    ] o.a.s.c.o.ClusterStateMutator building a new cName: control_collection
   [junit4]   2> 1464171 INFO  (OverseerStateUpdate-95765101894959108-127.0.0.1:42837_-n_0000000000) [n:127.0.0.1:42837_    ] o.a.s.c.o.ReplicaMutator Assigning new node to shard shard=shard1
   [junit4]   2> 1464172 INFO  (zkCallback-1314-thread-1-processing-n:127.0.0.1:42837_) [n:127.0.0.1:42837_    ] o.a.s.c.c.ZkStateReader A cluster state change: [WatchedEvent state:SyncConnected type:NodeDataChanged path:/clusterstate.json], has occurred - updating... (live nodes size: [1])
   [junit4]   2> 1465171 INFO  (coreLoadExecutor-5902-thread-1-processing-n:127.0.0.1:42837_) [n:127.0.0.1:42837_ c:control_collection   x:collection1] o.a.s.c.ZkController waiting to find shard id in clusterstate for collection1
   [junit4]   2> 1465171 INFO  (coreLoadExecutor-5902-thread-1-processing-n:127.0.0.1:42837_) [n:127.0.0.1:42837_ c:control_collection   x:collection1] o.a.s.c.ZkController Check for collection zkNode:control_collection
   [junit4]   2> 1465171 INFO  (coreLoadExecutor-5902-thread-1-processing-n:127.0.0.1:42837_) [n:127.0.0.1:42837_ c:control_collection   x:collection1] o.a.s.c.ZkController Collection zkNode exists
   [junit4]   2> 1465171 INFO  (coreLoadExecutor-5902-thread-1-processing-n:127.0.0.1:42837_) [n:127.0.0.1:42837_ c:control_collection   x:collection1] o.a.s.c.c.ZkStateReader Load collection config from: [/collections/control_collection]
   [junit4]   2> 1465172 INFO  (coreLoadExecutor-5902-thread-1-processing-n:127.0.0.1:42837_) [n:127.0.0.1:42837_ c:control_collection   x:collection1] o.a.s.c.c.ZkStateReader path=[/collections/control_collection] [configName]=[conf1] specified config exists in ZooKeeper
   [junit4]   2> 1465172 INFO  (coreLoadExecutor-5902-thread-1-processing-n:127.0.0.1:42837_) [n:127.0.0.1:42837_ c:control_collection   x:collection1] o.a.s.c.SolrResourceLoader new SolrResourceLoader for directory: '/home/jenkins/workspace/Lucene-Solr-6.0-Linux/solr/build/solr-core/test/J2/temp/solr.cloud.DistributedVersionInfoTest_37A3C47B137654BB-001/control-001/cores/collection1'
   [junit4]   2> 1465172 INFO  (coreLoadExecutor-5902-thread-1-processing-n:127.0.0.1:42837_) [n:127.0.0.1:42837_ c:control_collection   x:collection1] o.a.s.c.SolrResourceLoader JNDI not configured for solr (NoInitialContextEx)
   [junit4]   2> 1465172 INFO  (coreLoadExecutor-5902-thread-1-processing-n:127.0.0.1:42837_) [n:127.0.0.1:42837_ c:control_collection   x:collection1] o.a.s.c.SolrResourceLoader solr home defaulted to 'solr/' (could not find system property or JNDI)
   [junit4]   2> 1465173 INFO  (coreLoadExecutor-5902-thread-1-processing-n:127.0.0.1:42837_) [n:127.0.0.1:42837_ c:control_collection   x:collection1] o.a.s.c.Config loaded config solrconfig.xml with version 0 
   [junit4]   2> 1465177 INFO  (coreLoadExecutor-5902-thread-1-processing-n:127.0.0.1:42837_) [n:127.0.0.1:42837_ c:control_collection   x:collection1] o.a.s.c.SolrConfig current version of requestparams : -1
   [junit4]   2> 1465180 WARN  (coreLoadExecutor-5902-thread-1-processing-n:127.0.0.1:42837_) [n:127.0.0.1:42837_ c:control_collection   x:collection1] o.a.s.c.Config Beginning with Solr 5.5, <mergePolicy> is deprecated, use <mergePolicyFactory> instead.
   [junit4]   2> 1465180 INFO  (coreLoadExecutor-5902-thread-1-processing-n:127.0.0.1:42837_) [n:127.0.0.1:42837_ c:control_collection   x:collection1] o.a.s.c.SolrConfig Using Lucene MatchVersion: 6.0.0
   [junit4]   2> 1465203 INFO  (coreLoadExecutor-5902-thread-1-processing-n:127.0.0.1:42837_) [n:127.0.0.1:42837_ c:control_collection   x:collection1] o.a.s.c.SolrConfig Loaded SolrConfig: solrconfig.xml
   [junit4]   2> 1465207 INFO  (coreLoadExecutor-5902-thread-1-processing-n:127.0.0.1:42837_) [n:127.0.0.1:42837_ c:control_collection   x:collection1] o.a.s.s.IndexSchema [collection1] Schema name=test
   [junit4]   2> 1465274 INFO  (coreLoadExecutor-5902-thread-1-processing-n:127.0.0.1:42837_) [n:127.0.0.1:42837_ c:control_collection   x:collection1] o.a.s.s.OpenExchangeRatesOrgProvider Initialized with rates=open-exchange-rates.json, refreshInterval=1440.
   [junit4]   2> 1465278 INFO  (coreLoadExecutor-5902-thread-1-processing-n:127.0.0.1:42837_) [n:127.0.0.1:42837_ c:control_collection   x:collection1] o.a.s.s.IndexSchema default search field in schema is text
   [junit4]   2> 1465279 INFO  (coreLoadExecutor-5902-thread-1-processing-n:127.0.0.1:42837_) [n:127.0.0.1:42837_ c:control_collection   x:collection1] o.a.s.s.IndexSchema unique key field: id
   [junit4]   2> 1465283 INFO  (coreLoadExecutor-5902-thread-1-processing-n:127.0.0.1:42837_) [n:127.0.0.1:42837_ c:control_collection   x:collection1] o.a.s.s.FileExchangeRateProvider Reloading exchange rates from file currency.xml
   [junit4]   2> 1465284 INFO  (coreLoadExecutor-5902-thread-1-processing-n:127.0.0.1:42837_) [n:127.0.0.1:42837_ c:control_collection   x:collection1] o.a.s.s.FileExchangeRateProvider Reloading exchange rates from file currency.xml
   [junit4]   2> 1465285 INFO  (coreLoadExecutor-5902-thread-1-processing-n:127.0.0.1:42837_) [n:127.0.0.1:42837_ c:control_collection   x:collection1] o.a.s.s.OpenExchangeRatesOrgProvider Reloading exchange rates from open-exchange-rates.json
   [junit4]   2> 1465286 INFO  (coreLoadExecutor-5902-thread-1-processing-n:127.0.0.1:42837_) [n:127.0.0.1:42837_ c:control_collection   x:collection1] o.a.s.s.OpenExchangeRatesOrgProvider Reloading exchange rates from open-exchange-rates.json
   [junit4]   2> 1465287 INFO  (coreLoadExecutor-5902-thread-1-processing-n:127.0.0.1:42837_) [n:127.0.0.1:42837_ c:control_collection   x:collection1] o.a.s.c.ConfigSetProperties Did not find ConfigSet properties, assuming default properties: Can't find resource 'configsetprops.json' in classpath or '/configs/conf1', cwd=/home/jenkins/workspace/Lucene-Solr-6.0-Linux/solr/build/solr-core/test/J2
   [junit4]   2> 1465287 INFO  (coreLoadExecutor-5902-thread-1-processing-n:127.0.0.1:42837_) [n:127.0.0.1:42837_ c:control_collection   x:collection1] o.a.s.c.CoreContainer Creating SolrCore 'collection1' using configuration from collection control_collection
   [junit4]   2> 1465287 INFO  (coreLoadExecutor-5902-thread-1-processing-n:127.0.0.1:42837_) [n:127.0.0.1:42837_ c:control_collection s:shard1 r:core_node1 x:collection1] o.a.s.c.SolrCore org.apache.solr.core.MockDirectoryFactory
   [junit4]   2> 1465287 INFO  (coreLoadExecutor-5902-thread-1-processing-n:127.0.0.1:42837_) [n:127.0.0.1:42837_ c:control_collection s:shard1 r:core_node1 x:collection1] o.a.s.c.SolrCore [[collection1] ] Opening new SolrCore at [/home/jenkins/workspace/Lucene-Solr-6.0-Linux/solr/build/solr-core/test/J2/temp/solr.cloud.DistributedVersionInfoTest_37A3C47B137654BB-001/control-001/cores/collection1], dataDir=[/home/jenkins/workspace/Lucene-Solr-6.0-Linux/solr/build/solr-core/test/J2/temp/solr.cloud.DistributedVersionInfoTest_37A3C47B137654BB-001/control-001/cores/collection1/data/]
   [junit4]   2> 1465288 INFO  (coreLoadExecutor-5902-thread-1-processing-n:127.0.0.1:42837_) [n:127.0.0.1:42837_ c:control_collection s:shard1 r:core_node1 x:collection1] o.a.s.c.JmxMonitoredMap JMX monitoring is enabled. Adding Solr mbeans to JMX Server: com.sun.jmx.mbeanserver.JmxMBeanServer@f1aead
   [junit4]   2> 1465288 INFO  (coreLoadExecutor-5902-thread-1-processing-n:127.0.0.1:42837_) [n:127.0.0.1:42837_ c:control_collection s:shard1 r:core_node1 x:collection1] o.a.s.c.CachingDirectoryFactory return new directory for /home/jenkins/workspace/Lucene-Solr-6.0-Linux/solr/build/solr-core/test/J2/temp/solr.cloud.DistributedVersionInfoTest_37A3C47B137654BB-001/control-001/cores/collection1/data
   [junit4]   2> 1465288 INFO  (coreLoadExecutor-5902-thread-1-processing-n:127.0.0.1:42837_) [n:127.0.0.1:42837_ c:control_collection s:shard1 r:core_node1 x:collection1] o.a.s.c.SolrCore New index directory detected: old=null new=/home/jenkins/workspace/Lucene-Solr-6.0-Linux/solr/build/solr-core/test/J2/temp/solr.cloud.DistributedVersionInfoTest_37A3C47B137654BB-001/control-001/cores/collection1/data/index/
   [junit4]   2> 1465288 WARN  (coreLoadExecutor-5902-thread-1-processing-n:127.0.0.1:42837_) [n:127.0.0.1:42837_ c:control_collection s:shard1 r:core_node1 x:collection1] o.a.s.c.SolrCore [collection1] Solr index directory '/home/jenkins/workspace/Lucene-Solr-6.0-Linux/solr/build/solr-core/test/J2/temp/solr.cloud.DistributedVersionInfoTest_37A3C47B137654BB-001/control-001/cores/collection1/data/index' doesn't exist. Creating new index...
   [junit4]   2> 1465289 INFO  (coreLoadExecutor-5902-thread-1-processing-n:127.0.0.1:42837_) [n:127.0.0.1:42837_ c:control_collection s:shard1 r:core_node1 x:collection1] o.a.s.c.CachingDirectoryFactory return new directory for /home/jenkins/workspace/Lucene-Solr-6.0-Linux/solr/build/solr-core/test/J2/temp/solr.cloud.DistributedVersionInfoTest_37A3C47B137654BB-001/control-001/cores/collection1/data/index
   [junit4]   2> 1465289 INFO  (coreLoadExecutor-5902-thread-1-processing-n:127.0.0.1:42837_) [n:127.0.0.1:42837_ c:control_collection s:shard1 r:core_node1 x:collection1] o.a.s.u.RandomMergePolicy RandomMergePolicy wrapping class org.apache.lucene.index.LogByteSizeMergePolicy: [LogByteSizeMergePolicy: minMergeSize=1677721, mergeFactor=12, maxMergeSize=2147483648, maxMergeSizeForForcedMerge=9223372036854775807, calibrateSizeByDeletes=true, maxMergeDocs=2147483647, maxCFSSegmentSizeMB=8.796093022207999E12, noCFSRatio=0.4459700028905065]
   [junit4]   2> 1465292 INFO  (coreLoadExecutor-5902-thread-1-processing-n:127.0.0.1:42837_) [n:127.0.0.1:42837_ c:control_collection s:shard1 r:core_node1 x:collection1] o.a.s.c.SolrDeletionPolicy SolrDeletionPolicy.onCommit: commits: num=1
   [junit4]   2> 	commit{dir=MockDirectoryWrapper(SimpleFSDirectory@/home/jenkins/workspace/Lucene-Solr-6.0-Linux/solr/build/solr-core/test/J2/temp/solr.cloud.DistributedVersionInfoTest_37A3C47B137654BB-001/index-SimpleFSDirectory-001 lockFactory=org.apache.lucene.store.NativeFSLockFactory@14409be),segFN=segments_1,generation=1}
   [junit4]   2> 1465292 INFO  (coreLoadExecutor-5902-thread-1-processing-n:127.0.0.1:42837_) [n:127.0.0.1:42837_ c:control_collection s:shard1 r:core_node1 x:collection1] o.a.s.c.SolrDeletionPolicy newest commit generation = 1
   [junit4]   2> 1465293 INFO  (OldIndexDirectoryCleanupThreadForCore-collection1) [n:127.0.0.1:42837_ c:control_collection s:shard1 r:core_node1 x:collection1] o.a.s.c.SolrCore Looking for old index directories to cleanup for core collection1 in /home/jenkins/workspace/Lucene-Solr-6.0-Linux/solr/build/solr-core/test/J2/temp/solr.cloud.DistributedVersionInfoTest_37A3C47B137654BB-001/control-001/cores/collection1/data/
   [junit4]   2> 1465293 WARN  (OldIndexDirectoryCleanupThreadForCore-collection1) [n:127.0.0.1:42837_ c:control_collection s:shard1 r:core_node1 x:collection1] o.a.s.c.DirectoryFactory /home/jenkins/workspace/Lucene-Solr-6.0-Linux/solr/build/solr-core/test/J2/temp/solr.cloud.DistributedVersionInfoTest_37A3C47B137654BB-001/control-001/cores/collection1/data/ does not point to a valid data directory; skipping clean-up of old index directories.
   [junit4]   2> 1465295 INFO  (coreLoadExecutor-5902-thread-1-processing-n:127.0.0.1:42837_) [n:127.0.0.1:42837_ c:control_collection s:shard1 r:core_node1 x:collection1] o.a.s.u.p.UpdateRequestProcessorChain creating updateRequestProcessorChain "nodistrib"
   [junit4]   2> 1465295 INFO  (coreLoadExecutor-5902-thread-1-processing-n:127.0.0.1:42837_) [n:127.0.0.1:42837_ c:control_collection s:shard1 r:core_node1 x:collection1] o.a.s.u.p.UpdateRequestProcessorChain creating updateRequestProcessorChain "dedupe"
   [junit4]   2> 1465295 INFO  (coreLoadExecutor-5902-thread-1-processing-n:127.0.0.1:42837_) [n:127.0.0.1:42837_ c:control_collection s:shard1 r:core_node1 x:collection1] o.a.s.u.p.UpdateRequestProcessorChain inserting DistributedUpdateProcessorFactory into updateRequestProcessorChain "dedupe"
   [junit4]   2> 1465295 INFO  (coreLoadExecutor-5902-thread-1-processing-n:127.0.0.1:42837_) [n:127.0.0.1:42837_ c:control_collection s:shard1 r:core_node1 x:collection1] o.a.s.u.p.UpdateRequestProcessorChain creating updateRequestProcessorChain "stored_sig"
   [junit4]   2> 1465295 INFO  (coreLoadExecutor-5902-thread-1-processing-n:127.0.0.1:42837_) [n:127.0.0.1:42837_ c:control_collection s:shard1 r:core_node1 x:collection1] o.a.s.u.p.UpdateRequestProcessorChain inserting DistributedUpdateProcessorFactory into updateRequestProcessorChain "stored_sig"
   [junit4]   2> 1465295 INFO  (coreLoadExecutor-5902-thread-1-processing-n:127.0.0.1:42837_) [n:127.0.0.1:42837_ c:control_collection s:shard1 r:core_node1 x:collection1] o.a.s.u.p.UpdateRequestProcessorChain creating updateRequestProcessorChain "distrib-dup-test-chain-explicit"
   [junit4]   2> 1465295 INFO  (coreLoadExecutor-5902-thread-1-processing-n:127.0.0.1:42837_) [n:127.0.0.1:42837_ c:control_collection s:shard1 r:core_node1 x:collection1] o.a.s.u.p.UpdateRequestProcessorChain creating updateRequestProcessorChain "distrib-dup-test-chain-implicit"
   [junit4]   2> 1465295 INFO  (coreLoadExecutor-5902-thread-1-processing-n:127.0.0.1:42837_) [n:127.0.0.1:42837_ c:control_collection s:shard1 r:core_node1 x:collection1] o.a.s.u.p.UpdateRequestProcessorChain inserting DistributedUpdateProcessorFactory into updateRequestProcessorChain "distrib-dup-test-chain-implicit"
   [junit4]   2> 1465295 INFO  (coreLoadExecutor-5902-thread-1-processing-n:127.0.0.1:42837_) [n:127.0.0.1:42837_ c:control_collection s:shard1 r:core_node1 x:collection1] o.a.s.c.SolrCore no updateRequestProcessorChain defined as default, creating implicit default
   [junit4]   2> 1465295 WARN  (coreLoadExecutor-5902-thread-1-processing-n:127.0.0.1:42837_) [n:127.0.0.1:42837_ c:control_collection s:shard1 r:core_node1 x:collection1] o.a.s.c.RequestHandlers INVALID paramSet a in requestHandler {type = requestHandler,name = /dump,class = DumpRequestHandler,args = {defaults={a=A,b=B}}}
   [junit4]   2> 1465297 INFO  (coreLoadExecutor-5902-thread-1-processing-n:127.0.0.1:42837_) [n:127.0.0.1:42837_ c:control_collection s:shard1 r:core_node1 x:collection1] o.a.s.h.l.XMLLoader xsltCacheLifetimeSeconds=60
   [junit4]   2> 1465297 INFO  (coreLoadExecutor-5902-thread-1-processing-n:127.0.0.1:42837_) [n:127.0.0.1:42837_ c:control_collection s:shard1 r:core_node1 x:collection1] o.a.s.h.l.XMLLoader xsltCacheLifetimeSeconds=60
   [junit4]   2> 1465298 INFO  (coreLoadExecutor-5902-thread-1-processing-n:127.0.0.1:42837_) [n:127.0.0.1:42837_ c:control_collection s:shard1 r:core_node1 x:collection1] o.a.s.h.l.XMLLoader xsltCacheLifetimeSeconds=60
   [junit4]   2> 1465299 INFO  (coreLoadExecutor-5902-thread-1-processing-n:127.0.0.1:42837_) [n:127.0.0.1:42837_ c:control_collection s:shard1 r:core_node1 x:collection1] o.a.s.h.l.XMLLoader xsltCacheLifetimeSeconds=60
   [junit4]   2> 1465301 INFO  (coreLoadExecutor-5902-thread-1-processing-n:127.0.0.1:42837_) [n:127.0.0.1:42837_ c:control_collection s:shard1 r:core_node1 x:collection1] o.a.s.c.RequestHandlers Registered paths: /admin/mbeans,standard,/dump,/update/csv,/sql,/update/json/docs,/admin/luke,/export,/admin/segments,/get,/admin/system,/replication,/admin/properties,/config,/stream,/schema,/admin/plugins,/admin/logging,/update/json,/admin/ping,/admin/threads,/update,/admin/file
   [junit4]   2> 1465301 INFO  (coreLoadExecutor-5902-thread-1-processing-n:127.0.0.1:42837_) [n:127.0.0.1:42837_ c:control_collection s:shard1 r:core_node1 x:collection1] o.a.s.c.SolrCore Using default statsCache cache: org.apache.solr.search.stats.LocalStatsCache
   [junit4]   2> 1465301 INFO  (coreLoadExecutor-5902-thread-1-processing-n:127.0.0.1:42837_) [n:127.0.0.1:42837_ c:control_collection s:shard1 r:core_node1 x:collection1] o.a.s.u.UpdateHandler Using UpdateLog implementation: org.apache.solr.update.UpdateLog
   [junit4]   2> 1465301 INFO  (coreLoadExecutor-5902-thread-1-processing-n:127.0.0.1:42837_) [n:127.0.0.1:42837_ c:control_collection s:shard1 r:core_node1 x:collection1] o.a.s.u.UpdateLog Initializing UpdateLog: dataDir= defaultSyncLevel=FLUSH numRecordsToKeep=100 maxNumLogsToKeep=10 numVersionBuckets=65536
   [junit4]   2> 1465302 INFO  (coreLoadExecutor-5902-thread-1-processing-n:127.0.0.1:42837_) [n:127.0.0.1:42837_ c:control_collection s:shard1 r:core_node1 x:collection1] o.a.s.u.CommitTracker Hard AutoCommit: disabled
   [junit4]   2> 1465302 INFO  (coreLoadExecutor-5902-thread-1-processing-n:127.0.0.1:42837_) [n:127.0.0.1:42837_ c:control_collection s:shard1 r:core_node1 x:collection1] o.a.s.u.CommitTracker Soft AutoCommit: disabled
   [junit4]   2> 1465302 INFO  (coreLoadExecutor-5902-thread-1-processing-n:127.0.0.1:42837_) [n:127.0.0.1:42837_ c:control_collection s:shard1 r:core_node1 x:collection1] o.a.s.u.RandomMergePolicy RandomMergePolicy wrapping class org.apache.lucene.index.TieredMergePolicy: [TieredMergePolicy: maxMergeAtOnce=47, maxMergeAtOnceExplicit=32, maxMergedSegmentMB=57.35546875, floorSegmentMB=0.333984375, forceMergeDeletesPctAllowed=14.080778716254374, segmentsPerTier=21.0, maxCFSSegmentSizeMB=8.796093022207999E12, noCFSRatio=0.0
   [junit4]   2> 1465303 INFO  (coreLoadExecutor-5902-thread-1-processing-n:127.0.0.1:42837_) [n:127.0.0.1:42837_ c:control_collection s:shard1 r:core_node1 x:collection1] o.a.s.c.SolrDeletionPolicy SolrDeletionPolicy.onInit: commits: num=1
   [junit4]   2> 	commit{dir=MockDirectoryWrapper(SimpleFSDirectory@/home/jenkins/workspace/Lucene-Solr-6.0-Linux/solr/build/solr-core/test/J2/temp/solr.cloud.DistributedVersionInfoTest_37A3C47B137654BB-001/index-SimpleFSDirectory-001 lockFactory=org.apache.lucene.store.NativeFSLockFactory@14409be),segFN=segments_1,generation=1}
   [junit4]   2> 1465303 INFO  (coreLoadExecutor-5902-thread-1-processing-n:127.0.0.1:42837_) [n:127.0.0.1:42837_ c:control_collection s:shard1 r:core_node1 x:collection1] o.a.s.c.SolrDeletionPolicy newest commit generation = 1
   [junit4]   2> 1465303 INFO  (coreLoadExecutor-5902-thread-1-processing-n:127.0.0.1:42837_) [n:127.0.0.1:42837_ c:control_collection s:shard1 r:core_node1 x:collection1] o.a.s.s.SolrIndexSearcher Opening [Searcher@1c24fbb[collection1] main]
   [junit4]   2> 1465303 INFO  (coreLoadExecutor-5902-thread-1-processing-n:127.0.0.1:42837_) [n:127.0.0.1:42837_ c:control_collection s:shard1 r:core_node1 x:collection1] o.a.s.c.c.ZkStateReader Load collection config from: [/collections/control_collection]
   [junit4]   2> 1465304 INFO  (coreLoadExecutor-5902-thread-1-processing-n:127.0.0.1:42837_) [n:127.0.0.1:42837_ c:control_collection s:shard1 r:core_node1 x:collection1] o.a.s.c.c.ZkStateReader path=[/collections/control_collection] [configName]=[conf1] specified config exists in ZooKeeper
   [junit4]   2> 1465304 INFO  (coreLoadExecutor-5902-thread-1-processing-n:127.0.0.1:42837_) [n:127.0.0.1:42837_ c:control_collection s:shard1 r:core_node1 x:collection1] o.a.s.r.ManagedResourceStorage Setting up ZooKeeper-based storage for the RestManager with znodeBase: /configs/conf1
   [junit4]   2> 1465304 INFO  (coreLoadExecutor-5902-thread-1-processing-n:127.0.0.1:42837_) [n:127.0.0.1:42837_ c:control_collection s:shard1 r:core_node1 x:collection1] o.a.s.r.ManagedResourceStorage Configured ZooKeeperStorageIO with znodeBase: /configs/conf1
   [junit4]   2> 1465304 INFO  (coreLoadExecutor-5902-thread-1-processing-n:127.0.0.1:42837_) [n:127.0.0.1:42837_ c:control_collection s:shard1 r:core_node1 x:collection1] o.a.s.r.RestManager Initializing RestManager with initArgs: {}
   [junit4]   2> 1465304 INFO  (coreLoadExecutor-5902-thread-1-processing-n:127.0.0.1:42837_) [n:127.0.0.1:42837_ c:control_collection s:shard1 r:core_node1 x:collection1] o.a.s.r.ManagedResourceStorage Reading _rest_managed.json using ZooKeeperStorageIO:path=/configs/conf1
   [junit4]   2> 1465304 INFO  (coreLoadExecutor-5902-thread-1-processing-n:127.0.0.1:42837_) [n:127.0.0.1:42837_ c:control_collection s:shard1 r:core_node1 x:collection1] o.a.s.r.ManagedResourceStorage No data found for znode /configs/conf1/_rest_managed.json
   [junit4]   2> 1465304 INFO  (coreLoadExecutor-5902-thread-1-processing-n:127.0.0.1:42837_) [n:127.0.0.1:42837_ c:control_collection s:shard1 r:core_node1 x:collection1] o.a.s.r.ManagedResourceStorage Loaded null at path _rest_managed.json using ZooKeeperStorageIO:path=/configs/conf1
   [junit4]   2> 1465304 INFO  (coreLoadExecutor-5902-thread-1-processing-n:127.0.0.1:42837_) [n:127.0.0.1:42837_ c:control_collection s:shard1 r:core_node1 x:collection1] o.a.s.r.RestManager Initializing 0 registered ManagedResources
   [junit4]   2> 1465305 INFO  (coreLoadExecutor-5902-thread-1-processing-n:127.0.0.1:42837_) [n:127.0.0.1:42837_ c:control_collection s:shard1 r:core_node1 x:collection1] o.a.s.h.ReplicationHandler Commits will be reserved for  10000
   [junit4]   2> 1465305 INFO  (searcherExecutor-5903-thread-1-processing-n:127.0.0.1:42837_ x:collection1 s:shard1 c:control_collection r:core_node1) [n:127.0.0.1:42837_ c:control_collection s:shard1 r:core_node1 x:collection1] o.a.s.c.SolrCore [collection1] Registered new searcher Searcher@1c24fbb[collection1] main{ExitableDirectoryReader(UninvertingDirectoryReader())}
   [junit4]   2> 1465305 INFO  (coreLoadExecutor-5902-thread-1-processing-n:127.0.0.1:42837_) [n:127.0.0.1:42837_ c:control_collection s:shard1 r:core_node1 x:collection1] o.a.s.u.UpdateLog Looking up max value of version field to seed version buckets
   [junit4]   2> 1465305 INFO  (coreLoadExecutor-5902-thread-1-processing-n:127.0.0.1:42837_) [n:127.0.0.1:42837_ c:control_collection s:shard1 r:core_node1 x:collection1] o.a.s.u.VersionInfo Refreshing highest value of _version_ for 65536 version buckets from index
   [junit4]   2> 1465305 INFO  (coreLoadExecutor-5902-thread-1-processing-n:127.0.0.1:42837_) [n:127.0.0.1:42837_ c:control_collection s:shard1 r:core_node1 x:collection1] o.a.s.u.VersionInfo No terms found for _version_, cannot seed version bucket highest value from index
   [junit4]   2> 1465305 INFO  (coreLoadExecutor-5902-thread-1-processing-n:127.0.0.1:42837_) [n:127.0.0.1:42837_ c:control_collection s:shard1 r:core_node1 x:collection1] o.a.s.u.UpdateLog Could not find max version in index or recent updates, using new clock 1532241631756943360
   [junit4]   2> 1465307 INFO  (coreLoadExecutor-5902-thread-1-processing-n:127.0.0.1:42837_) [n:127.0.0.1:42837_ c:control_collection s:shard1 r:core_node1 x:collection1] o.a.s.u.UpdateLog Took 1.0ms to seed version buckets with highest version 1532241631756943360
   [junit4]   2> 1465307 INFO  (coreLoadExecutor-5902-thread-1-processing-n:127.0.0.1:42837_) [n:127.0.0.1:42837_ c:control_collection s:shard1 r:core_node1 x:collection1] o.a.s.c.ZkController watch zkdir /configs/conf1
   [junit4]   2> 1465308 INFO  (coreLoadExecutor-5902-thread-1-processing-n:127.0.0.1:42837_) [n:127.0.0.1:42837_ c:control_collection s:shard1 r:core_node1 x:collection1] o.a.s.c.CoreContainer registering core: collection1
   [junit4]   2> 1465308 INFO  (coreZkRegister-5896-thread-1-processing-n:127.0.0.1:42837_ x:collection1 s:shard1 c:control_collection r:core_node1) [n:127.0.0.1:42837_ c:control_collection s:shard1 r:core_node1 x:collection1] o.a.s.c.ZkController Register replica - core:collection1 address:http://127.0.0.1:42837 collection:control_collection shard:shard1
   [junit4]   2> 1465308 INFO  (coreZkRegister-5896-thread-1-processing-n:127.0.0.1:42837_ x:collection1 s:shard1 c:control_collection r:core_node1) [n:127.0.0.1:42837_ c:control_collection s:shard1 r:core_node1 x:collection1] o.a.s.c.c.SolrZkClient makePath: /collections/control_collection/leader_elect/shard1/election
   [junit4]   2> 1465310 INFO  (coreZkRegister-5896-thread-1-processing-n:127.0.0.1:42837_ x:collection1 s:shard1 c:control_collection r:core_node1) [n:127.0.0.1:42837_ c:control_collection s:shard1 r:core_node1 x:collection1] o.a.s.c.LeaderElector Joined leadership election with path: /collections/control_collection/leader_elect/shard1/election/95765101894959108-core_node1-n_0000000000
   [junit4]   2> 1465310 INFO  (coreZkRegister-5896-thread-1-processing-n:127.0.0.1:42837_ x:collection1 s:shard1 c:control_collection r:core_node1) [n:127.0.0.1:42837_ c:control_collection s:shard1 r:core_node1 x:collection1] o.a.s.c.ShardLeaderElectionContext Running the leader process for shard=shard1 and weAreReplacement=false and leaderVoteWait=10000
   [junit4]   2> 1465311 INFO  (coreZkRegister-5896-thread-1-processing-n:127.0.0.1:42837_ x:collection1 s:shard1 c:control_collection r:core_node1) [n:127.0.0.1:42837_ c:control_collection s:shard1 r:core_node1 x:collection1] o.a.s.c.ShardLeaderElectionContext Enough replicas found to continue.
   [junit4]   2> 1465311 INFO  (coreZkRegister-5896-thread-1-processing-n:127.0.0.1:42837_ x:collection1 s:shard1 c:control_collection r:core_node1) [n:127.0.0.1:42837_ c:control_collection s:shard1 r:core_node1 x:collection1] o.a.s.c.ShardLeaderElectionContext I may be the new leader - try and sync
   [junit4]   2> 1465311 INFO  (OverseerStateUpdate-95765101894959108-127.0.0.1:42837_-n_0000000000) [n:127.0.0.1:42837_    ] o.a.s.c.Overseer processMessage: queueSize: 1, message = {
   [junit4]   2>   "operation":"leader",
   [junit4]   2>   "shard":"shard1",
   [junit4]   2>   "collection":"control_collection"} current state version: 1
   [junit4]   2> 1465311 INFO  (coreZkRegister-5896-thread-1-processing-n:127.0.0.1:42837_ x:collection1 s:shard1 c:control_collection r:core_node1) [n:127.0.0.1:42837_ c:control_collection s:shard1 r:core_node1 x:collection1] o.a.s.c.SyncStrategy Sync replicas to http://127.0.0.1:42837/collection1/
   [junit4]   2> 1465311 INFO  (coreZkRegister-5896-thread-1-processing-n:127.0.0.1:42837_ x:collection1 s:shard1 c:control_collection r:core_node1) [n:127.0.0.1:42837_ c:control_collection s:shard1 r:core_node1 x:collection1] o.a.s.c.SyncStrategy Sync Success - now sync replicas to me
   [junit4]   2> 1465311 INFO  (coreZkRegister-5896-thread-1-processing-n:127.0.0.1:42837_ x:collection1 s:shard1 c:control_collection r:core_node1) [n:127.0.0.1:42837_ c:control_collection s:shard1 r:core_node1 x:collection1] o.a.s.c.SyncStrategy http://127.0.0.1:42837/collection1/ has no replicas
   [junit4]   2> 1465311 INFO  (coreZkRegister-5896-thread-1-processing-n:127.0.0.1:42837_ x:collection1 s:shard1 c:control_collection r:core_node1) [n:127.0.0.1:42837_ c:control_collection s:shard1 r:core_node1 x:collection1] o.a.s.c.c.SolrZkClient makePath: /collections/control_collection/leaders/shard1
   [junit4]   2> 1465312 INFO  (coreZkRegister-5896-thread-1-processing-n:127.0.0.1:42837_ x:collection1 s:shard1 c:control_collection r:core_node1) [n:127.0.0.1:42837_ c:control_collection s:shard1 r:core_node1 x:collection1] o.a.s.c.ShardLeaderElectionContextBase Creating leader registration node /collections/control_collection/leaders/shard1/leader after winning as /collections/control_collection/leader_elect/shard1/election/95765101894959108-core_node1-n_0000000000
   [junit4]   2> 1465313 INFO  (coreZkRegister-5896-thread-1-processing-n:127.0.0.1:42837_ x:collection1 s:shard1 c:control_collection r:core_node1) [n:127.0.0.1:42837_ c:control_collection s:shard1 r:core_node1 x:collection1] o.a.s.c.ShardLeaderElectionContext I am the new leader: http://127.0.0.1:42837/collection1/ shard1
   [junit4]   2> 1465313 INFO  (OverseerStateUpdate-95765101894959108-127.0.0.1:42837_-n_0000000000) [n:127.0.0.1:42837_    ] o.a.s.c.Overseer processMessage: queueSize: 1, message = {
   [junit4]   2>   "operation":"leader",
   [junit4]   2>   "shard":"shard1",
   [junit4]   2>   "collection":"control_collection",
   [junit4]   2>   "base_url":"http://127.0.0.1:42837",
   [junit4]   2>   "core":"collection1",
   [junit4]   2>   "state":"active"} current state version: 1
   [junit4]   2> 1465414 INFO  (zkCallback-1314-thread-1-processing-n:127.0.0.1:42837_) [n:127.0.0.1:42837_    ] o.a.s.c.c.ZkStateReader A cluster state change: [WatchedEvent state:SyncConnected type:NodeDataChanged path:/clusterstate.json], has occurred - updating... (live nodes size: [1])
   [junit4]   2> 1465464 INFO  (coreZkRegister-5896-thread-1-processing-n:127.0.0.1:42837_ x:collection1 s:shard1 c:control_collection r:core_node1) [n:127.0.0.1:42837_ c:control_collection s:shard1 r:core_node1 x:collection1] o.a.s.c.ZkController We are http://127.0.0.1:42837/collection1/ and leader is http://127.0.0.1:42837/collection1/
   [junit4]   2> 1465464 INFO  (coreZkRegister-5896-thread-1-processing-n:127.0.0.1:42837_ x:collection1 s:shard1 c:control_collection r:core_node1) [n:127.0.0.1:42837_ c:control_collection s:shard1 r:core_node1 x:collection1] o.a.s.c.ZkController No LogReplay needed for core=collection1 baseURL=http://127.0.0.1:42837
   [junit4]   2> 1465464 INFO  (coreZkRegister-5896-thread-1-processing-n:127.0.0.1:42837_ x:collection1 s:shard1 c:control_collection r:core_node1) [n:127.0.0.1:42837_ c:control_collection s:shard1 r:core_node1 x:collection1] o.a.s.c.ZkController I am the leader, no recovery necessary
   [junit4]   2> 1465464 INFO  (coreZkRegister-5896-thread-1-processing-n:127.0.0.1:42837_ x:collection1 s:shard1 c:control_collection r:core_node1) [n:127.0.0.1:42837_ c:control_collection s:shard1 r:core_node1 x:collection1] o.a.s.c.ZkController publishing state=active
   [junit4]   2> 1465464 INFO  (coreZkRegister-5896-thread-1-processing-n:127.0.0.1:42837_ x:collection1 s:shard1 c:control_collection r:core_node1) [n:127.0.0.1:42837_ c:control_collection s:shard1 r:core_node1 x:collection1] o.a.s.c.ZkController numShards not found on descriptor - reading it from system property
   [junit4]   2> 1465465 INFO  (OverseerStateUpdate-95765101894959108-127.0.0.1:42837_-n_0000000000) [n:127.0.0.1:42837_    ] o.a.s.c.Overseer processMessage: queueSize: 1, message = {
   [junit4]   2>   "core":"collection1",
   [junit4]   2>   "core_node_name":"core_node1",
   [junit4]   2>   "roles":null,
   [junit4]   2>   "base_url":"http://127.0.0.1:42837",
   [junit4]   2>   "node_name":"127.0.0.1:42837_",
   [junit4]   2>   "numShards":"1",
   [junit4]   2>   "state":"active",
   [junit4]   2>   "shard":"shard1",
   [junit4]   2>   "collection":"control_collection",
   [junit4]   2>   "operation":"state"} current state version: 2
   [junit4]   2> 1465465 INFO  (coreZkRegister-5896-thread-1-processing-n:127.0.0.1:42837_ x:collection1 s:shard1 c:control_collection r:core_node1) [n:127.0.0.1:42837_ c:control_collection s:shard1 r:core_node1 x:collection1] o.a.s.c.c.ZkStateReader Updated live nodes from ZooKeeper... (1) -> (1)
   [junit4]   2> 1465465 INFO  (OverseerStateUpdate-95765101894959108-127.0.0.1:42837_-n_0000000000) [n:127.0.0.1:42837_    ] o.a.s.c.o.ReplicaMutator Update state numShards=1 message={
   [junit4]   2>   "core":"collection1",
   [junit4]   2>   "core_node_name":"core_node1",
   [junit4]   2>   "roles":null,
   [junit4]   2>   "base_url":"http://127.0.0.1:42837",
   [junit4]   2>   "node_name":"127.0.0.1:42837_",
   [junit4]   2>   "numShards":"1",
   [junit4]   2>   "state":"active",
   [junit4]   2>   "shard":"shard1",
   [junit4]   2>   "collection":"control_collection",
   [junit4]   2>   "operation":"state"}
   [junit4]   2> 1465566 INFO  (zkCallback-1314-thread-1-processing-n:127.0.0.1:42837_) [n:127.0.0.1:42837_    ] o.a.s.c.c.ZkStateReader A cluster state change: [WatchedEvent state:SyncConnected type:NodeDataChanged path:/clusterstate.json], has occurred - updating... (live nodes size: [1])
   [junit4]   2> 1465672 INFO  (TEST-DistributedVersionInfoTest.test-seed#[37A3C47B137654BB]) [    ] o.a.s.c.c.SolrZkClient Using default ZkCredentialsProvider
   [junit4]   2> 1465673 INFO  (TEST-DistributedVersionInfoTest.test-seed#[37A3C47B137654BB]) [    ] o.a.s.c.c.ConnectionManager Waiting for client to connect to ZooKeeper
   [junit4]   2> 1465683 INFO  (zkCallback-1316-thread-1) [    ] o.a.s.c.c.ConnectionManager Watcher org.apache.solr.common.cloud.ConnectionManager@2132de name:ZooKeeperConnection Watcher:127.0.0.1:41790/solr got event WatchedEvent state:SyncConnected type:None path:null path:null type:None
   [junit4]   2> 1465683 INFO  (TEST-DistributedVersionInfoTest.test-seed#[37A3C47B137654BB]) [    ] o.a.s.c.c.ConnectionManager Client is connected to ZooKeeper
   [junit4]   2> 1465683 INFO  (TEST-DistributedVersionInfoTest.test-seed#[37A3C47B137654BB]) [    ] o.a.s.c.c.SolrZkClient Using default ZkACLProvider
   [junit4]   2> 1465683 INFO  (TEST-DistributedVersionInfoTest.test-seed#[37A3C47B137654BB]) [    ] o.a.s.c.c.ZkStateReader Updating cluster state from ZooKeeper... 
   [junit4]   2> 1465684 INFO  (TEST-DistributedVersionInfoTest.test-seed#[37A3C47B137654BB]) [    ] o.a.s.c.c.ZkStateReader Updated live nodes from ZooKeeper... (0) -> (1)
   [junit4]   2> 1465684 INFO  (TEST-DistributedVersionInfoTest.test-seed#[37A3C47B137654BB]) [    ] o.a.s.c.ChaosMonkey monkey: init - expire sessions:false cause connection loss:false
   [junit4]   2> 1465746 INFO  (TEST-DistributedVersionInfoTest.test-seed#[37A3C47B137654BB]) [    ] o.a.s.SolrTestCaseJ4 Writing core.properties file to /home/jenkins/workspace/Lucene-Solr-6.0-Linux/solr/build/solr-core/test/J2/temp/solr.cloud.DistributedVersionInfoTest_37A3C47B137654BB-001/shard-1-001/cores/collection1
   [junit4]   2> 1465746 INFO  (TEST-DistributedVersionInfoTest.test-seed#[37A3C47B137654BB]) [    ] o.a.s.c.AbstractFullDistribZkTestBase create jetty 1 in directory /home/jenkins/workspace/Lucene-Solr-6.0-Linux/solr/build/solr-core/test/J2/temp/solr.cloud.DistributedVersionInfoTest_37A3C47B137654BB-001/shard-1-001
   [junit4]   2> 1465747 INFO  (TEST-DistributedVersionInfoTest.test-seed#[37A3C47B137654BB]) [    ] o.e.j.s.Server jetty-9.3.8.v20160314
   [junit4]   2> 1465748 INFO  (TEST-DistributedVersionInfoTest.test-seed#[37A3C47B137654BB]) [    ] o.e.j.s.h.ContextHandler Started o.e.j.s.ServletContextHandler@1181319{/,null,AVAILABLE}
   [junit4]   2> 1465748 INFO  (TEST-DistributedVersionInfoTest.test-seed#[37A3C47B137654BB]) [    ] o.e.j.s.ServerConnector Started ServerConnector@15fa081{HTTP/1.1,[http/1.1]}{127.0.0.1:41509}
   [junit4]   2> 1465748 INFO  (TEST-DistributedVersionInfoTest.test-seed#[37A3C47B137654BB]) [    ] o.e.j.s.Server Started @1467836ms
   [junit4]   2> 1465748 INFO  (TEST-DistributedVersionInfoTest.test-seed#[37A3C47B137654BB]) [    ] o.a.s.c.s.e.JettySolrRunner Jetty properties: {solr.data.dir=/home/jenkins/workspace/Lucene-Solr-6.0-Linux/solr/build/solr-core/test/J2/temp/solr.cloud.DistributedVersionInfoTest_37A3C47B137654BB-001/tempDir-001/jetty1, solrconfig=solrconfig.xml, hostContext=/, hostPort=41509, coreRootDirectory=/home/jenkins/workspace/Lucene-Solr-6.0-Linux/solr/build/solr-core/test/J2/temp/solr.cloud.DistributedVersionInfoTest_37A3C47B137654BB-001/shard-1-001/cores}
   [junit4]   2> 1465748 INFO  (TEST-DistributedVersionInfoTest.test-seed#[37A3C47B137654BB]) [    ] o.a.s.s.SolrDispatchFilter SolrDispatchFilter.init(): sun.misc.Launcher$AppClassLoader@1d16e93
   [junit4]   2> 1465748 INFO  (TEST-DistributedVersionInfoTest.test-seed#[37A3C47B137654BB]) [    ] o.a.s.c.SolrResourceLoader new SolrResourceLoader for directory: '/home/jenkins/workspace/Lucene-Solr-6.0-Linux/solr/build/solr-core/test/J2/temp/solr.cloud.DistributedVersionInfoTest_37A3C47B137654BB-001/shard-1-001'
   [junit4]   2> 1465749 INFO  (TEST-DistributedVersionInfoTest.test-seed#[37A3C47B137654BB]) [    ] o.a.s.c.SolrResourceLoader JNDI not configured for solr (NoInitialContextEx)
   [junit4]   2> 1465749 INFO  (TEST-DistributedVersionInfoTest.test-seed#[37A3C47B137654BB]) [    ] o.a.s.c.SolrResourceLoader solr home defaulted to 'solr/' (could not find system property or JNDI)
   [junit4]   2> 1465749 INFO  (TEST-DistributedVersionInfoTest.test-seed#[37A3C47B137654BB]) [    ] o.a.s.c.c.SolrZkClient Using default ZkCredentialsProvider
   [junit4]   2> 1465749 INFO  (TEST-DistributedVersionInfoTest.test-seed#[37A3C47B137654BB]) [    ] o.a.s.c.c.ConnectionManager Waiting for client to connect to ZooKeeper
   [junit4]   2> 1465750 INFO  (zkCallback-1317-thread-1) [    ] o.a.s.c.c.ConnectionManager Watcher org.apache.solr.common.cloud.ConnectionManager@10a2f39 name:ZooKeeperConnection Watcher:127.0.0.1:41790/solr got event WatchedEvent state:SyncConnected type:None path:null path:null type:None
   [junit4]   2> 1465750 INFO  (TEST-DistributedVersionInfoTest.test-seed#[37A3C47B137654BB]) [    ] o.a.s.c.c.ConnectionManager Client is connected to ZooKeeper
   [junit4]   2> 1465750 INFO  (TEST-DistributedVersionInfoTest.test-seed#[37A3C47B137654BB]) [    ] o.a.s.c.c.SolrZkClient Using default ZkACLProvider
   [junit4]   2> 1465751 INFO  (TEST-DistributedVersionInfoTest.test-seed#[37A3C47B137654BB]) [    ] o.a.s.s.SolrDispatchFilter Loading solr.xml from SolrHome (not found in ZooKeeper)
   [junit4]   2> 1465751 INFO  (TEST-DistributedVersionInfoTest.test-seed#[37A3C47B137654BB]) [    ] o.a.s.c.SolrXmlConfig Loading container configuration from /home/jenkins/workspace/Lucene-Solr-6.0-Linux/solr/build/solr-core/test/J2/temp/solr.cloud.DistributedVersionInfoTest_37A3C47B137654BB-001/shard-1-001/solr.xml
   [junit4]   2> 1465754 INFO  (TEST-DistributedVersionInfoTest.test-seed#[37A3C47B137654BB]) [    ] o.a.s.c.CorePropertiesLocator Config-defined core root directory: /home/jenkins/workspace/Lucene-Solr-6.0-Linux/solr/build/solr-core/test/J2/temp/solr.cloud.DistributedVersionInfoTest_37A3C47B137654BB-001/shard-1-001/cores
   [junit4]   2> 1465754 INFO  (TEST-DistributedVersionInfoTest.test-seed#[37A3C47B137654BB]) [    ] o.a.s.c.CoreContainer New CoreContainer 6804607
   [junit4]   2> 1465754 INFO  (TEST-DistributedVersionInfoTest.test-seed#[37A3C47B137654BB]) [    ] o.a.s.c.CoreContainer Loading cores into CoreContainer [instanceDir=/home/jenkins/workspace/Lucene-Solr-6.0-Linux/solr/build/solr-core/test/J2/temp/solr.cloud.DistributedVersionInfoTest_37A3C47B137654BB-001/shard-1-001]
   [junit4]   2> 1465754 WARN  (TEST-DistributedVersionInfoTest.test-seed#[37A3C47B137654BB]) [    ] o.a.s.c.CoreContainer Couldn't add files from /home/jenkins/workspace/Lucene-Solr-6.0-Linux/solr/build/solr-core/test/J2/temp/solr.cloud.DistributedVersionInfoTest_37A3C47B137654BB-001/shard-1-001/lib to classpath: /home/jenkins/workspace/Lucene-Solr-6.0-Linux/solr/build/solr-core/test/J2/temp/solr.cloud.DistributedVersionInfoTest_37A3C47B137654BB-001/shard-1-001/lib
   [junit4]   2> 1465755 INFO  (TEST-DistributedVersionInfoTest.test-seed#[37A3C47B137654BB]) [    ] o.a.s.h.c.HttpShardHandlerFactory created with socketTimeout : 90000,urlScheme : ,connTimeout : 15000,maxConnectionsPerHost : 20,maxConnections : 10000,corePoolSize : 0,maximumPoolSize : 2147483647,maxThreadIdleTime : 5,sizeOfQueue : -1,fairnessPolicy : false,useRetries : false,
   [junit4]   2> 1465755 INFO  (TEST-DistributedVersionInfoTest.test-seed#[37A3C47B137654BB]) [    ] o.a.s.u.UpdateShardHandler Creating UpdateShardHandler HTTP client with params: socketTimeout=340000&connTimeout=45000&retry=true
   [junit4]   2> 1465756 INFO  (TEST-DistributedVersionInfoTest.test-seed#[37A3C47B137654BB]) [    ] o.a.s.l.LogWatcher SLF4J impl is org.slf4j.impl.Log4jLoggerFactory
   [junit4]   2> 1465756 INFO  (TEST-DistributedVersionInfoTest.test-seed#[37A3C47B137654BB]) [    ] o.a.s.l.LogWatcher Registering Log Listener [Log4j (org.slf4j.impl.Log4jLoggerFactory)]
   [junit4]   2> 1465756 INFO  (TEST-DistributedVersionInfoTest.test-seed#[37A3C47B137654BB]) [    ] o.a.s.c.ZkContainer Zookeeper client=127.0.0.1:41790/solr
   [junit4]   2> 1465756 INFO  (TEST-DistributedVersionInfoTest.test-seed#[37A3C47B137654BB]) [    ] o.a.s.c.ZkController zkHost includes chroot
   [junit4]   2> 1465756 INFO  (TEST-DistributedVersionInfoTest.test-seed#[37A3C47B137654BB]) [    ] o.a.s.c.c.SolrZkClient Using default ZkCredentialsProvider
   [junit4]   2> 1465758 INFO  (TEST-DistributedVersionInfoTest.test-seed#[37A3C47B137654BB]) [    ] o.a.s.c.c.ConnectionManager Waiting for client to connect to ZooKeeper
   [junit4]   2> 1465758 INFO  (zkCallback-1320-thread-1) [    ] o.a.s.c.c.ConnectionManager Watcher org.apache.solr.common.cloud.ConnectionManager@1d18c1d name:ZooKeeperConnection Watcher:127.0.0.1:41790 got event WatchedEvent state:SyncConnected type:None path:null path:null type:None
   [junit4]   2> 1465759 INFO  (TEST-DistributedVersionInfoTest.test-seed#[37A3C47B137654BB]) [    ] o.a.s.c.c.ConnectionManager Client is connected to ZooKeeper
   [junit4]   2> 1465759 INFO  (TEST-DistributedVersionInfoTest.test-seed#[37A3C47B137654BB]) [    ] o.a.s.c.c.SolrZkClient Using default ZkACLProvider
   [junit4]   2> 1465760 INFO  (TEST-DistributedVersionInfoTest.test-seed#[37A3C47B137654BB]) [n:127.0.0.1:41509_    ] o.a.s.c.c.ConnectionManager Waiting for client to connect to ZooKeeper
   [junit4]   2> 1465760 INFO  (zkCallback-1321-thread-1-processing-n:127.0.0.1:41509_) [n:127.0.0.1:41509_    ] o.a.s.c.c.ConnectionManager Watcher org.apache.solr.common.cloud.ConnectionManager@1742bba name:ZooKeeperConnection Watcher:127.0.0.1:41790/solr got event WatchedEvent state:SyncConnected type:None path:null path:null type:None
   [junit4]   2> 1465761 INFO  (TEST-DistributedVersionInfoTest.test-seed#[37A3C47B137654BB]) [n:127.0.0.1:41509_    ] o.a.s.c.c.ConnectionManager Client is connected to ZooKeeper
   [junit4]   2> 1465763 INFO  (TEST-DistributedVersionInfoTest.test-seed#[37A3C47B137654BB]) [n:127.0.0.1:41509_    ] o.a.s.c.c.ZkStateReader Updating cluster state from ZooKeeper... 
   [junit4]   2> 1465764 INFO  (TEST-DistributedVersionInfoTest.test-seed#[37A3C47B137654BB]) [n:127.0.0.1:41509_    ] o.a.s.c.c.ZkStateReader Updated live nodes from ZooKeeper... (0) -> (1)
   [junit4]   2> 1465765 INFO  (TEST-DistributedVersionInfoTest.test-seed#[37A3C47B137654BB]) [n:127.0.0.1:41509_    ] o.a.s.c.Overseer Overseer (id=null) closing
   [junit4]   2> 1465765 INFO  (TEST-DistributedVersionInfoTest.test-seed#[37A3C47B137654BB]) [n:127.0.0.1:41509_    ] o.a.s.c.LeaderElector Joined leadership election with path: /overseer_elect/election/95765101894959112-127.0.0.1:41509_-n_0000000001
   [junit4]   2> 1465765 INFO  (TEST-DistributedVersionInfoTest.test-seed#[37A3C47B137654BB]) [n:127.0.0.1:41509_    ] o.a.s.c.LeaderElector Watching path /overseer_elect/election/95765101894959108-127.0.0.1:42837_-n_0000000000 to know if I could be the leader
   [junit4]   2> 1465765 INFO  (TEST-DistributedVersionInfoTest.test-seed#[37A3C47B137654BB]) [n:127.0.0.1:41509_    ] o.a.s.c.ZkController Publish node=127.0.0.1:41509_ as DOWN
   [junit4]   2> 1465767 INFO  (OverseerStateUpdate-95765101894959108-127.0.0.1:42837_-n_0000000000) [n:127.0.0.1:42837_    ] o.a.s.c.Overseer processMessage: queueSize: 1, message = {
   [junit4]   2>   "operation":"downnode",
   [junit4]   2>   "node_name":"127.0.0.1:41509_"} current state version: 3
   [junit4]   2> 1465767 INFO  (OverseerStateUpdate-95765101894959108-127.0.0.1:42837_-n_0000000000) [n:127.0.0.1:42837_    ] o.a.s.c.o.NodeMutator DownNode state invoked for node: 127.0.0.1:41509_
   [junit4]   2> 1465868 INFO  (zkCallback-1321-thread-1-processing-n:127.0.0.1:41509_) [n:127.0.0.1:41509_    ] o.a.s.c.c.ZkStateReader A cluster state change: [WatchedEvent state:SyncConnected type:NodeDataChanged path:/clusterstate.json], has occurred - updating... (live nodes size: [1])
   [junit4]   2> 1465868 INFO  (zkCallback-1316-thread-1) [    ] o.a.s.c.c.ZkStateReader A cluster state change: [WatchedEvent state:SyncConnected type:NodeDataChanged path:/clusterstate.json], has occurred - updating... (live nodes size: [1])
   [junit4]   2> 1465868 INFO  (zkCallback-1314-thread-1-processing-n:127.0.0.1:42837_) [n:127.0.0.1:42837_    ] o.a.s.c.c.ZkStateReader A cluster state change: [WatchedEvent state:SyncConnected type:NodeDataChanged path:/clusterstate.json], has occurred - updating... (live nodes size: [1])
   [junit4]   2> 1466766 INFO  (TEST-DistributedVersionInfoTest.test-seed#[37A3C47B137654BB]) [n:127.0.0.1:41509_    ] o.a.s.c.ZkController Register node as live in ZooKeeper:/live_nodes/127.0.0.1:41509_
   [junit4]   2> 1466767 INFO  (TEST-DistributedVersionInfoTest.test-seed#[37A3C47B137654BB]) [n:127.0.0.1:41509_    ] o.a.s.c.c.SolrZkClient makePath: /live_nodes/127.0.0.1:41509_
   [junit4]   2> 1466768 INFO  (zkCallback-1321-thread-1-processing-n:127.0.0.1:41509_) [n:127.0.0.1:41509_    ] o.a.s.c.c.ZkStateReader A live node change: [WatchedEvent state:SyncConnected type:NodeChildrenChanged path:/live_nodes], has occurred - updating... (live nodes size: [1])
   [junit4]   2> 1466768 INFO  (zkCallback-1316-thread-1) [    ] o.a.s.c.c.ZkStateReader A live node change: [WatchedEvent state:SyncConnected type:NodeChildrenChanged path:/live_nodes], has occurred - updating... (live nodes size: [1])
   [junit4]   2> 1466768 INFO  (zkCallback-1314-thread-1-processing-n:127.0.0.1:42837_) [n:127.0.0.1:42837_    ] o.a.s.c.c.ZkStateReader A live node change: [WatchedEvent state:SyncConnected type:NodeChildrenChanged path:/live_nodes], has occurred - updating... (live nodes size: [1])
   [junit4]   2> 1466768 INFO  (zkCallback-1321-thread-1-processing-n:127.0.0.1:41509_) [n:127.0.0.1:41509_    ] o.a.s.c.c.ZkStateReader Updated live nodes from ZooKeeper... (1) -> (2)
   [junit4]   2> 1466768 INFO  (zkCallback-1316-thread-1) [    ] o.a.s.c.c.ZkStateReader Updated live nodes from ZooKeeper... (1) -> (2)
   [junit4]   2> 1466770 INFO  (zkCallback-1314-thread-1-processing-n:127.0.0.1:42837_) [n:127.0.0.1:42837_    ] o.a.s.c.c.ZkStateReader Updated live nodes from ZooKeeper... (1) -> (2)
   [junit4]   2> 1466782 INFO  (TEST-DistributedVersionInfoTest.test-seed#[37A3C47B137654BB]) [n:127.0.0.1:41509_    ] o.a.s.c.CoreContainer Security conf doesn't exist. Skipping setup for authorization module.
   [junit4]   2> 1466782 INFO  (TEST-DistributedVersionInfoTest.test-seed#[37A3C47B137654BB]) [n:127.0.0.1:41509_    ] o.a.s.c.CoreContainer No authentication plugin used.
   [junit4]   2> 1466782 INFO  (TEST-DistributedVersionInfoTest.test-seed#[37A3C47B137654BB]) [n:127.0.0.1:41509_    ] o.a.s.c.CorePropertiesLocator Looking for core definitions underneath /home/jenkins/workspace/Lucene-Solr-6.0-Linux/solr/build/solr-core/test/J2/temp/solr.cloud.DistributedVersionInfoTest_37A3C47B137654BB-001/shard-1-001/cores
   [junit4]   2> 1466783 INFO  (TEST-DistributedVersionInfoTest.test-seed#[37A3C47B137654BB]) [n:127.0.0.1:41509_    ] o.a.s.c.CoreDescriptor Created CoreDescriptor: {name=collection1, config=solrconfig.xml, transient=false, schema=schema.xml, loadOnStartup=true, configSetProperties=configsetprops.json, collection=collection1, coreNodeName=, dataDir=data/, shard=}
   [junit4]   2> 1466783 INFO  (TEST-DistributedVersionInfoTest.test-seed#[37A3C47B137654BB]) [n:127.0.0.1:41509_    ] o.a.s.c.CorePropertiesLocator Found core collection1 in /home/jenkins/workspace/Lucene-Solr-6.0-Linux/solr/build/solr-core/test/J2/temp/solr.cloud.DistributedVersionInfoTest_37A3C47B137654BB-001/shard-1-001/cores/collection1
   [junit4]   2> 1466783 INFO  (TEST-DistributedVersionInfoTest.test-seed#[37A3C47B137654BB]) [n:127.0.0.1:41509_    ] o.a.s.c.CorePropertiesLocator Found 1 core definitions
   [junit4]   2> 1466785 INFO  (TEST-DistributedVersionInfoTest.test-seed#[37A3C47B137654BB]) [n:127.0.0.1:41509_    ] o.a.s.s.SolrDispatchFilter user.dir=/home/jenkins/workspace/Lucene-Solr-6.0-Linux/solr/build/solr-core/test/J2
   [junit4]   2> 1466785 INFO  (coreLoadExecutor-5913-thread-1-processing-n:127.0.0.1:41509_) [n:127.0.0.1:41509_ c:collection1   x:collection1] o.a.s.c.ZkController publishing state=down
   [junit4]   2> 1466785 INFO  (coreLoadExecutor-5913-thread-1-processing-n:127.0.0.1:41509_) [n:127.0.0.1:41509_ c:collection1   x:collection1] o.a.s.c.ZkController numShards not found on descriptor - reading it from system property
   [junit4]   2> 1466785 INFO  (TEST-DistributedVersionInfoTest.test-seed#[37A3C47B137654BB]) [n:127.0.0.1:41509_    ] o.a.s.s.SolrDispatchFilter SolrDispatchFilter.init() done
   [junit4]   2> 1466787 INFO  (OverseerStateUpdate-95765101894959108-127.0.0.1:42837_-n_0000000000) [n:127.0.0.1:42837_    ] o.a.s.c.Overseer processMessage: queueSize: 1, message = {
   [junit4]   2>   "core":"collection1",
   [junit4]   2>   "roles":null,
   [junit4]   2>   "base_url":"http://127.0.0.1:41509",
   [junit4]   2>   "node_name":"127.0.0.1:41509_",
   [junit4]   2>   "numShards":"2",
   [junit4]   2>   "state":"down",
   [junit4]   2>   "shard":null,
   [junit4]   2>   "collection":"collection1",
   [junit4]   2>   "operation":"state"} current state version: 4
   [junit4]   2> 1466787 INFO  (OverseerStateUpdate-95765101894959108-127.0.0.1:42837_-n_0000000000) [n:127.0.0.1:42837_    ] o.a.s.c.o.ReplicaMutator Update state numShards=2 message={
   [junit4]   2>   "core":"collection1",
   [junit4]   2>   "roles":null,
   [junit4]   2>   "base_url":"http://127.0.0.1:41509",
   [junit4]   2>   "node_name":"127.0.0.1:41509_",
   [junit4]   2>   "numShards":"2",
   [junit4]   2>   "state":"down",
   [junit4]   2>   "shard":null,
   [junit4]   2>   "collection":"collection1",
   [junit4]   2>   "operation":"state"}
   [junit4]   2> 1466787 INFO  (OverseerStateUpdate-95765101894959108-127.0.0.1:42837_-n_0000000000) [n:127.0.0.1:42837_    ] o.a.s.c.o.ClusterStateMutator building a new cName: collection1
   [junit4]   2> 1466787 INFO  (OverseerStateUpdate-95765101894959108-127.0.0.1:42837_-n_0000000000) [n:127.0.0.1:42837_    ] o.a.s.c.o.ReplicaMutator Assigning new node to shard shard=shard2
   [junit4]   2> 1466787 INFO  (coreLoadExecutor-5913-thread-1-processing-n:127.0.0.1:41509_) [n:127.0.0.1:41509_ c:collection1   x:collection1] o.a.s.c.ZkController look for our core node name
   [junit4]   2> 1466889 INFO  (zkCallback-1316-thread-1) [    ] o.a.s.c.c.ZkStateReader A cluster state change: [WatchedEvent state:SyncConnected type:NodeDataChanged path:/clusterstate.json], has occurred - updating... (live nodes size: [2])
   [junit4]   2> 1466889 INFO  (zkCallback-1321-thread-1-processing-n:127.0.0.1:41509_) [n:127.0.0.1:41509_    ] o.a.s.c.c.ZkStateReader A cluster state change: [WatchedEvent state:SyncConnected type:NodeDataChanged path:/clusterstate.json], has occurred - updating... (live nodes size: [2])
   [junit4]   2> 1466889 INFO  (zkCallback-1314-thread-1-processing-n:127.0.0.1:42837_) [n:127.0.0.1:42837_    ] o.a.s.c.c.ZkStateReader A cluster state change: [WatchedEvent state:SyncConnected type:NodeDataChanged path:/clusterstate.json], has occurred - updating... (live nodes size: [2])
   [junit4]   2> 1467788 INFO  (coreLoadExecutor-5913-thread-1-processing-n:127.0.0.1:41509_) [n:127.0.0.1:41509_ c:collection1   x:collection1] o.a.s.c.ZkController waiting to find shard id in clusterstate for collection1
   [junit4]   2> 1467788 INFO  (coreLoadExecutor-5913-thread-1-processing-n:127.0.0.1:41509_) [n:127.0.0.1:41509_ c:collection1   x:collection1] o.a.s.c.ZkController Check for collection zkNode:collection1
   [junit4]   2> 1467788 INFO  (coreLoadExecutor-5913-thread-1-processing-n:127.0.0.1:41509_) [n:127.0.0.1:41509_ c:collection1   x:collection1] o.a.s.c.ZkController Collection zkNode exists
   [junit4]   2> 1467788 INFO  (coreLoadExecutor-5913-thread-1-processing-n:127.0.0.1:41509_) [n:127.0.0.1:41509_ c:collection1   x:collection1] o.a.s.c.c.ZkStateReader Load collection config from: [/collections/collection1]
   [junit4]   2> 1467789 INFO  (coreLoadExecutor-5913-thread-1-processing-n:127.0.0.1:41509_) [n:127.0.0.1:41509_ c:collection1   x:collection1] o.a.s.c.c.ZkStateReader path=[/collections/collection1] [configName]=[conf1] specified config exists in ZooKeeper
   [junit4]   2> 1467789 INFO  (coreLoadExecutor-5913-thread-1-processing-n:127.0.0.1:41509_) [n:127.0.0.1:41509_ c:collection1   x:collection1] o.a.s.c.SolrResourceLoader new SolrResourceLoader for directory: '/home/jenkins/workspace/Lucene-Solr-6.0-Linux/solr/build/solr-core/test/J2/temp/solr.cloud.DistributedVersionInfoTest_37A3C47B137654BB-001/shard-1-001/cores/collection1'
   [junit4]   2> 1467789 INFO  (coreLoadExecutor-5913-thread-1-processing-n:127.0.0.1:41509_) [n:127.0.0.1:41509_ c:collection1   x:collection1] o.a.s.c.SolrResourceLoader JNDI not configured for solr (NoInitialContextEx)
   [junit4]   2> 1467789 INFO  (coreLoadExecutor-5913-thread-1-processing-n:127.0.0.1:41509_) [n:127.0.0.1:41509_ c:collection1   x:collection1] o.a.s.c.SolrResourceLoader solr home defaulted to 'solr/' (could not find system property or JNDI)
   [junit4]   2> 1467790 INFO  (coreLoadExecutor-5913-thread-1-processing-n:127.0.0.1:41509_) [n:127.0.0.1:41509_ c:collection1   x:collection1] o.a.s.c.Config loaded config solrconfig.xml with version 0 
   [junit4]   2> 1467793 INFO  (coreLoadExecutor-5913-thread-1-processing-n:127.0.0.1:41509_) [n:127.0.0.1:41509_ c:collection1   x:collection1] o.a.s.c.SolrConfig current version of requestparams : -1
   [junit4]   2> 1467796 WARN  (coreLoadExecutor-5913-thread-1-processing-n:127.0.0.1:41509_) [n:127.0.0.1:41509_ c:collection1   x:collection1] o.a.s.c.Config Beginning with Solr 5.5, <mergePolicy> is deprecated, use <mergePolicyFactory> instead.
   [junit4]   2> 1467796 INFO  (coreLoadExecutor-5913-thread-1-processing-n:127.0.0.1:41509_) [n:127.0.0.1:41509_ c:collection1   x:collection1] o.a.s.c.SolrConfig Using Lucene MatchVersion: 6.0.0
   [junit4]   2> 1467803 INFO  (coreLoadExecutor-5913-thread-1-processing-n:127.0.0.1:41509_) [n:127.0.0.1:41509_ c:collection1   x:collection1] o.a.s.c.SolrConfig Loaded SolrConfig: solrconfig.xml
   [junit4]   2> 1467807 INFO  (coreLoadExecutor-5913-thread-1-processing-n:127.0.0.1:41509_) [n:127.0.0.1:41509_ c:collection1   x:collection1] o.a.s.s.IndexSchema [collection1] Schema name=test
   [junit4]   2> 1467880 INFO  (coreLoadExecutor-5913-thread-1-processing-n:127.0.0.1:41509_) [n:127.0.0.1:41509_ c:collection1   x:collection1] o.a.s.s.OpenExchangeRatesOrgProvider Initialized with rates=open-exchange-rates.json, refreshInterval=1440.
   [junit4]   2> 1467884 INFO  (coreLoadExecutor-5913-thread-1-processing-n:127.0.0.1:41509_) [n:127.0.0.1:41509_ c:collection1   x:collection1] o.a.s.s.IndexSchema default search field in schema is text
   [junit4]   2> 1467885 INFO  (coreLoadExecutor-5913-thread-1-processing-n:127.0.0.1:41509_) [n:127.0.0.1:41509_ c:collection1   x:collection1] o.a.s.s.IndexSchema unique key field: id
   [junit4]   2> 1467888 INFO  (coreLoadExecutor-5913-thread-1-processing-n:127.0.0.1:41509_) [n:127.0.0.1:41509_ c:collection1   x:collection1] o.a.s.s.FileExchangeRateProvider Reloading exchange rates from file currency.xml
   [junit4]   2> 1467889 INFO  (coreLoadExecutor-5913-thread-1-processing-n:127.0.0.1:41509_) [n:127.0.0.1:41509_ c:collection1   x:collection1] o.a.s.s.FileExchangeRateProvider Reloading exchange rates from file currency.xml
   [junit4]   2> 1467890 INFO  (coreLoadExecutor-5913-thread-1-processing-n:127.0.0.1:41509_) [n:127.0.0.1:41509_ c:collection1   x:collection1] o.a.s.s.OpenExchangeRatesOrgProvider Reloading exchange rates from open-exchange-rates.json
   [junit4]   2> 1467891 INFO  (coreLoadExecutor-5913-thread-1-processing-n:127.0.0.1:41509_) [n:127.0.0.1:41509_ c:collection1   x:collection1] o.a.s.s.OpenExchangeRatesOrgProvider Reloading exchange rates from open-exchange-rates.json
   [junit4]   2> 1467891 INFO  (coreLoadExecutor-5913-thread-1-processing-n:127.0.0.1:41509_) [n:127.0.0.1:41509_ c:collection1   x:collection1] o.a.s.c.ConfigSetProperties Did not find ConfigSet properties, assuming default properties: Can't find resource 'configsetprops.json' in classpath or '/configs/conf1', cwd=/home/jenkins/workspace/Lucene-Solr-6.0-Linux/solr/build/solr-core/test/J2
   [junit4]   2> 1467891 INFO  (coreLoadExecutor-5913-thread-1-processing-n:127.0.0.1:41509_) [n:127.0.0.1:41509_ c:collection1   x:collection1] o.a.s.c.CoreContainer Creating SolrCore 'collection1' using configuration from collection collection1
   [junit4]   2> 1467891 INFO  (coreLoadExecutor-5913-thread-1-processing-n:127.0.0.1:41509_) [n:127.0.0.1:41509_ c:collection1 s:shard2 r:core_node1 x:collection1] o.a.s.c.SolrCore org.apache.solr.core.MockDirectoryFactory
   [junit4]   2> 1467892 INFO  (coreLoadExecutor-5913-thread-1-processing-n:127.0.0.1:41509_) [n:127.0.0.1:41509_ c:collection1 s:shard2 r:core_node1 x:collection1] o.a.s.c.SolrCore [[collection1] ] Opening new SolrCore at [/home/jenkins/workspace/Lucene-Solr-6.0-Linux/solr/build/solr-core/test/J2/temp/solr.cloud.DistributedVersionInfoTest_37A3C47B137654BB-001/shard-1-001/cores/collection1], dataDir=[/home/jenkins/workspace/Lucene-Solr-6.0-Linux/solr/build/solr-core/test/J2/temp/solr.cloud.DistributedVersionInfoTest_37A3C47B137654BB-001/shard-1-001/cores/collection1/data/]
   [junit4]   2> 1467892 INFO  (coreLoadExecutor-5913-thread-1-processing-n:127.0.0.1:41509_) [n:127.0.0.1:41509_ c:collection1 s:shard2 r:core_node1 x:collection1] o.a.s.c.JmxMonitoredMap JMX monitoring is enabled. Adding Solr mbeans to JMX Server: com.sun.jmx.mbeanserver.JmxMBeanServer@f1aead
   [junit4]   2> 1467892 INFO  (coreLoadExecutor-5913-thread-1-processing-n:127.0.0.1:41509_) [n:127.0.0.1:41509_ c:collection1 s:shard2 r:core_node1 x:collection1] o.a.s.c.CachingDirectoryFactory return new directory for /home/jenkins/workspace/Lucene-Solr-6.0-Linux/solr/build/solr-core/test/J2/temp/solr.cloud.DistributedVersionInfoTest_37A3C47B137654BB-001/shard-1-001/cores/collection1/data
   [junit4]   2> 1467892 INFO  (coreLoadExecutor-5913-thread-1-processing-n:127.0.0.1:41509_) [n:127.0.0.1:41509_ c:collection1 s:shard2 r:core_node1 x:collection1] o.a.s.c.SolrCore New index directory detected: old=null new=/home/jenkins/workspace/Lucene-Solr-6.0-Linux/solr/build/solr-core/test/J2/temp/solr.cloud.DistributedVersionInfoTest_37A3C47B137654BB-001/shard-1-001/cores/collection1/data/index/
   [junit4]   2> 1467892 WARN  (coreLoadExecutor-5913-thread-1-processing-n:127.0.0.1:41509_) [n:127.0.0.1:41509_ c:collection1 s:shard2 r:core_node1 x:collection1] o.a.s.c.SolrCore [collection1] Solr index directory '/home/jenkins/workspace/Lucene-Solr-6.0-Linux/solr/build/solr-core/test/J2/temp/solr.cloud.DistributedVersionInfoTest_37A3C47B137654BB-001/shard-1-001/cores/collection1/data/index' doesn't exist. Creating new index...
   [junit4]   2> 1467893 INFO  (coreLoadExecutor-5913-thread-1-processing-n:127.0.0.1:41509_) [n:127.0.0.1:41509_ c:collection1 s:shard2 r:core_node1 x:collection1] o.a.s.c.CachingDirectoryFactory return new directory for /home/jenkins/workspace/Lucene-Solr-6.0-Linux/solr/build/solr-core/test/J2/temp/solr.cloud.DistributedVersionInfoTest_37A3C47B137654BB-001/shard-1-001/cores/collection1/data/index
   [junit4]   2> 1467893 INFO  (coreLoadExecutor-5913-thread-1-processing-n:127.0.0.1:41509_) [n:127.0.0.1:41509_ c:collection1 s:shard2 r:core_node1 x:collection1] o.a.s.u.RandomMergePolicy RandomMergePolicy wrapping class org.apache.lucene.index.LogByteSizeMergePolicy: [LogByteSizeMergePolicy: minMergeSize=1677721, mergeFactor=12, maxMergeSize=2147483648, maxMergeSizeForForcedMerge=9223372036854775807, calibrateSizeByDeletes=true, maxMergeDocs=2147483647, maxCFSSegmentSizeMB=8.796093022207999E12, noCFSRatio=0.4459700028905065]
   [junit4]   2> 1467896 INFO  (coreLoadExecutor-5913-thread-1-processing-n:127.0.0.1:41509_) [n:127.0.0.1:41509_ c:collection1 s:shard2 r:core_node1 x:collection1] o.a.s.c.SolrDeletionPolicy SolrDeletionPolicy.onCommit: commits: num=1
   [junit4]   2> 	commit{dir=MockDirectoryWrapper(SimpleFSDirectory@/home/jenkins/workspace/Lucene-Solr-6.0-Linux/solr/build/solr-core/test/J2/temp/solr.cloud.DistributedVersionInfoTest_37A3C47B137654BB-001/index-SimpleFSDirectory-002 lockFactory=org.apache.lucene.store.NativeFSLockFactory@14409be),segFN=segments_1,generation=1}
   [junit4]   2> 1467896 INFO  (coreLoadExecutor-5913-thread-1-processing-n:127.0.0.1:41509_) [n:127.0.0.1:41509_ c:collection1 s:shard2 r:core_node1 x:collection1] o.a.s.c.SolrDeletionPolicy newest commit generation = 1
   [junit4]   2> 1467896 INFO  (OldIndexDirectoryCleanupThreadForCore-collection1) [n:127.0.0.1:41509_ c:collection1 s:shard2 r:core_node1 x:collection1] o.a.s.c.SolrCore Looking for old index directories to cleanup for core collection1 in /home/jenkins/workspace/Lucene-Solr-6.0-Linux/solr/build/solr-core/test/J2/temp/solr.cloud.DistributedVersionInfoTest_37A3C47B137654BB-001/shard-1-001/cores/collection1/data/
   [junit4]   2> 1467896 WARN  (OldIndexDirectoryCleanupThreadForCore-collection1) [n:127.0.0.1:41509_ c:collection1 s:shard2 r:core_node1 x:collection1] o.a.s.c.DirectoryFactory /home/jenkins/workspace/Lucene-Solr-6.0-Linux/solr/build/solr-core/test/J2/temp/solr.cloud.DistributedVersionInfoTest_37A3C47B137654BB-001/shard-1-001/cores/collection1/data/ does not point to a valid data directory; skipping clean-up of old index directories.
   [junit4]   2> 1467898 INFO  (coreLoadExecutor-5913-thread-1-processing-n:127.0.0.1:41509_) [n:127.0.0.1:41509_ c:collection1 s:shard2 r:core_node1 x:collection1] o.a.s.u.p.UpdateRequestProcessorChain creating updateRequestProcessorChain "nodistrib"
   [junit4]   2> 1467898 INFO  (coreLoadExecutor-5913-thread-1-processing-n:127.0.0.1:41509_) [n:127.0.0.1:41509_ c:collection1 s:shard2 r:core_node1 x:collection1] o.a.s.u.p.UpdateRequestProcessorChain creating updateRequestProcessorChain "dedupe"
   [junit4]   2> 1467898 INFO  (coreLoadExecutor-5913-thread-1-processing-n:127.0.0.1:41509_) [n:127.0.0.1:41509_ c:collection1 s:shard2 r:core_node1 x:collection1] o.a.s.u.p.UpdateRequestProcessorChain inserting DistributedUpdateProcessorFactory into updateRequestProcessorChain "dedupe"
   [junit4]   2> 1467898 INFO  (coreLoadExecutor-5913-thread-1-processing-n:127.0.0.1:41509_) [n:127.0.0.1:41509_ c:collection1 s:shard2 r:core_node1 x:collection1] o.a.s.u.p.UpdateRequestProcessorChain creating updateRequestProcessorChain "stored_sig"
   [junit4]   2> 1467898 INFO  (coreLoadExecutor-5913-thread-1-processing-n:127.0.0.1:41509_) [n:127.0.0.1:41509_ c:collection1 s:shard2 r:core_node1 x:collection1] o.a.s.u.p.UpdateRequestProcessorChain inserting DistributedUpdateProcessorFactory into updateRequestProcessorChain "stored_sig"
   [junit4]   2> 1467898 INFO  (coreLoadExecutor-5913-thread-1-processing-n:127.0.0.1:41509_) [n:127.0.0.1:41509_ c:collection1 s:shard2 r:core_node1 x:collection1] o.a.s.u.p.UpdateRequestProcessorChain creating updateRequestProcessorChain "distrib-dup-test-chain-explicit"
   [junit4]   2> 1467899 INFO  (coreLoadExecutor-5913-thread-1-processing-n:127.0.0.1:41509_) [n:127.0.0.1:41509_ c:collection1 s:shard2 r:core_node1 x:collection1] o.a.s.u.p.UpdateRequestProcessorChain creating updateRequestProcessorChain "distrib-dup-test-chain-implicit"
   [junit4]   2> 1467899 INFO  (coreLoadExecutor-5913-thread-1-processing-n:127.0.0.1:41509_) [n:127.0.0.1:41509_ c:collection1 s:shard2 r:core_node1 x:collection1] o.a.s.u.p.UpdateRequestProcessorChain inserting DistributedUpdateProcessorFactory into updateRequestProcessorChain "distrib-dup-test-chain-implicit"
   [junit4]   2> 1467899 INFO  (coreLoadExecutor-5913-thread-1-processing-n:127.0.0.1:41509_) [n:127.0.0.1:41509_ c:collection1 s:shard2 r:core_node1 x:collection1] o.a.s.c.SolrCore no updateRequestProcessorChain defined as default, creating implicit default
   [junit4]   2> 1467899 WARN  (coreLoadExecutor-5913-thread-1-processing-n:127.0.0.1:41509_) [n:127.0.0.1:41509_ c:collecti

[...truncated too long message...]

va:745)
   [junit4]   2>   36) Thread[id=9393, name=qtp22358468-9393, state=RUNNABLE, group=TGRP-DistributedVersionInfoTest]
   [junit4]   2>         at sun.nio.ch.EPollArrayWrapper.interrupt(Native Method)
   [junit4]   2>         at sun.nio.ch.EPollArrayWrapper.interrupt(EPollArrayWrapper.java:317)
   [junit4]   2>         at sun.nio.ch.EPollSelectorImpl.wakeup(EPollSelectorImpl.java:207)
   [junit4]   2>         at java.nio.channels.spi.AbstractSelector$1.interrupt(AbstractSelector.java:213)
   [junit4]   2>         at java.nio.channels.spi.AbstractSelector.begin(AbstractSelector.java:219)
   [junit4]   2>         at sun.nio.ch.EPollSelectorImpl.doSelect(EPollSelectorImpl.java:92)
   [junit4]   2>         at sun.nio.ch.SelectorImpl.lockAndDoSelect(SelectorImpl.java:86)
   [junit4]   2>         at sun.nio.ch.SelectorImpl.select(SelectorImpl.java:97)
   [junit4]   2>         at sun.nio.ch.SelectorImpl.select(SelectorImpl.java:101)
   [junit4]   2>         at org.eclipse.jetty.io.ManagedSelector$SelectorProducer.select(ManagedSelector.java:233)
   [junit4]   2>         at org.eclipse.jetty.io.ManagedSelector$SelectorProducer.produce(ManagedSelector.java:181)
   [junit4]   2>         at org.eclipse.jetty.util.thread.strategy.ExecuteProduceConsume.produceAndRun(ExecuteProduceConsume.java:171)
   [junit4]   2>         at org.eclipse.jetty.util.thread.strategy.ExecuteProduceConsume.run(ExecuteProduceConsume.java:156)
   [junit4]   2>         at org.eclipse.jetty.util.thread.QueuedThreadPool.runJob(QueuedThreadPool.java:654)
   [junit4]   2>         at org.eclipse.jetty.util.thread.QueuedThreadPool$3.run(QueuedThreadPool.java:572)
   [junit4]   2>         at java.lang.Thread.run(Thread.java:745)
   [junit4]   2>   37) Thread[id=9453, name=qtp23937925-9453, state=RUNNABLE, group=TGRP-DistributedVersionInfoTest]
   [junit4]   2>         at sun.nio.ch.IOUtil.drain(Native Method)
   [junit4]   2>         at sun.nio.ch.EPollSelectorImpl.doSelect(EPollSelectorImpl.java:104)
   [junit4]   2>         at sun.nio.ch.SelectorImpl.lockAndDoSelect(SelectorImpl.java:86)
   [junit4]   2>         at sun.nio.ch.SelectorImpl.select(SelectorImpl.java:97)
   [junit4]   2>         at sun.nio.ch.SelectorImpl.select(SelectorImpl.java:101)
   [junit4]   2>         at org.eclipse.jetty.io.ManagedSelector$SelectorProducer.select(ManagedSelector.java:233)
   [junit4]   2>         at org.eclipse.jetty.io.ManagedSelector$SelectorProducer.produce(ManagedSelector.java:181)
   [junit4]   2>         at org.eclipse.jetty.util.thread.strategy.ExecuteProduceConsume.produceAndRun(ExecuteProduceConsume.java:171)
   [junit4]   2>         at org.eclipse.jetty.util.thread.strategy.ExecuteProduceConsume.run(ExecuteProduceConsume.java:156)
   [junit4]   2>         at org.eclipse.jetty.util.thread.QueuedThreadPool.runJob(QueuedThreadPool.java:654)
   [junit4]   2>         at org.eclipse.jetty.util.thread.QueuedThreadPool$3.run(QueuedThreadPool.java:572)
   [junit4]   2>         at java.lang.Thread.run(Thread.java:745)
   [junit4]   2>   38) Thread[id=9554, name=qtp23937925-9554, state=RUNNABLE, group=TGRP-DistributedVersionInfoTest]
   [junit4]   2>         at sun.nio.ch.IOUtil.drain(Native Method)
   [junit4]   2>         at sun.nio.ch.EPollSelectorImpl.doSelect(EPollSelectorImpl.java:104)
   [junit4]   2>         at sun.nio.ch.SelectorImpl.lockAndDoSelect(SelectorImpl.java:86)
   [junit4]   2>         at sun.nio.ch.SelectorImpl.select(SelectorImpl.java:97)
   [junit4]   2>         at sun.nio.ch.SelectorImpl.select(SelectorImpl.java:101)
   [junit4]   2>         at org.eclipse.jetty.io.ManagedSelector$SelectorProducer.select(ManagedSelector.java:233)
   [junit4]   2>         at org.eclipse.jetty.io.ManagedSelector$SelectorProducer.produce(ManagedSelector.java:181)
   [junit4]   2>         at org.eclipse.jetty.util.thread.strategy.ExecuteProduceConsume.produceAndRun(ExecuteProduceConsume.java:171)
   [junit4]   2>         at org.eclipse.jetty.util.thread.strategy.ExecuteProduceConsume.run(ExecuteProduceConsume.java:156)
   [junit4]   2>         at org.eclipse.jetty.util.thread.QueuedThreadPool.runJob(QueuedThreadPool.java:654)
   [junit4]   2>         at org.eclipse.jetty.util.thread.QueuedThreadPool$3.run(QueuedThreadPool.java:572)
   [junit4]   2>         at java.lang.Thread.run(Thread.java:745)
   [junit4]   2> NOTE: test params are: codec=Asserting(Lucene60): {range_facet_l_dv=PostingsFormat(name=MockRandom), _version_=FST50, multiDefault=PostingsFormat(name=Asserting), a_t=FST50, intDefault=FST50, id=PostingsFormat(name=MockRandom), range_facet_i_dv=FST50, text=PostingsFormat(name=LuceneVarGapDocFreqInterval), range_facet_l=FST50, timestamp=FST50}, docValues:{range_facet_l_dv=DocValuesFormat(name=Direct), range_facet_i_dv=DocValuesFormat(name=Lucene54), timestamp=DocValuesFormat(name=Lucene54)}, maxPointsInLeafNode=1651, maxMBSortInHeap=6.488466261544033, sim=ClassicSimilarity, locale=sr-ME, timezone=Asia/Shanghai
   [junit4]   2> NOTE: Linux 4.2.0-34-generic i386/Oracle Corporation 1.8.0_72 (32-bit)/cpus=12,threads=52,free=338042384,total=536870912
   [junit4]   2> NOTE: All tests run in this JVM: [DateRangeFieldTest, HdfsWriteToMultipleCollectionsTest, RuleEngineTest, TestJmxMonitoredMap, TestIndexSearcher, TestFastWriter, TestRecoveryHdfs, ParsingFieldUpdateProcessorsTest, TestFuzzyAnalyzedSuggestions, TestCharFilters, InfoHandlerTest, TestRTimerTree, DistribJoinFromCollectionTest, TestSchemaVersionResource, RequestLoggingTest, TestSearchPerf, TestManagedResourceStorage, FullSolrCloudDistribCmdsTest, GraphQueryTest, ClusterStateTest, TestPHPSerializedResponseWriter, SolrCloudExampleTest, TestRecovery, UnloadDistributedZkTest, TestManagedSchema, DebugComponentTest, StatsComponentTest, CursorMarkTest, PluginInfoTest, TestRebalanceLeaders, TestRuleBasedAuthorizationPlugin, TestDynamicFieldCollectionResource, HdfsRecoveryZkTest, TestJsonRequest, TestCSVResponseWriter, TestLeaderInitiatedRecoveryThread, TestIndexingPerformance, FieldAnalysisRequestHandlerTest, TestReload, TestCoreDiscovery, TestIntervalFaceting, TestNoOpRegenerator, AutoCommitTest, DirectUpdateHandlerOptimizeTest, RegexBoostProcessorTest, SearchHandlerTest, TestPerFieldSimilarity, BasicDistributedZk2Test, BinaryUpdateRequestHandlerTest, HighlighterConfigTest, SpatialRPTFieldTypeTest, CoreAdminHandlerTest, HardAutoCommitTest, JavabinLoaderTest, LukeRequestHandlerTest, CollectionsAPISolrJTest, TestJettySolrRunner, TestSchemaNameResource, TestJmxIntegration, TestExpandComponent, TestImplicitCoreProperties, TestTolerantSearch, OverseerCollectionConfigSetProcessorTest, DistributedFacetPivotLongTailTest, TriLevelCompositeIdRoutingTest, TestClassicSimilarityFactory, TestWriterPerf, TestFileDictionaryLookup, NoCacheHeaderTest, DirectoryFactoryTest, CloneFieldUpdateProcessorFactoryTest, CurrencyFieldXmlFileTest, TestReplicationHandlerBackup, TestCollapseQParserPlugin, TestSolrCloudWithKerberosAlt, TestExtendedDismaxParser, AssignTest, BlockCacheTest, TestSolrQueryParser, DistributedDebugComponentTest, CoreAdminCreateDiscoverTest, RequestHandlersTest, TestReversedWildcardFilterFactory, TestExactStatsCache, TestSolrConfigHandler, TestSolrQueryResponse, BadIndexSchemaTest, CircularListTest, TestGroupingSearch, DirectSolrConnectionTest, SuggesterTSTTest, HdfsThreadLeakTest, TestDownShardTolerantSearch, DateMathParserTest, BasicDistributedZkTest, ChaosMonkeySafeLeaderTest, CollectionsAPIDistributedZkTest, LeaderElectionIntegrationTest, TestReplicationHandler, SolrCoreTest, SpellCheckComponentTest, TestFiltering, SortByFunctionTest, DocValuesMultiTest, DistanceFunctionTest, XsltUpdateRequestHandlerTest, StandardRequestHandlerTest, PrimitiveFieldTypeTest, FileBasedSpellCheckerTest, TermVectorComponentTest, RequiredFieldsTest, IndexSchemaRuntimeFieldTest, TestCollationField, ReturnFieldsTest, QueryParsingTest, CSVRequestHandlerTest, TestBinaryResponseWriter, TestLFUCache, SolrTestCaseJ4Test, TestDistributedMissingSort, TestHighlightDedupGrouping, AsyncMigrateRouteKeyTest, CollectionTooManyReplicasTest, DeleteLastCustomShardedReplicaTest, DistribCursorPagingTest, DistributedVersionInfoTest]
   [junit4]   2> NOTE: reproduce with: ant test  -Dtestcase=DistributedVersionInfoTest -Dtests.seed=37A3C47B137654BB -Dtests.multiplier=3 -Dtests.slow=true -Dtests.locale=sr-ME -Dtests.timezone=Asia/Shanghai -Dtests.asserts=true -Dtests.file.encoding=UTF-8
   [junit4] ERROR   0.00s J2 | DistributedVersionInfoTest (suite) <<<
   [junit4]    > Throwable #1: java.lang.Exception: Suite timeout exceeded (>= 7200000 msec).
   [junit4]    > 	at __randomizedtesting.SeedInfo.seed([37A3C47B137654BB]:0)
   [junit4] Completed [580/580 (1!)] on J2 in 7223.78s, 1 test, 2 errors <<< FAILURES!

[...truncated 12 lines...]
BUILD FAILED
/home/jenkins/workspace/Lucene-Solr-6.0-Linux/build.xml:740: The following error occurred while executing this line:
/home/jenkins/workspace/Lucene-Solr-6.0-Linux/build.xml:684: The following error occurred while executing this line:
/home/jenkins/workspace/Lucene-Solr-6.0-Linux/build.xml:59: The following error occurred while executing this line:
/home/jenkins/workspace/Lucene-Solr-6.0-Linux/solr/build.xml:233: The following error occurred while executing this line:
/home/jenkins/workspace/Lucene-Solr-6.0-Linux/solr/common-build.xml:527: The following error occurred while executing this line:
/home/jenkins/workspace/Lucene-Solr-6.0-Linux/lucene/common-build.xml:1457: The following error occurred while executing this line:
/home/jenkins/workspace/Lucene-Solr-6.0-Linux/lucene/common-build.xml:1014: There were test failures: 580 suites (10 ignored), 2310 tests, 1 suite-level error, 1 error, 114 ignored (70 assumptions) [seed: 37A3C47B137654BB]

Total time: 168 minutes 42 seconds
Build step 'Invoke Ant' marked build as failure
Archiving artifacts
[WARNINGS] Skipping publisher since build result is FAILURE
Recording test results
Email was triggered for: Failure - Any
Sending email for trigger: Failure - Any



Mime
View raw message