lucene-dev mailing list archives

Site index · List index
Message view « Date » · « Thread »
Top « Date » · « Thread »
From Apache Jenkins Server <jenk...@builds.apache.org>
Subject [JENKINS] Lucene-Solr-Tests-6.x - Build # 131 - Failure
Date Mon, 11 Apr 2016 01:58:39 GMT
Build: https://builds.apache.org/job/Lucene-Solr-Tests-6.x/131/

1 tests failed.
FAILED:  org.apache.solr.cloud.overseer.ZkStateReaderTest.testStateFormatUpdateWithExplicitRefreshLazy

Error Message:
Could not find collection : c1

Stack Trace:
org.apache.solr.common.SolrException: Could not find collection : c1
	at __randomizedtesting.SeedInfo.seed([99DC7505406A6500:F293D5783965B83A]:0)
	at org.apache.solr.common.cloud.ClusterState.getCollection(ClusterState.java:170)
	at org.apache.solr.cloud.overseer.ZkStateReaderTest.testStateFormatUpdate(ZkStateReaderTest.java:135)
	at org.apache.solr.cloud.overseer.ZkStateReaderTest.testStateFormatUpdateWithExplicitRefreshLazy(ZkStateReaderTest.java:46)
	at sun.reflect.NativeMethodAccessorImpl.invoke0(Native Method)
	at sun.reflect.NativeMethodAccessorImpl.invoke(NativeMethodAccessorImpl.java:62)
	at sun.reflect.DelegatingMethodAccessorImpl.invoke(DelegatingMethodAccessorImpl.java:43)
	at java.lang.reflect.Method.invoke(Method.java:498)
	at com.carrotsearch.randomizedtesting.RandomizedRunner.invoke(RandomizedRunner.java:1764)
	at com.carrotsearch.randomizedtesting.RandomizedRunner$8.evaluate(RandomizedRunner.java:871)
	at com.carrotsearch.randomizedtesting.RandomizedRunner$9.evaluate(RandomizedRunner.java:907)
	at com.carrotsearch.randomizedtesting.RandomizedRunner$10.evaluate(RandomizedRunner.java:921)
	at com.carrotsearch.randomizedtesting.rules.SystemPropertiesRestoreRule$1.evaluate(SystemPropertiesRestoreRule.java:57)
	at org.apache.lucene.util.TestRuleSetupTeardownChained$1.evaluate(TestRuleSetupTeardownChained.java:49)
	at org.apache.lucene.util.AbstractBeforeAfterRule$1.evaluate(AbstractBeforeAfterRule.java:45)
	at org.apache.lucene.util.TestRuleThreadAndTestName$1.evaluate(TestRuleThreadAndTestName.java:48)
	at org.apache.lucene.util.TestRuleIgnoreAfterMaxFailures$1.evaluate(TestRuleIgnoreAfterMaxFailures.java:64)
	at org.apache.lucene.util.TestRuleMarkFailure$1.evaluate(TestRuleMarkFailure.java:47)
	at com.carrotsearch.randomizedtesting.rules.StatementAdapter.evaluate(StatementAdapter.java:36)
	at com.carrotsearch.randomizedtesting.ThreadLeakControl$StatementRunner.run(ThreadLeakControl.java:367)
	at com.carrotsearch.randomizedtesting.ThreadLeakControl.forkTimeoutingTask(ThreadLeakControl.java:809)
	at com.carrotsearch.randomizedtesting.ThreadLeakControl$3.evaluate(ThreadLeakControl.java:460)
	at com.carrotsearch.randomizedtesting.RandomizedRunner.runSingleTest(RandomizedRunner.java:880)
	at com.carrotsearch.randomizedtesting.RandomizedRunner$5.evaluate(RandomizedRunner.java:781)
	at com.carrotsearch.randomizedtesting.RandomizedRunner$6.evaluate(RandomizedRunner.java:816)
	at com.carrotsearch.randomizedtesting.RandomizedRunner$7.evaluate(RandomizedRunner.java:827)
	at com.carrotsearch.randomizedtesting.rules.StatementAdapter.evaluate(StatementAdapter.java:36)
	at com.carrotsearch.randomizedtesting.rules.SystemPropertiesRestoreRule$1.evaluate(SystemPropertiesRestoreRule.java:57)
	at org.apache.lucene.util.AbstractBeforeAfterRule$1.evaluate(AbstractBeforeAfterRule.java:45)
	at com.carrotsearch.randomizedtesting.rules.StatementAdapter.evaluate(StatementAdapter.java:36)
	at org.apache.lucene.util.TestRuleStoreClassName$1.evaluate(TestRuleStoreClassName.java:41)
	at com.carrotsearch.randomizedtesting.rules.NoShadowingOrOverridesOnMethodsRule$1.evaluate(NoShadowingOrOverridesOnMethodsRule.java:40)
	at com.carrotsearch.randomizedtesting.rules.NoShadowingOrOverridesOnMethodsRule$1.evaluate(NoShadowingOrOverridesOnMethodsRule.java:40)
	at com.carrotsearch.randomizedtesting.rules.StatementAdapter.evaluate(StatementAdapter.java:36)
	at com.carrotsearch.randomizedtesting.rules.StatementAdapter.evaluate(StatementAdapter.java:36)
	at com.carrotsearch.randomizedtesting.rules.StatementAdapter.evaluate(StatementAdapter.java:36)
	at org.apache.lucene.util.TestRuleAssertionsRequired$1.evaluate(TestRuleAssertionsRequired.java:53)
	at org.apache.lucene.util.TestRuleMarkFailure$1.evaluate(TestRuleMarkFailure.java:47)
	at org.apache.lucene.util.TestRuleIgnoreAfterMaxFailures$1.evaluate(TestRuleIgnoreAfterMaxFailures.java:64)
	at org.apache.lucene.util.TestRuleIgnoreTestSuites$1.evaluate(TestRuleIgnoreTestSuites.java:54)
	at com.carrotsearch.randomizedtesting.rules.StatementAdapter.evaluate(StatementAdapter.java:36)
	at com.carrotsearch.randomizedtesting.ThreadLeakControl$StatementRunner.run(ThreadLeakControl.java:367)
	at java.lang.Thread.run(Thread.java:745)




Build Log:
[...truncated 12137 lines...]
   [junit4] Suite: org.apache.solr.cloud.overseer.ZkStateReaderTest
   [junit4]   2> Creating dataDir: /x1/jenkins/jenkins-slave/workspace/Lucene-Solr-Tests-6.x/solr/build/solr-core/test/J2/temp/solr.cloud.overseer.ZkStateReaderTest_99DC7505406A6500-001/init-core-data-001
   [junit4]   2> 2368369 INFO  (SUITE-ZkStateReaderTest-seed#[99DC7505406A6500]-worker) [    ] o.a.s.SolrTestCaseJ4 Randomized ssl (false) and clientAuth (false)
   [junit4]   2> 2368371 INFO  (TEST-ZkStateReaderTest.testStateFormatUpdateWithTimeDelay-seed#[99DC7505406A6500]) [    ] o.a.s.SolrTestCaseJ4 ###Starting testStateFormatUpdateWithTimeDelay
   [junit4]   2> 2368371 INFO  (TEST-ZkStateReaderTest.testStateFormatUpdateWithTimeDelay-seed#[99DC7505406A6500]) [    ] o.a.s.c.ZkTestServer STARTING ZK TEST SERVER
   [junit4]   2> 2368371 INFO  (Thread-4759) [    ] o.a.s.c.ZkTestServer client port:0.0.0.0/0.0.0.0:0
   [junit4]   2> 2368371 INFO  (Thread-4759) [    ] o.a.s.c.ZkTestServer Starting server
   [junit4]   2> 2368471 INFO  (TEST-ZkStateReaderTest.testStateFormatUpdateWithTimeDelay-seed#[99DC7505406A6500]) [    ] o.a.s.c.ZkTestServer start zk server on port:58263
   [junit4]   2> 2368471 INFO  (TEST-ZkStateReaderTest.testStateFormatUpdateWithTimeDelay-seed#[99DC7505406A6500]) [    ] o.a.s.c.c.SolrZkClient Using default ZkCredentialsProvider
   [junit4]   2> 2368477 INFO  (TEST-ZkStateReaderTest.testStateFormatUpdateWithTimeDelay-seed#[99DC7505406A6500]) [    ] o.a.s.c.c.ConnectionManager Waiting for client to connect to ZooKeeper
   [junit4]   2> 2368497 INFO  (zkCallback-2167-thread-1) [    ] o.a.s.c.c.ConnectionManager Watcher org.apache.solr.common.cloud.ConnectionManager@282ad8c9 name:ZooKeeperConnection Watcher:127.0.0.1:58263 got event WatchedEvent state:SyncConnected type:None path:null path:null type:None
   [junit4]   2> 2368498 INFO  (TEST-ZkStateReaderTest.testStateFormatUpdateWithTimeDelay-seed#[99DC7505406A6500]) [    ] o.a.s.c.c.ConnectionManager Client is connected to ZooKeeper
   [junit4]   2> 2368498 INFO  (TEST-ZkStateReaderTest.testStateFormatUpdateWithTimeDelay-seed#[99DC7505406A6500]) [    ] o.a.s.c.c.SolrZkClient Using default ZkACLProvider
   [junit4]   2> 2368505 WARN  (NIOServerCxn.Factory:0.0.0.0/0.0.0.0:0) [    ] o.a.z.s.NIOServerCnxn caught end of stream exception
   [junit4]   2> EndOfStreamException: Unable to read additional data from client sessionid 0x1540302ad0f0000, likely client has closed socket
   [junit4]   2> 	at org.apache.zookeeper.server.NIOServerCnxn.doIO(NIOServerCnxn.java:228)
   [junit4]   2> 	at org.apache.zookeeper.server.NIOServerCnxnFactory.run(NIOServerCnxnFactory.java:208)
   [junit4]   2> 	at java.lang.Thread.run(Thread.java:745)
   [junit4]   2> 2368505 INFO  (TEST-ZkStateReaderTest.testStateFormatUpdateWithTimeDelay-seed#[99DC7505406A6500]) [    ] o.a.s.c.c.SolrZkClient Using default ZkCredentialsProvider
   [junit4]   2> 2368505 INFO  (TEST-ZkStateReaderTest.testStateFormatUpdateWithTimeDelay-seed#[99DC7505406A6500]) [    ] o.a.s.c.c.ConnectionManager Waiting for client to connect to ZooKeeper
   [junit4]   2> 2368506 INFO  (zkCallback-2168-thread-1) [    ] o.a.s.c.c.ConnectionManager Watcher org.apache.solr.common.cloud.ConnectionManager@3b5acfda name:ZooKeeperConnection Watcher:127.0.0.1:58263 got event WatchedEvent state:SyncConnected type:None path:null path:null type:None
   [junit4]   2> 2368506 INFO  (TEST-ZkStateReaderTest.testStateFormatUpdateWithTimeDelay-seed#[99DC7505406A6500]) [    ] o.a.s.c.c.ConnectionManager Client is connected to ZooKeeper
   [junit4]   2> 2368506 INFO  (TEST-ZkStateReaderTest.testStateFormatUpdateWithTimeDelay-seed#[99DC7505406A6500]) [    ] o.a.s.c.c.SolrZkClient Using default ZkACLProvider
   [junit4]   2> 2368506 INFO  (TEST-ZkStateReaderTest.testStateFormatUpdateWithTimeDelay-seed#[99DC7505406A6500]) [    ] o.a.s.c.c.SolrZkClient makePath: /solr
   [junit4]   2> 2368508 WARN  (NIOServerCxn.Factory:0.0.0.0/0.0.0.0:0) [    ] o.a.z.s.NIOServerCnxn caught end of stream exception
   [junit4]   2> EndOfStreamException: Unable to read additional data from client sessionid 0x1540302ad0f0001, likely client has closed socket
   [junit4]   2> 	at org.apache.zookeeper.server.NIOServerCnxn.doIO(NIOServerCnxn.java:228)
   [junit4]   2> 	at org.apache.zookeeper.server.NIOServerCnxnFactory.run(NIOServerCnxnFactory.java:208)
   [junit4]   2> 	at java.lang.Thread.run(Thread.java:745)
   [junit4]   2> 2368508 INFO  (TEST-ZkStateReaderTest.testStateFormatUpdateWithTimeDelay-seed#[99DC7505406A6500]) [    ] o.a.s.c.c.SolrZkClient Using default ZkCredentialsProvider
   [junit4]   2> 2368509 INFO  (TEST-ZkStateReaderTest.testStateFormatUpdateWithTimeDelay-seed#[99DC7505406A6500]) [    ] o.a.s.c.c.ConnectionManager Waiting for client to connect to ZooKeeper
   [junit4]   2> 2368509 INFO  (zkCallback-2169-thread-1) [    ] o.a.s.c.c.ConnectionManager Watcher org.apache.solr.common.cloud.ConnectionManager@35b3a3ee name:ZooKeeperConnection Watcher:127.0.0.1:58263/solr got event WatchedEvent state:SyncConnected type:None path:null path:null type:None
   [junit4]   2> 2368509 INFO  (TEST-ZkStateReaderTest.testStateFormatUpdateWithTimeDelay-seed#[99DC7505406A6500]) [    ] o.a.s.c.c.ConnectionManager Client is connected to ZooKeeper
   [junit4]   2> 2368509 INFO  (TEST-ZkStateReaderTest.testStateFormatUpdateWithTimeDelay-seed#[99DC7505406A6500]) [    ] o.a.s.c.c.SolrZkClient Using default ZkACLProvider
   [junit4]   2> 2368510 INFO  (TEST-ZkStateReaderTest.testStateFormatUpdateWithTimeDelay-seed#[99DC7505406A6500]) [    ] o.a.s.c.c.SolrZkClient makePath: /live_nodes
   [junit4]   2> 2368510 INFO  (TEST-ZkStateReaderTest.testStateFormatUpdateWithTimeDelay-seed#[99DC7505406A6500]) [    ] o.a.s.c.c.SolrZkClient makePath: /collections
   [junit4]   2> 2368511 INFO  (TEST-ZkStateReaderTest.testStateFormatUpdateWithTimeDelay-seed#[99DC7505406A6500]) [    ] o.a.s.c.c.SolrZkClient makePath: /aliases.json
   [junit4]   2> 2368511 INFO  (TEST-ZkStateReaderTest.testStateFormatUpdateWithTimeDelay-seed#[99DC7505406A6500]) [    ] o.a.s.c.c.SolrZkClient makePath: /clusterstate.json
   [junit4]   2> 2368512 INFO  (TEST-ZkStateReaderTest.testStateFormatUpdateWithTimeDelay-seed#[99DC7505406A6500]) [    ] o.a.s.c.c.SolrZkClient makePath: /security.json
   [junit4]   2> 2368512 INFO  (TEST-ZkStateReaderTest.testStateFormatUpdateWithTimeDelay-seed#[99DC7505406A6500]) [    ] o.a.s.c.c.ZkStateReader Updating cluster state from ZooKeeper... 
   [junit4]   2> 2368513 INFO  (TEST-ZkStateReaderTest.testStateFormatUpdateWithTimeDelay-seed#[99DC7505406A6500]) [    ] o.a.s.c.c.ZkStateReader Updated live nodes from ZooKeeper... (0) -> (0)
   [junit4]   2> 2368513 INFO  (TEST-ZkStateReaderTest.testStateFormatUpdateWithTimeDelay-seed#[99DC7505406A6500]) [    ] o.a.s.c.c.ZkStateReader addZkWatch [c1]
   [junit4]   2> 2368514 INFO  (TEST-ZkStateReaderTest.testStateFormatUpdateWithTimeDelay-seed#[99DC7505406A6500]) [    ] o.a.s.c.c.ZkStateReader Deleting data for [c1]
   [junit4]   2> 2368514 INFO  (TEST-ZkStateReaderTest.testStateFormatUpdateWithTimeDelay-seed#[99DC7505406A6500]) [    ] o.a.s.c.c.ZkStateReader Deleting data for [c1]
   [junit4]   2> 2368514 INFO  (TEST-ZkStateReaderTest.testStateFormatUpdateWithTimeDelay-seed#[99DC7505406A6500]) [    ] o.a.s.c.c.SolrZkClient makePath: /collections/c1
   [junit4]   2> 2368514 INFO  (zkCallback-2169-thread-1) [    ] o.a.s.c.c.ZkStateReader A collections change: [WatchedEvent state:SyncConnected type:NodeChildrenChanged path:/collections], has occurred - updating...
   [junit4]   2> 2368515 INFO  (zkCallback-2169-thread-1) [    ] o.a.s.c.c.ZkStateReader Deleting data for [c1]
   [junit4]   2> 2368518 INFO  (zkCallback-2169-thread-2) [    ] o.a.s.c.c.ZkStateReader A cluster state change: [WatchedEvent state:SyncConnected type:NodeDataChanged path:/clusterstate.json], has occurred - updating... (live nodes size: [0])
   [junit4]   2> 2368581 INFO  (TEST-ZkStateReaderTest.testStateFormatUpdateWithTimeDelay-seed#[99DC7505406A6500]) [    ] o.a.s.c.o.ZkStateWriter going to create_collection /collections/c1/state.json
   [junit4]   2> 2368597 INFO  (zkCallback-2169-thread-2) [    ] o.a.s.c.c.ZkStateReader A cluster state change: [WatchedEvent state:SyncConnected type:NodeDataChanged path:/clusterstate.json], has occurred - updating... (live nodes size: [0])
   [junit4]   2> 2368598 INFO  (zkCallback-2169-thread-2) [    ] o.a.s.c.c.ZkStateReader Add data for [c1] ver [0]
   [junit4]   2> 2368633 INFO  (TEST-ZkStateReaderTest.testStateFormatUpdateWithTimeDelay-seed#[99DC7505406A6500]) [    ] o.a.s.c.ZkTestServer connecting to 127.0.0.1:58263 58263
   [junit4]   2> 2368948 INFO  (Thread-4759) [    ] o.a.s.c.ZkTestServer connecting to 127.0.0.1:58263 58263
   [junit4]   2> 2368961 INFO  (TEST-ZkStateReaderTest.testStateFormatUpdateWithTimeDelay-seed#[99DC7505406A6500]) [    ] o.a.s.SolrTestCaseJ4 ###Ending testStateFormatUpdateWithTimeDelay
   [junit4]   2> 2368963 INFO  (TEST-ZkStateReaderTest.testStateFormatUpdateWithExplicitRefresh-seed#[99DC7505406A6500]) [    ] o.a.s.SolrTestCaseJ4 ###Starting testStateFormatUpdateWithExplicitRefresh
   [junit4]   2> 2368963 INFO  (TEST-ZkStateReaderTest.testStateFormatUpdateWithExplicitRefresh-seed#[99DC7505406A6500]) [    ] o.a.s.c.ZkTestServer STARTING ZK TEST SERVER
   [junit4]   2> 2368973 INFO  (Thread-4760) [    ] o.a.s.c.ZkTestServer client port:0.0.0.0/0.0.0.0:0
   [junit4]   2> 2368973 INFO  (Thread-4760) [    ] o.a.s.c.ZkTestServer Starting server
   [junit4]   2> 2369077 INFO  (TEST-ZkStateReaderTest.testStateFormatUpdateWithExplicitRefresh-seed#[99DC7505406A6500]) [    ] o.a.s.c.ZkTestServer start zk server on port:56750
   [junit4]   2> 2369077 INFO  (TEST-ZkStateReaderTest.testStateFormatUpdateWithExplicitRefresh-seed#[99DC7505406A6500]) [    ] o.a.s.c.c.SolrZkClient Using default ZkCredentialsProvider
   [junit4]   2> 2369089 INFO  (TEST-ZkStateReaderTest.testStateFormatUpdateWithExplicitRefresh-seed#[99DC7505406A6500]) [    ] o.a.s.c.c.ConnectionManager Waiting for client to connect to ZooKeeper
   [junit4]   2> 2369125 INFO  (zkCallback-2170-thread-1) [    ] o.a.s.c.c.ConnectionManager Watcher org.apache.solr.common.cloud.ConnectionManager@42cd95f4 name:ZooKeeperConnection Watcher:127.0.0.1:56750 got event WatchedEvent state:SyncConnected type:None path:null path:null type:None
   [junit4]   2> 2369129 INFO  (TEST-ZkStateReaderTest.testStateFormatUpdateWithExplicitRefresh-seed#[99DC7505406A6500]) [    ] o.a.s.c.c.ConnectionManager Client is connected to ZooKeeper
   [junit4]   2> 2369129 INFO  (TEST-ZkStateReaderTest.testStateFormatUpdateWithExplicitRefresh-seed#[99DC7505406A6500]) [    ] o.a.s.c.c.SolrZkClient Using default ZkACLProvider
   [junit4]   2> 2369153 INFO  (TEST-ZkStateReaderTest.testStateFormatUpdateWithExplicitRefresh-seed#[99DC7505406A6500]) [    ] o.a.s.c.c.SolrZkClient Using default ZkCredentialsProvider
   [junit4]   2> 2369158 INFO  (TEST-ZkStateReaderTest.testStateFormatUpdateWithExplicitRefresh-seed#[99DC7505406A6500]) [    ] o.a.s.c.c.ConnectionManager Waiting for client to connect to ZooKeeper
   [junit4]   2> 2369162 INFO  (zkCallback-2171-thread-1) [    ] o.a.s.c.c.ConnectionManager Watcher org.apache.solr.common.cloud.ConnectionManager@2a351afa name:ZooKeeperConnection Watcher:127.0.0.1:56750 got event WatchedEvent state:SyncConnected type:None path:null path:null type:None
   [junit4]   2> 2369165 INFO  (TEST-ZkStateReaderTest.testStateFormatUpdateWithExplicitRefresh-seed#[99DC7505406A6500]) [    ] o.a.s.c.c.ConnectionManager Client is connected to ZooKeeper
   [junit4]   2> 2369165 INFO  (TEST-ZkStateReaderTest.testStateFormatUpdateWithExplicitRefresh-seed#[99DC7505406A6500]) [    ] o.a.s.c.c.SolrZkClient Using default ZkACLProvider
   [junit4]   2> 2369165 INFO  (TEST-ZkStateReaderTest.testStateFormatUpdateWithExplicitRefresh-seed#[99DC7505406A6500]) [    ] o.a.s.c.c.SolrZkClient makePath: /solr
   [junit4]   2> 2369225 INFO  (TEST-ZkStateReaderTest.testStateFormatUpdateWithExplicitRefresh-seed#[99DC7505406A6500]) [    ] o.a.s.c.c.SolrZkClient Using default ZkCredentialsProvider
   [junit4]   2> 2369234 INFO  (TEST-ZkStateReaderTest.testStateFormatUpdateWithExplicitRefresh-seed#[99DC7505406A6500]) [    ] o.a.s.c.c.ConnectionManager Waiting for client to connect to ZooKeeper
   [junit4]   2> 2369253 INFO  (zkCallback-2172-thread-1) [    ] o.a.s.c.c.ConnectionManager Watcher org.apache.solr.common.cloud.ConnectionManager@46173462 name:ZooKeeperConnection Watcher:127.0.0.1:56750/solr got event WatchedEvent state:SyncConnected type:None path:null path:null type:None
   [junit4]   2> 2369257 INFO  (TEST-ZkStateReaderTest.testStateFormatUpdateWithExplicitRefresh-seed#[99DC7505406A6500]) [    ] o.a.s.c.c.ConnectionManager Client is connected to ZooKeeper
   [junit4]   2> 2369257 INFO  (TEST-ZkStateReaderTest.testStateFormatUpdateWithExplicitRefresh-seed#[99DC7505406A6500]) [    ] o.a.s.c.c.SolrZkClient Using default ZkACLProvider
   [junit4]   2> 2369273 INFO  (TEST-ZkStateReaderTest.testStateFormatUpdateWithExplicitRefresh-seed#[99DC7505406A6500]) [    ] o.a.s.c.c.SolrZkClient makePath: /live_nodes
   [junit4]   2> 2369299 INFO  (TEST-ZkStateReaderTest.testStateFormatUpdateWithExplicitRefresh-seed#[99DC7505406A6500]) [    ] o.a.s.c.c.SolrZkClient makePath: /collections
   [junit4]   2> 2369300 INFO  (TEST-ZkStateReaderTest.testStateFormatUpdateWithExplicitRefresh-seed#[99DC7505406A6500]) [    ] o.a.s.c.c.SolrZkClient makePath: /aliases.json
   [junit4]   2> 2369300 INFO  (TEST-ZkStateReaderTest.testStateFormatUpdateWithExplicitRefresh-seed#[99DC7505406A6500]) [    ] o.a.s.c.c.SolrZkClient makePath: /clusterstate.json
   [junit4]   2> 2369301 INFO  (TEST-ZkStateReaderTest.testStateFormatUpdateWithExplicitRefresh-seed#[99DC7505406A6500]) [    ] o.a.s.c.c.SolrZkClient makePath: /security.json
   [junit4]   2> 2369301 INFO  (TEST-ZkStateReaderTest.testStateFormatUpdateWithExplicitRefresh-seed#[99DC7505406A6500]) [    ] o.a.s.c.c.ZkStateReader Updating cluster state from ZooKeeper... 
   [junit4]   2> 2369302 INFO  (TEST-ZkStateReaderTest.testStateFormatUpdateWithExplicitRefresh-seed#[99DC7505406A6500]) [    ] o.a.s.c.c.ZkStateReader Updated live nodes from ZooKeeper... (0) -> (0)
   [junit4]   2> 2369302 INFO  (TEST-ZkStateReaderTest.testStateFormatUpdateWithExplicitRefresh-seed#[99DC7505406A6500]) [    ] o.a.s.c.c.ZkStateReader addZkWatch [c1]
   [junit4]   2> 2369302 INFO  (TEST-ZkStateReaderTest.testStateFormatUpdateWithExplicitRefresh-seed#[99DC7505406A6500]) [    ] o.a.s.c.c.ZkStateReader Deleting data for [c1]
   [junit4]   2> 2369303 INFO  (TEST-ZkStateReaderTest.testStateFormatUpdateWithExplicitRefresh-seed#[99DC7505406A6500]) [    ] o.a.s.c.c.ZkStateReader Deleting data for [c1]
   [junit4]   2> 2369303 INFO  (TEST-ZkStateReaderTest.testStateFormatUpdateWithExplicitRefresh-seed#[99DC7505406A6500]) [    ] o.a.s.c.c.SolrZkClient makePath: /collections/c1
   [junit4]   2> 2369303 INFO  (zkCallback-2172-thread-1) [    ] o.a.s.c.c.ZkStateReader A collections change: [WatchedEvent state:SyncConnected type:NodeChildrenChanged path:/collections], has occurred - updating...
   [junit4]   2> 2369304 INFO  (zkCallback-2172-thread-1) [    ] o.a.s.c.c.ZkStateReader Deleting data for [c1]
   [junit4]   2> 2369304 INFO  (zkCallback-2172-thread-2) [    ] o.a.s.c.c.ZkStateReader A cluster state change: [WatchedEvent state:SyncConnected type:NodeDataChanged path:/clusterstate.json], has occurred - updating... (live nodes size: [0])
   [junit4]   2> 2369305 INFO  (TEST-ZkStateReaderTest.testStateFormatUpdateWithExplicitRefresh-seed#[99DC7505406A6500]) [    ] o.a.s.c.o.ZkStateWriter going to create_collection /collections/c1/state.json
   [junit4]   2> 2369305 INFO  (zkCallback-2172-thread-2) [    ] o.a.s.c.c.ZkStateReader A cluster state change: [WatchedEvent state:SyncConnected type:NodeDataChanged path:/clusterstate.json], has occurred - updating... (live nodes size: [0])
   [junit4]   2> 2369305 INFO  (zkCallback-2172-thread-2) [    ] o.a.s.c.c.ZkStateReader Add data for [c1] ver [0]
   [junit4]   2> 2369307 INFO  (TEST-ZkStateReaderTest.testStateFormatUpdateWithExplicitRefresh-seed#[99DC7505406A6500]) [    ] o.a.s.c.ZkTestServer connecting to 127.0.0.1:56750 56750
   [junit4]   2> 2369489 INFO  (Thread-4760) [    ] o.a.s.c.ZkTestServer connecting to 127.0.0.1:56750 56750
   [junit4]   2> 2369490 INFO  (TEST-ZkStateReaderTest.testStateFormatUpdateWithExplicitRefresh-seed#[99DC7505406A6500]) [    ] o.a.s.SolrTestCaseJ4 ###Ending testStateFormatUpdateWithExplicitRefresh
   [junit4]   2> 2369491 INFO  (TEST-ZkStateReaderTest.testStateFormatUpdateWithExplicitRefreshLazy-seed#[99DC7505406A6500]) [    ] o.a.s.SolrTestCaseJ4 ###Starting testStateFormatUpdateWithExplicitRefreshLazy
   [junit4]   2> 2369492 INFO  (TEST-ZkStateReaderTest.testStateFormatUpdateWithExplicitRefreshLazy-seed#[99DC7505406A6500]) [    ] o.a.s.c.ZkTestServer STARTING ZK TEST SERVER
   [junit4]   2> 2369492 INFO  (Thread-4761) [    ] o.a.s.c.ZkTestServer client port:0.0.0.0/0.0.0.0:0
   [junit4]   2> 2369492 INFO  (Thread-4761) [    ] o.a.s.c.ZkTestServer Starting server
   [junit4]   2> 2369592 INFO  (TEST-ZkStateReaderTest.testStateFormatUpdateWithExplicitRefreshLazy-seed#[99DC7505406A6500]) [    ] o.a.s.c.ZkTestServer start zk server on port:36791
   [junit4]   2> 2369592 INFO  (TEST-ZkStateReaderTest.testStateFormatUpdateWithExplicitRefreshLazy-seed#[99DC7505406A6500]) [    ] o.a.s.c.c.SolrZkClient Using default ZkCredentialsProvider
   [junit4]   2> 2369593 INFO  (TEST-ZkStateReaderTest.testStateFormatUpdateWithExplicitRefreshLazy-seed#[99DC7505406A6500]) [    ] o.a.s.c.c.ConnectionManager Waiting for client to connect to ZooKeeper
   [junit4]   2> 2369609 INFO  (zkCallback-2173-thread-1) [    ] o.a.s.c.c.ConnectionManager Watcher org.apache.solr.common.cloud.ConnectionManager@65f2eea2 name:ZooKeeperConnection Watcher:127.0.0.1:36791 got event WatchedEvent state:SyncConnected type:None path:null path:null type:None
   [junit4]   2> 2369613 INFO  (TEST-ZkStateReaderTest.testStateFormatUpdateWithExplicitRefreshLazy-seed#[99DC7505406A6500]) [    ] o.a.s.c.c.ConnectionManager Client is connected to ZooKeeper
   [junit4]   2> 2369613 INFO  (TEST-ZkStateReaderTest.testStateFormatUpdateWithExplicitRefreshLazy-seed#[99DC7505406A6500]) [    ] o.a.s.c.c.SolrZkClient Using default ZkACLProvider
   [junit4]   2> 2369635 INFO  (TEST-ZkStateReaderTest.testStateFormatUpdateWithExplicitRefreshLazy-seed#[99DC7505406A6500]) [    ] o.a.s.c.c.SolrZkClient Using default ZkCredentialsProvider
   [junit4]   2> 2369645 INFO  (TEST-ZkStateReaderTest.testStateFormatUpdateWithExplicitRefreshLazy-seed#[99DC7505406A6500]) [    ] o.a.s.c.c.ConnectionManager Waiting for client to connect to ZooKeeper
   [junit4]   2> 2369657 INFO  (zkCallback-2174-thread-1) [    ] o.a.s.c.c.ConnectionManager Watcher org.apache.solr.common.cloud.ConnectionManager@56f450f8 name:ZooKeeperConnection Watcher:127.0.0.1:36791 got event WatchedEvent state:SyncConnected type:None path:null path:null type:None
   [junit4]   2> 2369661 INFO  (TEST-ZkStateReaderTest.testStateFormatUpdateWithExplicitRefreshLazy-seed#[99DC7505406A6500]) [    ] o.a.s.c.c.ConnectionManager Client is connected to ZooKeeper
   [junit4]   2> 2369661 INFO  (TEST-ZkStateReaderTest.testStateFormatUpdateWithExplicitRefreshLazy-seed#[99DC7505406A6500]) [    ] o.a.s.c.c.SolrZkClient Using default ZkACLProvider
   [junit4]   2> 2369662 INFO  (TEST-ZkStateReaderTest.testStateFormatUpdateWithExplicitRefreshLazy-seed#[99DC7505406A6500]) [    ] o.a.s.c.c.SolrZkClient makePath: /solr
   [junit4]   2> 2369685 INFO  (TEST-ZkStateReaderTest.testStateFormatUpdateWithExplicitRefreshLazy-seed#[99DC7505406A6500]) [    ] o.a.s.c.c.SolrZkClient Using default ZkCredentialsProvider
   [junit4]   2> 2369689 INFO  (TEST-ZkStateReaderTest.testStateFormatUpdateWithExplicitRefreshLazy-seed#[99DC7505406A6500]) [    ] o.a.s.c.c.ConnectionManager Waiting for client to connect to ZooKeeper
   [junit4]   2> 2369698 INFO  (zkCallback-2175-thread-1) [    ] o.a.s.c.c.ConnectionManager Watcher org.apache.solr.common.cloud.ConnectionManager@6e160975 name:ZooKeeperConnection Watcher:127.0.0.1:36791/solr got event WatchedEvent state:SyncConnected type:None path:null path:null type:None
   [junit4]   2> 2369701 INFO  (TEST-ZkStateReaderTest.testStateFormatUpdateWithExplicitRefreshLazy-seed#[99DC7505406A6500]) [    ] o.a.s.c.c.ConnectionManager Client is connected to ZooKeeper
   [junit4]   2> 2369701 INFO  (TEST-ZkStateReaderTest.testStateFormatUpdateWithExplicitRefreshLazy-seed#[99DC7505406A6500]) [    ] o.a.s.c.c.SolrZkClient Using default ZkACLProvider
   [junit4]   2> 2369702 INFO  (TEST-ZkStateReaderTest.testStateFormatUpdateWithExplicitRefreshLazy-seed#[99DC7505406A6500]) [    ] o.a.s.c.c.SolrZkClient makePath: /live_nodes
   [junit4]   2> 2369702 INFO  (TEST-ZkStateReaderTest.testStateFormatUpdateWithExplicitRefreshLazy-seed#[99DC7505406A6500]) [    ] o.a.s.c.c.SolrZkClient makePath: /collections
   [junit4]   2> 2369703 INFO  (TEST-ZkStateReaderTest.testStateFormatUpdateWithExplicitRefreshLazy-seed#[99DC7505406A6500]) [    ] o.a.s.c.c.SolrZkClient makePath: /aliases.json
   [junit4]   2> 2369703 INFO  (TEST-ZkStateReaderTest.testStateFormatUpdateWithExplicitRefreshLazy-seed#[99DC7505406A6500]) [    ] o.a.s.c.c.SolrZkClient makePath: /clusterstate.json
   [junit4]   2> 2369704 INFO  (TEST-ZkStateReaderTest.testStateFormatUpdateWithExplicitRefreshLazy-seed#[99DC7505406A6500]) [    ] o.a.s.c.c.SolrZkClient makePath: /security.json
   [junit4]   2> 2369704 INFO  (TEST-ZkStateReaderTest.testStateFormatUpdateWithExplicitRefreshLazy-seed#[99DC7505406A6500]) [    ] o.a.s.c.c.ZkStateReader Updating cluster state from ZooKeeper... 
   [junit4]   2> 2369704 INFO  (TEST-ZkStateReaderTest.testStateFormatUpdateWithExplicitRefreshLazy-seed#[99DC7505406A6500]) [    ] o.a.s.c.c.ZkStateReader Updated live nodes from ZooKeeper... (0) -> (0)
   [junit4]   2> 2369705 INFO  (TEST-ZkStateReaderTest.testStateFormatUpdateWithExplicitRefreshLazy-seed#[99DC7505406A6500]) [    ] o.a.s.c.c.SolrZkClient makePath: /collections/c1
   [junit4]   2> 2369706 INFO  (TEST-ZkStateReaderTest.testStateFormatUpdateWithExplicitRefreshLazy-seed#[99DC7505406A6500]) [    ] o.a.s.c.o.ZkStateWriter going to create_collection /collections/c1/state.json
   [junit4]   2> 2369707 ERROR (TEST-ZkStateReaderTest.testStateFormatUpdateWithExplicitRefreshLazy-seed#[99DC7505406A6500]-EventThread) [    ] o.a.z.ClientCnxn Error while calling watcher 
   [junit4]   2> java.util.concurrent.RejectedExecutionException: Task org.apache.solr.common.util.ExecutorUtil$MDCAwareThreadPoolExecutor$$Lambda$7/565485801@2c77cc16 rejected from org.apache.solr.common.util.ExecutorUtil$MDCAwareThreadPoolExecutor@28485d40[Shutting down, pool size = 1, active threads = 0, queued tasks = 0, completed tasks = 1]
   [junit4]   2> 	at java.util.concurrent.ThreadPoolExecutor$AbortPolicy.rejectedExecution(ThreadPoolExecutor.java:2047)
   [junit4]   2> 	at java.util.concurrent.ThreadPoolExecutor.reject(ThreadPoolExecutor.java:823)
   [junit4]   2> 	at java.util.concurrent.ThreadPoolExecutor.execute(ThreadPoolExecutor.java:1369)
   [junit4]   2> 	at org.apache.solr.common.util.ExecutorUtil$MDCAwareThreadPoolExecutor.execute(ExecutorUtil.java:214)
   [junit4]   2> 	at java.util.concurrent.AbstractExecutorService.submit(AbstractExecutorService.java:112)
   [junit4]   2> 	at org.apache.solr.common.cloud.SolrZkClient$3.process(SolrZkClient.java:266)
   [junit4]   2> 	at org.apache.zookeeper.ClientCnxn$EventThread.processEvent(ClientCnxn.java:522)
   [junit4]   2> 	at org.apache.zookeeper.ClientCnxn$EventThread.run(ClientCnxn.java:498)
   [junit4]   2> 2369707 ERROR (TEST-ZkStateReaderTest.testStateFormatUpdateWithExplicitRefreshLazy-seed#[99DC7505406A6500]-EventThread) [    ] o.a.z.ClientCnxn Error while calling watcher 
   [junit4]   2> java.util.concurrent.RejectedExecutionException: Task org.apache.solr.common.util.ExecutorUtil$MDCAwareThreadPoolExecutor$$Lambda$7/565485801@4ee86c02 rejected from org.apache.solr.common.util.ExecutorUtil$MDCAwareThreadPoolExecutor@28485d40[Shutting down, pool size = 1, active threads = 0, queued tasks = 0, completed tasks = 1]
   [junit4]   2> 	at java.util.concurrent.ThreadPoolExecutor$AbortPolicy.rejectedExecution(ThreadPoolExecutor.java:2047)
   [junit4]   2> 	at java.util.concurrent.ThreadPoolExecutor.reject(ThreadPoolExecutor.java:823)
   [junit4]   2> 	at java.util.concurrent.ThreadPoolExecutor.execute(ThreadPoolExecutor.java:1369)
   [junit4]   2> 	at org.apache.solr.common.util.ExecutorUtil$MDCAwareThreadPoolExecutor.execute(ExecutorUtil.java:214)
   [junit4]   2> 	at java.util.concurrent.AbstractExecutorService.submit(AbstractExecutorService.java:112)
   [junit4]   2> 	at org.apache.solr.common.cloud.SolrZkClient$3.process(SolrZkClient.java:266)
   [junit4]   2> 	at org.apache.zookeeper.ClientCnxn$EventThread.processEvent(ClientCnxn.java:522)
   [junit4]   2> 	at org.apache.zookeeper.ClientCnxn$EventThread.run(ClientCnxn.java:498)
   [junit4]   2> 2369714 INFO  (TEST-ZkStateReaderTest.testStateFormatUpdateWithExplicitRefreshLazy-seed#[99DC7505406A6500]) [    ] o.a.s.c.ZkTestServer connecting to 127.0.0.1:36791 36791
   [junit4]   2> 2369918 INFO  (Thread-4761) [    ] o.a.s.c.ZkTestServer connecting to 127.0.0.1:36791 36791
   [junit4]   2> 2369919 INFO  (TEST-ZkStateReaderTest.testStateFormatUpdateWithExplicitRefreshLazy-seed#[99DC7505406A6500]) [    ] o.a.s.SolrTestCaseJ4 ###Ending testStateFormatUpdateWithExplicitRefreshLazy
   [junit4]   2> NOTE: reproduce with: ant test  -Dtestcase=ZkStateReaderTest -Dtests.method=testStateFormatUpdateWithExplicitRefreshLazy -Dtests.seed=99DC7505406A6500 -Dtests.multiplier=2 -Dtests.slow=true -Dtests.locale=cs-CZ -Dtests.timezone=CET -Dtests.asserts=true -Dtests.file.encoding=ISO-8859-1
   [junit4] ERROR   0.43s J2 | ZkStateReaderTest.testStateFormatUpdateWithExplicitRefreshLazy <<<
   [junit4]    > Throwable #1: org.apache.solr.common.SolrException: Could not find collection : c1
   [junit4]    > 	at __randomizedtesting.SeedInfo.seed([99DC7505406A6500:F293D5783965B83A]:0)
   [junit4]    > 	at org.apache.solr.common.cloud.ClusterState.getCollection(ClusterState.java:170)
   [junit4]    > 	at org.apache.solr.cloud.overseer.ZkStateReaderTest.testStateFormatUpdate(ZkStateReaderTest.java:135)
   [junit4]    > 	at org.apache.solr.cloud.overseer.ZkStateReaderTest.testStateFormatUpdateWithExplicitRefreshLazy(ZkStateReaderTest.java:46)
   [junit4]    > 	at java.lang.Thread.run(Thread.java:745)
   [junit4]   2> 2369922 INFO  (TEST-ZkStateReaderTest.testExternalCollectionWatchedNotWatched-seed#[99DC7505406A6500]) [    ] o.a.s.SolrTestCaseJ4 ###Starting testExternalCollectionWatchedNotWatched
   [junit4]   2> 2369922 INFO  (TEST-ZkStateReaderTest.testExternalCollectionWatchedNotWatched-seed#[99DC7505406A6500]) [    ] o.a.s.c.ZkTestServer STARTING ZK TEST SERVER
   [junit4]   2> 2369922 INFO  (Thread-4762) [    ] o.a.s.c.ZkTestServer client port:0.0.0.0/0.0.0.0:0
   [junit4]   2> 2369922 INFO  (Thread-4762) [    ] o.a.s.c.ZkTestServer Starting server
   [junit4]   2> 2370022 INFO  (TEST-ZkStateReaderTest.testExternalCollectionWatchedNotWatched-seed#[99DC7505406A6500]) [    ] o.a.s.c.ZkTestServer start zk server on port:54396
   [junit4]   2> 2370022 INFO  (TEST-ZkStateReaderTest.testExternalCollectionWatchedNotWatched-seed#[99DC7505406A6500]) [    ] o.a.s.c.c.SolrZkClient Using default ZkCredentialsProvider
   [junit4]   2> 2370025 INFO  (TEST-ZkStateReaderTest.testExternalCollectionWatchedNotWatched-seed#[99DC7505406A6500]) [    ] o.a.s.c.c.ConnectionManager Waiting for client to connect to ZooKeeper
   [junit4]   2> 2370033 INFO  (zkCallback-2176-thread-1) [    ] o.a.s.c.c.ConnectionManager Watcher org.apache.solr.common.cloud.ConnectionManager@4a9aa4c5 name:ZooKeeperConnection Watcher:127.0.0.1:54396 got event WatchedEvent state:SyncConnected type:None path:null path:null type:None
   [junit4]   2> 2370033 INFO  (TEST-ZkStateReaderTest.testExternalCollectionWatchedNotWatched-seed#[99DC7505406A6500]) [    ] o.a.s.c.c.ConnectionManager Client is connected to ZooKeeper
   [junit4]   2> 2370033 INFO  (TEST-ZkStateReaderTest.testExternalCollectionWatchedNotWatched-seed#[99DC7505406A6500]) [    ] o.a.s.c.c.SolrZkClient Using default ZkACLProvider
   [junit4]   2> 2370037 INFO  (TEST-ZkStateReaderTest.testExternalCollectionWatchedNotWatched-seed#[99DC7505406A6500]) [    ] o.a.s.c.c.SolrZkClient Using default ZkCredentialsProvider
   [junit4]   2> 2370041 INFO  (TEST-ZkStateReaderTest.testExternalCollectionWatchedNotWatched-seed#[99DC7505406A6500]) [    ] o.a.s.c.c.ConnectionManager Waiting for client to connect to ZooKeeper
   [junit4]   2> 2370042 INFO  (zkCallback-2177-thread-1) [    ] o.a.s.c.c.ConnectionManager Watcher org.apache.solr.common.cloud.ConnectionManager@6cafc080 name:ZooKeeperConnection Watcher:127.0.0.1:54396 got event WatchedEvent state:SyncConnected type:None path:null path:null type:None
   [junit4]   2> 2370042 INFO  (TEST-ZkStateReaderTest.testExternalCollectionWatchedNotWatched-seed#[99DC7505406A6500]) [    ] o.a.s.c.c.ConnectionManager Client is connected to ZooKeeper
   [junit4]   2> 2370042 INFO  (TEST-ZkStateReaderTest.testExternalCollectionWatchedNotWatched-seed#[99DC7505406A6500]) [    ] o.a.s.c.c.SolrZkClient Using default ZkACLProvider
   [junit4]   2> 2370042 INFO  (TEST-ZkStateReaderTest.testExternalCollectionWatchedNotWatched-seed#[99DC7505406A6500]) [    ] o.a.s.c.c.SolrZkClient makePath: /solr
   [junit4]   2> 2370044 INFO  (TEST-ZkStateReaderTest.testExternalCollectionWatchedNotWatched-seed#[99DC7505406A6500]) [    ] o.a.s.c.c.SolrZkClient Using default ZkCredentialsProvider
   [junit4]   2> 2370044 INFO  (TEST-ZkStateReaderTest.testExternalCollectionWatchedNotWatched-seed#[99DC7505406A6500]) [    ] o.a.s.c.c.ConnectionManager Waiting for client to connect to ZooKeeper
   [junit4]   2> 2370045 INFO  (zkCallback-2178-thread-1) [    ] o.a.s.c.c.ConnectionManager Watcher org.apache.solr.common.cloud.ConnectionManager@d828eb name:ZooKeeperConnection Watcher:127.0.0.1:54396/solr got event WatchedEvent state:SyncConnected type:None path:null path:null type:None
   [junit4]   2> 2370045 INFO  (TEST-ZkStateReaderTest.testExternalCollectionWatchedNotWatched-seed#[99DC7505406A6500]) [    ] o.a.s.c.c.ConnectionManager Client is connected to ZooKeeper
   [junit4]   2> 2370045 INFO  (TEST-ZkStateReaderTest.testExternalCollectionWatchedNotWatched-seed#[99DC7505406A6500]) [    ] o.a.s.c.c.SolrZkClient Using default ZkACLProvider
   [junit4]   2> 2370045 INFO  (TEST-ZkStateReaderTest.testExternalCollectionWatchedNotWatched-seed#[99DC7505406A6500]) [    ] o.a.s.c.c.SolrZkClient makePath: /live_nodes
   [junit4]   2> 2370046 INFO  (TEST-ZkStateReaderTest.testExternalCollectionWatchedNotWatched-seed#[99DC7505406A6500]) [    ] o.a.s.c.c.SolrZkClient makePath: /collections
   [junit4]   2> 2370047 INFO  (TEST-ZkStateReaderTest.testExternalCollectionWatchedNotWatched-seed#[99DC7505406A6500]) [    ] o.a.s.c.c.SolrZkClient makePath: /aliases.json
   [junit4]   2> 2370047 INFO  (TEST-ZkStateReaderTest.testExternalCollectionWatchedNotWatched-seed#[99DC7505406A6500]) [    ] o.a.s.c.c.SolrZkClient makePath: /clusterstate.json
   [junit4]   2> 2370048 INFO  (TEST-ZkStateReaderTest.testExternalCollectionWatchedNotWatched-seed#[99DC7505406A6500]) [    ] o.a.s.c.c.SolrZkClient makePath: /security.json
   [junit4]   2> 2370048 INFO  (TEST-ZkStateReaderTest.testExternalCollectionWatchedNotWatched-seed#[99DC7505406A6500]) [    ] o.a.s.c.c.ZkStateReader Updating cluster state from ZooKeeper... 
   [junit4]   2> 2370049 INFO  (TEST-ZkStateReaderTest.testExternalCollectionWatchedNotWatched-seed#[99DC7505406A6500]) [    ] o.a.s.c.c.ZkStateReader Updated live nodes from ZooKeeper... (0) -> (0)
   [junit4]   2> 2370049 INFO  (TEST-ZkStateReaderTest.testExternalCollectionWatchedNotWatched-seed#[99DC7505406A6500]) [    ] o.a.s.c.c.SolrZkClient makePath: /collections/c1
   [junit4]   2> 2370050 INFO  (zkCallback-2178-thread-1) [    ] o.a.s.c.c.ZkStateReader A collections change: [WatchedEvent state:SyncConnected type:NodeChildrenChanged path:/collections], has occurred - updating...
   [junit4]   2> 2370050 INFO  (TEST-ZkStateReaderTest.testExternalCollectionWatchedNotWatched-seed#[99DC7505406A6500]) [    ] o.a.s.c.o.ZkStateWriter going to create_collection /collections/c1/state.json
   [junit4]   2> 2370051 INFO  (TEST-ZkStateReaderTest.testExternalCollectionWatchedNotWatched-seed#[99DC7505406A6500]) [    ] o.a.s.c.c.ZkStateReader addZkWatch [c1]
   [junit4]   2> 2370051 INFO  (TEST-ZkStateReaderTest.testExternalCollectionWatchedNotWatched-seed#[99DC7505406A6500]) [    ] o.a.s.c.c.ZkStateReader Add data for [c1] ver [0]
   [junit4]   2> 2370051 INFO  (TEST-ZkStateReaderTest.testExternalCollectionWatchedNotWatched-seed#[99DC7505406A6500]) [    ] o.a.s.c.c.ZkStateReader Removing watch for uninteresting collection [c1]
   [junit4]   2> 2370052 INFO  (TEST-ZkStateReaderTest.testExternalCollectionWatchedNotWatched-seed#[99DC7505406A6500]) [    ] o.a.s.c.ZkTestServer connecting to 127.0.0.1:54396 54396
   [junit4]   2> 2370321 INFO  (Thread-4762) [    ] o.a.s.c.ZkTestServer connecting to 127.0.0.1:54396 54396
   [junit4]   2> 2370325 INFO  (TEST-ZkStateReaderTest.testExternalCollectionWatchedNotWatched-seed#[99DC7505406A6500]) [    ] o.a.s.SolrTestCaseJ4 ###Ending testExternalCollectionWatchedNotWatched
   [junit4]   2> 2370330 INFO  (TEST-ZkStateReaderTest.testStateFormatUpdateWithTimeDelayLazy-seed#[99DC7505406A6500]) [    ] o.a.s.SolrTestCaseJ4 ###Starting testStateFormatUpdateWithTimeDelayLazy
   [junit4]   2> 2370330 INFO  (TEST-ZkStateReaderTest.testStateFormatUpdateWithTimeDelayLazy-seed#[99DC7505406A6500]) [    ] o.a.s.c.ZkTestServer STARTING ZK TEST SERVER
   [junit4]   2> 2370330 INFO  (Thread-4763) [    ] o.a.s.c.ZkTestServer client port:0.0.0.0/0.0.0.0:0
   [junit4]   2> 2370330 INFO  (Thread-4763) [    ] o.a.s.c.ZkTestServer Starting server
   [junit4]   2> 2370430 INFO  (TEST-ZkStateReaderTest.testStateFormatUpdateWithTimeDelayLazy-seed#[99DC7505406A6500]) [    ] o.a.s.c.ZkTestServer start zk server on port:51335
   [junit4]   2> 2370431 INFO  (TEST-ZkStateReaderTest.testStateFormatUpdateWithTimeDelayLazy-seed#[99DC7505406A6500]) [    ] o.a.s.c.c.SolrZkClient Using default ZkCredentialsProvider
   [junit4]   2> 2370431 INFO  (TEST-ZkStateReaderTest.testStateFormatUpdateWithTimeDelayLazy-seed#[99DC7505406A6500]) [    ] o.a.s.c.c.ConnectionManager Waiting for client to connect to ZooKeeper
   [junit4]   2> 2370446 INFO  (zkCallback-2179-thread-1) [    ] o.a.s.c.c.ConnectionManager Watcher org.apache.solr.common.cloud.ConnectionManager@7a936fe7 name:ZooKeeperConnection Watcher:127.0.0.1:51335 got event WatchedEvent state:SyncConnected type:None path:null path:null type:None
   [junit4]   2> 2370446 INFO  (TEST-ZkStateReaderTest.testStateFormatUpdateWithTimeDelayLazy-seed#[99DC7505406A6500]) [    ] o.a.s.c.c.ConnectionManager Client is connected to ZooKeeper
   [junit4]   2> 2370446 INFO  (TEST-ZkStateReaderTest.testStateFormatUpdateWithTimeDelayLazy-seed#[99DC7505406A6500]) [    ] o.a.s.c.c.SolrZkClient Using default ZkACLProvider
   [junit4]   2> 2370458 INFO  (TEST-ZkStateReaderTest.testStateFormatUpdateWithTimeDelayLazy-seed#[99DC7505406A6500]) [    ] o.a.s.c.c.SolrZkClient Using default ZkCredentialsProvider
   [junit4]   2> 2370462 INFO  (TEST-ZkStateReaderTest.testStateFormatUpdateWithTimeDelayLazy-seed#[99DC7505406A6500]) [    ] o.a.s.c.c.ConnectionManager Waiting for client to connect to ZooKeeper
   [junit4]   2> 2370477 INFO  (zkCallback-2180-thread-1) [    ] o.a.s.c.c.ConnectionManager Watcher org.apache.solr.common.cloud.ConnectionManager@7b4918f name:ZooKeeperConnection Watcher:127.0.0.1:51335 got event WatchedEvent state:SyncConnected type:None path:null path:null type:None
   [junit4]   2> 2370481 INFO  (TEST-ZkStateReaderTest.testStateFormatUpdateWithTimeDelayLazy-seed#[99DC7505406A6500]) [    ] o.a.s.c.c.ConnectionManager Client is connected to ZooKeeper
   [junit4]   2> 2370481 INFO  (TEST-ZkStateReaderTest.testStateFormatUpdateWithTimeDelayLazy-seed#[99DC7505406A6500]) [    ] o.a.s.c.c.SolrZkClient Using default ZkACLProvider
   [junit4]   2> 2370482 INFO  (TEST-ZkStateReaderTest.testStateFormatUpdateWithTimeDelayLazy-seed#[99DC7505406A6500]) [    ] o.a.s.c.c.SolrZkClient makePath: /solr
   [junit4]   2> 2370505 INFO  (TEST-ZkStateReaderTest.testStateFormatUpdateWithTimeDelayLazy-seed#[99DC7505406A6500]) [    ] o.a.s.c.c.SolrZkClient Using default ZkCredentialsProvider
   [junit4]   2> 2370506 INFO  (TEST-ZkStateReaderTest.testStateFormatUpdateWithTimeDelayLazy-seed#[99DC7505406A6500]) [    ] o.a.s.c.c.ConnectionManager Waiting for client to connect to ZooKeeper
   [junit4]   2> 2370506 INFO  (zkCallback-2181-thread-1) [    ] o.a.s.c.c.ConnectionManager Watcher org.apache.solr.common.cloud.ConnectionManager@57235b38 name:ZooKeeperConnection Watcher:127.0.0.1:51335/solr got event WatchedEvent state:SyncConnected type:None path:null path:null type:None
   [junit4]   2> 2370506 INFO  (TEST-ZkStateReaderTest.testStateFormatUpdateWithTimeDelayLazy-seed#[99DC7505406A6500]) [    ] o.a.s.c.c.ConnectionManager Client is connected to ZooKeeper
   [junit4]   2> 2370507 INFO  (TEST-ZkStateReaderTest.testStateFormatUpdateWithTimeDelayLazy-seed#[99DC7505406A6500]) [    ] o.a.s.c.c.SolrZkClient Using default ZkACLProvider
   [junit4]   2> 2370507 INFO  (TEST-ZkStateReaderTest.testStateFormatUpdateWithTimeDelayLazy-seed#[99DC7505406A6500]) [    ] o.a.s.c.c.SolrZkClient makePath: /live_nodes
   [junit4]   2> 2370508 INFO  (TEST-ZkStateReaderTest.testStateFormatUpdateWithTimeDelayLazy-seed#[99DC7505406A6500]) [    ] o.a.s.c.c.SolrZkClient makePath: /collections
   [junit4]   2> 2370508 INFO  (TEST-ZkStateReaderTest.testStateFormatUpdateWithTimeDelayLazy-seed#[99DC7505406A6500]) [    ] o.a.s.c.c.SolrZkClient makePath: /aliases.json
   [junit4]   2> 2370509 INFO  (TEST-ZkStateReaderTest.testStateFormatUpdateWithTimeDelayLazy-seed#[99DC7505406A6500]) [    ] o.a.s.c.c.SolrZkClient makePath: /clusterstate.json
   [junit4]   2> 2370509 INFO  (TEST-ZkStateReaderTest.testStateFormatUpdateWithTimeDelayLazy-seed#[99DC7505406A6500]) [    ] o.a.s.c.c.SolrZkClient makePath: /security.json
   [junit4]   2> 2370510 INFO  (TEST-ZkStateReaderTest.testStateFormatUpdateWithTimeDelayLazy-seed#[99DC7505406A6500]) [    ] o.a.s.c.c.ZkStateReader Updating cluster state from ZooKeeper... 
   [junit4]   2> 2370511 INFO  (TEST-ZkStateReaderTest.testStateFormatUpdateWithTimeDelayLazy-seed#[99DC7505406A6500]) [    ] o.a.s.c.c.ZkStateReader Updated live nodes from ZooKeeper... (0) -> (0)
   [junit4]   2> 2370511 INFO  (TEST-ZkStateReaderTest.testStateFormatUpdateWithTimeDelayLazy-seed#[99DC7505406A6500]) [    ] o.a.s.c.c.SolrZkClient makePath: /collections/c1
   [junit4]   2> 2370511 INFO  (zkCallback-2181-thread-1) [    ] o.a.s.c.c.ZkStateReader A collections change: [WatchedEvent state:SyncConnected type:NodeChildrenChanged path:/collections], has occurred - updating...
   [junit4]   2> 2370512 INFO  (zkCallback-2181-thread-2) [    ] o.a.s.c.c.ZkStateReader A cluster state change: [WatchedEvent state:SyncConnected type:NodeDataChanged path:/clusterstate.json], has occurred - updating... (live nodes size: [0])
   [junit4]   2> 2370512 INFO  (TEST-ZkStateReaderTest.testStateFormatUpdateWithTimeDelayLazy-seed#[99DC7505406A6500]) [    ] o.a.s.c.o.ZkStateWriter going to create_collection /collections/c1/state.json
   [junit4]   2> 2370513 INFO  (zkCallback-2181-thread-2) [    ] o.a.s.c.c.ZkStateReader A cluster state change: [WatchedEvent state:SyncConnected type:NodeDataChanged path:/clusterstate.json], has occurred - updating... (live nodes size: [0])
   [junit4]   2> 2370745 INFO  (TEST-ZkStateReaderTest.testStateFormatUpdateWithTimeDelayLazy-seed#[99DC7505406A6500]) [    ] o.a.s.c.ZkTestServer connecting to 127.0.0.1:51335 51335
   [junit4]   2> 2370855 INFO  (Thread-4763) [    ] o.a.s.c.ZkTestServer connecting to 127.0.0.1:51335 51335
   [junit4]   2> 2370856 INFO  (TEST-ZkStateReaderTest.testStateFormatUpdateWithTimeDelayLazy-seed#[99DC7505406A6500]) [    ] o.a.s.SolrTestCaseJ4 ###Ending testStateFormatUpdateWithTimeDelayLazy
   [junit4]   2> 2370857 INFO  (SUITE-ZkStateReaderTest-seed#[99DC7505406A6500]-worker) [    ] o.a.s.SolrTestCaseJ4 ###deleteCore
   [junit4]   2> NOTE: leaving temporary files on disk at: /x1/jenkins/jenkins-slave/workspace/Lucene-Solr-Tests-6.x/solr/build/solr-core/test/J2/temp/solr.cloud.overseer.ZkStateReaderTest_99DC7505406A6500-001
   [junit4]   2> Apr 11, 2016 1:49:50 AM com.carrotsearch.randomizedtesting.ThreadLeakControl checkThreadLeaks
   [junit4]   2> WARNING: Will linger awaiting termination of 1 leaked thread(s).
   [junit4]   2> NOTE: test params are: codec=Asserting(Lucene60), sim=RandomSimilarity(queryNorm=false,coord=yes): {}, locale=cs-CZ, timezone=CET
   [junit4]   2> NOTE: Linux 3.13.0-52-generic amd64/Oracle Corporation 1.8.0_74 (64-bit)/cpus=4,threads=1,free=56319232,total=525860864
   [junit4]   2> NOTE: All tests run in this JVM: [TestExactStatsCache, TestCloudDeleteByQuery, LukeRequestHandlerTest, SolrTestCaseJ4Test, ReplicationFactorTest, SuggesterTest, MultiThreadedOCPTest, TestRuleBasedAuthorizationPlugin, TestFastWriter, TestExtendedDismaxParser, TestUniqueKeyFieldResource, TestJmxMonitoredMap, SegmentsInfoRequestHandlerTest, PKIAuthenticationIntegrationTest, UnloadDistributedZkTest, SolrCloudExampleTest, TestClusterStateMutator, HdfsRecoverLeaseTest, TestJettySolrRunner, DeleteLastCustomShardedReplicaTest, HdfsUnloadDistributedZkTest, BadIndexSchemaTest, CdcrRequestHandlerTest, UpdateParamsTest, TestFuzzyAnalyzedSuggestions, FieldMutatingUpdateProcessorTest, DirectSolrConnectionTest, TermVectorComponentDistributedTest, TestWriterPerf, DateMathParserTest, TestSchemaManager, TestIndexingPerformance, BaseCdcrDistributedZkTest, TestBulkSchemaConcurrent, TlogReplayBufferedWhileIndexingTest, SpatialHeatmapFacetsTest, TestStressRecovery, PluginInfoTest, SmileWriterTest, AnalyticsMergeStrategyTest, BigEndianAscendingWordSerializerTest, TestSolrDeletionPolicy1, TestUtils, TestSweetSpotSimilarityFactory, DirectUpdateHandlerOptimizeTest, TestStandardQParsers, ScriptEngineTest, TestSchemaResource, TestDynamicLoading, AnalysisErrorHandlingTest, TestCollectionAPI, TestRecovery, BadComponentTest, TestPHPSerializedResponseWriter, TestCopyFieldCollectionResource, TestStressReorder, TestConfigReload, TestReload, TestComplexPhraseQParserPlugin, CollectionsAPISolrJTest, SSLMigrationTest, QueryParsingTest, TestCollationField, TestConfigSetsAPIZkFailure, TestInitParams, WrapperMergePolicyFactoryTest, OverseerTest, DistributedQueryComponentOptimizationTest, TestSort, SampleTest, TestOrdValues, CircularListTest, TestRawResponseWriter, GraphQueryTest, TestFieldTypeCollectionResource, TestSuggestSpellingConverter, TestXIncludeConfig, DistanceUnitsTest, ShowFileRequestHandlerTest, TestIndexSearcher, TestConfigSetImmutable, TestMaxScoreQueryParser, TestRebalanceLeaders, LeaderElectionTest, TestDistributedStatsComponentCardinality, TestSmileRequest, ClusterStateTest, CleanupOldIndexTest, DebugComponentTest, RegexBoostProcessorTest, TestTrackingShardHandlerFactory, CoreAdminHandlerTest, DocValuesMultiTest, CoreMergeIndexesAdminHandlerTest, TestSolrCLIRunExample, RecoveryZkTest, FullSolrCloudDistribCmdsTest, AutoCommitTest, TestDistributedGrouping, TestFaceting, TestHashPartitioner, TestRealTimeGet, TestJoin, TestStressVersions, HardAutoCommitTest, DistributedTermsComponentTest, TestRangeQuery, SimpleFacetsTest, TestSolr4Spatial, SolrCoreTest, StatsComponentTest, QueryElevationComponentTest, PeerSyncTest, DirectUpdateHandlerTest, TestBadConfig, CurrencyFieldOpenExchangeTest, CurrencyFieldXmlFileTest, SolrIndexSplitterTest, TestCoreDiscovery, SuggesterFSTTest, SuggesterTSTTest, SuggesterWFSTTest, DefaultValueUpdateProcessorTest, SolrInfoMBeanTest, IndexBasedSpellCheckerTest, TestSurroundQueryParser, TestReversedWildcardFilterFactory, PrimitiveFieldTypeTest, FileBasedSpellCheckerTest, DocumentBuilderTest, TestSolrQueryParser, TestJmxIntegration, TestCSVResponseWriter, BinaryUpdateRequestHandlerTest, SearchHandlerTest, TestCharFilters, TestLMJelinekMercerSimilarityFactory, OpenExchangeRatesOrgProviderTest, DateFieldTest, DOMUtilTest, TestSolrJ, SliceStateTest, UUIDFieldTest, DistributedIntervalFacetingTest, CdcrReplicationDistributedZkTest, CdcrVersionReplicationTest, CollectionReloadTest, ConfigSetsAPITest, ConnectionManagerTest, DeleteShardTest, DistribDocExpirationUpdateProcessorTest, DistributedQueueTest, ForceLeaderTest, SharedFSAutoReplicaFailoverTest, SimpleCollectionCreateDeleteTest, TestAuthenticationFramework, TestTolerantUpdateProcessorCloud, ZkStateReaderTest]
   [junit4] Completed [480/585 (1!)] on J2 in 3.52s, 5 tests, 1 error <<< FAILURES!

[...truncated 363 lines...]
BUILD FAILED
/x1/jenkins/jenkins-slave/workspace/Lucene-Solr-Tests-6.x/build.xml:740: The following error occurred while executing this line:
/x1/jenkins/jenkins-slave/workspace/Lucene-Solr-Tests-6.x/build.xml:684: The following error occurred while executing this line:
/x1/jenkins/jenkins-slave/workspace/Lucene-Solr-Tests-6.x/build.xml:59: The following error occurred while executing this line:
/x1/jenkins/jenkins-slave/workspace/Lucene-Solr-Tests-6.x/solr/build.xml:233: The following error occurred while executing this line:
/x1/jenkins/jenkins-slave/workspace/Lucene-Solr-Tests-6.x/solr/common-build.xml:529: The following error occurred while executing this line:
/x1/jenkins/jenkins-slave/workspace/Lucene-Solr-Tests-6.x/lucene/common-build.xml:1457: The following error occurred while executing this line:
/x1/jenkins/jenkins-slave/workspace/Lucene-Solr-Tests-6.x/lucene/common-build.xml:1014: There were test failures: 585 suites (10 ignored), 2363 tests, 1 error, 85 ignored (70 assumptions) [seed: 99DC7505406A6500]

Total time: 86 minutes 8 seconds
Build step 'Invoke Ant' marked build as failure
Archiving artifacts
Recording test results
Email was triggered for: Failure - Any
Sending email for trigger: Failure - Any




Mime
View raw message