lucene-dev mailing list archives

Site index · List index
Message view « Date » · « Thread »
Top « Date » · « Thread »
From Policeman Jenkins Server <jenk...@thetaphi.de>
Subject [JENKINS] Lucene-Solr-6.x-Linux (32bit/jdk1.8.0_72) - Build # 459 - Failure!
Date Wed, 20 Apr 2016 05:39:29 GMT
Build: http://jenkins.thetaphi.de/job/Lucene-Solr-6.x-Linux/459/
Java: 32bit/jdk1.8.0_72 -client -XX:+UseG1GC

2 tests failed.
FAILED:  org.apache.solr.cloud.TestSolrCloudWithKerberosAlt.testBasics

Error Message:
Address already in use

Stack Trace:
java.net.BindException: Address already in use
	at __randomizedtesting.SeedInfo.seed([CAD607DC9BC14B87:F70EA9F0A32F15F7]:0)
	at sun.nio.ch.Net.bind0(Native Method)
	at sun.nio.ch.Net.bind(Net.java:433)
	at sun.nio.ch.Net.bind(Net.java:425)
	at sun.nio.ch.ServerSocketChannelImpl.bind(ServerSocketChannelImpl.java:223)
	at sun.nio.ch.ServerSocketAdaptor.bind(ServerSocketAdaptor.java:74)
	at org.apache.mina.transport.socket.nio.NioSocketAcceptor.open(NioSocketAcceptor.java:252)
	at org.apache.mina.transport.socket.nio.NioSocketAcceptor.open(NioSocketAcceptor.java:49)
	at org.apache.mina.core.polling.AbstractPollingIoAcceptor.registerHandles(AbstractPollingIoAcceptor.java:525)
	at org.apache.mina.core.polling.AbstractPollingIoAcceptor.access$200(AbstractPollingIoAcceptor.java:67)
	at org.apache.mina.core.polling.AbstractPollingIoAcceptor$Acceptor.run(AbstractPollingIoAcceptor.java:409)
	at org.apache.mina.util.NamePreservingRunnable.run(NamePreservingRunnable.java:65)
	at java.util.concurrent.ThreadPoolExecutor.runWorker(ThreadPoolExecutor.java:1142)
	at java.util.concurrent.ThreadPoolExecutor$Worker.run(ThreadPoolExecutor.java:617)
	at java.lang.Thread.run(Thread.java:745)


FAILED:  org.apache.solr.schema.TestManagedSchemaAPI.test

Error Message:
Error from server at http://127.0.0.1:34379/solr/testschemaapi_shard1_replica1: ERROR: [doc=2] unknown field 'myNewField1'

Stack Trace:
org.apache.solr.client.solrj.impl.CloudSolrClient$RouteException: Error from server at http://127.0.0.1:34379/solr/testschemaapi_shard1_replica1: ERROR: [doc=2] unknown field 'myNewField1'
	at __randomizedtesting.SeedInfo.seed([CAD607DC9BC14B87:42823806353D267F]:0)
	at org.apache.solr.client.solrj.impl.CloudSolrClient.directUpdate(CloudSolrClient.java:661)
	at org.apache.solr.client.solrj.impl.CloudSolrClient.sendRequest(CloudSolrClient.java:1073)
	at org.apache.solr.client.solrj.impl.CloudSolrClient.requestWithRetryOnStaleState(CloudSolrClient.java:962)
	at org.apache.solr.client.solrj.impl.CloudSolrClient.request(CloudSolrClient.java:898)
	at org.apache.solr.schema.TestManagedSchemaAPI.testAddFieldAndDocument(TestManagedSchemaAPI.java:86)
	at org.apache.solr.schema.TestManagedSchemaAPI.test(TestManagedSchemaAPI.java:55)
	at sun.reflect.NativeMethodAccessorImpl.invoke0(Native Method)
	at sun.reflect.NativeMethodAccessorImpl.invoke(NativeMethodAccessorImpl.java:62)
	at sun.reflect.DelegatingMethodAccessorImpl.invoke(DelegatingMethodAccessorImpl.java:43)
	at java.lang.reflect.Method.invoke(Method.java:498)
	at com.carrotsearch.randomizedtesting.RandomizedRunner.invoke(RandomizedRunner.java:1764)
	at com.carrotsearch.randomizedtesting.RandomizedRunner$8.evaluate(RandomizedRunner.java:871)
	at com.carrotsearch.randomizedtesting.RandomizedRunner$9.evaluate(RandomizedRunner.java:907)
	at com.carrotsearch.randomizedtesting.RandomizedRunner$10.evaluate(RandomizedRunner.java:921)
	at com.carrotsearch.randomizedtesting.rules.SystemPropertiesRestoreRule$1.evaluate(SystemPropertiesRestoreRule.java:57)
	at org.apache.lucene.util.TestRuleSetupTeardownChained$1.evaluate(TestRuleSetupTeardownChained.java:49)
	at org.apache.lucene.util.AbstractBeforeAfterRule$1.evaluate(AbstractBeforeAfterRule.java:45)
	at org.apache.lucene.util.TestRuleThreadAndTestName$1.evaluate(TestRuleThreadAndTestName.java:48)
	at org.apache.lucene.util.TestRuleIgnoreAfterMaxFailures$1.evaluate(TestRuleIgnoreAfterMaxFailures.java:64)
	at org.apache.lucene.util.TestRuleMarkFailure$1.evaluate(TestRuleMarkFailure.java:47)
	at com.carrotsearch.randomizedtesting.rules.StatementAdapter.evaluate(StatementAdapter.java:36)
	at com.carrotsearch.randomizedtesting.ThreadLeakControl$StatementRunner.run(ThreadLeakControl.java:367)
	at com.carrotsearch.randomizedtesting.ThreadLeakControl.forkTimeoutingTask(ThreadLeakControl.java:809)
	at com.carrotsearch.randomizedtesting.ThreadLeakControl$3.evaluate(ThreadLeakControl.java:460)
	at com.carrotsearch.randomizedtesting.RandomizedRunner.runSingleTest(RandomizedRunner.java:880)
	at com.carrotsearch.randomizedtesting.RandomizedRunner$5.evaluate(RandomizedRunner.java:781)
	at com.carrotsearch.randomizedtesting.RandomizedRunner$6.evaluate(RandomizedRunner.java:816)
	at com.carrotsearch.randomizedtesting.RandomizedRunner$7.evaluate(RandomizedRunner.java:827)
	at com.carrotsearch.randomizedtesting.rules.StatementAdapter.evaluate(StatementAdapter.java:36)
	at com.carrotsearch.randomizedtesting.rules.SystemPropertiesRestoreRule$1.evaluate(SystemPropertiesRestoreRule.java:57)
	at org.apache.lucene.util.AbstractBeforeAfterRule$1.evaluate(AbstractBeforeAfterRule.java:45)
	at com.carrotsearch.randomizedtesting.rules.StatementAdapter.evaluate(StatementAdapter.java:36)
	at org.apache.lucene.util.TestRuleStoreClassName$1.evaluate(TestRuleStoreClassName.java:41)
	at com.carrotsearch.randomizedtesting.rules.NoShadowingOrOverridesOnMethodsRule$1.evaluate(NoShadowingOrOverridesOnMethodsRule.java:40)
	at com.carrotsearch.randomizedtesting.rules.NoShadowingOrOverridesOnMethodsRule$1.evaluate(NoShadowingOrOverridesOnMethodsRule.java:40)
	at com.carrotsearch.randomizedtesting.rules.StatementAdapter.evaluate(StatementAdapter.java:36)
	at com.carrotsearch.randomizedtesting.rules.StatementAdapter.evaluate(StatementAdapter.java:36)
	at com.carrotsearch.randomizedtesting.rules.StatementAdapter.evaluate(StatementAdapter.java:36)
	at org.apache.lucene.util.TestRuleAssertionsRequired$1.evaluate(TestRuleAssertionsRequired.java:53)
	at org.apache.lucene.util.TestRuleMarkFailure$1.evaluate(TestRuleMarkFailure.java:47)
	at org.apache.lucene.util.TestRuleIgnoreAfterMaxFailures$1.evaluate(TestRuleIgnoreAfterMaxFailures.java:64)
	at org.apache.lucene.util.TestRuleIgnoreTestSuites$1.evaluate(TestRuleIgnoreTestSuites.java:54)
	at com.carrotsearch.randomizedtesting.rules.StatementAdapter.evaluate(StatementAdapter.java:36)
	at com.carrotsearch.randomizedtesting.ThreadLeakControl$StatementRunner.run(ThreadLeakControl.java:367)
	at java.lang.Thread.run(Thread.java:745)
Caused by: org.apache.solr.client.solrj.impl.HttpSolrClient$RemoteSolrException: Error from server at http://127.0.0.1:34379/solr/testschemaapi_shard1_replica1: ERROR: [doc=2] unknown field 'myNewField1'
	at org.apache.solr.client.solrj.impl.HttpSolrClient.executeMethod(HttpSolrClient.java:590)
	at org.apache.solr.client.solrj.impl.HttpSolrClient.request(HttpSolrClient.java:259)
	at org.apache.solr.client.solrj.impl.HttpSolrClient.request(HttpSolrClient.java:248)
	at org.apache.solr.client.solrj.impl.LBHttpSolrClient.doRequest(LBHttpSolrClient.java:404)
	at org.apache.solr.client.solrj.impl.LBHttpSolrClient.request(LBHttpSolrClient.java:357)
	at org.apache.solr.client.solrj.impl.CloudSolrClient.lambda$directUpdate$0(CloudSolrClient.java:638)
	at java.util.concurrent.FutureTask.run(FutureTask.java:266)
	at org.apache.solr.common.util.ExecutorUtil$MDCAwareThreadPoolExecutor.lambda$execute$0(ExecutorUtil.java:229)
	at java.util.concurrent.ThreadPoolExecutor.runWorker(ThreadPoolExecutor.java:1142)
	at java.util.concurrent.ThreadPoolExecutor$Worker.run(ThreadPoolExecutor.java:617)
	... 1 more




Build Log:
[...truncated 11484 lines...]
   [junit4] Suite: org.apache.solr.schema.TestManagedSchemaAPI
   [junit4]   2> Creating dataDir: /home/jenkins/workspace/Lucene-Solr-6.x-Linux/solr/build/solr-core/test/J1/temp/solr.schema.TestManagedSchemaAPI_CAD607DC9BC14B87-001/init-core-data-001
   [junit4]   2> 1179096 INFO  (SUITE-TestManagedSchemaAPI-seed#[CAD607DC9BC14B87]-worker) [    ] o.a.s.SolrTestCaseJ4 Randomized ssl (false) and clientAuth (false)
   [junit4]   2> 1179097 INFO  (SUITE-TestManagedSchemaAPI-seed#[CAD607DC9BC14B87]-worker) [    ] o.a.s.c.ZkTestServer STARTING ZK TEST SERVER
   [junit4]   2> 1179097 INFO  (Thread-3144) [    ] o.a.s.c.ZkTestServer client port:0.0.0.0/0.0.0.0:0
   [junit4]   2> 1179097 INFO  (Thread-3144) [    ] o.a.s.c.ZkTestServer Starting server
   [junit4]   2> 1179197 INFO  (SUITE-TestManagedSchemaAPI-seed#[CAD607DC9BC14B87]-worker) [    ] o.a.s.c.ZkTestServer start zk server on port:39163
   [junit4]   2> 1179197 INFO  (SUITE-TestManagedSchemaAPI-seed#[CAD607DC9BC14B87]-worker) [    ] o.a.s.c.c.SolrZkClient Using default ZkCredentialsProvider
   [junit4]   2> 1179198 INFO  (SUITE-TestManagedSchemaAPI-seed#[CAD607DC9BC14B87]-worker) [    ] o.a.s.c.c.ConnectionManager Waiting for client to connect to ZooKeeper
   [junit4]   2> 1179200 INFO  (zkCallback-1415-thread-1) [    ] o.a.s.c.c.ConnectionManager Watcher org.apache.solr.common.cloud.ConnectionManager@10b5c74 name:ZooKeeperConnection Watcher:127.0.0.1:39163 got event WatchedEvent state:SyncConnected type:None path:null path:null type:None
   [junit4]   2> 1179200 INFO  (SUITE-TestManagedSchemaAPI-seed#[CAD607DC9BC14B87]-worker) [    ] o.a.s.c.c.ConnectionManager Client is connected to ZooKeeper
   [junit4]   2> 1179200 INFO  (SUITE-TestManagedSchemaAPI-seed#[CAD607DC9BC14B87]-worker) [    ] o.a.s.c.c.SolrZkClient Using default ZkACLProvider
   [junit4]   2> 1179201 INFO  (SUITE-TestManagedSchemaAPI-seed#[CAD607DC9BC14B87]-worker) [    ] o.a.s.c.c.SolrZkClient makePath: /solr/solr.xml
   [junit4]   2> 1179203 INFO  (jetty-launcher-1414-thread-2) [    ] o.e.j.s.Server jetty-9.3.8.v20160314
   [junit4]   2> 1179203 INFO  (jetty-launcher-1414-thread-1) [    ] o.e.j.s.Server jetty-9.3.8.v20160314
   [junit4]   2> 1179204 INFO  (jetty-launcher-1414-thread-2) [    ] o.e.j.s.h.ContextHandler Started o.e.j.s.ServletContextHandler@1408859{/solr,null,AVAILABLE}
   [junit4]   2> 1179205 INFO  (jetty-launcher-1414-thread-1) [    ] o.e.j.s.h.ContextHandler Started o.e.j.s.ServletContextHandler@f3e925{/solr,null,AVAILABLE}
   [junit4]   2> 1179207 INFO  (jetty-launcher-1414-thread-1) [    ] o.e.j.s.ServerConnector Started ServerConnector@1915848{HTTP/1.1,[http/1.1]}{127.0.0.1:34379}
   [junit4]   2> 1179207 INFO  (jetty-launcher-1414-thread-2) [    ] o.e.j.s.ServerConnector Started ServerConnector@cc9749{HTTP/1.1,[http/1.1]}{127.0.0.1:44425}
   [junit4]   2> 1179207 INFO  (jetty-launcher-1414-thread-1) [    ] o.e.j.s.Server Started @1180506ms
   [junit4]   2> 1179207 INFO  (jetty-launcher-1414-thread-2) [    ] o.e.j.s.Server Started @1180506ms
   [junit4]   2> 1179207 INFO  (jetty-launcher-1414-thread-1) [    ] o.a.s.c.s.e.JettySolrRunner Jetty properties: {hostContext=/solr, hostPort=34379}
   [junit4]   2> 1179207 INFO  (jetty-launcher-1414-thread-2) [    ] o.a.s.c.s.e.JettySolrRunner Jetty properties: {hostContext=/solr, hostPort=44425}
   [junit4]   2> 1179208 INFO  (jetty-launcher-1414-thread-1) [    ] o.a.s.s.SolrDispatchFilter SolrDispatchFilter.init(): sun.misc.Launcher$AppClassLoader@1d16e93
   [junit4]   2> 1179208 INFO  (jetty-launcher-1414-thread-2) [    ] o.a.s.s.SolrDispatchFilter SolrDispatchFilter.init(): sun.misc.Launcher$AppClassLoader@1d16e93
   [junit4]   2> 1179208 INFO  (jetty-launcher-1414-thread-1) [    ] o.a.s.c.SolrResourceLoader new SolrResourceLoader for directory: '/home/jenkins/workspace/Lucene-Solr-6.x-Linux/solr/build/solr-core/test/J1/temp/solr.schema.TestManagedSchemaAPI_CAD607DC9BC14B87-001/tempDir-001/node1'
   [junit4]   2> 1179208 INFO  (jetty-launcher-1414-thread-2) [    ] o.a.s.c.SolrResourceLoader new SolrResourceLoader for directory: '/home/jenkins/workspace/Lucene-Solr-6.x-Linux/solr/build/solr-core/test/J1/temp/solr.schema.TestManagedSchemaAPI_CAD607DC9BC14B87-001/tempDir-001/node2'
   [junit4]   2> 1179208 INFO  (jetty-launcher-1414-thread-1) [    ] o.a.s.c.SolrResourceLoader JNDI not configured for solr (NoInitialContextEx)
   [junit4]   2> 1179208 INFO  (jetty-launcher-1414-thread-2) [    ] o.a.s.c.SolrResourceLoader JNDI not configured for solr (NoInitialContextEx)
   [junit4]   2> 1179208 INFO  (jetty-launcher-1414-thread-1) [    ] o.a.s.c.SolrResourceLoader solr home defaulted to 'solr/' (could not find system property or JNDI)
   [junit4]   2> 1179208 INFO  (jetty-launcher-1414-thread-2) [    ] o.a.s.c.SolrResourceLoader solr home defaulted to 'solr/' (could not find system property or JNDI)
   [junit4]   2> 1179208 INFO  (jetty-launcher-1414-thread-1) [    ] o.a.s.c.c.SolrZkClient Using default ZkCredentialsProvider
   [junit4]   2> 1179208 INFO  (jetty-launcher-1414-thread-2) [    ] o.a.s.c.c.SolrZkClient Using default ZkCredentialsProvider
   [junit4]   2> 1179208 INFO  (jetty-launcher-1414-thread-1) [    ] o.a.s.c.c.ConnectionManager Waiting for client to connect to ZooKeeper
   [junit4]   2> 1179209 INFO  (jetty-launcher-1414-thread-2) [    ] o.a.s.c.c.ConnectionManager Waiting for client to connect to ZooKeeper
   [junit4]   2> 1179209 INFO  (zkCallback-1416-thread-1) [    ] o.a.s.c.c.ConnectionManager Watcher org.apache.solr.common.cloud.ConnectionManager@d0217b name:ZooKeeperConnection Watcher:127.0.0.1:39163/solr got event WatchedEvent state:SyncConnected type:None path:null path:null type:None
   [junit4]   2> 1179209 INFO  (jetty-launcher-1414-thread-1) [    ] o.a.s.c.c.ConnectionManager Client is connected to ZooKeeper
   [junit4]   2> 1179210 INFO  (zkCallback-1417-thread-1) [    ] o.a.s.c.c.ConnectionManager Watcher org.apache.solr.common.cloud.ConnectionManager@18b0a0e name:ZooKeeperConnection Watcher:127.0.0.1:39163/solr got event WatchedEvent state:SyncConnected type:None path:null path:null type:None
   [junit4]   2> 1179210 INFO  (jetty-launcher-1414-thread-2) [    ] o.a.s.c.c.ConnectionManager Client is connected to ZooKeeper
   [junit4]   2> 1179210 INFO  (jetty-launcher-1414-thread-1) [    ] o.a.s.c.c.SolrZkClient Using default ZkACLProvider
   [junit4]   2> 1179210 INFO  (jetty-launcher-1414-thread-2) [    ] o.a.s.c.c.SolrZkClient Using default ZkACLProvider
   [junit4]   2> 1179210 INFO  (jetty-launcher-1414-thread-1) [    ] o.a.s.s.SolrDispatchFilter solr.xml found in ZooKeeper. Loading...
   [junit4]   2> 1179210 INFO  (jetty-launcher-1414-thread-2) [    ] o.a.s.s.SolrDispatchFilter solr.xml found in ZooKeeper. Loading...
   [junit4]   2> 1179217 INFO  (jetty-launcher-1414-thread-1) [    ] o.a.s.c.CorePropertiesLocator Config-defined core root directory: /home/jenkins/workspace/Lucene-Solr-6.x-Linux/solr/build/solr-core/test/J1/temp/solr.schema.TestManagedSchemaAPI_CAD607DC9BC14B87-001/tempDir-001/node1/.
   [junit4]   2> 1179217 INFO  (jetty-launcher-1414-thread-2) [    ] o.a.s.c.CorePropertiesLocator Config-defined core root directory: /home/jenkins/workspace/Lucene-Solr-6.x-Linux/solr/build/solr-core/test/J1/temp/solr.schema.TestManagedSchemaAPI_CAD607DC9BC14B87-001/tempDir-001/node2/.
   [junit4]   2> 1179217 INFO  (jetty-launcher-1414-thread-1) [    ] o.a.s.c.CoreContainer New CoreContainer 17061909
   [junit4]   2> 1179217 INFO  (jetty-launcher-1414-thread-2) [    ] o.a.s.c.CoreContainer New CoreContainer 6855829
   [junit4]   2> 1179217 INFO  (jetty-launcher-1414-thread-1) [    ] o.a.s.c.CoreContainer Loading cores into CoreContainer [instanceDir=/home/jenkins/workspace/Lucene-Solr-6.x-Linux/solr/build/solr-core/test/J1/temp/solr.schema.TestManagedSchemaAPI_CAD607DC9BC14B87-001/tempDir-001/node1]
   [junit4]   2> 1179217 INFO  (jetty-launcher-1414-thread-2) [    ] o.a.s.c.CoreContainer Loading cores into CoreContainer [instanceDir=/home/jenkins/workspace/Lucene-Solr-6.x-Linux/solr/build/solr-core/test/J1/temp/solr.schema.TestManagedSchemaAPI_CAD607DC9BC14B87-001/tempDir-001/node2]
   [junit4]   2> 1179217 WARN  (NIOServerCxn.Factory:0.0.0.0/0.0.0.0:0) [    ] o.a.z.s.NIOServerCnxn caught end of stream exception
   [junit4]   2> EndOfStreamException: Unable to read additional data from client sessionid 0x15432207ef40002, likely client has closed socket
   [junit4]   2> 	at org.apache.zookeeper.server.NIOServerCnxn.doIO(NIOServerCnxn.java:228)
   [junit4]   2> 	at org.apache.zookeeper.server.NIOServerCnxnFactory.run(NIOServerCnxnFactory.java:208)
   [junit4]   2> 	at java.lang.Thread.run(Thread.java:745)
   [junit4]   2> 1179217 WARN  (jetty-launcher-1414-thread-2) [    ] o.a.s.c.CoreContainer Couldn't add files from /home/jenkins/workspace/Lucene-Solr-6.x-Linux/solr/build/solr-core/test/J1/temp/solr.schema.TestManagedSchemaAPI_CAD607DC9BC14B87-001/tempDir-001/node2/lib to classpath: /home/jenkins/workspace/Lucene-Solr-6.x-Linux/solr/build/solr-core/test/J1/temp/solr.schema.TestManagedSchemaAPI_CAD607DC9BC14B87-001/tempDir-001/node2/lib
   [junit4]   2> 1179217 WARN  (jetty-launcher-1414-thread-1) [    ] o.a.s.c.CoreContainer Couldn't add files from /home/jenkins/workspace/Lucene-Solr-6.x-Linux/solr/build/solr-core/test/J1/temp/solr.schema.TestManagedSchemaAPI_CAD607DC9BC14B87-001/tempDir-001/node1/lib to classpath: /home/jenkins/workspace/Lucene-Solr-6.x-Linux/solr/build/solr-core/test/J1/temp/solr.schema.TestManagedSchemaAPI_CAD607DC9BC14B87-001/tempDir-001/node1/lib
   [junit4]   2> 1179218 INFO  (jetty-launcher-1414-thread-2) [    ] o.a.s.h.c.HttpShardHandlerFactory created with socketTimeout : 90000,urlScheme : ,connTimeout : 15000,maxConnectionsPerHost : 20,maxConnections : 10000,corePoolSize : 0,maximumPoolSize : 2147483647,maxThreadIdleTime : 5,sizeOfQueue : -1,fairnessPolicy : false,useRetries : false,
   [junit4]   2> 1179218 INFO  (jetty-launcher-1414-thread-1) [    ] o.a.s.h.c.HttpShardHandlerFactory created with socketTimeout : 90000,urlScheme : ,connTimeout : 15000,maxConnectionsPerHost : 20,maxConnections : 10000,corePoolSize : 0,maximumPoolSize : 2147483647,maxThreadIdleTime : 5,sizeOfQueue : -1,fairnessPolicy : false,useRetries : false,
   [junit4]   2> 1179219 INFO  (jetty-launcher-1414-thread-2) [    ] o.a.s.u.UpdateShardHandler Creating UpdateShardHandler HTTP client with params: socketTimeout=340000&connTimeout=45000&retry=true
   [junit4]   2> 1179219 INFO  (jetty-launcher-1414-thread-1) [    ] o.a.s.u.UpdateShardHandler Creating UpdateShardHandler HTTP client with params: socketTimeout=340000&connTimeout=45000&retry=true
   [junit4]   2> 1179219 INFO  (jetty-launcher-1414-thread-2) [    ] o.a.s.l.LogWatcher SLF4J impl is org.slf4j.impl.Log4jLoggerFactory
   [junit4]   2> 1179219 INFO  (jetty-launcher-1414-thread-2) [    ] o.a.s.l.LogWatcher Registering Log Listener [Log4j (org.slf4j.impl.Log4jLoggerFactory)]
   [junit4]   2> 1179219 INFO  (jetty-launcher-1414-thread-1) [    ] o.a.s.l.LogWatcher SLF4J impl is org.slf4j.impl.Log4jLoggerFactory
   [junit4]   2> 1179219 INFO  (jetty-launcher-1414-thread-1) [    ] o.a.s.l.LogWatcher Registering Log Listener [Log4j (org.slf4j.impl.Log4jLoggerFactory)]
   [junit4]   2> 1179219 INFO  (jetty-launcher-1414-thread-2) [    ] o.a.s.c.ZkContainer Zookeeper client=127.0.0.1:39163/solr
   [junit4]   2> 1179220 INFO  (jetty-launcher-1414-thread-2) [    ] o.a.s.c.ZkController zkHost includes chroot
   [junit4]   2> 1179220 INFO  (jetty-launcher-1414-thread-1) [    ] o.a.s.c.ZkContainer Zookeeper client=127.0.0.1:39163/solr
   [junit4]   2> 1179220 INFO  (jetty-launcher-1414-thread-2) [    ] o.a.s.c.c.SolrZkClient Using default ZkCredentialsProvider
   [junit4]   2> 1179220 INFO  (jetty-launcher-1414-thread-1) [    ] o.a.s.c.ZkController zkHost includes chroot
   [junit4]   2> 1179221 INFO  (jetty-launcher-1414-thread-1) [    ] o.a.s.c.c.SolrZkClient Using default ZkCredentialsProvider
   [junit4]   2> 1179221 INFO  (jetty-launcher-1414-thread-2) [    ] o.a.s.c.c.ConnectionManager Waiting for client to connect to ZooKeeper
   [junit4]   2> 1179221 INFO  (jetty-launcher-1414-thread-1) [    ] o.a.s.c.c.ConnectionManager Waiting for client to connect to ZooKeeper
   [junit4]   2> 1179222 INFO  (zkCallback-1422-thread-1) [    ] o.a.s.c.c.ConnectionManager Watcher org.apache.solr.common.cloud.ConnectionManager@1b08604 name:ZooKeeperConnection Watcher:127.0.0.1:39163 got event WatchedEvent state:SyncConnected type:None path:null path:null type:None
   [junit4]   2> 1179222 INFO  (jetty-launcher-1414-thread-2) [    ] o.a.s.c.c.ConnectionManager Client is connected to ZooKeeper
   [junit4]   2> 1179222 INFO  (zkCallback-1423-thread-1) [    ] o.a.s.c.c.ConnectionManager Watcher org.apache.solr.common.cloud.ConnectionManager@17bb6c4 name:ZooKeeperConnection Watcher:127.0.0.1:39163 got event WatchedEvent state:SyncConnected type:None path:null path:null type:None
   [junit4]   2> 1179222 INFO  (jetty-launcher-1414-thread-1) [    ] o.a.s.c.c.ConnectionManager Client is connected to ZooKeeper
   [junit4]   2> 1179222 INFO  (jetty-launcher-1414-thread-2) [    ] o.a.s.c.c.SolrZkClient Using default ZkACLProvider
   [junit4]   2> 1179222 INFO  (jetty-launcher-1414-thread-1) [    ] o.a.s.c.c.SolrZkClient Using default ZkACLProvider
   [junit4]   2> 1179223 INFO  (jetty-launcher-1414-thread-2) [n:127.0.0.1:44425_solr    ] o.a.s.c.ZkController Added new OnReconnect listener org.apache.solr.cloud.ZkController$$Lambda$10/22184680@1a889ac
   [junit4]   2> 1179223 INFO  (jetty-launcher-1414-thread-1) [n:127.0.0.1:34379_solr    ] o.a.s.c.ZkController Added new OnReconnect listener org.apache.solr.cloud.ZkController$$Lambda$10/22184680@c6d6ae
   [junit4]   2> 1179223 INFO  (jetty-launcher-1414-thread-2) [n:127.0.0.1:44425_solr    ] o.a.s.c.c.ConnectionManager Waiting for client to connect to ZooKeeper
   [junit4]   2> 1179223 INFO  (jetty-launcher-1414-thread-1) [n:127.0.0.1:34379_solr    ] o.a.s.c.c.ConnectionManager Waiting for client to connect to ZooKeeper
   [junit4]   2> 1179224 INFO  (zkCallback-1424-thread-1-processing-n:127.0.0.1:44425_solr) [n:127.0.0.1:44425_solr    ] o.a.s.c.c.ConnectionManager Watcher org.apache.solr.common.cloud.ConnectionManager@179d463 name:ZooKeeperConnection Watcher:127.0.0.1:39163/solr got event WatchedEvent state:SyncConnected type:None path:null path:null type:None
   [junit4]   2> 1179224 INFO  (jetty-launcher-1414-thread-2) [n:127.0.0.1:44425_solr    ] o.a.s.c.c.ConnectionManager Client is connected to ZooKeeper
   [junit4]   2> 1179224 INFO  (zkCallback-1425-thread-1-processing-n:127.0.0.1:34379_solr) [n:127.0.0.1:34379_solr    ] o.a.s.c.c.ConnectionManager Watcher org.apache.solr.common.cloud.ConnectionManager@ca28a2 name:ZooKeeperConnection Watcher:127.0.0.1:39163/solr got event WatchedEvent state:SyncConnected type:None path:null path:null type:None
   [junit4]   2> 1179224 INFO  (jetty-launcher-1414-thread-1) [n:127.0.0.1:34379_solr    ] o.a.s.c.c.ConnectionManager Client is connected to ZooKeeper
   [junit4]   2> 1179224 INFO  (jetty-launcher-1414-thread-2) [n:127.0.0.1:44425_solr    ] o.a.s.c.c.SolrZkClient makePath: /overseer/queue
   [junit4]   2> 1179225 INFO  (jetty-launcher-1414-thread-1) [n:127.0.0.1:34379_solr    ] o.a.s.c.c.SolrZkClient makePath: /overseer/queue
   [junit4]   2> 1179226 INFO  (jetty-launcher-1414-thread-2) [n:127.0.0.1:44425_solr    ] o.a.s.c.c.SolrZkClient makePath: /overseer/collection-queue-work
   [junit4]   2> 1179226 INFO  (jetty-launcher-1414-thread-1) [n:127.0.0.1:34379_solr    ] o.a.s.c.c.SolrZkClient makePath: /overseer/collection-queue-work
   [junit4]   2> 1179227 INFO  (jetty-launcher-1414-thread-1) [n:127.0.0.1:34379_solr    ] o.a.s.c.c.SolrZkClient makePath: /overseer/collection-map-running
   [junit4]   2> 1179227 INFO  (jetty-launcher-1414-thread-2) [n:127.0.0.1:44425_solr    ] o.a.s.c.c.SolrZkClient makePath: /overseer/collection-map-running
   [junit4]   2> 1179228 INFO  (jetty-launcher-1414-thread-1) [n:127.0.0.1:34379_solr    ] o.a.s.c.c.SolrZkClient makePath: /overseer/collection-map-completed
   [junit4]   2> 1179228 INFO  (jetty-launcher-1414-thread-2) [n:127.0.0.1:44425_solr    ] o.a.s.c.c.SolrZkClient makePath: /overseer/collection-map-completed
   [junit4]   2> 1179229 INFO  (jetty-launcher-1414-thread-1) [n:127.0.0.1:34379_solr    ] o.a.s.c.c.SolrZkClient makePath: /overseer/collection-map-failure
   [junit4]   2> 1179229 INFO  (jetty-launcher-1414-thread-2) [n:127.0.0.1:44425_solr    ] o.a.s.c.c.SolrZkClient makePath: /overseer/collection-map-failure
   [junit4]   2> 1179230 INFO  (jetty-launcher-1414-thread-2) [n:127.0.0.1:44425_solr    ] o.a.s.c.c.SolrZkClient makePath: /live_nodes
   [junit4]   2> 1179230 INFO  (jetty-launcher-1414-thread-1) [n:127.0.0.1:34379_solr    ] o.a.s.c.c.SolrZkClient makePath: /live_nodes
   [junit4]   2> 1179231 INFO  (jetty-launcher-1414-thread-1) [n:127.0.0.1:34379_solr    ] o.a.s.c.c.SolrZkClient makePath: /collections
   [junit4]   2> 1179231 INFO  (jetty-launcher-1414-thread-2) [n:127.0.0.1:44425_solr    ] o.a.s.c.c.SolrZkClient makePath: /collections
   [junit4]   2> 1179231 INFO  (jetty-launcher-1414-thread-2) [n:127.0.0.1:44425_solr    ] o.a.s.c.c.SolrZkClient makePath: /aliases.json
   [junit4]   2> 1179231 INFO  (jetty-launcher-1414-thread-1) [n:127.0.0.1:34379_solr    ] o.a.s.c.c.SolrZkClient makePath: /aliases.json
   [junit4]   2> 1179232 INFO  (jetty-launcher-1414-thread-1) [n:127.0.0.1:34379_solr    ] o.a.s.c.c.SolrZkClient makePath: /clusterstate.json
   [junit4]   2> 1179232 INFO  (jetty-launcher-1414-thread-2) [n:127.0.0.1:44425_solr    ] o.a.s.c.c.SolrZkClient makePath: /clusterstate.json
   [junit4]   2> 1179233 INFO  (jetty-launcher-1414-thread-2) [n:127.0.0.1:44425_solr    ] o.a.s.c.c.SolrZkClient makePath: /security.json
   [junit4]   2> 1179233 INFO  (jetty-launcher-1414-thread-1) [n:127.0.0.1:34379_solr    ] o.a.s.c.c.SolrZkClient makePath: /security.json
   [junit4]   2> 1179233 INFO  (jetty-launcher-1414-thread-1) [n:127.0.0.1:34379_solr    ] o.a.s.c.c.ZkStateReader Updating cluster state from ZooKeeper... 
   [junit4]   2> 1179233 INFO  (jetty-launcher-1414-thread-2) [n:127.0.0.1:44425_solr    ] o.a.s.c.c.ZkStateReader Updating cluster state from ZooKeeper... 
   [junit4]   2> 1179234 INFO  (jetty-launcher-1414-thread-1) [n:127.0.0.1:34379_solr    ] o.a.s.c.c.ZkStateReader Updated live nodes from ZooKeeper... (0) -> (0)
   [junit4]   2> 1179234 INFO  (jetty-launcher-1414-thread-2) [n:127.0.0.1:44425_solr    ] o.a.s.c.c.ZkStateReader Updated live nodes from ZooKeeper... (0) -> (0)
   [junit4]   2> 1179235 INFO  (jetty-launcher-1414-thread-2) [n:127.0.0.1:44425_solr    ] o.a.s.c.c.SolrZkClient makePath: /overseer_elect
   [junit4]   2> 1179235 INFO  (jetty-launcher-1414-thread-1) [n:127.0.0.1:34379_solr    ] o.a.s.c.c.SolrZkClient makePath: /overseer_elect
   [junit4]   2> 1179236 INFO  (jetty-launcher-1414-thread-1) [n:127.0.0.1:34379_solr    ] o.a.s.c.c.SolrZkClient makePath: /overseer_elect/election
   [junit4]   2> 1179236 INFO  (jetty-launcher-1414-thread-2) [n:127.0.0.1:44425_solr    ] o.a.s.c.c.SolrZkClient makePath: /overseer_elect/election
   [junit4]   2> 1179236 INFO  (jetty-launcher-1414-thread-2) [n:127.0.0.1:44425_solr    ] o.a.s.c.Overseer Overseer (id=null) closing
   [junit4]   2> 1179236 INFO  (jetty-launcher-1414-thread-1) [n:127.0.0.1:34379_solr    ] o.a.s.c.Overseer Overseer (id=null) closing
   [junit4]   2> 1179236 INFO  (jetty-launcher-1414-thread-2) [n:127.0.0.1:44425_solr    ] o.a.s.c.LeaderElector Joined leadership election with path: /overseer_elect/election/95756607231885317-127.0.0.1:44425_solr-n_0000000000
   [junit4]   2> 1179236 INFO  (jetty-launcher-1414-thread-1) [n:127.0.0.1:34379_solr    ] o.a.s.c.LeaderElector Joined leadership election with path: /overseer_elect/election/95756607231885318-127.0.0.1:34379_solr-n_0000000001
   [junit4]   2> 1179237 INFO  (jetty-launcher-1414-thread-2) [n:127.0.0.1:44425_solr    ] o.a.s.c.OverseerElectionContext I am going to be the leader 127.0.0.1:44425_solr
   [junit4]   2> 1179237 INFO  (jetty-launcher-1414-thread-2) [n:127.0.0.1:44425_solr    ] o.a.s.c.c.SolrZkClient makePath: /overseer_elect/leader
   [junit4]   2> 1179237 INFO  (jetty-launcher-1414-thread-1) [n:127.0.0.1:34379_solr    ] o.a.s.c.LeaderElector Watching path /overseer_elect/election/95756607231885317-127.0.0.1:44425_solr-n_0000000000 to know if I could be the leader
   [junit4]   2> 1179237 INFO  (jetty-launcher-1414-thread-1) [n:127.0.0.1:34379_solr    ] o.a.s.c.ZkController Register node as live in ZooKeeper:/live_nodes/127.0.0.1:34379_solr
   [junit4]   2> 1179237 INFO  (jetty-launcher-1414-thread-1) [n:127.0.0.1:34379_solr    ] o.a.s.c.c.SolrZkClient makePath: /live_nodes/127.0.0.1:34379_solr
   [junit4]   2> 1179237 INFO  (jetty-launcher-1414-thread-2) [n:127.0.0.1:44425_solr    ] o.a.s.c.Overseer Overseer (id=95756607231885317-127.0.0.1:44425_solr-n_0000000000) starting
   [junit4]   2> 1179238 INFO  (zkCallback-1425-thread-1-processing-n:127.0.0.1:34379_solr) [n:127.0.0.1:34379_solr    ] o.a.s.c.c.ZkStateReader A live node change: [WatchedEvent state:SyncConnected type:NodeChildrenChanged path:/live_nodes], has occurred - updating... (live nodes size: [0])
   [junit4]   2> 1179238 INFO  (zkCallback-1424-thread-1-processing-n:127.0.0.1:44425_solr) [n:127.0.0.1:44425_solr    ] o.a.s.c.c.ZkStateReader A live node change: [WatchedEvent state:SyncConnected type:NodeChildrenChanged path:/live_nodes], has occurred - updating... (live nodes size: [0])
   [junit4]   2> 1179243 INFO  (zkCallback-1425-thread-1-processing-n:127.0.0.1:34379_solr) [n:127.0.0.1:34379_solr    ] o.a.s.c.c.ZkStateReader Updated live nodes from ZooKeeper... (0) -> (1)
   [junit4]   2> 1179243 INFO  (zkCallback-1424-thread-1-processing-n:127.0.0.1:44425_solr) [n:127.0.0.1:44425_solr    ] o.a.s.c.c.ZkStateReader Updated live nodes from ZooKeeper... (0) -> (1)
   [junit4]   2> 1179243 INFO  (jetty-launcher-1414-thread-2) [n:127.0.0.1:44425_solr    ] o.a.s.c.c.SolrZkClient makePath: /overseer/queue-work
   [junit4]   2> 1179246 INFO  (jetty-launcher-1414-thread-2) [n:127.0.0.1:44425_solr    ] o.a.s.c.OverseerAutoReplicaFailoverThread Starting OverseerAutoReplicaFailoverThread autoReplicaFailoverWorkLoopDelay=10000 autoReplicaFailoverWaitAfterExpiration=30000 autoReplicaFailoverBadNodeExpiration=60000
   [junit4]   2> 1179247 INFO  (OverseerCollectionConfigSetProcessor-95756607231885317-127.0.0.1:44425_solr-n_0000000000) [n:127.0.0.1:44425_solr    ] o.a.s.c.OverseerTaskProcessor Process current queue of overseer operations
   [junit4]   2> 1179247 INFO  (OverseerStateUpdate-95756607231885317-127.0.0.1:44425_solr-n_0000000000) [n:127.0.0.1:44425_solr    ] o.a.s.c.Overseer Starting to work on the main queue
   [junit4]   2> 1179247 INFO  (jetty-launcher-1414-thread-2) [n:127.0.0.1:44425_solr    ] o.a.s.c.ZkController Publish node=127.0.0.1:44425_solr as DOWN
   [junit4]   2> 1179248 INFO  (OverseerStateUpdate-95756607231885317-127.0.0.1:44425_solr-n_0000000000) [n:127.0.0.1:44425_solr    ] o.a.s.c.c.ZkStateReader Updated live nodes from ZooKeeper... (1) -> (1)
   [junit4]   2> 1179248 INFO  (OverseerStateUpdate-95756607231885317-127.0.0.1:44425_solr-n_0000000000) [n:127.0.0.1:44425_solr    ] o.a.s.c.Overseer processMessage: queueSize: 1, message = {
   [junit4]   2>   "operation":"downnode",
   [junit4]   2>   "node_name":"127.0.0.1:44425_solr"} current state version: 0
   [junit4]   2> 1179248 INFO  (OverseerStateUpdate-95756607231885317-127.0.0.1:44425_solr-n_0000000000) [n:127.0.0.1:44425_solr    ] o.a.s.c.o.NodeMutator DownNode state invoked for node: 127.0.0.1:44425_solr
   [junit4]   2> 1179290 INFO  (jetty-launcher-1414-thread-1) [n:127.0.0.1:34379_solr    ] o.a.s.c.CoreContainer Security conf doesn't exist. Skipping setup for authorization module.
   [junit4]   2> 1179290 INFO  (jetty-launcher-1414-thread-1) [n:127.0.0.1:34379_solr    ] o.a.s.c.CoreContainer No authentication plugin used.
   [junit4]   2> 1179291 INFO  (jetty-launcher-1414-thread-1) [n:127.0.0.1:34379_solr    ] o.a.s.c.CorePropertiesLocator Looking for core definitions underneath /home/jenkins/workspace/Lucene-Solr-6.x-Linux/solr/build/solr-core/test/J1/temp/solr.schema.TestManagedSchemaAPI_CAD607DC9BC14B87-001/tempDir-001/node1/.
   [junit4]   2> 1179291 INFO  (jetty-launcher-1414-thread-1) [n:127.0.0.1:34379_solr    ] o.a.s.c.CorePropertiesLocator Found 0 core definitions
   [junit4]   2> 1179291 INFO  (jetty-launcher-1414-thread-1) [n:127.0.0.1:34379_solr    ] o.a.s.s.SolrDispatchFilter user.dir=/home/jenkins/workspace/Lucene-Solr-6.x-Linux/solr/build/solr-core/test/J1
   [junit4]   2> 1179291 INFO  (jetty-launcher-1414-thread-1) [n:127.0.0.1:34379_solr    ] o.a.s.s.SolrDispatchFilter SolrDispatchFilter.init() done
   [junit4]   2> 1180248 INFO  (jetty-launcher-1414-thread-2) [n:127.0.0.1:44425_solr    ] o.a.s.c.ZkController Register node as live in ZooKeeper:/live_nodes/127.0.0.1:44425_solr
   [junit4]   2> 1180248 INFO  (jetty-launcher-1414-thread-2) [n:127.0.0.1:44425_solr    ] o.a.s.c.c.SolrZkClient makePath: /live_nodes/127.0.0.1:44425_solr
   [junit4]   2> 1180249 INFO  (zkCallback-1424-thread-1-processing-n:127.0.0.1:44425_solr) [n:127.0.0.1:44425_solr    ] o.a.s.c.c.ZkStateReader A live node change: [WatchedEvent state:SyncConnected type:NodeChildrenChanged path:/live_nodes], has occurred - updating... (live nodes size: [1])
   [junit4]   2> 1180249 INFO  (zkCallback-1425-thread-1-processing-n:127.0.0.1:34379_solr) [n:127.0.0.1:34379_solr    ] o.a.s.c.c.ZkStateReader A live node change: [WatchedEvent state:SyncConnected type:NodeChildrenChanged path:/live_nodes], has occurred - updating... (live nodes size: [1])
   [junit4]   2> 1180249 INFO  (zkCallback-1424-thread-1-processing-n:127.0.0.1:44425_solr) [n:127.0.0.1:44425_solr    ] o.a.s.c.c.ZkStateReader Updated live nodes from ZooKeeper... (1) -> (2)
   [junit4]   2> 1180249 INFO  (zkCallback-1425-thread-1-processing-n:127.0.0.1:34379_solr) [n:127.0.0.1:34379_solr    ] o.a.s.c.c.ZkStateReader Updated live nodes from ZooKeeper... (1) -> (2)
   [junit4]   2> 1180294 INFO  (jetty-launcher-1414-thread-2) [n:127.0.0.1:44425_solr    ] o.a.s.c.CoreContainer Security conf doesn't exist. Skipping setup for authorization module.
   [junit4]   2> 1180294 INFO  (jetty-launcher-1414-thread-2) [n:127.0.0.1:44425_solr    ] o.a.s.c.CoreContainer No authentication plugin used.
   [junit4]   2> 1180295 INFO  (jetty-launcher-1414-thread-2) [n:127.0.0.1:44425_solr    ] o.a.s.c.CorePropertiesLocator Looking for core definitions underneath /home/jenkins/workspace/Lucene-Solr-6.x-Linux/solr/build/solr-core/test/J1/temp/solr.schema.TestManagedSchemaAPI_CAD607DC9BC14B87-001/tempDir-001/node2/.
   [junit4]   2> 1180295 INFO  (jetty-launcher-1414-thread-2) [n:127.0.0.1:44425_solr    ] o.a.s.c.CorePropertiesLocator Found 0 core definitions
   [junit4]   2> 1180296 INFO  (jetty-launcher-1414-thread-2) [n:127.0.0.1:44425_solr    ] o.a.s.s.SolrDispatchFilter user.dir=/home/jenkins/workspace/Lucene-Solr-6.x-Linux/solr/build/solr-core/test/J1
   [junit4]   2> 1180296 INFO  (jetty-launcher-1414-thread-2) [n:127.0.0.1:44425_solr    ] o.a.s.s.SolrDispatchFilter SolrDispatchFilter.init() done
   [junit4]   2> 1180296 INFO  (SUITE-TestManagedSchemaAPI-seed#[CAD607DC9BC14B87]-worker) [    ] o.a.s.c.c.SolrZkClient Using default ZkCredentialsProvider
   [junit4]   2> 1180296 INFO  (SUITE-TestManagedSchemaAPI-seed#[CAD607DC9BC14B87]-worker) [    ] o.a.s.c.c.ConnectionManager Waiting for client to connect to ZooKeeper
   [junit4]   2> 1180297 INFO  (zkCallback-1426-thread-1) [    ] o.a.s.c.c.ConnectionManager Watcher org.apache.solr.common.cloud.ConnectionManager@176c2d9 name:ZooKeeperConnection Watcher:127.0.0.1:39163 got event WatchedEvent state:SyncConnected type:None path:null path:null type:None
   [junit4]   2> 1180297 INFO  (SUITE-TestManagedSchemaAPI-seed#[CAD607DC9BC14B87]-worker) [    ] o.a.s.c.c.ConnectionManager Client is connected to ZooKeeper
   [junit4]   2> 1180298 INFO  (SUITE-TestManagedSchemaAPI-seed#[CAD607DC9BC14B87]-worker) [    ] o.a.s.c.c.SolrZkClient Using default ZkACLProvider
   [junit4]   2> 1180298 INFO  (SUITE-TestManagedSchemaAPI-seed#[CAD607DC9BC14B87]-worker) [    ] o.a.s.c.s.i.CloudSolrClient Final constructed zkHost string: 127.0.0.1:39163/solr
   [junit4]   2> 1180298 INFO  (SUITE-TestManagedSchemaAPI-seed#[CAD607DC9BC14B87]-worker) [    ] o.a.s.c.c.SolrZkClient Using default ZkCredentialsProvider
   [junit4]   2> 1180299 INFO  (SUITE-TestManagedSchemaAPI-seed#[CAD607DC9BC14B87]-worker) [    ] o.a.s.c.c.ConnectionManager Waiting for client to connect to ZooKeeper
   [junit4]   2> 1180300 INFO  (zkCallback-1428-thread-1) [    ] o.a.s.c.c.ConnectionManager Watcher org.apache.solr.common.cloud.ConnectionManager@1de3aba name:ZooKeeperConnection Watcher:127.0.0.1:39163/solr got event WatchedEvent state:SyncConnected type:None path:null path:null type:None
   [junit4]   2> 1180300 INFO  (SUITE-TestManagedSchemaAPI-seed#[CAD607DC9BC14B87]-worker) [    ] o.a.s.c.c.ConnectionManager Client is connected to ZooKeeper
   [junit4]   2> 1180300 INFO  (SUITE-TestManagedSchemaAPI-seed#[CAD607DC9BC14B87]-worker) [    ] o.a.s.c.c.SolrZkClient Using default ZkACLProvider
   [junit4]   2> 1180300 INFO  (SUITE-TestManagedSchemaAPI-seed#[CAD607DC9BC14B87]-worker) [    ] o.a.s.c.c.ZkStateReader Updating cluster state from ZooKeeper... 
   [junit4]   2> 1180301 INFO  (SUITE-TestManagedSchemaAPI-seed#[CAD607DC9BC14B87]-worker) [    ] o.a.s.c.c.ZkStateReader Updated live nodes from ZooKeeper... (0) -> (2)
   [junit4]   2> 1180301 INFO  (SUITE-TestManagedSchemaAPI-seed#[CAD607DC9BC14B87]-worker) [    ] o.a.s.c.c.SolrZkClient makePath: /configs/conf1/solrconfig.xml
   [junit4]   2> 1180303 INFO  (SUITE-TestManagedSchemaAPI-seed#[CAD607DC9BC14B87]-worker) [    ] o.a.s.c.c.SolrZkClient makePath: /configs/conf1/managed-schema
   [junit4]   2> 1180324 INFO  (TEST-TestManagedSchemaAPI.test-seed#[CAD607DC9BC14B87]) [    ] o.a.s.SolrTestCaseJ4 ###Starting test
   [junit4]   2> 1180328 INFO  (qtp12488948-9056) [n:127.0.0.1:44425_solr    ] o.a.s.h.a.CollectionsHandler Invoked Collection Action :create with params replicationFactor=2&collection.configName=conf1&name=testschemaapi&action=CREATE&numShards=1&wt=javabin&version=2 and sendToOCPQueue=true
   [junit4]   2> 1180330 INFO  (OverseerCollectionConfigSetProcessor-95756607231885317-127.0.0.1:44425_solr-n_0000000000) [n:127.0.0.1:44425_solr    ] o.a.s.c.OverseerTaskProcessor Overseer Collection Message Handler: Get the message id:/overseer/collection-queue-work/qn-0000000000 message:{
   [junit4]   2>   "name":"testschemaapi",
   [junit4]   2>   "fromApi":"true",
   [junit4]   2>   "replicationFactor":"2",
   [junit4]   2>   "collection.configName":"conf1",
   [junit4]   2>   "numShards":"1",
   [junit4]   2>   "stateFormat":"2",
   [junit4]   2>   "operation":"create"}
   [junit4]   2> 1180330 INFO  (OverseerThreadFactory-3930-thread-1-processing-n:127.0.0.1:44425_solr) [n:127.0.0.1:44425_solr    ] o.a.s.c.OverseerCollectionMessageHandler OverseerCollectionMessageHandler.processMessage : create , {
   [junit4]   2>   "name":"testschemaapi",
   [junit4]   2>   "fromApi":"true",
   [junit4]   2>   "replicationFactor":"2",
   [junit4]   2>   "collection.configName":"conf1",
   [junit4]   2>   "numShards":"1",
   [junit4]   2>   "stateFormat":"2",
   [junit4]   2>   "operation":"create"}
   [junit4]   2> 1180330 INFO  (OverseerThreadFactory-3930-thread-1-processing-n:127.0.0.1:44425_solr) [n:127.0.0.1:44425_solr    ] o.a.s.c.OverseerCollectionMessageHandler Create collection testschemaapi
   [junit4]   2> 1180331 INFO  (OverseerThreadFactory-3930-thread-1-processing-n:127.0.0.1:44425_solr) [n:127.0.0.1:44425_solr    ] o.a.s.c.OverseerCollectionMessageHandler creating collections conf node /collections/testschemaapi 
   [junit4]   2> 1180331 INFO  (OverseerThreadFactory-3930-thread-1-processing-n:127.0.0.1:44425_solr) [n:127.0.0.1:44425_solr    ] o.a.s.c.c.SolrZkClient makePath: /collections/testschemaapi
   [junit4]   2> 1180332 INFO  (zkCallback-1424-thread-1-processing-n:127.0.0.1:44425_solr) [n:127.0.0.1:44425_solr    ] o.a.s.c.c.ZkStateReader A collections change: [WatchedEvent state:SyncConnected type:NodeChildrenChanged path:/collections], has occurred - updating...
   [junit4]   2> 1180332 INFO  (zkCallback-1425-thread-1-processing-n:127.0.0.1:34379_solr) [n:127.0.0.1:34379_solr    ] o.a.s.c.c.ZkStateReader A collections change: [WatchedEvent state:SyncConnected type:NodeChildrenChanged path:/collections], has occurred - updating...
   [junit4]   2> 1180332 INFO  (zkCallback-1428-thread-1) [    ] o.a.s.c.c.ZkStateReader A collections change: [WatchedEvent state:SyncConnected type:NodeChildrenChanged path:/collections], has occurred - updating...
   [junit4]   2> 1180334 INFO  (OverseerStateUpdate-95756607231885317-127.0.0.1:44425_solr-n_0000000000) [n:127.0.0.1:44425_solr    ] o.a.s.c.Overseer processMessage: queueSize: 1, message = {
   [junit4]   2>   "name":"testschemaapi",
   [junit4]   2>   "fromApi":"true",
   [junit4]   2>   "replicationFactor":"2",
   [junit4]   2>   "collection.configName":"conf1",
   [junit4]   2>   "numShards":"1",
   [junit4]   2>   "stateFormat":"2",
   [junit4]   2>   "operation":"create"} current state version: 0
   [junit4]   2> 1180334 INFO  (OverseerStateUpdate-95756607231885317-127.0.0.1:44425_solr-n_0000000000) [n:127.0.0.1:44425_solr    ] o.a.s.c.o.ClusterStateMutator building a new cName: testschemaapi
   [junit4]   2> 1180334 INFO  (OverseerStateUpdate-95756607231885317-127.0.0.1:44425_solr-n_0000000000) [n:127.0.0.1:44425_solr    ] o.a.s.c.o.ZkStateWriter going to create_collection /collections/testschemaapi/state.json
   [junit4]   2> 1180433 INFO  (OverseerThreadFactory-3930-thread-1-processing-n:127.0.0.1:44425_solr) [n:127.0.0.1:44425_solr    ] o.a.s.c.OverseerCollectionMessageHandler Creating SolrCores for new collection testschemaapi, shardNames [shard1] , replicationFactor : 2
   [junit4]   2> 1180434 INFO  (OverseerThreadFactory-3930-thread-1-processing-n:127.0.0.1:44425_solr) [n:127.0.0.1:44425_solr    ] o.a.s.c.OverseerCollectionMessageHandler Creating core testschemaapi_shard1_replica1 as part of shard shard1 of collection testschemaapi on 127.0.0.1:34379_solr
   [junit4]   2> 1180434 INFO  (OverseerThreadFactory-3930-thread-1-processing-n:127.0.0.1:44425_solr) [n:127.0.0.1:44425_solr    ] o.a.s.c.OverseerCollectionMessageHandler Creating core testschemaapi_shard1_replica2 as part of shard shard1 of collection testschemaapi on 127.0.0.1:44425_solr
   [junit4]   2> 1180437 INFO  (qtp12488948-9060) [n:127.0.0.1:44425_solr    ] o.a.s.h.a.CoreAdminOperation core create command qt=/admin/cores&collection.configName=conf1&name=testschemaapi_shard1_replica2&action=CREATE&numShards=1&collection=testschemaapi&shard=shard1&wt=javabin&version=2
   [junit4]   2> 1180437 INFO  (qtp23689047-9057) [n:127.0.0.1:34379_solr    ] o.a.s.h.a.CoreAdminOperation core create command qt=/admin/cores&collection.configName=conf1&name=testschemaapi_shard1_replica1&action=CREATE&numShards=1&collection=testschemaapi&shard=shard1&wt=javabin&version=2
   [junit4]   2> 1180438 INFO  (qtp23689047-9057) [n:127.0.0.1:34379_solr    ] o.a.s.c.CoreDescriptor Created CoreDescriptor: {name=testschemaapi_shard1_replica1, collection.configName=conf1, config=solrconfig.xml, transient=false, schema=schema.xml, loadOnStartup=true, configSetProperties=configsetprops.json, collection=testschemaapi, numShards=1, dataDir=data/, shard=shard1}
   [junit4]   2> 1180438 INFO  (qtp12488948-9060) [n:127.0.0.1:44425_solr    ] o.a.s.c.CoreDescriptor Created CoreDescriptor: {name=testschemaapi_shard1_replica2, collection.configName=conf1, config=solrconfig.xml, transient=false, schema=schema.xml, loadOnStartup=true, configSetProperties=configsetprops.json, collection=testschemaapi, numShards=1, dataDir=data/, shard=shard1}
   [junit4]   2> 1180439 INFO  (qtp23689047-9057) [n:127.0.0.1:34379_solr c:testschemaapi s:shard1  x:testschemaapi_shard1_replica1] o.a.s.c.ZkController publishing state=down
   [junit4]   2> 1180439 INFO  (qtp12488948-9060) [n:127.0.0.1:44425_solr c:testschemaapi s:shard1  x:testschemaapi_shard1_replica2] o.a.s.c.ZkController publishing state=down
   [junit4]   2> 1180440 INFO  (qtp23689047-9057) [n:127.0.0.1:34379_solr c:testschemaapi s:shard1  x:testschemaapi_shard1_replica1] o.a.s.c.ZkController Registering watch for collection testschemaapi
   [junit4]   2> 1180440 INFO  (qtp23689047-9057) [n:127.0.0.1:34379_solr c:testschemaapi s:shard1  x:testschemaapi_shard1_replica1] o.a.s.c.c.ZkStateReader addZkWatch [testschemaapi]
   [junit4]   2> 1180440 INFO  (qtp23689047-9057) [n:127.0.0.1:34379_solr c:testschemaapi s:shard1  x:testschemaapi_shard1_replica1] o.a.s.c.c.ZkStateReader Add data for [testschemaapi] ver [0]
   [junit4]   2> 1180440 INFO  (qtp23689047-9057) [n:127.0.0.1:34379_solr c:testschemaapi s:shard1  x:testschemaapi_shard1_replica1] o.a.s.c.ZkController look for our core node name
   [junit4]   2> 1180440 INFO  (OverseerStateUpdate-95756607231885317-127.0.0.1:44425_solr-n_0000000000) [n:127.0.0.1:44425_solr    ] o.a.s.c.Overseer processMessage: queueSize: 1, message = {
   [junit4]   2>   "core":"testschemaapi_shard1_replica1",
   [junit4]   2>   "roles":null,
   [junit4]   2>   "base_url":"http://127.0.0.1:34379/solr",
   [junit4]   2>   "node_name":"127.0.0.1:34379_solr",
   [junit4]   2>   "numShards":"1",
   [junit4]   2>   "state":"down",
   [junit4]   2>   "shard":"shard1",
   [junit4]   2>   "collection":"testschemaapi",
   [junit4]   2>   "operation":"state"} current state version: 0
   [junit4]   2> 1180440 INFO  (qtp12488948-9060) [n:127.0.0.1:44425_solr c:testschemaapi s:shard1  x:testschemaapi_shard1_replica2] o.a.s.c.ZkController Registering watch for collection testschemaapi
   [junit4]   2> 1180440 INFO  (qtp12488948-9060) [n:127.0.0.1:44425_solr c:testschemaapi s:shard1  x:testschemaapi_shard1_replica2] o.a.s.c.c.ZkStateReader addZkWatch [testschemaapi]
   [junit4]   2> 1180440 INFO  (OverseerStateUpdate-95756607231885317-127.0.0.1:44425_solr-n_0000000000) [n:127.0.0.1:44425_solr    ] o.a.s.c.o.ReplicaMutator Update state numShards=1 message={
   [junit4]   2>   "core":"testschemaapi_shard1_replica1",
   [junit4]   2>   "roles":null,
   [junit4]   2>   "base_url":"http://127.0.0.1:34379/solr",
   [junit4]   2>   "node_name":"127.0.0.1:34379_solr",
   [junit4]   2>   "numShards":"1",
   [junit4]   2>   "state":"down",
   [junit4]   2>   "shard":"shard1",
   [junit4]   2>   "collection":"testschemaapi",
   [junit4]   2>   "operation":"state"}
   [junit4]   2> 1180440 INFO  (qtp12488948-9060) [n:127.0.0.1:44425_solr c:testschemaapi s:shard1  x:testschemaapi_shard1_replica2] o.a.s.c.c.ZkStateReader Add data for [testschemaapi] ver [0]
   [junit4]   2> 1180440 INFO  (qtp12488948-9060) [n:127.0.0.1:44425_solr c:testschemaapi s:shard1  x:testschemaapi_shard1_replica2] o.a.s.c.ZkController look for our core node name
   [junit4]   2> 1180441 INFO  (OverseerStateUpdate-95756607231885317-127.0.0.1:44425_solr-n_0000000000) [n:127.0.0.1:44425_solr    ] o.a.s.c.Overseer processMessage: queueSize: 1, message = {
   [junit4]   2>   "core":"testschemaapi_shard1_replica2",
   [junit4]   2>   "roles":null,
   [junit4]   2>   "base_url":"http://127.0.0.1:44425/solr",
   [junit4]   2>   "node_name":"127.0.0.1:44425_solr",
   [junit4]   2>   "numShards":"1",
   [junit4]   2>   "state":"down",
   [junit4]   2>   "shard":"shard1",
   [junit4]   2>   "collection":"testschemaapi",
   [junit4]   2>   "operation":"state"} current state version: 0
   [junit4]   2> 1180442 INFO  (OverseerStateUpdate-95756607231885317-127.0.0.1:44425_solr-n_0000000000) [n:127.0.0.1:44425_solr    ] o.a.s.c.o.ReplicaMutator Update state numShards=1 message={
   [junit4]   2>   "core":"testschemaapi_shard1_replica2",
   [junit4]   2>   "roles":null,
   [junit4]   2>   "base_url":"http://127.0.0.1:44425/solr",
   [junit4]   2>   "node_name":"127.0.0.1:44425_solr",
   [junit4]   2>   "numShards":"1",
   [junit4]   2>   "state":"down",
   [junit4]   2>   "shard":"shard1",
   [junit4]   2>   "collection":"testschemaapi",
   [junit4]   2>   "operation":"state"}
   [junit4]   2> 1180543 INFO  (OverseerStateUpdate-95756607231885317-127.0.0.1:44425_solr-n_0000000000) [n:127.0.0.1:44425_solr    ] o.a.s.c.o.ZkStateWriter going to update_collection /collections/testschemaapi/state.json version: 0
   [junit4]   2> 1180543 INFO  (zkCallback-1425-thread-1-processing-n:127.0.0.1:34379_solr) [n:127.0.0.1:34379_solr    ] o.a.s.c.c.ZkStateReader A cluster state change: [WatchedEvent state:SyncConnected type:NodeDataChanged path:/collections/testschemaapi/state.json] for collection [testschemaapi] has occurred - updating... (live nodes size: [2])
   [junit4]   2> 1180543 INFO  (zkCallback-1424-thread-1-processing-n:127.0.0.1:44425_solr) [n:127.0.0.1:44425_solr    ] o.a.s.c.c.ZkStateReader A cluster state change: [WatchedEvent state:SyncConnected type:NodeDataChanged path:/collections/testschemaapi/state.json] for collection [testschemaapi] has occurred - updating... (live nodes size: [2])
   [junit4]   2> 1180544 INFO  (zkCallback-1425-thread-1-processing-n:127.0.0.1:34379_solr) [n:127.0.0.1:34379_solr    ] o.a.s.c.c.ZkStateReader Updating data for [testschemaapi] from [0] to [1]
   [junit4]   2> 1180544 INFO  (zkCallback-1424-thread-1-processing-n:127.0.0.1:44425_solr) [n:127.0.0.1:44425_solr    ] o.a.s.c.c.ZkStateReader Updating data for [testschemaapi] from [0] to [1]
   [junit4]   2> 1181440 INFO  (qtp23689047-9057) [n:127.0.0.1:34379_solr c:testschemaapi s:shard1  x:testschemaapi_shard1_replica1] o.a.s.c.ZkController waiting to find shard id in clusterstate for testschemaapi_shard1_replica1
   [junit4]   2> 1181440 INFO  (qtp23689047-9057) [n:127.0.0.1:34379_solr c:testschemaapi s:shard1  x:testschemaapi_shard1_replica1] o.a.s.c.ZkController Check for collection zkNode:testschemaapi
   [junit4]   2> 1181440 INFO  (qtp23689047-9057) [n:127.0.0.1:34379_solr c:testschemaapi s:shard1  x:testschemaapi_shard1_replica1] o.a.s.c.ZkController Collection zkNode exists
   [junit4]   2> 1181440 INFO  (qtp23689047-9057) [n:127.0.0.1:34379_solr c:testschemaapi s:shard1  x:testschemaapi_shard1_replica1] o.a.s.c.c.ZkStateReader Load collection config from: [/collections/testschemaapi]
   [junit4]   2> 1181440 INFO  (qtp12488948-9060) [n:127.0.0.1:44425_solr c:testschemaapi s:shard1  x:testschemaapi_shard1_replica2] o.a.s.c.ZkController waiting to find shard id in clusterstate for testschemaapi_shard1_replica2
   [junit4]   2> 1181441 INFO  (qtp12488948-9060) [n:127.0.0.1:44425_solr c:testschemaapi s:shard1  x:testschemaapi_shard1_replica2] o.a.s.c.ZkController Check for collection zkNode:testschemaapi
   [junit4]   2> 1181441 INFO  (qtp12488948-9060) [n:127.0.0.1:44425_solr c:testschemaapi s:shard1  x:testschemaapi_shard1_replica2] o.a.s.c.ZkController Collection zkNode exists
   [junit4]   2> 1181441 INFO  (qtp23689047-9057) [n:127.0.0.1:34379_solr c:testschemaapi s:shard1  x:testschemaapi_shard1_replica1] o.a.s.c.c.ZkStateReader path=[/collections/testschemaapi] [configName]=[conf1] specified config exists in ZooKeeper
   [junit4]   2> 1181441 INFO  (qtp12488948-9060) [n:127.0.0.1:44425_solr c:testschemaapi s:shard1  x:testschemaapi_shard1_replica2] o.a.s.c.c.ZkStateReader Load collection config from: [/collections/testschemaapi]
   [junit4]   2> 1181441 INFO  (qtp23689047-9057) [n:127.0.0.1:34379_solr c:testschemaapi s:shard1  x:testschemaapi_shard1_replica1] o.a.s.c.SolrResourceLoader new SolrResourceLoader for directory: '/home/jenkins/workspace/Lucene-Solr-6.x-Linux/solr/build/solr-core/test/J1/temp/solr.schema.TestManagedSchemaAPI_CAD607DC9BC14B87-001/tempDir-001/node1/testschemaapi_shard1_replica1'
   [junit4]   2> 1181441 INFO  (qtp23689047-9057) [n:127.0.0.1:34379_solr c:testschemaapi s:shard1  x:testschemaapi_shard1_replica1] o.a.s.c.SolrResourceLoader JNDI not configured for solr (NoInitialContextEx)
   [junit4]   2> 1181441 INFO  (qtp12488948-9060) [n:127.0.0.1:44425_solr c:testschemaapi s:shard1  x:testschemaapi_shard1_replica2] o.a.s.c.c.ZkStateReader path=[/collections/testschemaapi] [configName]=[conf1] specified config exists in ZooKeeper
   [junit4]   2> 1181441 INFO  (qtp23689047-9057) [n:127.0.0.1:34379_solr c:testschemaapi s:shard1  x:testschemaapi_shard1_replica1] o.a.s.c.SolrResourceLoader solr home defaulted to 'solr/' (could not find system property or JNDI)
   [junit4]   2> 1181441 INFO  (qtp12488948-9060) [n:127.0.0.1:44425_solr c:testschemaapi s:shard1  x:testschemaapi_shard1_replica2] o.a.s.c.SolrResourceLoader new SolrResourceLoader for directory: '/home/jenkins/workspace/Lucene-Solr-6.x-Linux/solr/build/solr-core/test/J1/temp/solr.schema.TestManagedSchemaAPI_CAD607DC9BC14B87-001/tempDir-001/node2/testschemaapi_shard1_replica2'
   [junit4]   2> 1181441 INFO  (qtp12488948-9060) [n:127.0.0.1:44425_solr c:testschemaapi s:shard1  x:testschemaapi_shard1_replica2] o.a.s.c.SolrResourceLoader JNDI not configured for solr (NoInitialContextEx)
   [junit4]   2> 1181441 INFO  (qtp12488948-9060) [n:127.0.0.1:44425_solr c:testschemaapi s:shard1  x:testschemaapi_shard1_replica2] o.a.s.c.SolrResourceLoader solr home defaulted to 'solr/' (could not find system property or JNDI)
   [junit4]   2> 1181443 INFO  (qtp23689047-9057) [n:127.0.0.1:34379_solr c:testschemaapi s:shard1  x:testschemaapi_shard1_replica1] o.a.s.c.Config loaded config solrconfig.xml with version 0 
   [junit4]   2> 1181443 INFO  (qtp12488948-9060) [n:127.0.0.1:44425_solr c:testschemaapi s:shard1  x:testschemaapi_shard1_replica2] o.a.s.c.Config loaded config solrconfig.xml with version 0 
   [junit4]   2> 1181448 INFO  (qtp23689047-9057) [n:127.0.0.1:34379_solr c:testschemaapi s:shard1  x:testschemaapi_shard1_replica1] o.a.s.c.SolrConfig current version of requestparams : -1
   [junit4]   2> 1181448 INFO  (qtp12488948-9060) [n:127.0.0.1:44425_solr c:testschemaapi s:shard1  x:testschemaapi_shard1_replica2] o.a.s.c.SolrConfig current version of requestparams : -1
   [junit4]   2> 1181451 INFO  (qtp23689047-9057) [n:127.0.0.1:34379_solr c:testschemaapi s:shard1  x:testschemaapi_shard1_replica1] o.a.s.c.SolrConfig Using Lucene MatchVersion: 6.1.0
   [junit4]   2> 1181451 INFO  (qtp12488948-9060) [n:127.0.0.1:44425_solr c:testschemaapi s:shard1  x:testschemaapi_shard1_replica2] o.a.s.c.SolrConfig Using Lucene MatchVersion: 6.1.0
   [junit4]   2> 1181468 INFO  (qtp12488948-9060) [n:127.0.0.1:44425_solr c:testschemaapi s:shard1  x:testschemaapi_shard1_replica2] o.a.s.c.SolrConfig Loaded SolrConfig: solrconfig.xml
   [junit4]   2> 1181468 INFO  (qtp23689047-9057) [n:127.0.0.1:34379_solr c:testschemaapi s:shard1  x:testschemaapi_shard1_replica1] o.a.s.c.SolrConfig Loaded SolrConfig: solrconfig.xml
   [junit4]   2> 1181472 INFO  (qtp12488948-9060) [n:127.0.0.1:44425_solr c:testschemaapi s:shard1  x:testschemaapi_shard1_replica2] o.a.s.s.IndexSchema [testschemaapi_shard1_replica2] Schema name=minimal
   [junit4]   2> 1181472 INFO  (qtp23689047-9057) [n:127.0.0.1:34379_solr c:testschemaapi s:shard1  x:testschemaapi_shard1_replica1] o.a.s.s.IndexSchema [testschemaapi_shard1_replica1] Schema name=minimal
   [junit4]   2> 1181476 INFO  (qtp12488948-9060) [n:127.0.0.1:44425_solr c:testschemaapi s:shard1  x:testschemaapi_shard1_replica2] o.a.s.s.IndexSchema unique key field: id
   [junit4]   2> 1181476 INFO  (qtp23689047-9057) [n:127.0.0.1:34379_solr c:testschemaapi s:shard1  x:testschemaapi_shard1_replica1] o.a.s.s.IndexSchema unique key field: id
   [junit4]   2> 1181477 INFO  (qtp23689047-9057) [n:127.0.0.1:34379_solr c:testschemaapi s:shard1  x:testschemaapi_shard1_replica1] o.a.s.c.ConfigSetProperties Did not find ConfigSet properties, assuming default properties: Can't find resource 'configsetprops.json' in classpath or '/configs/conf1', cwd=/home/jenkins/workspace/Lucene-Solr-6.x-Linux/solr/build/solr-core/test/J1
   [junit4]   2> 1181477 INFO  (qtp12488948-9060) [n:127.0.0.1:44425_solr c:testschemaapi s:shard1  x:testschemaapi_shard1_replica2] o.a.s.c.ConfigSetProperties Did not find ConfigSet properties, assuming default properties: Can't find resource 'configsetprops.json' in classpath or '/configs/conf1', cwd=/home/jenkins/workspace/Lucene-Solr-6.x-Linux/solr/build/solr-core/test/J1
   [junit4]   2> 1181478 INFO  (qtp23689047-9057) [n:127.0.0.1:34379_solr c:testschemaapi s:shard1  x:testschemaapi_shard1_replica1] o.a.s.c.CoreContainer Creating SolrCore 'testschemaapi_shard1_replica1' using configuration from collection testschemaapi
   [junit4]   2> 1181478 INFO  (qtp12488948-9060) [n:127.0.0.1:44425_solr c:testschemaapi s:shard1  x:testschemaapi_shard1_replica2] o.a.s.c.CoreContainer Creating SolrCore 'testschemaapi_shard1_replica2' using configuration from collection testschemaapi
   [junit4]   2> 1181478 INFO  (qtp23689047-9057) [n:127.0.0.1:34379_solr c:testschemaapi s:shard1 r:core_node1 x:testschemaapi_shard1_replica1] o.a.s.c.SolrCore org.apache.solr.core.MockDirectoryFactory
   [junit4]   2> 1181478 INFO  (qtp12488948-9060) [n:127.0.0.1:44425_solr c:testschemaapi s:shard1 r:core_node2 x:testschemaapi_shard1_replica2] o.a.s.c.SolrCore org.apache.solr.core.MockDirectoryFactory
   [junit4]   2> 1181479 INFO  (qtp12488948-9060) [n:127.0.0.1:44425_solr c:testschemaapi s:shard1 r:core_node2 x:testschemaapi_shard1_replica2] o.a.s.c.SolrCore [[testschemaapi_shard1_replica2] ] Opening new SolrCore at [/home/jenkins/workspace/Lucene-Solr-6.x-Linux/solr/build/solr-core/test/J1/temp/solr.schema.TestManagedSchemaAPI_CAD607DC9BC14B87-001/tempDir-001/node2/testschemaapi_shard1_replica2], dataDir=[/home/jenkins/workspace/Lucene-Solr-6.x-Linux/solr/build/solr-core/test/J1/temp/solr.schema.TestManagedSchemaAPI_CAD607DC9BC14B87-001/tempDir-001/node2/./testschemaapi_shard1_replica2/data/]
   [junit4]   2> 1181479 INFO  (qtp23689047-9057) [n:127.0.0.1:34379_solr c:testschemaapi s:shard1 r:core_node1 x:testschemaapi_shard1_replica1] o.a.s.c.SolrCore [[testschemaapi_shard1_replica1] ] Opening new SolrCore at [/home/jenkins/workspace/Lucene-Solr-6.x-Linux/solr/build/solr-core/test/J1/temp/solr.schema.TestManagedSchemaAPI_CAD607DC9BC14B87-001/tempDir-001/node1/testschemaapi_shard1_replica1], dataDir=[/home/jenkins/workspace/Lucene-Solr-6.x-Linux/solr/build/solr-core/test/J1/temp/solr.schema.TestManagedSchemaAPI_CAD607DC9BC14B87-001/tempDir-001/node1/./testschemaapi_shard1_replica1/data/]
   [junit4]   2> 1181479 INFO  (qtp12488948-9060) [n:127.0.0.1:44425_solr c:testschemaapi s:shard1 r:core_node2 x:testschemaapi_shard1_replica2] o.a.s.c.SolrCore JMX monitoring not detected for core: testschemaapi_shard1_replica2
   [junit4]   2> 1181479 INFO  (qtp23689047-9057) [n:127.0.0.1:34379_solr c:testschemaapi s:shard1 r:core_node1 x:testschemaapi_shard1_replica1] o.a.s.c.SolrCore JMX monitoring not detected for core: testschemaapi_shard1_replica1
   [junit4]   2> 1181480 INFO  (qtp12488948-9060) [n:127.0.0.1:44425_solr c:testschemaapi s:shard1 r:core_node2 x:testschemaapi_shard1_replica2] o.a.s.c.CachingDirectoryFactory return new directory for /home/jenkins/workspace/Lucene-Solr-6.x-Linux/solr/build/solr-core/test/J1/temp/solr.schema.TestManagedSchemaAPI_CAD607DC9BC14B87-001/tempDir-001/node2/./testschemaapi_shard1_replica2/data
   [junit4]   2> 1181480 INFO  (qtp12488948-9060) [n:127.0.0.1:44425_solr c:testschemaapi s:shard1 r:core_node2 x:testschemaapi_shard1_replica2] o.a.s.c.SolrCore New index directory detected: old=null new=/home/jenkins/workspace/Lucene-Solr-6.x-Linux/solr/build/solr-core/test/J1/temp/solr.schema.TestManagedSchemaAPI_CAD607DC9BC14B87-001/tempDir-001/node2/./testschemaapi_shard1_replica2/data/index/
   [junit4]   2> 1181480 INFO  (qtp23689047-9057) [n:127.0.0.1:34379_solr c:testschemaapi s:shard1 r:core_node1 x:testschemaapi_shard1_replica1] o.a.s.c.CachingDirectoryFactory return new directory for /home/jenkins/workspace/Lucene-Solr-6.x-Linux/solr/build/solr-core/test/J1/temp/solr.schema.TestManagedSchemaAPI_CAD607DC9BC14B87-001/tempDir-001/node1/./testschemaapi_shard1_replica1/data
   [junit4]   2> 1181480 WARN  (qtp12488948-9060) [n:127.0.0.1:44425_solr c:testschemaapi s:shard1 r:core_node2 x:testschemaapi_shard1_replica2] o.a.s.c.SolrCore [testschemaapi_shard1_replica2] Solr index directory '/home/jenkins/workspace/Lucene-Solr-6.x-Linux/solr/build/solr-core/test/J1/temp/solr.schema.TestManagedSchemaAPI_CAD607DC9BC14B87-001/tempDir-001/node2/./testschemaapi_shard1_replica2/data/index' doesn't exist. Creating new index...
   [junit4]   2> 1181480 INFO  (qtp23689047-9057) [n:127.0.0.1:34379_solr c:testschemaapi s:shard1 r:core_node1 x:testschemaapi_shard1_replica1] o.a.s.c.SolrCore New index directory detected: old=null new=/home/jenkins/workspace/Lucene-Solr-6.x-Linux/solr/build/solr-core/test/J1/temp/solr.schema.TestManagedSchemaAPI_CAD607DC9BC14B87-001/tempDir-001/node1/./testschemaapi_shard1_replica1/data/index/
   [junit4]   2> 1181480 WARN  (qtp23689047-9057) [n:127.0.0.1:34379_solr c:testschemaapi s:shard1 r:core_node1 x:testschemaapi_shard1_replica1] o.a.s.c.SolrCore [testschemaapi_shard1_replica1] Solr index directory '/home/jenkins/workspace/Lucene-Solr-6.x-Linux/solr/build/solr-core/test/J1/temp/solr.schema.TestManagedSchemaAPI_CAD607DC9BC14B87-001/tempDir-001/node1/./testschemaapi_shard1_replica1/data/index' doesn't exist. Creating new index...
   [junit4]   2> 1181481 INFO  (qtp12488948-9060) [n:127.0.0.1:44425_solr c:testschemaapi s:shard1 r:core_node2 x:testschemaapi_shard1_replica2] o.a.s.c.CachingDirectoryFactory return new directory for /home/jenkins/workspace/Lucene-Solr-6.x-Linux/solr/build/solr-core/test/J1/temp/solr.schema.TestManagedSchemaAPI_CAD607DC9BC14B87-001/tempDir-001/node2/./testschemaapi_shard1_replica2/data/index
   [junit4]   2> 1181481 INFO  (qtp23689047-9057) [n:127.0.0.1:34379_solr c:testschemaapi s:shard1 r:core_node1 x:testschemaapi_shard1_replica1] o.a.s.c.CachingDirectoryFactory return new directory for /home/jenkins/workspace/Lucene-Solr-6.x-Linux/solr/build/solr-core/test/J1/temp/solr.schema.TestManagedSchemaAPI_CAD607DC9BC14B87-001/tempDir-001/node1/./testschemaapi_shard1_replica1/data/index
   [junit4]   2> 1181482 INFO  (qtp12488948-9060) [n:127.0.0.1:44425_solr c:testschemaapi s:shard1 r:core_node2 x:testschemaapi_shard1_replica2] o.a.s.c.SolrDeletionPolicy SolrDeletionPolicy.onCommit: commits: num=1
   [junit4]   2> 	commit{dir=MockDirectoryWrapper(RAMDirectory@1e25b28 lockFactory=org.apache.lucene.store.SingleInstanceLockFactory@18a6799),segFN=segments_1,generation=1}
   [junit4]   2> 1181482 INFO  (qtp23689047-9057) [n:127.0.0.1:34379_solr c:testschemaapi s:shard1 r:core_node1 x:testschemaapi_shard1_replica1] o.a.s.c.SolrDeletionPolicy SolrDeletionPolicy.onCommit: commits: num=1
   [junit4]   2> 	commit{dir=MockDirectoryWrapper(RAMDirectory@d780b2 lockFactory=org.apache.lucene.store.SingleInstanceLockFactory@16d1915),segFN=segments_1,generation=1}
   [junit4]   2> 1181482 INFO  (qtp12488948-9060) [n:127.0.0.1:44425_solr c:testschemaapi s:shard1 r:core_node2 x:testschemaapi_shard1_replica2] o.a.s.c.SolrDeletionPolicy newest commit generation = 1
   [junit4]   2> 1181482 INFO  (qtp23689047-9057) [n:127.0.0.1:34379_solr c:testschemaapi s:shard1 r:core_node1 x:testschemaapi_shard1_replica1] o.a.s.c.SolrDeletionPolicy newest commit generation = 1
   [junit4]   2> 1181482 INFO  (OldIndexDirectoryCleanupThreadForCore-testschemaapi_shard1_replica2) [n:127.0.0.1:44425_solr c:testschemaapi s:shard1 r:core_node2 x:testschemaapi_shard1_replica2] o.a.s.c.SolrCore Looking for old index directories to cleanup for core testschemaapi_shard1_replica2 in /home/jenkins/workspace/Lucene-Solr-6.x-Linux/solr/build/solr-core/test/J1/temp/solr.schema.TestManagedSchemaAPI_CAD607DC9BC14B87-001/tempDir-001/node2/./testschemaapi_shard1_replica2/data/
   [junit4]   2> 1181482 INFO  (OldIndexDirectoryCleanupThreadForCore-testschemaapi_shard1_replica1) [n:127.0.0.1:34379_solr c:testschemaapi s:shard1 r:core_node1 x:testschemaapi_shard1_replica1] o.a.s.c.SolrCore Looking for old index directories to cleanup for core testschemaapi_shard1_replica1 in /home/jenkins/workspace/Lucene-Solr-6.x-Linux/solr/build/solr-core/test/J1/temp/solr.schema.TestManagedSchemaAPI_CAD607DC9BC14B87-001/tempDir-001/node1/./testschemaapi_shard1_replica1/data/
   [junit4]   2> 1181483 WARN  (OldIndexDirectoryCleanupThreadForCore-testschemaapi_shard1_replica2) [n:127.0.0.1:44425_solr c:testschemaapi s:shard1 r:core_node2 x:testschemaapi_shard1_replica2] o.a.s.c.DirectoryFactory /home/jenkins/workspace/Lucene-Solr-6.x-Linux/solr/build/solr-core/test/J1/temp/solr.schema.TestManagedSchemaAPI_CAD607DC9BC14B87-001/tempDir-001/node2/./testschemaapi_shard1_replica2/data/ does not point to a valid data directory; skipping clean-up of old index directories.
   [junit4]   2> 1181483 WARN  (OldIndexDirectoryCleanupThreadForCore-testschemaapi_shard1_replica1) [n:127.0.0.1:34379_solr c:testschemaapi s:shard1 r:core_node1 x:testschemaapi_shard1_replica1] o.a.s.c.DirectoryFactory /home/jenkins/workspace/Lucene-Solr-6.x-Linux/solr/build/solr-core/test/J1/temp/solr.schema.TestManagedSchemaAPI_CAD607DC9BC14B87-001/tempDir-001/node1/./testschemaapi_shard1_replica1/data/ does not point to a valid data directory; skipping clean-up of old index directories.
   [junit4]   2> 1181484 INFO  (qtp23689047-9057) [n:127.0.0.1:34379_solr c:testschemaapi s:shard1 r:core_node1 x:testschemaapi_shard1_replica1] o.a.s.c.SolrCore no updateRequestProcessorChain defined as default, creating implicit default
   [junit4]   2> 1181484 INFO  (qtp12488948-9060) [n:127.0.0.1:44425_solr c:testschemaapi s:shard1 r:core_node2 x:testschemaapi_shard1_replica2] o.a.s.c.SolrCore no updateRequestProcessorChain defined as default, creating implicit default
   [junit4]   2> 1181485 INFO  (qtp12488948-9060) [n:127.0.0.1:44425_solr c:testschemaapi s:shard1 r:core_node2 x:testschemaapi_shard1_replica2] o.a.s.h.l.XMLLoader xsltCacheLifetimeSeconds=60
   [junit4]   2> 1181485 INFO  (qtp23689047-9057) [n:127.0.0.1:34379_solr c:testschemaapi s:shard1 r:core_node1 x:testschemaapi_shard1_replica1] o.a.s.h.l.XMLLoader xsltCacheLifetimeSeconds=60
   [junit4]   2> 1181486 INFO  (qtp12488948-9060) [n:127.0.0.1:44425_solr c:testschemaapi s:shard1 r:core_node2 x:testschemaapi_shard1_replica2] o.a.s.h.l.XMLLoader xsltCacheLifetimeSeconds=60
   [junit4]   2> 1181486 INFO  (qtp23689047-9057) [n:127.0.0.1:34379_solr c:testschemaapi s:shard1 r:core_node1 x:testschemaapi_shard1_replica1] o.a.s.h.l.XMLLoader xsltCacheLifetimeSeconds=60
   [junit4]   2> 1181487 INFO  (qtp12488948-9060) [n:127.0.0.1:44425_solr c:testschemaapi s:shard1 r:core_node2 x:testschemaapi_shard1_replica2] o.a.s.h.l.XMLLoader xsltCacheLifetimeSeconds=60
   [junit4]   2> 1181487 INFO  (qtp23689047-9057) [n:127.0.0.1:34379_solr c:testschemaapi s:shard1 r:core_node1 x:testschemaapi_shard1_replica1] o.a.s.h.l.XMLLoader xsltCacheLifetimeSeconds=60
   [junit4]   2> 1181488 INFO  (qtp12488948-9060) [n:127.0.0.1:44425_solr c:testschemaapi s:shard1 r:core_node2 x:testschemaapi_shard1_replica2] o.a.s.h.l.XMLLoader xsltCacheLifetimeSeconds=60
   [junit4]   2> 1181488 INFO  (qtp23689047-9057) [n:127.0.0.1:34379_solr c:testschemaapi s:shard1 r:core_node1 x:testschemaapi_shard1_replica1] o.a.s.h.l.XMLLoader xsltCacheLifetimeSeconds=60
   [junit4]   2> 1181489 INFO  (qtp12488948-9060) [n:127.0.0.1:44425_solr c:testschemaapi s:shard1 r:core_node2 x:testschemaapi_shard1_replica2] o.a.s.c.RequestHandlers Registered paths: /admin/mbeans,/update/csv,/sql,/update/json/docs,/admin/luke,/export,/select,/admin/segments,/get,/admin/system,/replication,/admin/properties,/config,/stream,/schema,/admin/plugins,/admin/logging,/update/json,/admin/ping,/admin/threads,/update,/admin/file
   [junit4]   2> 1181489 INFO  (qtp23689047-9057) [n:127.0.0.1:34379_solr c:testschemaapi s:shard1 r:core_node1 x:testschemaapi_shard1_replica1] o.a.s.c.RequestHandlers Registered paths: /admin/mbeans,/update/csv,/sql,/update/json/docs,/admin/luke,/export,/select,/admin/segments,/get,/admin/system,/replication,/admin/properties,/config,/stream,/schema,/admin/plugins,/admin/logging,/update/json,/admin/ping,/admin/threads,/update,/admin/file
   [junit4]   2> 1181489 INFO  (qtp12488948-9060) [n:127.0.0.1:44425_solr c:testschemaapi s:shard1 r:core_node2 x:testschemaapi_shard1_replica2] o.a.s.c.SolrCore Using default statsCache cache: org.apache.solr.search.stats.LocalStatsCache
   [junit4]   2> 1181489 INFO  (qtp23689047-9057) [n:127.0.0.1:34379_solr c:testschemaapi s:shard1 r:core_node1 x:testschemaapi_shard1_replica1] o.a.s.c.SolrCore Using default statsCache cache: org.apache.solr.search.stats.LocalStatsCache
   [junit4]   2> 1181489 INFO  (qtp12488948-9060) [n:127.0.0.1:44425_solr c:testschemaapi s:shard1 r:core_node2 x:testschemaapi_shard1_replica2] o.a.s.u.UpdateHandler Using UpdateLog implementation: org.apache.solr.update.UpdateLog
   [junit4]   2> 1181490 INFO  (qtp12488948-9060) [n:127.0.0.1:44425_solr c:testschemaapi s:shard1 r:core_node2 x:testschemaapi_shard1_replica2] o.a.s.u.UpdateLog Initializing UpdateLog: dataDir=null defaultSyncLevel=FLUSH numRecordsToKeep=100 maxNumLogsToKeep=10 numVersionBuckets=65536
   [junit4]   2> 1181490 INFO  (qtp23689047-9057) [n:127.0.0.1:34379_solr c:testschemaapi s:shard1 r:core_node1 x:testschemaapi_shard1_replica1] o.a.s.u.UpdateHandler Using UpdateLog implementation: org.apache.solr.update.UpdateLog
   [junit4]   2> 1181490 INFO  (qtp23689047-9057) [n:127.0.0.1:34379_solr c:testschemaapi s:shard1 r:core_node1 x:testschemaapi_shard1_replica1] o.a.s.u.UpdateLog Initializing UpdateLog: dataDir=null defaultSyncLevel=FLUSH numRecordsToKeep=100 maxNumLogsToKeep=10 numVersionBuckets=65536
   [junit4]   2> 1181491 INFO  (qtp12488948-9060) [n:127.0.0.1:44425_solr c:testschemaapi s:shard1 r:core_node2 x:testschemaapi_shard1_replica2] o.a.s.u.CommitTracker Hard AutoCommit: disabled
   [junit4]   2> 1181491 INFO  (qtp12488948-9060) [n:127.0.0.1:44425_solr c:testschemaapi s:shard1 r:core_node2 x:testschemaapi_shard1_replica2] o.a.s.u.CommitTracker Soft AutoCommit: disabled
   [junit4]   2> 1181491 INFO  (qtp23689047-9057) [n:127.0.0.1:34379_solr c:testschemaapi s:shard1 r:core_node1 x:testschemaapi_shard1_replica1] o.a.s.u.CommitTracker Hard AutoCommit: disabled
   [junit4]   2> 1181491 INFO  (qtp23689047-9057) [n:127.0.0.1:34379_solr c:testschemaapi s:shard1 r:core_node1 x:testschemaapi_shard1_replica1] o.a.s.u.CommitTracker Soft AutoCommit: disabled
   [junit4]   2> 1181491 INFO  (qtp12488948-9060) [n:127.0.0.1:44425_solr c:testschemaapi s:shard1 r:core_node2 x:testschemaapi_shard1_replica2] o.a.s.c.SolrDeletionPolicy SolrDeletionPolicy.onInit: commits: num=1
   [junit4]   2> 	commit{dir=MockDirectoryWrapper(RAMDirectory@1e25b28 lockFactory=org.apache.lucene.store.SingleInstanceLockFactory@18a6799),segFN=segments_1,generation=1}
   [junit4]   2> 1181491 INFO  (qtp23689047-9057) [n:127.0.0.1:34379_solr c:testschemaapi s:shard1 r:core_node1 x:testschemaapi_shard1_replica1] o.a.s.c.SolrDeletionPolicy SolrDeletionPolicy.onInit: commits: num=1
   [junit4]   2> 	commit{dir=MockDirectoryWrapper(RAMDirectory@d780b2 lockFactory=org.apache.lucene.store.SingleInstanceLockFactory@16d1915),segFN=segments_1,generation=1}
   [junit4]   2> 1181492 INFO  (qtp12488948-9060) [n:127.0.0.1:44425_solr c:testschemaapi s:shard1 r:core_node2 x:testschemaapi_shard1_replica2] o.a.s.c.SolrDeletionPolicy newest commit generation = 1
   [junit4]   2> 1181492 INFO  (qtp23689047-9057) [n:127.0.0.1:34379_solr c:testschemaapi s:shard1 r:core_node1 x:testschemaapi_shard1_replica1] o.a.s.c.SolrDeletionPolicy newest commit generation = 1
   [junit4]   2> 1181492 INFO  (qtp12488948-9060) [n:127.0.0.1:44425_solr c:testschemaapi s:shard1 r:core_node2 x:testschemaapi_shard1_replica2] o.a.s.s.SolrIndexSearcher Opening [Searcher@1afa7e5[testschemaapi_shard1_replica2] main]
   [junit4]   2> 1181492 INFO  (qtp23689047-9057) [n:127.0.0.1:34379_solr c:testschemaapi s:shard1 r:core_node1 x:testschemaapi_shard1_replica1] o.a.s.s.SolrIndexSearcher Opening [Searcher@1ffbcc6[testschemaapi_shard1_replica1] main]
   [junit4]   2> 1181492 INFO  (qtp12488948-9060) [n:127.0.0.1:44425_solr c:testschemaapi s:shard1 r:core_node2 x:testschemaapi_shard1_replica2] o.a.s.c.c.ZkStateReader Load collection config from: [/collections/testschemaapi]
   [junit4]   2> 1181492 INFO  (qtp23689047-9057) [n:127.0.0.1:34379_solr c:testschemaapi s:shard1 r:core_node1 x:testschemaapi_shard1_replica1] o.a.s.c.c.ZkStateReader Load collection config from: [/collections/testschemaapi]
   [junit4]   2> 1181492 INFO  (qtp12488948-9060) [n:127.0.0.1:44425_solr c:testschemaapi s:shard1 r:core_node2 x:testschemaapi_shard1_replica2] o.a.s.c.c.ZkStateReader path=[/collections/testschemaapi] [configName]=[conf1] specified config exists in ZooKeeper
   [junit4]   2> 1181492 INFO  (qtp12488948-9060) [n:127.0.0.1:44425_solr c:testschemaapi s:shard1 r:core_node2 x:testschemaapi_shard1_replica2] o.a.s.r.ManagedResourceStorage Setting up ZooKeeper-based storage for the RestManager with znodeBase: /configs/conf1
   [junit4]   2> 1181492 INFO  (qtp23689047-9057) [n:127.0.0.1:34379_solr c:testschemaapi s:shard1 r:core_node1 x:testschemaapi_shard1_replica1] o.a.s.c.c.ZkStateReader path=[/collections/testschemaapi] [configName]=[conf1] specified config exists in ZooKeeper
   [junit4]   2> 1181492 INFO  (qtp23689047-9057) [n:127.0.0.1:34379_solr c:testschemaapi s:shard1 r:core_node1 x:testschemaapi_shard1_replica1] o.a.s.r.ManagedResourceStorage Setting up ZooKeeper-based storage for the RestManager with znodeBase: /configs/conf1
   [junit4]   2> 1181492 INFO  (qtp12488948-9060) [n:127.0.0.1:44425_solr c:testschemaapi s:shard1 r:core_node2 x:testschemaapi_shard1_replica2] o.a.s.r.ManagedResourceStorage Configured ZooKeeperStorageIO with znodeBase: /configs/conf1
   [junit4]   2> 1181492 INFO  (qtp12488948-9060) [n:127.0.0.1:44425_solr c:testschemaapi s:shard1 r:core_node2 x:testschemaapi_shard1_replica2] o.a.s.r.RestManager Initializing RestManager with initArgs: {}
   [junit4]   2> 1181493 INFO  (qtp23689047-9057) [n:127.0.0.1:34379_solr c:testschemaapi s:shard1 r:core_node1 x:testschemaapi_shard1_replica1] o.a.s.r.ManagedResourceStorage Configured ZooKeeperStorageIO with znodeBase: /configs/conf1
   [junit4]   2> 1181493 INFO  (qtp12488948-9060) [n:127.0.0.1:44425_solr c:testschemaapi s:shard1 r:core_node2 x:testschemaapi_shard1_replica2] o.a.s.r.ManagedResourceStorage Reading _rest_managed.json using ZooKeeperStorageIO:path=/configs/conf1
   [junit4]   2> 1181493 INFO  (qtp23689047-9057) [n:127.0.0.1:34379_solr c:testschemaapi s:shard1 r:core_node1 x:testschemaapi_shard1_replica1] o.a.s.r.RestManager Initializing RestManager with initArgs: {}
   [junit4]   2> 1181493 INFO  (qtp23689047-9057) [n:127.0.0.1:34379_solr c:testschemaapi s:shard1 r:core_node1 x:testschemaapi_shard1_replica1] o.a.s.r.ManagedResourceStorage Reading _rest_managed.json using ZooKeeperStorageIO:path=/configs/conf1
   [junit4]   2> 1181493 INFO  (qtp12488948-9060) [n:127.0.0.1:44425_solr c:testschemaapi s:shard1 r:core_node2 x:testschemaapi_shard1_replica2] o.a.s.r.ManagedResourceStorage No data found for znode /configs/conf1/_rest_managed.json
   [junit4]   2> 1181493 INFO  (qtp23689047-9057) [n:127.0.0.1:34379_solr c:testschemaapi s:shard1 r:core_node1 x:testschemaapi_shard1_replica1] o.a.s.r.ManagedResourceStorage No data found for znode /configs/conf1/_rest_managed.json
   [junit4]   2> 1181493 INFO  (qtp12488948-9060) [n:127.0.0.1:44425_solr c:testschemaapi s:shard1 r:core_node2 x:testschemaapi_shard1_replica2] o.a.s.r.ManagedResourceStorage Loaded null at path _rest_managed.json using ZooKeeperStorageIO:path=/configs/conf1
   [junit4]   2> 1181493 INFO  (qtp23689047-9057) [n:127.0.0.1:34379_solr c:testschemaapi s:shard1 r:core_node1 x:testschemaapi_shard1_replica1] o.a.s.r.ManagedResourceStorage Loaded null at path _rest_managed.json using ZooKeeperStorageIO:path=/configs/conf1
   [junit4]   2> 1181493 INFO  (qtp12488948-9060) [n:127.0.0.1:44425_solr c:testschemaapi s:shard1 r:core_node2 x:testschemaapi_shard1_replica2] o.a.s.r.RestManager Initializing 0 registered ManagedResources
   [junit4]   2> 1181493 INFO  (qtp23689047-9057) [n:127.0.0.1:34379_solr c:testschemaapi s:shard1 r:core_node1 x:testschemaapi_shard1_replica1] o.a.s.r.RestManager Initializing 0 registered ManagedResources
   [junit4]   2> 1181493 INFO  (qtp12488948-9060) [n:127.0.0.1:44425_solr c:testschemaapi s:shard1 r:core_node2 x:testschemaapi_shard1_replica2] o.a.s.s.ZkIndexSchemaReader Creating ZooKeeper watch for the managed schema at /configs/conf1/managed-schema
   [junit4]   2> 1181493 INFO  (qtp23689047-9057) [n:127.0.0.1:34379_solr c:testschemaapi s:shard1 r:core_node1 x:testschemaapi_shard1_replica1] o.a.s.s.ZkIndexSchemaReader Creating ZooKeeper watch for the managed schema at /configs/conf1/managed-schema
   [junit4]   2> 1181493 INFO  (qtp12488948-9060) [n:127.0.0.1:44425_solr c:testschemaapi s:shard1 r:core_node2 x:testschemaapi_shard1_replica2] o.a.s.c.ZkController Added new OnReconnect listener ZkIndexSchemaReader: /configs/conf1/managed-schema, uniqueCoreId: testschemaapi_shard1_replica2:3084503023591707
   [junit4]   2> 1181493 INFO  (qtp23689047-9057) [n:127.0.0.1:34379_solr c:testschemaapi s:shard1 r:core_node1 x:testschemaapi_shard1_replica1] o.a.s.c.ZkController Added new OnReconnect listener ZkIndexSchemaReader: /configs/conf1/managed-schema, uniqueCoreId: testschemaapi_shard1_replica1:3084503023549648
   [junit4]   2> 1181493 INFO  (qtp12488948-9060) [n:127.0.0.1:44425_solr c:testschemaapi s:shard1 r:core_node2 x:testschemaapi_shard1_replica2] o.a.s.h.ReplicationHandler Commits will be reserved for  10000
   [junit4]   2> 1181493 INFO  (qtp23689047-9057) [n:127.0.0.1:34379_solr c:testschemaapi s:shard1 r:core_node1 x:testschemaapi_shard1_replica1] o.a.s.h.ReplicationHandler Commits will be reserved for  10000
   [junit4]   2> 1181494 INFO  (searcherExecutor-3935-thread-1-processing-n:127.0.0.1:34379_solr x:testschemaapi_shard1_replica1 s:shard1 c:testschemaapi r:core_node1) [n:127.0.0.1:34379_solr c:testschemaapi s:shard1 r:core_node1 x:testschemaapi_shard1_replica1] o.a.s.c.SolrCore [testschemaapi_shard1_replica1] Registered new searcher Searcher@1ffbcc6[testschemaapi_shard1_replica1] main{ExitableDirectoryReader(UninvertingDirectoryReader())}
   [junit4]   2> 1181494 INFO  (searcherExecutor-3936-thread-1-processing-n:127.0.0.1:44425_solr x:testschemaapi_shard1_replica2 s:shard1 c:testschemaapi r:core_node2) [n:127.0.0.1:44425_solr c:testschemaapi s:shard1 r:core_node2 x:testschemaapi_shard1_replica2] o.a.s.c.SolrCore [testschemaapi_shard1_replica2] Registered new searcher Searcher@1afa7e5[testschemaapi_shard1_replica2] main{ExitableDirectoryReader(UninvertingDirectoryReader())}
   [junit4]   2> 1181494 INFO  (qtp23689047-9057) [n:127.0.0.1:34379_solr c:testschemaapi s:shard1 r:core_node1 x:testschemaapi_shard1_replica1] o.a.s.u.UpdateLog Looking up max value of version field to seed version buckets
   [junit4]   2> 1181494 INFO  (qtp12488948-9060) [n:127.0.0.1:44425_solr c:testschemaapi s:shard1 r:core_node2 x:testschemaapi_shard1_replica2] o.a.s.u.UpdateLog Looking up max value of version field to seed version buckets
   [junit4]   2> 1181494 INFO  (qtp23689047-9057) [n:127.0.0.1:34379_solr c:testschemaapi s:shard1 r:core_node1 x:testschemaapi_shard1_replica1] o.a.s.u.VersionInfo Refreshing highest value of _version_ for 65536 version buckets from index
   [junit4]   2> 1181494 INFO  (qtp12488948-9060) [n:127.0.0.1:44425_solr c:testschemaapi s:shard1 r:core_node2 x:testschemaapi_shard1_replica2] o.a.s.u.VersionInfo Refreshing highest value of _version_ for 65536 version buckets from index
   [junit4]   2> 1181494 INFO  (qtp23689047-9057) [n:127.0.0.1:34379_solr c:testschemaapi s:shard1 r:core_node1 x:testschemaapi_shard1_replica1] o.a.s.u.VersionInfo No terms found for _version_, cannot seed version bucket highest value from index
   [junit4]   2> 1181494 INFO  (qtp12488948-9060) [n:127.0.0.1:44425_solr c:testschemaapi s:shard1 r:core_node2 x:testschemaapi_shard1_replica2] o.a.s.u.VersionInfo No terms found for _version_, cannot seed version bucket highest value from index
   [junit4]   2> 1181494 INFO  (qtp23689047-9057) [n:127.0.0.1:34379_solr c:testschemaapi s:shard1 r:core_node1 x:testschemaapi_shard1_replica1] o.a.s.u.UpdateLog Could not find max version in index or recent updates, using new clock 1532105718222553088
   [junit4]   2> 1181494 INFO  (qtp12488948-9060) [n:127.0.0.1:44425_solr c:testschemaapi s:shard1 r:core_node2 x:testschemaapi_shard1_replica2] o.a.s.u.UpdateLog Could not find max version in index or recent updates, using new clock 1532105718222553088
   [junit4]   2> 1181496 INFO  (qtp23689047-9057) [n:127.0.0.1:34379_solr c:testschemaapi s:shard1 r:core_node1 x:testschemaapi_shard1_replica1] o.a.s.u.UpdateLog Took 1.0ms to seed version buckets with highest version 1532105718222553088
   [junit4]   2> 1181496 INFO  (qtp23689047-9057) [n:127.0.0.1:34379_solr c:testschemaapi s:shard1 r:core_node1 x:testschemaapi_shard1_replica1] o.a.s.c.ZkController watch zkdir /configs/conf1
   [junit4]   2> 1181496 INFO  (qtp12488948-9060) [n:127.0.0.1:44425_solr c:testschemaapi s:shard1 r:core_node2 x:testschemaapi_shard1_replica2] o.a.s.u.UpdateLog Took 1.0ms to seed version buckets with highest version 1532105718222553088
   [junit4]   2> 1181496 INFO  (qtp12488948-9060) [n:127.0.0.1:44425_solr c:testschemaapi s:shard1 r:core_node2 x:testschemaapi_shard1_replica2] o.a.s.c.ZkController watch zkdir /configs/conf1
   [junit4]   2> 1181496 INFO  (qtp23689047-9057) [n:127.0.0.1:34379_solr c:testschemaapi s:shard1 r:core_node1 x:testschemaapi_shard1_replica1] o.a.s.c.CoreContainer registering core: testschemaapi_shard1_replica1
   [junit4]   2> 1181496 INFO  (qtp12488948-9060) [n:127.0.0.1:44425_solr c:testschemaapi s:shard1 r:core_node2 x:testschemaapi_shard1_replica2] o.a.s.c.CoreContainer registering core: testschemaapi_shard1_replica2
   [junit4]   2> 1181496 INFO  (qtp23689047-9057) [n:127.0.0.1:34379_solr c:testschemaapi s:shard1 r:core_node1 x:testschemaapi_shard1_replica1] o.a.s.c.ZkController Register replica - core:testschemaapi_shard1_replica1 address:http://127.0.0.1:34379/solr collection:testschemaapi shard:shard1
   [junit4]   2> 1181496 INFO  (qtp12488948-9060) [n:127.0.0.1:44425_solr c:testschemaapi s:shard1 r:core_node2 x:testschemaapi_shard1_replica2] o.a.s.c.ZkController Register replica - core:testschemaapi_shard1_replica2 address:http://127.0.0.1:44425/solr collection:testschemaapi shard:shard1
   [junit4]   2> 1181497 INFO  (qtp23689047-9057) [n:127.0.0.1:34379_solr c:testschemaapi s:shard1 r:core_node1 x:testschemaapi_shard1_replica1] o.a.s.c.c.SolrZkClient makePath: /collections/testschemaapi/leader_elect/shard1/election
   [junit4]   2> 1181497 INFO  (qtp12488948-9060) [n:127.0.0.1:44425_solr c:testschemaapi s:shard1 r:core_node2 x:testschemaapi_shard1_replica2] o.a.s.c.c.SolrZkClient makePath: /collections/testschemaapi/leader_elect/shard1/election
   [junit4]   2> 1181499 INFO  (qtp23689047-9057) [n:127.0.0.1:34379_solr c:testschemaapi s:shard1 r:core_node1 x:testschemaapi_shard1_replica1] o.a.s.c.LeaderElector Joined leadership election with path: /collections/testschemaapi/leader_elect/shard1/election/95756607231885318-core_node1-n_0000000000
   [junit4]   2> 1181499 INFO  (qtp12488948-9060) [n:127.0.0.1:44425_solr c:testschemaapi s:shard1 r:core_node2 x:testschemaapi_shard1_replica2] o.a.s.c.LeaderElector Joined leadership election with path: /collections/testschemaapi/leader_elect/shard1/election/95756607231885317-core_node2-n_0000000001
   [junit4]   2> 1181499 INFO  (qtp23689047-9057) [n:127.0.0.1:34379_solr c:testschemaapi s:shard1 r:core_node1 x:testschemaapi_shard1_replica1] o.a.s.c.ShardLeaderElectionContext Running the leader process for shard=shard1 and weAreReplacement=false and leaderVoteWait=10000
   [junit4]   2> 1181499 INFO  (qtp12488948-9060) [n:127.0.0.1:44425_solr c:testschemaapi s:shard1 r:core_node2 x:testschemaapi_shard1_replica2] o.a.s.c.LeaderElector Watching path /collections/testschemaapi/leader_elect/shard1/election/95756607231885318-core_node1-n_0000000000 to know if I could be the leader
   [junit4]   2> 1181500 INFO  (qtp23689047-9057) [n:127.0.0.1:34379_solr c:testschemaapi s:shard1 r:core_node1 x:testschemaapi_shard1_replica1] o.a.s.c.ShardLeaderElectionContext Enough replicas found to continue.
   [junit4]   2> 1181500 INFO  (qtp23689047-9057) [n:127.0.0.1:34379_solr c:testschemaapi s:shard1 r:core_node1 x:testschemaapi_shard1_replica1] o.a.s.c.ShardLeaderElectionContext I may be the new leader - try and sync
   [junit4]   2> 1181500 INFO  (qtp23689047-9057) [n:127.0.0.1:34379_solr c:testschemaapi s:shard1 r:core_node1 x:testschemaapi_shard1_replica1] o.a.s.c.SyncStrategy Sync replicas to http://127.0.0.1:34379/solr/testschemaapi_shard1_replica1/
   [junit4]   2> 1181500 INFO  (qtp23689047-9057) [n:127.0.0.1:34379_solr c:testschemaapi s:shard1 r:core_node1 x:testschemaapi_shard1_replica1] o.a.s.u.PeerSync PeerSync: core=testschemaapi_shard1_replica1 url=http://127.0.0.1:34379/solr START replicas=[http://127.0.0.1:44425/solr/testschemaapi_shard1_replica2/] nUpdates=100
   [junit4]   2> 1181500 INFO  (OverseerStateUpdate-95756607231885317-127.0.0.1:44425_solr-n_0000000000) [n:127.0.0.1:44425_solr    ] o.a.s.c.Overseer processMessage: queueSize: 1, message = {
   [junit4]   2>   "operation":"leader",
   [junit4]   2>   "shard":"shard1",
   [junit4]   2>   "collection":"testschemaapi"} current state version: 0
   [junit4]   2> 1181500 INFO  (qtp23689047-9057) [n:127.0.0.1:34379_solr c:testschemaapi s:shard1 r:core_node1 x:testschemaapi_shard1_replica1] o.a.s.u.PeerSync PeerSync: core=testschemaapi_shard1_replica1 url=http://127.0.0.1:34379/solr DONE.  We have no versions.  sync failed.
   [junit4]   2> 1181500 INFO  (qtp23689047-9057) [n:127.0.0.1:34379_solr c:testschemaapi s:shard1 r:core_node1 x:testschemaapi_shard1_replica1] o.a.s.c.SyncStrategy Leader's attempt to sync with shard failed, moving to the next candidate
   [junit4]   2> 1181500 INFO  (qtp23689047-9057) [n:127.0.0.1:34379_solr c:testschemaapi s:shard1 r:core_node1 x:testschemaapi_shard1_replica1] o.a.s.c.ShardLeaderElectionContext We failed sync, but we have no versions - we can't sync in that case - we were active before, so become leader anyway
   [junit4]   2> 1181501 INFO  (qtp23689047-9057) [n:127.0.0.1:34379_solr c:testschemaapi s:shard1 r:core_node1 x:testschemaapi_shard1_replica1] o.a.s.c.c.SolrZkClient makePath: /collections/testschemaapi/leaders/shard1
   [junit4]   2> 1181503 INFO  (qtp12488948-9048) [n:127.0.0.1:44425_solr c:testschemaapi s:shard1 r:core_node2 x:testschemaapi_shard1_replica2] o.a.s.c.S.Request [testschemaapi_shard1_replica2]  webapp=/solr path=/get params={distrib=false&qt=/get&fingerprint=false&getVersions=100&wt=javabin&version=2} status=0 QTime=1
   [junit4]   2> 1181503 INFO  (qtp23689047-9057) [n:127.0.0.1:34379_solr c:testschemaapi s:shard1 r:core_node1 x:testschemaapi_shard1_replica1] o.a.s.c.ShardLeaderElectionContextBase Creating leader registration node /collections/testschemaapi/leaders/shard1/leader after winning as /collections/testschemaapi/leader_elect/shard1/election/95756607231885318-core_node1-n_0000000000
   [junit4]   2> 1181504 INFO  (qtp23689047-9057) [n:127.0.0.1:34379_solr c:testschemaapi s:shard1 r:core_node1 x:testschemaapi_shard1_replica1] o.a.s.c.ShardLeaderElectionContext I am the new leader: http://127.0.0.1:34379/solr/testschemaapi_shard1_replica1/ shard1
   [junit4]   2> 1181505 INFO  (OverseerStateUpdate-95756607231885317-127.0.0.1:44425_solr-n_0000000000) [n:127.0.0.1:44425_solr    ] o.a.s.c.Overseer processMessage: queueSize: 1, message = {
   [junit4]   2>   "operation":"leader",
   [junit4]   2>   "shard":"shard1",
   [junit4]   2>   "collection":"testschemaapi",
   [junit4]   2>   "base_url":"http://127.0.0.1:34379/solr",
   [junit4]   2>   "core":"testschemaapi_shard1_replica1",
   [junit4]   2>   "state":"active"} current state version: 0
   [junit4]   2> 1181606 INFO  (OverseerStateUpdate-95756607231885317-127.0.0.1:44425_solr-n_0000000000) [n:127.0.0.1:44425_solr    ] o.a.s.c.o.ZkStateWriter going to update_collection /collections/testschemaapi/state.json version: 1
   [junit4]   2> 1181606 INFO  (zkCallback-1424-thread-1-processing-n:127.0.0.1:44425_solr) [n:127.0.0.1:44425_solr    ] o.a.s.c.c.ZkStateReader A cluster state change: [WatchedEvent state:SyncConnected type:NodeDataChanged path:/collections/testschemaapi/state.json] for collection [testschemaapi] has occurred - updating... (live nodes size: [2])
   [junit4]   2> 1181606 INFO  (zkCallback-1425-thread-1-processing-n:127.0.0.1:34379_solr) [n:127.0.0.1:34379_solr    ] o.a.s.c.c.ZkStateReader A cluster state change: [WatchedEvent state:SyncConnected type:NodeDataChanged path:/collections/testschemaapi/state.json] for collection [testschemaapi] has occurred - updating... (live nodes size: [2])
   [junit4]   2> 1181607 INFO  (zkCallback-1424-thread-1-processing-n:127.0.0.1:44425_solr) [n:127.0.0.1:44425_solr    ] o.a.s.c.c.ZkStateReader Updating data for [testschemaapi] from [1] to [2]
   [junit4]   2> 1181607 INFO  (zkCallback-1425-thread-1-processing-n:127.0.0.1:34379_solr) [n:127.0.0.1:34379_solr    ] o.a.s.c.c.ZkStateReader Updating data for [testschemaapi] from [1] to [2]
   [junit4]   2> 1181655 INFO  (qtp23689047-9057) [n:127.0.0.1:34379_solr c:testschemaapi s:shard1 r:core_node1 x:testschemaapi_shard1_replica1] o.a.s.c.ZkController We are http://127.0.0.1:34379/solr/testschemaapi_shard1_replica1/ and leader is http://127.0.0.1:34379/solr/testschemaapi_shard1_replica1/
   [junit4]   2> 1181655 INFO  (qtp23689047-9057) [n:127.0.0.1:34379_solr c:testschemaapi s:shard1 r:core_node1 x:testschemaapi_shard1_replica1] o.a.s.c.ZkController No LogReplay needed for core=testschemaapi_shard1_replica1 baseURL=http://127.0.0.1:34379/solr
   [junit4]   2> 1181655 INFO  (qtp23689047-9057) [n:127.0.0.1:34379_solr c:testschemaapi s:shard1 r:core_node1 x:testschemaapi_shard1_replica1] o.a.s.c.ZkController I am the leader, no recovery necessary
   [junit4]   2> 1181655 INFO  (qtp23689047-9057) [n:127.0.0

[...truncated too long message...]

Memory doPackFST= false)}, docValues:{}, maxPointsInLeafNode=1995, maxMBSortInHeap=5.1889352341581345, sim=ClassicSimilarity, locale=es-PR, timezone=Pacific/Noumea
   [junit4]   2> NOTE: Linux 4.2.0-34-generic i386/Oracle Corporation 1.8.0_72 (32-bit)/cpus=12,threads=1,free=165429368,total=536870912
   [junit4]   2> NOTE: All tests run in this JVM: [AliasIntegrationTest, CursorMarkTest, TestMinMaxOnMultiValuedField, StressHdfsTest, TestTolerantUpdateProcessorRandomCloud, CachingDirectoryFactoryTest, LeaderInitiatedRecoveryOnShardRestartTest, BJQParserTest, TestUpdate, BufferStoreTest, TestBulkSchemaConcurrent, MultiTermTest, TestTrieFacet, DistributedIntervalFacetingTest, HdfsRestartWhileUpdatingTest, SaslZkACLProviderTest, TestRTimerTree, MBeansHandlerTest, HLLUtilTest, TestDFRSimilarityFactory, TestBinaryResponseWriter, HdfsTlogReplayBufferedWhileIndexingTest, CustomCollectionTest, DistributedFacetPivotSmallTest, AddBlockUpdateTest, TestCopyFieldCollectionResource, HighlighterTest, ConvertedLegacyTest, TestRebalanceLeaders, SpellCheckComponentTest, ChaosMonkeyNothingIsSafeTest, TestQuerySenderListener, DistributedFacetPivotLargeTest, NotRequiredUniqueKeyTest, ShardRoutingCustomTest, TestConfigReload, HdfsDirectoryFactoryTest, TestPartialUpdateDeduplication, ClusterStateUpdateTest, TermVectorComponentTest, SolrInfoMBeanTest, TestInitParams, TestRestoreCore, SolrCmdDistributorTest, TestCloudInspectUtil, NumericFieldsTest, ShardRoutingTest, BigEndianAscendingWordDeserializerTest, RestartWhileUpdatingTest, TestFiltering, BasicAuthIntegrationTest, TestBlendedInfixSuggestions, TestFastLRUCache, ZkStateWriterTest, FileUtilsTest, CdcrReplicationHandlerTest, DistanceFunctionTest, SharedFSAutoReplicaFailoverUtilsTest, OutOfBoxZkACLAndCredentialsProvidersTest, TestCryptoKeys, TestDynamicFieldResource, SolrXmlInZkTest, DocExpirationUpdateProcessorFactoryTest, TestExactSharedStatsCache, VMParamsZkACLAndCredentialsProvidersTest, ResponseHeaderTest, TestFieldTypeCollectionResource, TimeZoneUtilsTest, SolrIndexSplitterTest, TestQueryTypes, SegmentsInfoRequestHandlerTest, TestWordDelimiterFilterFactory, ZkCLITest, DeleteReplicaTest, DistribCursorPagingTest, MinimalSchemaTest, SimpleMLTQParserTest, DataDrivenBlockJoinTest, WrapperMergePolicyFactoryTest, SolrPluginUtilsTest, TestBM25SimilarityFactory, TestSimpleQParserPlugin, CSVRequestHandlerTest, ConfigSetsAPITest, TestDistributedGrouping, TestHighFrequencyDictionaryFactory, OverseerRolesTest, RulesTest, TestCursorMarkWithoutUniqueKey, TestUseDocValuesAsStored2, CollectionsAPIDistributedZkTest, TestManagedSchemaAPI]
   [junit4] Completed [294/591 (1!)] on J1 in 15.00s, 1 test, 1 error <<< FAILURES!

[...truncated 516 lines...]
   [junit4] Suite: org.apache.solr.cloud.TestSolrCloudWithKerberosAlt
   [junit4]   2> 1751852 WARN  (TEST-TestSolrCloudWithKerberosAlt.testBasics-seed#[CAD607DC9BC14B87]) [    ] o.a.d.s.c.DefaultDirectoryService You didn't change the admin password of directory service instance 'DefaultKrbServer'.  Please update the admin password as soon as possible to prevent a possible security breach.
   [junit4]   2> NOTE: reproduce with: ant test  -Dtestcase=TestSolrCloudWithKerberosAlt -Dtests.method=testBasics -Dtests.seed=CAD607DC9BC14B87 -Dtests.multiplier=3 -Dtests.slow=true -Dtests.locale=ja-JP -Dtests.timezone=Etc/Zulu -Dtests.asserts=true -Dtests.file.encoding=ISO-8859-1
   [junit4] ERROR   12.2s J2 | TestSolrCloudWithKerberosAlt.testBasics <<<
   [junit4]    > Throwable #1: java.net.BindException: Address already in use
   [junit4]    > 	at __randomizedtesting.SeedInfo.seed([CAD607DC9BC14B87:F70EA9F0A32F15F7]:0)
   [junit4]    > 	at sun.nio.ch.Net.bind0(Native Method)
   [junit4]    > 	at sun.nio.ch.Net.bind(Net.java:433)
   [junit4]    > 	at sun.nio.ch.Net.bind(Net.java:425)
   [junit4]    > 	at sun.nio.ch.ServerSocketChannelImpl.bind(ServerSocketChannelImpl.java:223)
   [junit4]    > 	at sun.nio.ch.ServerSocketAdaptor.bind(ServerSocketAdaptor.java:74)
   [junit4]    > 	at org.apache.mina.transport.socket.nio.NioSocketAcceptor.open(NioSocketAcceptor.java:252)
   [junit4]    > 	at org.apache.mina.transport.socket.nio.NioSocketAcceptor.open(NioSocketAcceptor.java:49)
   [junit4]    > 	at org.apache.mina.core.polling.AbstractPollingIoAcceptor.registerHandles(AbstractPollingIoAcceptor.java:525)
   [junit4]    > 	at org.apache.mina.core.polling.AbstractPollingIoAcceptor.access$200(AbstractPollingIoAcceptor.java:67)
   [junit4]    > 	at org.apache.mina.core.polling.AbstractPollingIoAcceptor$Acceptor.run(AbstractPollingIoAcceptor.java:409)
   [junit4]    > 	at org.apache.mina.util.NamePreservingRunnable.run(NamePreservingRunnable.java:65)
   [junit4]    > 	at java.util.concurrent.ThreadPoolExecutor.runWorker(ThreadPoolExecutor.java:1142)
   [junit4]    > 	at java.util.concurrent.ThreadPoolExecutor$Worker.run(ThreadPoolExecutor.java:617)
   [junit4]    > 	at java.lang.Thread.run(Thread.java:745)
   [junit4]   2> NOTE: leaving temporary files on disk at: /home/jenkins/workspace/Lucene-Solr-6.x-Linux/solr/build/solr-core/test/J2/temp/solr.cloud.TestSolrCloudWithKerberosAlt_CAD607DC9BC14B87-001
   [junit4]   2> NOTE: test params are: codec=Lucene60, sim=ClassicSimilarity, locale=ja-JP, timezone=Etc/Zulu
   [junit4]   2> NOTE: Linux 4.2.0-34-generic i386/Oracle Corporation 1.8.0_72 (32-bit)/cpus=12,threads=1,free=158084752,total=536870912
   [junit4]   2> NOTE: All tests run in this JVM: [ClusterStateTest, MergeStrategyTest, TestStressRecovery, RequestHandlersTest, HdfsRecoverLeaseTest, TestCoreDiscovery, RemoteQueryErrorTest, TestXmlQParser, UpdateParamsTest, BlockCacheTest, TestCollationField, CurrencyFieldXmlFileTest, TestSort, TestDistributedMissingSort, PluginInfoTest, TestAuthenticationFramework, TestFastWriter, BadComponentTest, SparseHLLTest, TestClassicSimilarityFactory, TestCustomDocTransformer, QueryResultKeyTest, MigrateRouteKeyTest, DistributedFacetPivotLongTailTest, HdfsDirectoryTest, TestDefaultSearchFieldResource, CheckHdfsIndexTest, SolrTestCaseJ4Test, UnloadDistributedZkTest, SuggestComponentContextFilterQueryTest, ConnectionManagerTest, TestXIncludeConfig, TestSweetSpotSimilarityFactory, DistributedDebugComponentTest, DocValuesMultiTest, TestCloudPivotFacet, CoreAdminCreateDiscoverTest, TestImplicitCoreProperties, IgnoreCommitOptimizeUpdateProcessorFactoryTest, DistribDocExpirationUpdateProcessorTest, TermVectorComponentDistributedTest, TestTolerantSearch, TestSolrIndexConfig, CoreAdminHandlerTest, DirectUpdateHandlerTest, TestMiniSolrCloudClusterBase, EnumFieldTest, TestConfigSetsAPIExclusivity, BigEndianAscendingWordSerializerTest, SliceStateTest, TestWriterPerf, TestFilteredDocIdSet, TestExactStatsCache, TestFileDictionaryLookup, TestElisionMultitermQuery, SolrCoreCheckLockOnStartupTest, CircularListTest, CollectionsAPISolrJTest, TestStressReorder, TestDistribDocBasedVersion, RollingRestartTest, TestReplicaProperties, TestFieldCollectionResource, TestLeaderElectionZkExpiry, ClassificationUpdateProcessorFactoryTest, TestDefaultStatsCache, HdfsSyncSliceTest, TestRuleBasedAuthorizationPlugin, TestFieldTypeResource, TestUtils, TestDocBasedVersionConstraints, DebugComponentTest, CdcrRequestHandlerTest, HdfsUnloadDistributedZkTest, OverriddenZkACLAndCredentialsProvidersTest, OverseerStatusTest, TestGroupingSearch, GraphQueryTest, AnalysisErrorHandlingTest, DistanceUnitsTest, TestJsonRequest, TestSearchPerf, TestSQLHandler, LeaderFailoverAfterPartitionTest, TestReversedWildcardFilterFactory, TestFuzzyAnalyzedSuggestions, ShardSplitTest, TestConfigSetProperties, TestCharFilters, AnalyticsMergeStrategyTest, LeaderElectionTest, TestSchemaManager, TestStandardQParsers, OverseerTest, RequestLoggingTest, TestJmxMonitoredMap, BinaryUpdateRequestHandlerTest, ZkSolrClientTest, AutoCommitTest, TestHashPartitioner, TestReload, DistributedTermsComponentTest, SolrCoreTest, BadIndexSchemaTest, BasicFunctionalityTest, TestIndexSearcher, ShowFileRequestHandlerTest, CurrencyFieldOpenExchangeTest, SimplePostToolTest, AnalysisAfterCoreReloadTest, TestExtendedDismaxParser, SuggesterFSTTest, DocValuesTest, TestIndexingPerformance, MoreLikeThisHandlerTest, FastVectorHighlighterTest, RegexBoostProcessorTest, UpdateRequestProcessorFactoryTest, UniqFieldsUpdateProcessorFactoryTest, TestComponentsName, TestLFUCache, CollectionReloadTest, CollectionsAPIAsyncDistributedZkTest, DeleteShardTest, OverseerTaskQueueTest, RecoveryAfterSoftCommitTest, TestConfigSetsAPI, TestConfigSetsAPIZkFailure, TestLeaderInitiatedRecoveryThread, TestMiniSolrCloudClusterSSL, TestOnReconnectListenerSupport, TestRandomRequestDistribution, TestShortCircuitedRequests, TestSolrCloudWithKerberosAlt]
   [junit4] Completed [461/591 (2!)] on J2 in 12.19s, 1 test, 1 error <<< FAILURES!

[...truncated 440 lines...]
BUILD FAILED
/home/jenkins/workspace/Lucene-Solr-6.x-Linux/build.xml:740: The following error occurred while executing this line:
/home/jenkins/workspace/Lucene-Solr-6.x-Linux/build.xml:684: The following error occurred while executing this line:
/home/jenkins/workspace/Lucene-Solr-6.x-Linux/build.xml:59: The following error occurred while executing this line:
/home/jenkins/workspace/Lucene-Solr-6.x-Linux/solr/build.xml:233: The following error occurred while executing this line:
/home/jenkins/workspace/Lucene-Solr-6.x-Linux/solr/common-build.xml:529: The following error occurred while executing this line:
/home/jenkins/workspace/Lucene-Solr-6.x-Linux/lucene/common-build.xml:1457: The following error occurred while executing this line:
/home/jenkins/workspace/Lucene-Solr-6.x-Linux/lucene/common-build.xml:1014: There were test failures: 591 suites (10 ignored), 2380 tests, 2 errors, 114 ignored (70 assumptions) [seed: CAD607DC9BC14B87]

Total time: 64 minutes 42 seconds
Build step 'Invoke Ant' marked build as failure
Archiving artifacts
[WARNINGS] Skipping publisher since build result is FAILURE
Recording test results
Email was triggered for: Failure - Any
Sending email for trigger: Failure - Any



Mime
View raw message