lucene-dev mailing list archives

Site index · List index
Message view « Date » · « Thread »
Top « Date » · « Thread »
From Policeman Jenkins Server <jenk...@thetaphi.de>
Subject [JENKINS-EA] Lucene-Solr-6.x-Linux (64bit/jdk-9-ea+113) - Build # 395 - Failure!
Date Mon, 11 Apr 2016 10:16:27 GMT
Build: http://jenkins.thetaphi.de/job/Lucene-Solr-6.x-Linux/395/
Java: 64bit/jdk-9-ea+113 -XX:-UseCompressedOops -XX:+UseSerialGC -XX:-CompactStrings

1 tests failed.
FAILED:  org.apache.solr.cloud.DistribDocExpirationUpdateProcessorTest.test

Error Message:
Exactly one shard should have changed, instead: [shard2, shard1] nodes=([core_node3(shard2), core_node2(shard1), core_node4(shard1)]) expected:<1> but was:<2>

Stack Trace:
java.lang.AssertionError: Exactly one shard should have changed, instead: [shard2, shard1] nodes=([core_node3(shard2), core_node2(shard1), core_node4(shard1)]) expected:<1> but was:<2>
	at __randomizedtesting.SeedInfo.seed([DA0EEC8B855FAF2C:525AD3512BA3C2D4]:0)
	at org.junit.Assert.fail(Assert.java:93)
	at org.junit.Assert.failNotEquals(Assert.java:647)
	at org.junit.Assert.assertEquals(Assert.java:128)
	at org.junit.Assert.assertEquals(Assert.java:472)
	at org.apache.solr.cloud.DistribDocExpirationUpdateProcessorTest.test(DistribDocExpirationUpdateProcessorTest.java:118)
	at sun.reflect.NativeMethodAccessorImpl.invoke0(java.base@9-ea/Native Method)
	at sun.reflect.NativeMethodAccessorImpl.invoke(java.base@9-ea/NativeMethodAccessorImpl.java:62)
	at sun.reflect.DelegatingMethodAccessorImpl.invoke(java.base@9-ea/DelegatingMethodAccessorImpl.java:43)
	at java.lang.reflect.Method.invoke(java.base@9-ea/Method.java:531)
	at com.carrotsearch.randomizedtesting.RandomizedRunner.invoke(RandomizedRunner.java:1764)
	at com.carrotsearch.randomizedtesting.RandomizedRunner$8.evaluate(RandomizedRunner.java:871)
	at com.carrotsearch.randomizedtesting.RandomizedRunner$9.evaluate(RandomizedRunner.java:907)
	at com.carrotsearch.randomizedtesting.RandomizedRunner$10.evaluate(RandomizedRunner.java:921)
	at org.apache.solr.BaseDistributedSearchTestCase$ShardsRepeatRule$ShardsFixedStatement.callStatement(BaseDistributedSearchTestCase.java:992)
	at org.apache.solr.BaseDistributedSearchTestCase$ShardsRepeatRule$ShardsStatement.evaluate(BaseDistributedSearchTestCase.java:967)
	at com.carrotsearch.randomizedtesting.rules.SystemPropertiesRestoreRule$1.evaluate(SystemPropertiesRestoreRule.java:57)
	at org.apache.lucene.util.TestRuleSetupTeardownChained$1.evaluate(TestRuleSetupTeardownChained.java:49)
	at org.apache.lucene.util.AbstractBeforeAfterRule$1.evaluate(AbstractBeforeAfterRule.java:45)
	at org.apache.lucene.util.TestRuleThreadAndTestName$1.evaluate(TestRuleThreadAndTestName.java:48)
	at org.apache.lucene.util.TestRuleIgnoreAfterMaxFailures$1.evaluate(TestRuleIgnoreAfterMaxFailures.java:64)
	at org.apache.lucene.util.TestRuleMarkFailure$1.evaluate(TestRuleMarkFailure.java:47)
	at com.carrotsearch.randomizedtesting.rules.StatementAdapter.evaluate(StatementAdapter.java:36)
	at com.carrotsearch.randomizedtesting.ThreadLeakControl$StatementRunner.run(ThreadLeakControl.java:367)
	at com.carrotsearch.randomizedtesting.ThreadLeakControl.forkTimeoutingTask(ThreadLeakControl.java:809)
	at com.carrotsearch.randomizedtesting.ThreadLeakControl$3.evaluate(ThreadLeakControl.java:460)
	at com.carrotsearch.randomizedtesting.RandomizedRunner.runSingleTest(RandomizedRunner.java:880)
	at com.carrotsearch.randomizedtesting.RandomizedRunner$5.evaluate(RandomizedRunner.java:781)
	at com.carrotsearch.randomizedtesting.RandomizedRunner$6.evaluate(RandomizedRunner.java:816)
	at com.carrotsearch.randomizedtesting.RandomizedRunner$7.evaluate(RandomizedRunner.java:827)
	at com.carrotsearch.randomizedtesting.rules.StatementAdapter.evaluate(StatementAdapter.java:36)
	at com.carrotsearch.randomizedtesting.rules.SystemPropertiesRestoreRule$1.evaluate(SystemPropertiesRestoreRule.java:57)
	at org.apache.lucene.util.AbstractBeforeAfterRule$1.evaluate(AbstractBeforeAfterRule.java:45)
	at com.carrotsearch.randomizedtesting.rules.StatementAdapter.evaluate(StatementAdapter.java:36)
	at org.apache.lucene.util.TestRuleStoreClassName$1.evaluate(TestRuleStoreClassName.java:41)
	at com.carrotsearch.randomizedtesting.rules.NoShadowingOrOverridesOnMethodsRule$1.evaluate(NoShadowingOrOverridesOnMethodsRule.java:40)
	at com.carrotsearch.randomizedtesting.rules.NoShadowingOrOverridesOnMethodsRule$1.evaluate(NoShadowingOrOverridesOnMethodsRule.java:40)
	at com.carrotsearch.randomizedtesting.rules.StatementAdapter.evaluate(StatementAdapter.java:36)
	at com.carrotsearch.randomizedtesting.rules.StatementAdapter.evaluate(StatementAdapter.java:36)
	at com.carrotsearch.randomizedtesting.rules.StatementAdapter.evaluate(StatementAdapter.java:36)
	at org.apache.lucene.util.TestRuleAssertionsRequired$1.evaluate(TestRuleAssertionsRequired.java:53)
	at org.apache.lucene.util.TestRuleMarkFailure$1.evaluate(TestRuleMarkFailure.java:47)
	at org.apache.lucene.util.TestRuleIgnoreAfterMaxFailures$1.evaluate(TestRuleIgnoreAfterMaxFailures.java:64)
	at org.apache.lucene.util.TestRuleIgnoreTestSuites$1.evaluate(TestRuleIgnoreTestSuites.java:54)
	at com.carrotsearch.randomizedtesting.rules.StatementAdapter.evaluate(StatementAdapter.java:36)
	at com.carrotsearch.randomizedtesting.ThreadLeakControl$StatementRunner.run(ThreadLeakControl.java:367)
	at java.lang.Thread.run(java.base@9-ea/Thread.java:804)




Build Log:
[...truncated 12060 lines...]
   [junit4] Suite: org.apache.solr.cloud.DistribDocExpirationUpdateProcessorTest
   [junit4]   2> Creating dataDir: /home/jenkins/workspace/Lucene-Solr-6.x-Linux/solr/build/solr-core/test/J1/temp/solr.cloud.DistribDocExpirationUpdateProcessorTest_DA0EEC8B855FAF2C-001/init-core-data-001
   [junit4]   2> 1256703 INFO  (SUITE-DistribDocExpirationUpdateProcessorTest-seed#[DA0EEC8B855FAF2C]-worker) [    ] o.a.s.SolrTestCaseJ4 Randomized ssl (false) and clientAuth (false)
   [junit4]   2> 1256704 INFO  (SUITE-DistribDocExpirationUpdateProcessorTest-seed#[DA0EEC8B855FAF2C]-worker) [    ] o.a.s.BaseDistributedSearchTestCase Setting hostContext system property: /
   [junit4]   2> 1256705 INFO  (TEST-DistribDocExpirationUpdateProcessorTest.test-seed#[DA0EEC8B855FAF2C]) [    ] o.a.s.c.ZkTestServer STARTING ZK TEST SERVER
   [junit4]   2> 1256705 INFO  (Thread-3769) [    ] o.a.s.c.ZkTestServer client port:0.0.0.0/0.0.0.0:0
   [junit4]   2> 1256705 INFO  (Thread-3769) [    ] o.a.s.c.ZkTestServer Starting server
   [junit4]   2> 1256805 INFO  (TEST-DistribDocExpirationUpdateProcessorTest.test-seed#[DA0EEC8B855FAF2C]) [    ] o.a.s.c.ZkTestServer start zk server on port:40319
   [junit4]   2> 1256805 INFO  (TEST-DistribDocExpirationUpdateProcessorTest.test-seed#[DA0EEC8B855FAF2C]) [    ] o.a.s.c.c.SolrZkClient Using default ZkCredentialsProvider
   [junit4]   2> 1256805 INFO  (TEST-DistribDocExpirationUpdateProcessorTest.test-seed#[DA0EEC8B855FAF2C]) [    ] o.a.s.c.c.ConnectionManager Waiting for client to connect to ZooKeeper
   [junit4]   2> 1256807 INFO  (zkCallback-1948-thread-1) [    ] o.a.s.c.c.ConnectionManager Watcher org.apache.solr.common.cloud.ConnectionManager@41ff5af name:ZooKeeperConnection Watcher:127.0.0.1:40319 got event WatchedEvent state:SyncConnected type:None path:null path:null type:None
   [junit4]   2> 1256807 INFO  (TEST-DistribDocExpirationUpdateProcessorTest.test-seed#[DA0EEC8B855FAF2C]) [    ] o.a.s.c.c.ConnectionManager Client is connected to ZooKeeper
   [junit4]   2> 1256807 INFO  (TEST-DistribDocExpirationUpdateProcessorTest.test-seed#[DA0EEC8B855FAF2C]) [    ] o.a.s.c.c.SolrZkClient Using default ZkACLProvider
   [junit4]   2> 1256807 INFO  (TEST-DistribDocExpirationUpdateProcessorTest.test-seed#[DA0EEC8B855FAF2C]) [    ] o.a.s.c.c.SolrZkClient makePath: /solr
   [junit4]   2> 1256808 INFO  (TEST-DistribDocExpirationUpdateProcessorTest.test-seed#[DA0EEC8B855FAF2C]) [    ] o.a.s.c.c.SolrZkClient Using default ZkCredentialsProvider
   [junit4]   2> 1256809 INFO  (TEST-DistribDocExpirationUpdateProcessorTest.test-seed#[DA0EEC8B855FAF2C]) [    ] o.a.s.c.c.ConnectionManager Waiting for client to connect to ZooKeeper
   [junit4]   2> 1256809 INFO  (zkCallback-1949-thread-1) [    ] o.a.s.c.c.ConnectionManager Watcher org.apache.solr.common.cloud.ConnectionManager@6fb9805f name:ZooKeeperConnection Watcher:127.0.0.1:40319/solr got event WatchedEvent state:SyncConnected type:None path:null path:null type:None
   [junit4]   2> 1256809 INFO  (TEST-DistribDocExpirationUpdateProcessorTest.test-seed#[DA0EEC8B855FAF2C]) [    ] o.a.s.c.c.ConnectionManager Client is connected to ZooKeeper
   [junit4]   2> 1256809 INFO  (TEST-DistribDocExpirationUpdateProcessorTest.test-seed#[DA0EEC8B855FAF2C]) [    ] o.a.s.c.c.SolrZkClient Using default ZkACLProvider
   [junit4]   2> 1256810 INFO  (TEST-DistribDocExpirationUpdateProcessorTest.test-seed#[DA0EEC8B855FAF2C]) [    ] o.a.s.c.c.SolrZkClient makePath: /collections/collection1
   [junit4]   2> 1256810 INFO  (TEST-DistribDocExpirationUpdateProcessorTest.test-seed#[DA0EEC8B855FAF2C]) [    ] o.a.s.c.c.SolrZkClient makePath: /collections/collection1/shards
   [junit4]   2> 1256811 INFO  (TEST-DistribDocExpirationUpdateProcessorTest.test-seed#[DA0EEC8B855FAF2C]) [    ] o.a.s.c.c.SolrZkClient makePath: /collections/control_collection
   [junit4]   2> 1256811 INFO  (TEST-DistribDocExpirationUpdateProcessorTest.test-seed#[DA0EEC8B855FAF2C]) [    ] o.a.s.c.c.SolrZkClient makePath: /collections/control_collection/shards
   [junit4]   2> 1256812 INFO  (TEST-DistribDocExpirationUpdateProcessorTest.test-seed#[DA0EEC8B855FAF2C]) [    ] o.a.s.c.AbstractZkTestCase put /home/jenkins/workspace/Lucene-Solr-6.x-Linux/solr/core/src/test-files/solr/collection1/conf/solrconfig-doc-expire-update-processor.xml to /configs/conf1/solrconfig.xml
   [junit4]   2> 1256812 INFO  (TEST-DistribDocExpirationUpdateProcessorTest.test-seed#[DA0EEC8B855FAF2C]) [    ] o.a.s.c.c.SolrZkClient makePath: /configs/conf1/solrconfig.xml
   [junit4]   2> 1256812 INFO  (TEST-DistribDocExpirationUpdateProcessorTest.test-seed#[DA0EEC8B855FAF2C]) [    ] o.a.s.c.AbstractZkTestCase put /home/jenkins/workspace/Lucene-Solr-6.x-Linux/solr/core/src/test-files/solr/collection1/conf/schema15.xml to /configs/conf1/schema.xml
   [junit4]   2> 1256813 INFO  (TEST-DistribDocExpirationUpdateProcessorTest.test-seed#[DA0EEC8B855FAF2C]) [    ] o.a.s.c.c.SolrZkClient makePath: /configs/conf1/schema.xml
   [junit4]   2> 1256813 INFO  (TEST-DistribDocExpirationUpdateProcessorTest.test-seed#[DA0EEC8B855FAF2C]) [    ] o.a.s.c.AbstractZkTestCase put /home/jenkins/workspace/Lucene-Solr-6.x-Linux/solr/core/src/test-files/solr/collection1/conf/solrconfig.snippet.randomindexconfig.xml to /configs/conf1/solrconfig.snippet.randomindexconfig.xml
   [junit4]   2> 1256813 INFO  (TEST-DistribDocExpirationUpdateProcessorTest.test-seed#[DA0EEC8B855FAF2C]) [    ] o.a.s.c.c.SolrZkClient makePath: /configs/conf1/solrconfig.snippet.randomindexconfig.xml
   [junit4]   2> 1256814 INFO  (TEST-DistribDocExpirationUpdateProcessorTest.test-seed#[DA0EEC8B855FAF2C]) [    ] o.a.s.c.AbstractZkTestCase put /home/jenkins/workspace/Lucene-Solr-6.x-Linux/solr/core/src/test-files/solr/collection1/conf/stopwords.txt to /configs/conf1/stopwords.txt
   [junit4]   2> 1256814 INFO  (TEST-DistribDocExpirationUpdateProcessorTest.test-seed#[DA0EEC8B855FAF2C]) [    ] o.a.s.c.c.SolrZkClient makePath: /configs/conf1/stopwords.txt
   [junit4]   2> 1256814 INFO  (TEST-DistribDocExpirationUpdateProcessorTest.test-seed#[DA0EEC8B855FAF2C]) [    ] o.a.s.c.AbstractZkTestCase put /home/jenkins/workspace/Lucene-Solr-6.x-Linux/solr/core/src/test-files/solr/collection1/conf/protwords.txt to /configs/conf1/protwords.txt
   [junit4]   2> 1256814 INFO  (TEST-DistribDocExpirationUpdateProcessorTest.test-seed#[DA0EEC8B855FAF2C]) [    ] o.a.s.c.c.SolrZkClient makePath: /configs/conf1/protwords.txt
   [junit4]   2> 1256815 INFO  (TEST-DistribDocExpirationUpdateProcessorTest.test-seed#[DA0EEC8B855FAF2C]) [    ] o.a.s.c.AbstractZkTestCase put /home/jenkins/workspace/Lucene-Solr-6.x-Linux/solr/core/src/test-files/solr/collection1/conf/currency.xml to /configs/conf1/currency.xml
   [junit4]   2> 1256815 INFO  (TEST-DistribDocExpirationUpdateProcessorTest.test-seed#[DA0EEC8B855FAF2C]) [    ] o.a.s.c.c.SolrZkClient makePath: /configs/conf1/currency.xml
   [junit4]   2> 1256815 INFO  (TEST-DistribDocExpirationUpdateProcessorTest.test-seed#[DA0EEC8B855FAF2C]) [    ] o.a.s.c.AbstractZkTestCase put /home/jenkins/workspace/Lucene-Solr-6.x-Linux/solr/core/src/test-files/solr/collection1/conf/enumsConfig.xml to /configs/conf1/enumsConfig.xml
   [junit4]   2> 1256816 INFO  (TEST-DistribDocExpirationUpdateProcessorTest.test-seed#[DA0EEC8B855FAF2C]) [    ] o.a.s.c.c.SolrZkClient makePath: /configs/conf1/enumsConfig.xml
   [junit4]   2> 1256816 INFO  (TEST-DistribDocExpirationUpdateProcessorTest.test-seed#[DA0EEC8B855FAF2C]) [    ] o.a.s.c.AbstractZkTestCase put /home/jenkins/workspace/Lucene-Solr-6.x-Linux/solr/core/src/test-files/solr/collection1/conf/open-exchange-rates.json to /configs/conf1/open-exchange-rates.json
   [junit4]   2> 1256816 INFO  (TEST-DistribDocExpirationUpdateProcessorTest.test-seed#[DA0EEC8B855FAF2C]) [    ] o.a.s.c.c.SolrZkClient makePath: /configs/conf1/open-exchange-rates.json
   [junit4]   2> 1256816 INFO  (TEST-DistribDocExpirationUpdateProcessorTest.test-seed#[DA0EEC8B855FAF2C]) [    ] o.a.s.c.AbstractZkTestCase put /home/jenkins/workspace/Lucene-Solr-6.x-Linux/solr/core/src/test-files/solr/collection1/conf/mapping-ISOLatin1Accent.txt to /configs/conf1/mapping-ISOLatin1Accent.txt
   [junit4]   2> 1256817 INFO  (TEST-DistribDocExpirationUpdateProcessorTest.test-seed#[DA0EEC8B855FAF2C]) [    ] o.a.s.c.c.SolrZkClient makePath: /configs/conf1/mapping-ISOLatin1Accent.txt
   [junit4]   2> 1256817 INFO  (TEST-DistribDocExpirationUpdateProcessorTest.test-seed#[DA0EEC8B855FAF2C]) [    ] o.a.s.c.AbstractZkTestCase put /home/jenkins/workspace/Lucene-Solr-6.x-Linux/solr/core/src/test-files/solr/collection1/conf/old_synonyms.txt to /configs/conf1/old_synonyms.txt
   [junit4]   2> 1256817 INFO  (TEST-DistribDocExpirationUpdateProcessorTest.test-seed#[DA0EEC8B855FAF2C]) [    ] o.a.s.c.c.SolrZkClient makePath: /configs/conf1/old_synonyms.txt
   [junit4]   2> 1256818 INFO  (TEST-DistribDocExpirationUpdateProcessorTest.test-seed#[DA0EEC8B855FAF2C]) [    ] o.a.s.c.AbstractZkTestCase put /home/jenkins/workspace/Lucene-Solr-6.x-Linux/solr/core/src/test-files/solr/collection1/conf/synonyms.txt to /configs/conf1/synonyms.txt
   [junit4]   2> 1256818 INFO  (TEST-DistribDocExpirationUpdateProcessorTest.test-seed#[DA0EEC8B855FAF2C]) [    ] o.a.s.c.c.SolrZkClient makePath: /configs/conf1/synonyms.txt
   [junit4]   2> 1256869 INFO  (TEST-DistribDocExpirationUpdateProcessorTest.test-seed#[DA0EEC8B855FAF2C]) [    ] o.a.s.SolrTestCaseJ4 Writing core.properties file to /home/jenkins/workspace/Lucene-Solr-6.x-Linux/solr/build/solr-core/test/J1/temp/solr.cloud.DistribDocExpirationUpdateProcessorTest_DA0EEC8B855FAF2C-001/control-001/cores/collection1
   [junit4]   2> 1256870 INFO  (TEST-DistribDocExpirationUpdateProcessorTest.test-seed#[DA0EEC8B855FAF2C]) [    ] o.e.j.s.Server jetty-9.3.8.v20160314
   [junit4]   2> 1256871 INFO  (TEST-DistribDocExpirationUpdateProcessorTest.test-seed#[DA0EEC8B855FAF2C]) [    ] o.e.j.s.h.ContextHandler Started o.e.j.s.ServletContextHandler@b191086{/,null,AVAILABLE}
   [junit4]   2> 1256873 INFO  (TEST-DistribDocExpirationUpdateProcessorTest.test-seed#[DA0EEC8B855FAF2C]) [    ] o.e.j.s.ServerConnector Started ServerConnector@22a94c4f{HTTP/1.1,[http/1.1]}{127.0.0.1:43035}
   [junit4]   2> 1256873 INFO  (TEST-DistribDocExpirationUpdateProcessorTest.test-seed#[DA0EEC8B855FAF2C]) [    ] o.e.j.s.Server Started @1258832ms
   [junit4]   2> 1256873 INFO  (TEST-DistribDocExpirationUpdateProcessorTest.test-seed#[DA0EEC8B855FAF2C]) [    ] o.a.s.c.s.e.JettySolrRunner Jetty properties: {solr.data.dir=/home/jenkins/workspace/Lucene-Solr-6.x-Linux/solr/build/solr-core/test/J1/temp/solr.cloud.DistribDocExpirationUpdateProcessorTest_DA0EEC8B855FAF2C-001/tempDir-001/control/data, hostContext=/, hostPort=43035, coreRootDirectory=/home/jenkins/workspace/Lucene-Solr-6.x-Linux/solr/build/solr-core/test/J1/../../../../../../../../../home/jenkins/workspace/Lucene-Solr-6.x-Linux/solr/build/solr-core/test/J1/temp/solr.cloud.DistribDocExpirationUpdateProcessorTest_DA0EEC8B855FAF2C-001/control-001/cores}
   [junit4]   2> 1256873 INFO  (TEST-DistribDocExpirationUpdateProcessorTest.test-seed#[DA0EEC8B855FAF2C]) [    ] o.a.s.s.SolrDispatchFilter SolrDispatchFilter.init(): jdk.internal.loader.ClassLoaders$AppClassLoader@725bef66
   [junit4]   2> 1256873 INFO  (TEST-DistribDocExpirationUpdateProcessorTest.test-seed#[DA0EEC8B855FAF2C]) [    ] o.a.s.c.SolrResourceLoader new SolrResourceLoader for directory: '/home/jenkins/workspace/Lucene-Solr-6.x-Linux/solr/build/solr-core/test/J1/temp/solr.cloud.DistribDocExpirationUpdateProcessorTest_DA0EEC8B855FAF2C-001/control-001'
   [junit4]   2> 1256873 INFO  (TEST-DistribDocExpirationUpdateProcessorTest.test-seed#[DA0EEC8B855FAF2C]) [    ] o.a.s.c.SolrResourceLoader JNDI not configured for solr (NoInitialContextEx)
   [junit4]   2> 1256874 INFO  (TEST-DistribDocExpirationUpdateProcessorTest.test-seed#[DA0EEC8B855FAF2C]) [    ] o.a.s.c.SolrResourceLoader solr home defaulted to 'solr/' (could not find system property or JNDI)
   [junit4]   2> 1256874 INFO  (TEST-DistribDocExpirationUpdateProcessorTest.test-seed#[DA0EEC8B855FAF2C]) [    ] o.a.s.c.c.SolrZkClient Using default ZkCredentialsProvider
   [junit4]   2> 1256874 INFO  (TEST-DistribDocExpirationUpdateProcessorTest.test-seed#[DA0EEC8B855FAF2C]) [    ] o.a.s.c.c.ConnectionManager Waiting for client to connect to ZooKeeper
   [junit4]   2> 1256874 INFO  (zkCallback-1950-thread-1) [    ] o.a.s.c.c.ConnectionManager Watcher org.apache.solr.common.cloud.ConnectionManager@7e4a7e7b name:ZooKeeperConnection Watcher:127.0.0.1:40319/solr got event WatchedEvent state:SyncConnected type:None path:null path:null type:None
   [junit4]   2> 1256875 INFO  (TEST-DistribDocExpirationUpdateProcessorTest.test-seed#[DA0EEC8B855FAF2C]) [    ] o.a.s.c.c.ConnectionManager Client is connected to ZooKeeper
   [junit4]   2> 1256875 INFO  (TEST-DistribDocExpirationUpdateProcessorTest.test-seed#[DA0EEC8B855FAF2C]) [    ] o.a.s.c.c.SolrZkClient Using default ZkACLProvider
   [junit4]   2> 1256875 INFO  (TEST-DistribDocExpirationUpdateProcessorTest.test-seed#[DA0EEC8B855FAF2C]) [    ] o.a.s.s.SolrDispatchFilter Loading solr.xml from SolrHome (not found in ZooKeeper)
   [junit4]   2> 1256875 INFO  (TEST-DistribDocExpirationUpdateProcessorTest.test-seed#[DA0EEC8B855FAF2C]) [    ] o.a.s.c.SolrXmlConfig Loading container configuration from /home/jenkins/workspace/Lucene-Solr-6.x-Linux/solr/build/solr-core/test/J1/temp/solr.cloud.DistribDocExpirationUpdateProcessorTest_DA0EEC8B855FAF2C-001/control-001/solr.xml
   [junit4]   2> 1256878 INFO  (TEST-DistribDocExpirationUpdateProcessorTest.test-seed#[DA0EEC8B855FAF2C]) [    ] o.a.s.c.CorePropertiesLocator Config-defined core root directory: /home/jenkins/workspace/Lucene-Solr-6.x-Linux/solr/build/solr-core/test/J1/../../../../../../../../../home/jenkins/workspace/Lucene-Solr-6.x-Linux/solr/build/solr-core/test/J1/temp/solr.cloud.DistribDocExpirationUpdateProcessorTest_DA0EEC8B855FAF2C-001/control-001/cores
   [junit4]   2> 1256878 INFO  (TEST-DistribDocExpirationUpdateProcessorTest.test-seed#[DA0EEC8B855FAF2C]) [    ] o.a.s.c.CoreContainer New CoreContainer 595444944
   [junit4]   2> 1256878 INFO  (TEST-DistribDocExpirationUpdateProcessorTest.test-seed#[DA0EEC8B855FAF2C]) [    ] o.a.s.c.CoreContainer Loading cores into CoreContainer [instanceDir=/home/jenkins/workspace/Lucene-Solr-6.x-Linux/solr/build/solr-core/test/J1/temp/solr.cloud.DistribDocExpirationUpdateProcessorTest_DA0EEC8B855FAF2C-001/control-001]
   [junit4]   2> 1256878 WARN  (TEST-DistribDocExpirationUpdateProcessorTest.test-seed#[DA0EEC8B855FAF2C]) [    ] o.a.s.c.CoreContainer Couldn't add files from /home/jenkins/workspace/Lucene-Solr-6.x-Linux/solr/build/solr-core/test/J1/temp/solr.cloud.DistribDocExpirationUpdateProcessorTest_DA0EEC8B855FAF2C-001/control-001/lib to classpath: /home/jenkins/workspace/Lucene-Solr-6.x-Linux/solr/build/solr-core/test/J1/temp/solr.cloud.DistribDocExpirationUpdateProcessorTest_DA0EEC8B855FAF2C-001/control-001/lib
   [junit4]   2> 1256879 INFO  (TEST-DistribDocExpirationUpdateProcessorTest.test-seed#[DA0EEC8B855FAF2C]) [    ] o.a.s.h.c.HttpShardHandlerFactory created with socketTimeout : 90000,urlScheme : ,connTimeout : 15000,maxConnectionsPerHost : 20,maxConnections : 10000,corePoolSize : 0,maximumPoolSize : 2147483647,maxThreadIdleTime : 5,sizeOfQueue : -1,fairnessPolicy : false,useRetries : false,
   [junit4]   2> 1256879 INFO  (TEST-DistribDocExpirationUpdateProcessorTest.test-seed#[DA0EEC8B855FAF2C]) [    ] o.a.s.u.UpdateShardHandler Creating UpdateShardHandler HTTP client with params: socketTimeout=340000&connTimeout=45000&retry=true
   [junit4]   2> 1256879 INFO  (TEST-DistribDocExpirationUpdateProcessorTest.test-seed#[DA0EEC8B855FAF2C]) [    ] o.a.s.l.LogWatcher SLF4J impl is org.slf4j.impl.Log4jLoggerFactory
   [junit4]   2> 1256879 INFO  (TEST-DistribDocExpirationUpdateProcessorTest.test-seed#[DA0EEC8B855FAF2C]) [    ] o.a.s.l.LogWatcher Registering Log Listener [Log4j (org.slf4j.impl.Log4jLoggerFactory)]
   [junit4]   2> 1256880 INFO  (TEST-DistribDocExpirationUpdateProcessorTest.test-seed#[DA0EEC8B855FAF2C]) [    ] o.a.s.c.ZkContainer Zookeeper client=127.0.0.1:40319/solr
   [junit4]   2> 1256880 INFO  (TEST-DistribDocExpirationUpdateProcessorTest.test-seed#[DA0EEC8B855FAF2C]) [    ] o.a.s.c.ZkController zkHost includes chroot
   [junit4]   2> 1256880 INFO  (TEST-DistribDocExpirationUpdateProcessorTest.test-seed#[DA0EEC8B855FAF2C]) [    ] o.a.s.c.c.SolrZkClient Using default ZkCredentialsProvider
   [junit4]   2> 1256880 INFO  (TEST-DistribDocExpirationUpdateProcessorTest.test-seed#[DA0EEC8B855FAF2C]) [    ] o.a.s.c.c.ConnectionManager Waiting for client to connect to ZooKeeper
   [junit4]   2> 1256880 INFO  (zkCallback-1953-thread-1) [    ] o.a.s.c.c.ConnectionManager Watcher org.apache.solr.common.cloud.ConnectionManager@5c90d6e1 name:ZooKeeperConnection Watcher:127.0.0.1:40319 got event WatchedEvent state:SyncConnected type:None path:null path:null type:None
   [junit4]   2> 1256881 INFO  (TEST-DistribDocExpirationUpdateProcessorTest.test-seed#[DA0EEC8B855FAF2C]) [    ] o.a.s.c.c.ConnectionManager Client is connected to ZooKeeper
   [junit4]   2> 1256881 INFO  (TEST-DistribDocExpirationUpdateProcessorTest.test-seed#[DA0EEC8B855FAF2C]) [    ] o.a.s.c.c.SolrZkClient Using default ZkACLProvider
   [junit4]   2> 1256882 INFO  (TEST-DistribDocExpirationUpdateProcessorTest.test-seed#[DA0EEC8B855FAF2C]) [    ] o.a.s.c.c.ConnectionManager Waiting for client to connect to ZooKeeper
   [junit4]   2> 1256882 INFO  (zkCallback-1954-thread-1) [    ] o.a.s.c.c.ConnectionManager Watcher org.apache.solr.common.cloud.ConnectionManager@7233c366 name:ZooKeeperConnection Watcher:127.0.0.1:40319/solr got event WatchedEvent state:SyncConnected type:None path:null path:null type:None
   [junit4]   2> 1256882 INFO  (TEST-DistribDocExpirationUpdateProcessorTest.test-seed#[DA0EEC8B855FAF2C]) [    ] o.a.s.c.c.ConnectionManager Client is connected to ZooKeeper
   [junit4]   2> 1256883 INFO  (TEST-DistribDocExpirationUpdateProcessorTest.test-seed#[DA0EEC8B855FAF2C]) [    ] o.a.s.c.c.SolrZkClient makePath: /overseer/queue
   [junit4]   2> 1256883 INFO  (TEST-DistribDocExpirationUpdateProcessorTest.test-seed#[DA0EEC8B855FAF2C]) [    ] o.a.s.c.c.SolrZkClient makePath: /overseer/collection-queue-work
   [junit4]   2> 1256884 INFO  (TEST-DistribDocExpirationUpdateProcessorTest.test-seed#[DA0EEC8B855FAF2C]) [    ] o.a.s.c.c.SolrZkClient makePath: /overseer/collection-map-running
   [junit4]   2> 1256885 INFO  (TEST-DistribDocExpirationUpdateProcessorTest.test-seed#[DA0EEC8B855FAF2C]) [    ] o.a.s.c.c.SolrZkClient makePath: /overseer/collection-map-completed
   [junit4]   2> 1256885 INFO  (TEST-DistribDocExpirationUpdateProcessorTest.test-seed#[DA0EEC8B855FAF2C]) [    ] o.a.s.c.c.SolrZkClient makePath: /overseer/collection-map-failure
   [junit4]   2> 1256886 INFO  (TEST-DistribDocExpirationUpdateProcessorTest.test-seed#[DA0EEC8B855FAF2C]) [    ] o.a.s.c.c.SolrZkClient makePath: /live_nodes
   [junit4]   2> 1256886 INFO  (TEST-DistribDocExpirationUpdateProcessorTest.test-seed#[DA0EEC8B855FAF2C]) [    ] o.a.s.c.c.SolrZkClient makePath: /aliases.json
   [junit4]   2> 1256887 INFO  (TEST-DistribDocExpirationUpdateProcessorTest.test-seed#[DA0EEC8B855FAF2C]) [    ] o.a.s.c.c.SolrZkClient makePath: /clusterstate.json
   [junit4]   2> 1256887 INFO  (TEST-DistribDocExpirationUpdateProcessorTest.test-seed#[DA0EEC8B855FAF2C]) [    ] o.a.s.c.c.SolrZkClient makePath: /security.json
   [junit4]   2> 1256887 INFO  (TEST-DistribDocExpirationUpdateProcessorTest.test-seed#[DA0EEC8B855FAF2C]) [    ] o.a.s.c.c.ZkStateReader Updating cluster state from ZooKeeper... 
   [junit4]   2> 1256888 INFO  (TEST-DistribDocExpirationUpdateProcessorTest.test-seed#[DA0EEC8B855FAF2C]) [    ] o.a.s.c.c.ZkStateReader Updated live nodes from ZooKeeper... (0) -> (0)
   [junit4]   2> 1256888 INFO  (TEST-DistribDocExpirationUpdateProcessorTest.test-seed#[DA0EEC8B855FAF2C]) [    ] o.a.s.c.c.SolrZkClient makePath: /overseer_elect
   [junit4]   2> 1256888 INFO  (TEST-DistribDocExpirationUpdateProcessorTest.test-seed#[DA0EEC8B855FAF2C]) [    ] o.a.s.c.c.SolrZkClient makePath: /overseer_elect/election
   [junit4]   2> 1256889 INFO  (TEST-DistribDocExpirationUpdateProcessorTest.test-seed#[DA0EEC8B855FAF2C]) [    ] o.a.s.c.Overseer Overseer (id=null) closing
   [junit4]   2> 1256889 INFO  (TEST-DistribDocExpirationUpdateProcessorTest.test-seed#[DA0EEC8B855FAF2C]) [    ] o.a.s.c.LeaderElector Joined leadership election with path: /overseer_elect/election/95706748106637316-127.0.0.1:43035_-n_0000000000
   [junit4]   2> 1256889 INFO  (TEST-DistribDocExpirationUpdateProcessorTest.test-seed#[DA0EEC8B855FAF2C]) [    ] o.a.s.c.OverseerElectionContext I am going to be the leader 127.0.0.1:43035_
   [junit4]   2> 1256889 INFO  (TEST-DistribDocExpirationUpdateProcessorTest.test-seed#[DA0EEC8B855FAF2C]) [    ] o.a.s.c.c.SolrZkClient makePath: /overseer_elect/leader
   [junit4]   2> 1256889 INFO  (TEST-DistribDocExpirationUpdateProcessorTest.test-seed#[DA0EEC8B855FAF2C]) [    ] o.a.s.c.Overseer Overseer (id=95706748106637316-127.0.0.1:43035_-n_0000000000) starting
   [junit4]   2> 1256890 INFO  (TEST-DistribDocExpirationUpdateProcessorTest.test-seed#[DA0EEC8B855FAF2C]) [    ] o.a.s.c.c.SolrZkClient makePath: /overseer/queue-work
   [junit4]   2> 1256891 INFO  (TEST-DistribDocExpirationUpdateProcessorTest.test-seed#[DA0EEC8B855FAF2C]) [    ] o.a.s.c.OverseerAutoReplicaFailoverThread Starting OverseerAutoReplicaFailoverThread autoReplicaFailoverWorkLoopDelay=10000 autoReplicaFailoverWaitAfterExpiration=30000 autoReplicaFailoverBadNodeExpiration=60000
   [junit4]   2> 1256891 INFO  (OverseerCollectionConfigSetProcessor-95706748106637316-127.0.0.1:43035_-n_0000000000) [    ] o.a.s.c.OverseerTaskProcessor Process current queue of overseer operations
   [junit4]   2> 1256891 INFO  (TEST-DistribDocExpirationUpdateProcessorTest.test-seed#[DA0EEC8B855FAF2C]) [    ] o.a.s.c.ZkController Register node as live in ZooKeeper:/live_nodes/127.0.0.1:43035_
   [junit4]   2> 1256891 INFO  (OverseerStateUpdate-95706748106637316-127.0.0.1:43035_-n_0000000000) [    ] o.a.s.c.Overseer Starting to work on the main queue
   [junit4]   2> 1256891 INFO  (TEST-DistribDocExpirationUpdateProcessorTest.test-seed#[DA0EEC8B855FAF2C]) [    ] o.a.s.c.c.SolrZkClient makePath: /live_nodes/127.0.0.1:43035_
   [junit4]   2> 1256892 INFO  (OverseerStateUpdate-95706748106637316-127.0.0.1:43035_-n_0000000000) [    ] o.a.s.c.c.ZkStateReader Updated live nodes from ZooKeeper... (0) -> (0)
   [junit4]   2> 1256892 INFO  (zkCallback-1954-thread-1) [    ] o.a.s.c.c.ZkStateReader A live node change: [WatchedEvent state:SyncConnected type:NodeChildrenChanged path:/live_nodes], has occurred - updating... (live nodes size: [0])
   [junit4]   2> 1256893 INFO  (zkCallback-1954-thread-1) [    ] o.a.s.c.c.ZkStateReader Updated live nodes from ZooKeeper... (0) -> (1)
   [junit4]   2> 1256897 INFO  (TEST-DistribDocExpirationUpdateProcessorTest.test-seed#[DA0EEC8B855FAF2C]) [    ] o.a.s.c.CoreContainer Security conf doesn't exist. Skipping setup for authorization module.
   [junit4]   2> 1256897 INFO  (TEST-DistribDocExpirationUpdateProcessorTest.test-seed#[DA0EEC8B855FAF2C]) [    ] o.a.s.c.CoreContainer No authentication plugin used.
   [junit4]   2> 1256897 INFO  (TEST-DistribDocExpirationUpdateProcessorTest.test-seed#[DA0EEC8B855FAF2C]) [    ] o.a.s.c.CorePropertiesLocator Looking for core definitions underneath /home/jenkins/workspace/Lucene-Solr-6.x-Linux/solr/build/solr-core/test/J1/../../../../../../../../../home/jenkins/workspace/Lucene-Solr-6.x-Linux/solr/build/solr-core/test/J1/temp/solr.cloud.DistribDocExpirationUpdateProcessorTest_DA0EEC8B855FAF2C-001/control-001/cores
   [junit4]   2> 1256898 INFO  (TEST-DistribDocExpirationUpdateProcessorTest.test-seed#[DA0EEC8B855FAF2C]) [    ] o.a.s.c.CoreDescriptor Created CoreDescriptor: {name=collection1, config=solrconfig.xml, transient=false, schema=schema.xml, loadOnStartup=true, configSetProperties=configsetprops.json, collection=control_collection, coreNodeName=, dataDir=data/, shard=}
   [junit4]   2> 1256898 INFO  (TEST-DistribDocExpirationUpdateProcessorTest.test-seed#[DA0EEC8B855FAF2C]) [    ] o.a.s.c.CorePropertiesLocator Found core collection1 in /home/jenkins/workspace/Lucene-Solr-6.x-Linux/solr/build/solr-core/test/J1/../../../../../../../../../home/jenkins/workspace/Lucene-Solr-6.x-Linux/solr/build/solr-core/test/J1/temp/solr.cloud.DistribDocExpirationUpdateProcessorTest_DA0EEC8B855FAF2C-001/control-001/cores/collection1
   [junit4]   2> 1256898 INFO  (TEST-DistribDocExpirationUpdateProcessorTest.test-seed#[DA0EEC8B855FAF2C]) [    ] o.a.s.c.CorePropertiesLocator Found 1 core definitions
   [junit4]   2> 1256898 INFO  (TEST-DistribDocExpirationUpdateProcessorTest.test-seed#[DA0EEC8B855FAF2C]) [    ] o.a.s.s.SolrDispatchFilter user.dir=/home/jenkins/workspace/Lucene-Solr-6.x-Linux/solr/build/solr-core/test/J1
   [junit4]   2> 1256898 INFO  (TEST-DistribDocExpirationUpdateProcessorTest.test-seed#[DA0EEC8B855FAF2C]) [    ] o.a.s.s.SolrDispatchFilter SolrDispatchFilter.init() done
   [junit4]   2> 1256898 INFO  (coreLoadExecutor-5914-thread-1) [    ] o.a.s.c.ZkController publishing state=down
   [junit4]   2> 1256898 INFO  (coreLoadExecutor-5914-thread-1) [    ] o.a.s.c.ZkController numShards not found on descriptor - reading it from system property
   [junit4]   2> 1256899 INFO  (OverseerStateUpdate-95706748106637316-127.0.0.1:43035_-n_0000000000) [    ] o.a.s.c.Overseer processMessage: queueSize: 1, message = {
   [junit4]   2>   "core":"collection1",
   [junit4]   2>   "roles":null,
   [junit4]   2>   "base_url":"http://127.0.0.1:43035",
   [junit4]   2>   "node_name":"127.0.0.1:43035_",
   [junit4]   2>   "numShards":"1",
   [junit4]   2>   "state":"down",
   [junit4]   2>   "shard":null,
   [junit4]   2>   "collection":"control_collection",
   [junit4]   2>   "operation":"state"} current state version: 0
   [junit4]   2> 1256899 INFO  (coreLoadExecutor-5914-thread-1) [    ] o.a.s.c.ZkController look for our core node name
   [junit4]   2> 1256899 INFO  (OverseerStateUpdate-95706748106637316-127.0.0.1:43035_-n_0000000000) [    ] o.a.s.c.o.ReplicaMutator Update state numShards=1 message={
   [junit4]   2>   "core":"collection1",
   [junit4]   2>   "roles":null,
   [junit4]   2>   "base_url":"http://127.0.0.1:43035",
   [junit4]   2>   "node_name":"127.0.0.1:43035_",
   [junit4]   2>   "numShards":"1",
   [junit4]   2>   "state":"down",
   [junit4]   2>   "shard":null,
   [junit4]   2>   "collection":"control_collection",
   [junit4]   2>   "operation":"state"}
   [junit4]   2> 1256899 INFO  (OverseerStateUpdate-95706748106637316-127.0.0.1:43035_-n_0000000000) [    ] o.a.s.c.o.ClusterStateMutator building a new cName: control_collection
   [junit4]   2> 1256899 INFO  (OverseerStateUpdate-95706748106637316-127.0.0.1:43035_-n_0000000000) [    ] o.a.s.c.o.ReplicaMutator Assigning new node to shard shard=shard1
   [junit4]   2> 1256900 INFO  (zkCallback-1954-thread-1) [    ] o.a.s.c.c.ZkStateReader A cluster state change: [WatchedEvent state:SyncConnected type:NodeDataChanged path:/clusterstate.json], has occurred - updating... (live nodes size: [1])
   [junit4]   2> 1257899 INFO  (coreLoadExecutor-5914-thread-1) [    ] o.a.s.c.ZkController waiting to find shard id in clusterstate for collection1
   [junit4]   2> 1257899 INFO  (coreLoadExecutor-5914-thread-1) [    ] o.a.s.c.ZkController Check for collection zkNode:control_collection
   [junit4]   2> 1257899 INFO  (coreLoadExecutor-5914-thread-1) [    ] o.a.s.c.ZkController Collection zkNode exists
   [junit4]   2> 1257900 INFO  (coreLoadExecutor-5914-thread-1) [    ] o.a.s.c.c.ZkStateReader Load collection config from: [/collections/control_collection]
   [junit4]   2> 1257900 INFO  (coreLoadExecutor-5914-thread-1) [    ] o.a.s.c.c.ZkStateReader path=[/collections/control_collection] [configName]=[conf1] specified config exists in ZooKeeper
   [junit4]   2> 1257900 INFO  (coreLoadExecutor-5914-thread-1) [    ] o.a.s.c.SolrResourceLoader new SolrResourceLoader for directory: '/home/jenkins/workspace/Lucene-Solr-6.x-Linux/solr/build/solr-core/test/J1/temp/solr.cloud.DistribDocExpirationUpdateProcessorTest_DA0EEC8B855FAF2C-001/control-001/cores/collection1'
   [junit4]   2> 1257900 INFO  (coreLoadExecutor-5914-thread-1) [    ] o.a.s.c.SolrResourceLoader JNDI not configured for solr (NoInitialContextEx)
   [junit4]   2> 1257900 INFO  (coreLoadExecutor-5914-thread-1) [    ] o.a.s.c.SolrResourceLoader solr home defaulted to 'solr/' (could not find system property or JNDI)
   [junit4]   2> 1257901 INFO  (coreLoadExecutor-5914-thread-1) [    ] o.a.s.c.Config loaded config solrconfig.xml with version 0 
   [junit4]   2> 1257913 INFO  (coreLoadExecutor-5914-thread-1) [    ] o.a.s.c.SolrConfig current version of requestparams : -1
   [junit4]   2> 1257915 WARN  (coreLoadExecutor-5914-thread-1) [    ] o.a.s.c.Config Beginning with Solr 5.5, <mergePolicy> is deprecated, use <mergePolicyFactory> instead.
   [junit4]   2> 1257915 INFO  (coreLoadExecutor-5914-thread-1) [    ] o.a.s.c.SolrConfig Using Lucene MatchVersion: 6.1.0
   [junit4]   2> 1257920 INFO  (coreLoadExecutor-5914-thread-1) [    ] o.a.s.c.SolrConfig Loaded SolrConfig: solrconfig.xml
   [junit4]   2> 1257923 INFO  (coreLoadExecutor-5914-thread-1) [    ] o.a.s.s.IndexSchema [collection1] Schema name=test
   [junit4]   2> 1257976 INFO  (coreLoadExecutor-5914-thread-1) [    ] o.a.s.s.IndexSchema default search field in schema is text
   [junit4]   2> 1257976 INFO  (coreLoadExecutor-5914-thread-1) [    ] o.a.s.s.IndexSchema unique key field: id
   [junit4]   2> 1257977 INFO  (coreLoadExecutor-5914-thread-1) [    ] o.a.s.s.FileExchangeRateProvider Reloading exchange rates from file currency.xml
   [junit4]   2> 1257978 INFO  (coreLoadExecutor-5914-thread-1) [    ] o.a.s.s.FileExchangeRateProvider Reloading exchange rates from file currency.xml
   [junit4]   2> 1257983 INFO  (coreLoadExecutor-5914-thread-1) [    ] o.a.s.c.ConfigSetProperties Did not find ConfigSet properties, assuming default properties: Can't find resource 'configsetprops.json' in classpath or '/configs/conf1', cwd=/home/jenkins/workspace/Lucene-Solr-6.x-Linux/solr/build/solr-core/test/J1
   [junit4]   2> 1257984 INFO  (coreLoadExecutor-5914-thread-1) [    ] o.a.s.c.CoreContainer Creating SolrCore 'collection1' using configuration from collection control_collection
   [junit4]   2> 1257984 INFO  (coreLoadExecutor-5914-thread-1) [    ] o.a.s.c.SolrCore org.apache.solr.core.MockDirectoryFactory
   [junit4]   2> 1257984 INFO  (coreLoadExecutor-5914-thread-1) [    ] o.a.s.c.SolrCore [[collection1] ] Opening new SolrCore at [/home/jenkins/workspace/Lucene-Solr-6.x-Linux/solr/build/solr-core/test/J1/temp/solr.cloud.DistribDocExpirationUpdateProcessorTest_DA0EEC8B855FAF2C-001/control-001/cores/collection1], dataDir=[/home/jenkins/workspace/Lucene-Solr-6.x-Linux/solr/build/solr-core/test/J1/../../../../../../../../../home/jenkins/workspace/Lucene-Solr-6.x-Linux/solr/build/solr-core/test/J1/temp/solr.cloud.DistribDocExpirationUpdateProcessorTest_DA0EEC8B855FAF2C-001/control-001/cores/collection1/data/]
   [junit4]   2> 1257984 INFO  (coreLoadExecutor-5914-thread-1) [    ] o.a.s.c.SolrCore JMX monitoring not detected for core: collection1
   [junit4]   2> 1257984 INFO  (coreLoadExecutor-5914-thread-1) [    ] o.a.s.c.CachingDirectoryFactory return new directory for /home/jenkins/workspace/Lucene-Solr-6.x-Linux/solr/build/solr-core/test/J1/../../../../../../../../../home/jenkins/workspace/Lucene-Solr-6.x-Linux/solr/build/solr-core/test/J1/temp/solr.cloud.DistribDocExpirationUpdateProcessorTest_DA0EEC8B855FAF2C-001/control-001/cores/collection1/data
   [junit4]   2> 1257984 INFO  (coreLoadExecutor-5914-thread-1) [    ] o.a.s.c.SolrCore New index directory detected: old=null new=/home/jenkins/workspace/Lucene-Solr-6.x-Linux/solr/build/solr-core/test/J1/../../../../../../../../../home/jenkins/workspace/Lucene-Solr-6.x-Linux/solr/build/solr-core/test/J1/temp/solr.cloud.DistribDocExpirationUpdateProcessorTest_DA0EEC8B855FAF2C-001/control-001/cores/collection1/data/index/
   [junit4]   2> 1257984 WARN  (coreLoadExecutor-5914-thread-1) [    ] o.a.s.c.SolrCore [collection1] Solr index directory '/home/jenkins/workspace/Lucene-Solr-6.x-Linux/solr/build/solr-core/test/J1/../../../../../../../../../home/jenkins/workspace/Lucene-Solr-6.x-Linux/solr/build/solr-core/test/J1/temp/solr.cloud.DistribDocExpirationUpdateProcessorTest_DA0EEC8B855FAF2C-001/control-001/cores/collection1/data/index' doesn't exist. Creating new index...
   [junit4]   2> 1257984 INFO  (coreLoadExecutor-5914-thread-1) [    ] o.a.s.c.CachingDirectoryFactory return new directory for /home/jenkins/workspace/Lucene-Solr-6.x-Linux/solr/build/solr-core/test/J1/../../../../../../../../../home/jenkins/workspace/Lucene-Solr-6.x-Linux/solr/build/solr-core/test/J1/temp/solr.cloud.DistribDocExpirationUpdateProcessorTest_DA0EEC8B855FAF2C-001/control-001/cores/collection1/data/index
   [junit4]   2> 1257985 INFO  (coreLoadExecutor-5914-thread-1) [    ] o.a.s.u.RandomMergePolicy RandomMergePolicy wrapping class org.apache.lucene.index.TieredMergePolicy: [TieredMergePolicy: maxMergeAtOnce=34, maxMergeAtOnceExplicit=30, maxMergedSegmentMB=4.421875, floorSegmentMB=0.29296875, forceMergeDeletesPctAllowed=12.334096912585608, segmentsPerTier=22.0, maxCFSSegmentSizeMB=8.796093022207999E12, noCFSRatio=1.0
   [junit4]   2> 1257985 INFO  (coreLoadExecutor-5914-thread-1) [    ] o.a.s.c.SolrDeletionPolicy SolrDeletionPolicy.onCommit: commits: num=1
   [junit4]   2> 	commit{dir=MockDirectoryWrapper(RAMDirectory@2fbb9329 lockFactory=org.apache.lucene.store.SingleInstanceLockFactory@547af3ee),segFN=segments_1,generation=1}
   [junit4]   2> 1257985 INFO  (coreLoadExecutor-5914-thread-1) [    ] o.a.s.c.SolrDeletionPolicy newest commit generation = 1
   [junit4]   2> 1257985 INFO  (OldIndexDirectoryCleanupThreadForCore-collection1) [    ] o.a.s.c.SolrCore Looking for old index directories to cleanup for core collection1 in /home/jenkins/workspace/Lucene-Solr-6.x-Linux/solr/build/solr-core/test/J1/../../../../../../../../../home/jenkins/workspace/Lucene-Solr-6.x-Linux/solr/build/solr-core/test/J1/temp/solr.cloud.DistribDocExpirationUpdateProcessorTest_DA0EEC8B855FAF2C-001/control-001/cores/collection1/data/
   [junit4]   2> 1257985 WARN  (OldIndexDirectoryCleanupThreadForCore-collection1) [    ] o.a.s.c.DirectoryFactory /home/jenkins/workspace/Lucene-Solr-6.x-Linux/solr/build/solr-core/test/J1/../../../../../../../../../home/jenkins/workspace/Lucene-Solr-6.x-Linux/solr/build/solr-core/test/J1/temp/solr.cloud.DistribDocExpirationUpdateProcessorTest_DA0EEC8B855FAF2C-001/control-001/cores/collection1/data/ does not point to a valid data directory; skipping clean-up of old index directories.
   [junit4]   2> 1257986 INFO  (coreLoadExecutor-5914-thread-1) [    ] o.a.s.u.p.UpdateRequestProcessorChain creating updateRequestProcessorChain "convert-ttl-defaults"
   [junit4]   2> 1257992 INFO  (coreLoadExecutor-5914-thread-1) [    ] o.a.s.u.p.UpdateRequestProcessorChain creating updateRequestProcessorChain "convert-ttl-field"
   [junit4]   2> 1257992 INFO  (coreLoadExecutor-5914-thread-1) [    ] o.a.s.u.p.UpdateRequestProcessorChain creating updateRequestProcessorChain "convert-ttl-param"
   [junit4]   2> 1257992 INFO  (coreLoadExecutor-5914-thread-1) [    ] o.a.s.u.p.UpdateRequestProcessorChain creating updateRequestProcessorChain "convert-ttl-field-with-param-default"
   [junit4]   2> 1257992 INFO  (coreLoadExecutor-5914-thread-1) [    ] o.a.s.u.p.UpdateRequestProcessorChain creating updateRequestProcessorChain "scheduled-delete" (default)
   [junit4]   2> 1257998 INFO  (coreLoadExecutor-5914-thread-1) [    ] o.a.s.u.p.UpdateRequestProcessorChain inserting DistributedUpdateProcessorFactory into updateRequestProcessorChain "scheduled-delete" (default)
   [junit4]   2> 1257999 INFO  (coreLoadExecutor-5914-thread-1) [    ] o.a.s.h.l.XMLLoader xsltCacheLifetimeSeconds=60
   [junit4]   2> 1257999 INFO  (coreLoadExecutor-5914-thread-1) [    ] o.a.s.h.l.XMLLoader xsltCacheLifetimeSeconds=60
   [junit4]   2> 1257999 INFO  (coreLoadExecutor-5914-thread-1) [    ] o.a.s.h.l.XMLLoader xsltCacheLifetimeSeconds=60
   [junit4]   2> 1258000 INFO  (coreLoadExecutor-5914-thread-1) [    ] o.a.s.h.l.XMLLoader xsltCacheLifetimeSeconds=60
   [junit4]   2> 1258000 INFO  (coreLoadExecutor-5914-thread-1) [    ] o.a.s.c.RequestHandlers Registered paths: /admin/mbeans,,/update/csv,/sql,/update/json/docs,/admin/luke,/export,/select,/admin/segments,/get,/admin/system,/replication,/admin/properties,/config,/stream,/schema,/admin/plugins,/admin/logging,/update/json,/admin/ping,/admin/threads,/update,/admin/file
   [junit4]   2> 1258000 INFO  (coreLoadExecutor-5914-thread-1) [    ] o.a.s.c.SolrCore Using default statsCache cache: org.apache.solr.search.stats.LocalStatsCache
   [junit4]   2> 1258001 INFO  (coreLoadExecutor-5914-thread-1) [    ] o.a.s.u.UpdateHandler Using UpdateLog implementation: org.apache.solr.update.UpdateLog
   [junit4]   2> 1258001 INFO  (coreLoadExecutor-5914-thread-1) [    ] o.a.s.u.UpdateLog Initializing UpdateLog: dataDir= defaultSyncLevel=FLUSH numRecordsToKeep=100 maxNumLogsToKeep=10 numVersionBuckets=65536
   [junit4]   2> 1258001 INFO  (coreLoadExecutor-5914-thread-1) [    ] o.a.s.u.CommitTracker Hard AutoCommit: disabled
   [junit4]   2> 1258001 INFO  (coreLoadExecutor-5914-thread-1) [    ] o.a.s.u.CommitTracker Soft AutoCommit: disabled
   [junit4]   2> 1258002 INFO  (coreLoadExecutor-5914-thread-1) [    ] o.a.s.u.RandomMergePolicy RandomMergePolicy wrapping class org.apache.lucene.index.LogByteSizeMergePolicy: [LogByteSizeMergePolicy: minMergeSize=1677721, mergeFactor=27, maxMergeSize=2147483648, maxMergeSizeForForcedMerge=9223372036854775807, calibrateSizeByDeletes=true, maxMergeDocs=2147483647, maxCFSSegmentSizeMB=8.796093022207999E12, noCFSRatio=0.562846891021848]
   [junit4]   2> 1258002 INFO  (coreLoadExecutor-5914-thread-1) [    ] o.a.s.c.SolrDeletionPolicy SolrDeletionPolicy.onInit: commits: num=1
   [junit4]   2> 	commit{dir=MockDirectoryWrapper(RAMDirectory@2fbb9329 lockFactory=org.apache.lucene.store.SingleInstanceLockFactory@547af3ee),segFN=segments_1,generation=1}
   [junit4]   2> 1258002 INFO  (coreLoadExecutor-5914-thread-1) [    ] o.a.s.c.SolrDeletionPolicy newest commit generation = 1
   [junit4]   2> 1258002 INFO  (coreLoadExecutor-5914-thread-1) [    ] o.a.s.s.SolrIndexSearcher Opening [Searcher@d9332f0[collection1] main]
   [junit4]   2> 1258002 INFO  (coreLoadExecutor-5914-thread-1) [    ] o.a.s.c.c.ZkStateReader Load collection config from: [/collections/control_collection]
   [junit4]   2> 1258002 INFO  (coreLoadExecutor-5914-thread-1) [    ] o.a.s.c.c.ZkStateReader path=[/collections/control_collection] [configName]=[conf1] specified config exists in ZooKeeper
   [junit4]   2> 1258002 INFO  (coreLoadExecutor-5914-thread-1) [    ] o.a.s.r.ManagedResourceStorage Setting up ZooKeeper-based storage for the RestManager with znodeBase: /configs/conf1
   [junit4]   2> 1258002 INFO  (coreLoadExecutor-5914-thread-1) [    ] o.a.s.r.ManagedResourceStorage Configured ZooKeeperStorageIO with znodeBase: /configs/conf1
   [junit4]   2> 1258002 INFO  (coreLoadExecutor-5914-thread-1) [    ] o.a.s.r.RestManager Initializing RestManager with initArgs: {}
   [junit4]   2> 1258003 INFO  (coreLoadExecutor-5914-thread-1) [    ] o.a.s.r.ManagedResourceStorage Reading _rest_managed.json using ZooKeeperStorageIO:path=/configs/conf1
   [junit4]   2> 1258003 INFO  (coreLoadExecutor-5914-thread-1) [    ] o.a.s.r.ManagedResourceStorage No data found for znode /configs/conf1/_rest_managed.json
   [junit4]   2> 1258003 INFO  (coreLoadExecutor-5914-thread-1) [    ] o.a.s.r.ManagedResourceStorage Loaded null at path _rest_managed.json using ZooKeeperStorageIO:path=/configs/conf1
   [junit4]   2> 1258003 INFO  (coreLoadExecutor-5914-thread-1) [    ] o.a.s.r.RestManager Initializing 0 registered ManagedResources
   [junit4]   2> 1258007 INFO  (coreLoadExecutor-5914-thread-1) [    ] o.a.s.h.ReplicationHandler Commits will be reserved for  10000
   [junit4]   2> 1258007 INFO  (searcherExecutor-5915-thread-1) [    ] o.a.s.c.SolrCore [collection1] Registered new searcher Searcher@d9332f0[collection1] main{ExitableDirectoryReader(UninvertingDirectoryReader())}
   [junit4]   2> 1258007 INFO  (coreLoadExecutor-5914-thread-1) [    ] o.a.s.u.UpdateLog Looking up max value of version field to seed version buckets
   [junit4]   2> 1258007 INFO  (coreLoadExecutor-5914-thread-1) [    ] o.a.s.u.VersionInfo Refreshing highest value of _version_ for 65536 version buckets from index
   [junit4]   2> 1258007 INFO  (coreLoadExecutor-5914-thread-1) [    ] o.a.s.u.VersionInfo No terms found for _version_, cannot seed version bucket highest value from index
   [junit4]   2> 1258007 INFO  (coreLoadExecutor-5914-thread-1) [    ] o.a.s.u.UpdateLog Could not find max version in index or recent updates, using new clock 1531307971070394368
   [junit4]   2> 1258009 INFO  (coreLoadExecutor-5914-thread-1) [    ] o.a.s.u.UpdateLog Took 2.0ms to seed version buckets with highest version 1531307971070394368
   [junit4]   2> 1258010 INFO  (coreLoadExecutor-5914-thread-1) [    ] o.a.s.c.ZkController watch zkdir /configs/conf1
   [junit4]   2> 1258010 INFO  (coreLoadExecutor-5914-thread-1) [    ] o.a.s.c.CoreContainer registering core: collection1
   [junit4]   2> 1258010 INFO  (coreZkRegister-5908-thread-1) [    ] o.a.s.c.ZkController Register replica - core:collection1 address:http://127.0.0.1:43035 collection:control_collection shard:shard1
   [junit4]   2> 1258010 INFO  (coreZkRegister-5908-thread-1) [    ] o.a.s.c.c.SolrZkClient makePath: /collections/control_collection/leader_elect/shard1/election
   [junit4]   2> 1258011 INFO  (coreZkRegister-5908-thread-1) [    ] o.a.s.c.LeaderElector Joined leadership election with path: /collections/control_collection/leader_elect/shard1/election/95706748106637316-core_node1-n_0000000000
   [junit4]   2> 1258011 INFO  (coreZkRegister-5908-thread-1) [    ] o.a.s.c.ShardLeaderElectionContext Running the leader process for shard=shard1 and weAreReplacement=false and leaderVoteWait=10000
   [junit4]   2> 1258012 INFO  (coreZkRegister-5908-thread-1) [    ] o.a.s.c.ShardLeaderElectionContext Enough replicas found to continue.
   [junit4]   2> 1258012 INFO  (coreZkRegister-5908-thread-1) [    ] o.a.s.c.ShardLeaderElectionContext I may be the new leader - try and sync
   [junit4]   2> 1258012 INFO  (coreZkRegister-5908-thread-1) [    ] o.a.s.c.SyncStrategy Sync replicas to http://127.0.0.1:43035/collection1/
   [junit4]   2> 1258012 INFO  (coreZkRegister-5908-thread-1) [    ] o.a.s.c.SyncStrategy Sync Success - now sync replicas to me
   [junit4]   2> 1258012 INFO  (coreZkRegister-5908-thread-1) [    ] o.a.s.c.SyncStrategy http://127.0.0.1:43035/collection1/ has no replicas
   [junit4]   2> 1258012 INFO  (OverseerStateUpdate-95706748106637316-127.0.0.1:43035_-n_0000000000) [    ] o.a.s.c.Overseer processMessage: queueSize: 1, message = {
   [junit4]   2>   "operation":"leader",
   [junit4]   2>   "shard":"shard1",
   [junit4]   2>   "collection":"control_collection"} current state version: 1
   [junit4]   2> 1258012 INFO  (coreZkRegister-5908-thread-1) [    ] o.a.s.c.c.SolrZkClient makePath: /collections/control_collection/leaders/shard1
   [junit4]   2> 1258013 INFO  (coreZkRegister-5908-thread-1) [    ] o.a.s.c.ShardLeaderElectionContextBase Creating leader registration node /collections/control_collection/leaders/shard1/leader after winning as /collections/control_collection/leader_elect/shard1/election/95706748106637316-core_node1-n_0000000000
   [junit4]   2> 1258014 INFO  (coreZkRegister-5908-thread-1) [    ] o.a.s.c.ShardLeaderElectionContext I am the new leader: http://127.0.0.1:43035/collection1/ shard1
   [junit4]   2> 1258014 INFO  (OverseerStateUpdate-95706748106637316-127.0.0.1:43035_-n_0000000000) [    ] o.a.s.c.Overseer processMessage: queueSize: 1, message = {
   [junit4]   2>   "operation":"leader",
   [junit4]   2>   "shard":"shard1",
   [junit4]   2>   "collection":"control_collection",
   [junit4]   2>   "base_url":"http://127.0.0.1:43035",
   [junit4]   2>   "core":"collection1",
   [junit4]   2>   "state":"active"} current state version: 1
   [junit4]   2> 1258115 INFO  (zkCallback-1954-thread-1) [    ] o.a.s.c.c.ZkStateReader A cluster state change: [WatchedEvent state:SyncConnected type:NodeDataChanged path:/clusterstate.json], has occurred - updating... (live nodes size: [1])
   [junit4]   2> 1258164 INFO  (coreZkRegister-5908-thread-1) [    ] o.a.s.c.ZkController We are http://127.0.0.1:43035/collection1/ and leader is http://127.0.0.1:43035/collection1/
   [junit4]   2> 1258164 INFO  (coreZkRegister-5908-thread-1) [    ] o.a.s.c.ZkController No LogReplay needed for core=collection1 baseURL=http://127.0.0.1:43035
   [junit4]   2> 1258164 INFO  (coreZkRegister-5908-thread-1) [    ] o.a.s.c.ZkController I am the leader, no recovery necessary
   [junit4]   2> 1258164 INFO  (coreZkRegister-5908-thread-1) [    ] o.a.s.c.ZkController publishing state=active
   [junit4]   2> 1258165 INFO  (coreZkRegister-5908-thread-1) [    ] o.a.s.c.ZkController numShards not found on descriptor - reading it from system property
   [junit4]   2> 1258165 INFO  (OverseerStateUpdate-95706748106637316-127.0.0.1:43035_-n_0000000000) [    ] o.a.s.c.Overseer processMessage: queueSize: 1, message = {
   [junit4]   2>   "core":"collection1",
   [junit4]   2>   "core_node_name":"core_node1",
   [junit4]   2>   "roles":null,
   [junit4]   2>   "base_url":"http://127.0.0.1:43035",
   [junit4]   2>   "node_name":"127.0.0.1:43035_",
   [junit4]   2>   "numShards":"1",
   [junit4]   2>   "state":"active",
   [junit4]   2>   "shard":"shard1",
   [junit4]   2>   "collection":"control_collection",
   [junit4]   2>   "operation":"state"} current state version: 2
   [junit4]   2> 1258166 INFO  (OverseerStateUpdate-95706748106637316-127.0.0.1:43035_-n_0000000000) [    ] o.a.s.c.o.ReplicaMutator Update state numShards=1 message={
   [junit4]   2>   "core":"collection1",
   [junit4]   2>   "core_node_name":"core_node1",
   [junit4]   2>   "roles":null,
   [junit4]   2>   "base_url":"http://127.0.0.1:43035",
   [junit4]   2>   "node_name":"127.0.0.1:43035_",
   [junit4]   2>   "numShards":"1",
   [junit4]   2>   "state":"active",
   [junit4]   2>   "shard":"shard1",
   [junit4]   2>   "collection":"control_collection",
   [junit4]   2>   "operation":"state"}
   [junit4]   2> 1258267 INFO  (zkCallback-1954-thread-1) [    ] o.a.s.c.c.ZkStateReader A cluster state change: [WatchedEvent state:SyncConnected type:NodeDataChanged path:/clusterstate.json], has occurred - updating... (live nodes size: [1])
   [junit4]   2> 1258399 INFO  (TEST-DistribDocExpirationUpdateProcessorTest.test-seed#[DA0EEC8B855FAF2C]) [    ] o.a.s.c.c.SolrZkClient Using default ZkCredentialsProvider
   [junit4]   2> 1258400 INFO  (TEST-DistribDocExpirationUpdateProcessorTest.test-seed#[DA0EEC8B855FAF2C]) [    ] o.a.s.c.c.ConnectionManager Waiting for client to connect to ZooKeeper
   [junit4]   2> 1258400 INFO  (zkCallback-1956-thread-1) [    ] o.a.s.c.c.ConnectionManager Watcher org.apache.solr.common.cloud.ConnectionManager@2e2f5a4d name:ZooKeeperConnection Watcher:127.0.0.1:40319/solr got event WatchedEvent state:SyncConnected type:None path:null path:null type:None
   [junit4]   2> 1258400 INFO  (TEST-DistribDocExpirationUpdateProcessorTest.test-seed#[DA0EEC8B855FAF2C]) [    ] o.a.s.c.c.ConnectionManager Client is connected to ZooKeeper
   [junit4]   2> 1258401 INFO  (TEST-DistribDocExpirationUpdateProcessorTest.test-seed#[DA0EEC8B855FAF2C]) [    ] o.a.s.c.c.SolrZkClient Using default ZkACLProvider
   [junit4]   2> 1258401 INFO  (TEST-DistribDocExpirationUpdateProcessorTest.test-seed#[DA0EEC8B855FAF2C]) [    ] o.a.s.c.c.ZkStateReader Updating cluster state from ZooKeeper... 
   [junit4]   2> 1258401 INFO  (TEST-DistribDocExpirationUpdateProcessorTest.test-seed#[DA0EEC8B855FAF2C]) [    ] o.a.s.c.c.ZkStateReader Updated live nodes from ZooKeeper... (0) -> (1)
   [junit4]   2> 1258401 INFO  (TEST-DistribDocExpirationUpdateProcessorTest.test-seed#[DA0EEC8B855FAF2C]) [    ] o.a.s.c.ChaosMonkey monkey: init - expire sessions:false cause connection loss:false
   [junit4]   2> 1258401 INFO  (TEST-DistribDocExpirationUpdateProcessorTest.test-seed#[DA0EEC8B855FAF2C]) [    ] o.a.s.c.AbstractFullDistribZkTestBase Creating collection1 with stateFormat=2
   [junit4]   2> 1258401 INFO  (TEST-DistribDocExpirationUpdateProcessorTest.test-seed#[DA0EEC8B855FAF2C]) [    ] o.a.s.c.c.SolrZkClient Using default ZkCredentialsProvider
   [junit4]   2> 1258402 INFO  (TEST-DistribDocExpirationUpdateProcessorTest.test-seed#[DA0EEC8B855FAF2C]) [    ] o.a.s.c.c.ConnectionManager Waiting for client to connect to ZooKeeper
   [junit4]   2> 1258402 INFO  (zkCallback-1957-thread-1) [    ] o.a.s.c.c.ConnectionManager Watcher org.apache.solr.common.cloud.ConnectionManager@740777b8 name:ZooKeeperConnection Watcher:127.0.0.1:40319/solr got event WatchedEvent state:SyncConnected type:None path:null path:null type:None
   [junit4]   2> 1258402 INFO  (TEST-DistribDocExpirationUpdateProcessorTest.test-seed#[DA0EEC8B855FAF2C]) [    ] o.a.s.c.c.ConnectionManager Client is connected to ZooKeeper
   [junit4]   2> 1258402 INFO  (TEST-DistribDocExpirationUpdateProcessorTest.test-seed#[DA0EEC8B855FAF2C]) [    ] o.a.s.c.c.SolrZkClient Using default ZkACLProvider
   [junit4]   2> 1258403 INFO  (OverseerStateUpdate-95706748106637316-127.0.0.1:43035_-n_0000000000) [    ] o.a.s.c.Overseer processMessage: queueSize: 1, message = {
   [junit4]   2>   "operation":"create",
   [junit4]   2>   "name":"collection1",
   [junit4]   2>   "numShards":"2",
   [junit4]   2>   "stateFormat":"2"} current state version: 3
   [junit4]   2> 1258403 INFO  (OverseerStateUpdate-95706748106637316-127.0.0.1:43035_-n_0000000000) [    ] o.a.s.c.o.ClusterStateMutator building a new cName: collection1
   [junit4]   2> 1258454 INFO  (TEST-DistribDocExpirationUpdateProcessorTest.test-seed#[DA0EEC8B855FAF2C]) [    ] o.a.s.SolrTestCaseJ4 Writing core.properties file to /home/jenkins/workspace/Lucene-Solr-6.x-Linux/solr/build/solr-core/test/J1/temp/solr.cloud.DistribDocExpirationUpdateProcessorTest_DA0EEC8B855FAF2C-001/shard-1-001/cores/collection1
   [junit4]   2> 1258454 INFO  (TEST-DistribDocExpirationUpdateProcessorTest.test-seed#[DA0EEC8B855FAF2C]) [    ] o.a.s.c.AbstractFullDistribZkTestBase create jetty 1 in directory /home/jenkins/workspace/Lucene-Solr-6.x-Linux/solr/build/solr-core/test/J1/temp/solr.cloud.DistribDocExpirationUpdateProcessorTest_DA0EEC8B855FAF2C-001/shard-1-001
   [junit4]   2> 1258455 INFO  (TEST-DistribDocExpirationUpdateProcessorTest.test-seed#[DA0EEC8B855FAF2C]) [    ] o.e.j.s.Server jetty-9.3.8.v20160314
   [junit4]   2> 1258455 INFO  (TEST-DistribDocExpirationUpdateProcessorTest.test-seed#[DA0EEC8B855FAF2C]) [    ] o.e.j.s.h.ContextHandler Started o.e.j.s.ServletContextHandler@3e64bbaf{/,null,AVAILABLE}
   [junit4]   2> 1258456 INFO  (TEST-DistribDocExpirationUpdateProcessorTest.test-seed#[DA0EEC8B855FAF2C]) [    ] o.e.j.s.ServerConnector Started ServerConnector@6ee7fe64{HTTP/1.1,[http/1.1]}{127.0.0.1:34193}
   [junit4]   2> 1258456 INFO  (TEST-DistribDocExpirationUpdateProcessorTest.test-seed#[DA0EEC8B855FAF2C]) [    ] o.e.j.s.Server Started @1260415ms
   [junit4]   2> 1258456 INFO  (TEST-DistribDocExpirationUpdateProcessorTest.test-seed#[DA0EEC8B855FAF2C]) [    ] o.a.s.c.s.e.JettySolrRunner Jetty properties: {solr.data.dir=/home/jenkins/workspace/Lucene-Solr-6.x-Linux/solr/build/solr-core/test/J1/temp/solr.cloud.DistribDocExpirationUpdateProcessorTest_DA0EEC8B855FAF2C-001/tempDir-001/jetty1, solrconfig=solrconfig.xml, hostContext=/, hostPort=34193, coreRootDirectory=/home/jenkins/workspace/Lucene-Solr-6.x-Linux/solr/build/solr-core/test/J1/temp/solr.cloud.DistribDocExpirationUpdateProcessorTest_DA0EEC8B855FAF2C-001/shard-1-001/cores}
   [junit4]   2> 1258457 INFO  (TEST-DistribDocExpirationUpdateProcessorTest.test-seed#[DA0EEC8B855FAF2C]) [    ] o.a.s.s.SolrDispatchFilter SolrDispatchFilter.init(): jdk.internal.loader.ClassLoaders$AppClassLoader@725bef66
   [junit4]   2> 1258457 INFO  (TEST-DistribDocExpirationUpdateProcessorTest.test-seed#[DA0EEC8B855FAF2C]) [    ] o.a.s.c.SolrResourceLoader new SolrResourceLoader for directory: '/home/jenkins/workspace/Lucene-Solr-6.x-Linux/solr/build/solr-core/test/J1/temp/solr.cloud.DistribDocExpirationUpdateProcessorTest_DA0EEC8B855FAF2C-001/shard-1-001'
   [junit4]   2> 1258457 INFO  (TEST-DistribDocExpirationUpdateProcessorTest.test-seed#[DA0EEC8B855FAF2C]) [    ] o.a.s.c.SolrResourceLoader JNDI not configured for solr (NoInitialContextEx)
   [junit4]   2> 1258457 INFO  (TEST-DistribDocExpirationUpdateProcessorTest.test-seed#[DA0EEC8B855FAF2C]) [    ] o.a.s.c.SolrResourceLoader solr home defaulted to 'solr/' (could not find system property or JNDI)
   [junit4]   2> 1258457 INFO  (TEST-DistribDocExpirationUpdateProcessorTest.test-seed#[DA0EEC8B855FAF2C]) [    ] o.a.s.c.c.SolrZkClient Using default ZkCredentialsProvider
   [junit4]   2> 1258457 INFO  (TEST-DistribDocExpirationUpdateProcessorTest.test-seed#[DA0EEC8B855FAF2C]) [    ] o.a.s.c.c.ConnectionManager Waiting for client to connect to ZooKeeper
   [junit4]   2> 1258458 INFO  (zkCallback-1958-thread-1) [    ] o.a.s.c.c.ConnectionManager Watcher org.apache.solr.common.cloud.ConnectionManager@3d4921a4 name:ZooKeeperConnection Watcher:127.0.0.1:40319/solr got event WatchedEvent state:SyncConnected type:None path:null path:null type:None
   [junit4]   2> 1258458 INFO  (TEST-DistribDocExpirationUpdateProcessorTest.test-seed#[DA0EEC8B855FAF2C]) [    ] o.a.s.c.c.ConnectionManager Client is connected to ZooKeeper
   [junit4]   2> 1258458 INFO  (TEST-DistribDocExpirationUpdateProcessorTest.test-seed#[DA0EEC8B855FAF2C]) [    ] o.a.s.c.c.SolrZkClient Using default ZkACLProvider
   [junit4]   2> 1258458 INFO  (TEST-DistribDocExpirationUpdateProcessorTest.test-seed#[DA0EEC8B855FAF2C]) [    ] o.a.s.s.SolrDispatchFilter Loading solr.xml from SolrHome (not found in ZooKeeper)
   [junit4]   2> 1258459 INFO  (TEST-DistribDocExpirationUpdateProcessorTest.test-seed#[DA0EEC8B855FAF2C]) [    ] o.a.s.c.SolrXmlConfig Loading container configuration from /home/jenkins/workspace/Lucene-Solr-6.x-Linux/solr/build/solr-core/test/J1/temp/solr.cloud.DistribDocExpirationUpdateProcessorTest_DA0EEC8B855FAF2C-001/shard-1-001/solr.xml
   [junit4]   2> 1258461 INFO  (TEST-DistribDocExpirationUpdateProcessorTest.test-seed#[DA0EEC8B855FAF2C]) [    ] o.a.s.c.CorePropertiesLocator Config-defined core root directory: /home/jenkins/workspace/Lucene-Solr-6.x-Linux/solr/build/solr-core/test/J1/temp/solr.cloud.DistribDocExpirationUpdateProcessorTest_DA0EEC8B855FAF2C-001/shard-1-001/cores
   [junit4]   2> 1258461 INFO  (TEST-DistribDocExpirationUpdateProcessorTest.test-seed#[DA0EEC8B855FAF2C]) [    ] o.a.s.c.CoreContainer New CoreContainer 859446202
   [junit4]   2> 1258461 INFO  (TEST-DistribDocExpirationUpdateProcessorTest.test-seed#[DA0EEC8B855FAF2C]) [    ] o.a.s.c.CoreContainer Loading cores into CoreContainer [instanceDir=/home/jenkins/workspace/Lucene-Solr-6.x-Linux/solr/build/solr-core/test/J1/temp/solr.cloud.DistribDocExpirationUpdateProcessorTest_DA0EEC8B855FAF2C-001/shard-1-001]
   [junit4]   2> 1258461 WARN  (TEST-DistribDocExpirationUpdateProcessorTest.test-seed#[DA0EEC8B855FAF2C]) [    ] o.a.s.c.CoreContainer Couldn't add files from /home/jenkins/workspace/Lucene-Solr-6.x-Linux/solr/build/solr-core/test/J1/temp/solr.cloud.DistribDocExpirationUpdateProcessorTest_DA0EEC8B855FAF2C-001/shard-1-001/lib to classpath: /home/jenkins/workspace/Lucene-Solr-6.x-Linux/solr/build/solr-core/test/J1/temp/solr.cloud.DistribDocExpirationUpdateProcessorTest_DA0EEC8B855FAF2C-001/shard-1-001/lib
   [junit4]   2> 1258462 INFO  (TEST-DistribDocExpirationUpdateProcessorTest.test-seed#[DA0EEC8B855FAF2C]) [    ] o.a.s.h.c.HttpShardHandlerFactory created with socketTimeout : 90000,urlScheme : ,connTimeout : 15000,maxConnectionsPerHost : 20,maxConnections : 10000,corePoolSize : 0,maximumPoolSize : 2147483647,maxThreadIdleTime : 5,sizeOfQueue : -1,fairnessPolicy : false,useRetries : false,
   [junit4]   2> 1258462 INFO  (TEST-DistribDocExpirationUpdateProcessorTest.test-seed#[DA0EEC8B855FAF2C]) [    ] o.a.s.u.UpdateShardHandler Creating UpdateShardHandler HTTP client with params: socketTimeout=340000&connTimeout=45000&retry=true
   [junit4]   2> 1258462 INFO  (TEST-DistribDocExpirationUpdateProcessorTest.test-seed#[DA0EEC8B855FAF2C]) [    ] o.a.s.l.LogWatcher SLF4J impl is org.slf4j.impl.Log4jLoggerFactory
   [junit4]   2> 1258462 INFO  (TEST-DistribDocExpirationUpdateProcessorTest.test-seed#[DA0EEC8B855FAF2C]) [    ] o.a.s.l.LogWatcher Registering Log Listener [Log4j (org.slf4j.impl.Log4jLoggerFactory)]
   [junit4]   2> 1258462 INFO  (TEST-DistribDocExpirationUpdateProcessorTest.test-seed#[DA0EEC8B855FAF2C]) [    ] o.a.s.c.ZkContainer Zookeeper client=127.0.0.1:40319/solr
   [junit4]   2> 1258463 INFO  (TEST-DistribDocExpirationUpdateProcessorTest.test-seed#[DA0EEC8B855FAF2C]) [    ] o.a.s.c.ZkController zkHost includes chroot
   [junit4]   2> 1258463 INFO  (TEST-DistribDocExpirationUpdateProcessorTest.test-seed#[DA0EEC8B855FAF2C]) [    ] o.a.s.c.c.SolrZkClient Using default ZkCredentialsProvider
   [junit4]   2> 1258463 INFO  (TEST-DistribDocExpirationUpdateProcessorTest.test-seed#[DA0EEC8B855FAF2C]) [    ] o.a.s.c.c.ConnectionManager Waiting for client to connect to ZooKeeper
   [junit4]   2> 1258463 INFO  (zkCallback-1961-thread-1) [    ] o.a.s.c.c.ConnectionManager Watcher org.apache.solr.common.cloud.ConnectionManager@6caa0e48 name:ZooKeeperConnection Watcher:127.0.0.1:40319 got event WatchedEvent state:SyncConnected type:None path:null path:null type:None
   [junit4]   2> 1258463 INFO  (TEST-DistribDocExpirationUpdateProcessorTest.test-seed#[DA0EEC8B855FAF2C]) [    ] o.a.s.c.c.ConnectionManager Client is connected to ZooKeeper
   [junit4]   2> 1258464 INFO  (TEST-DistribDocExpirationUpdateProcessorTest.test-seed#[DA0EEC8B855FAF2C]) [    ] o.a.s.c.c.SolrZkClient Using default ZkACLProvider
   [junit4]   2> 1258464 INFO  (TEST-DistribDocExpirationUpdateProcessorTest.test-seed#[DA0EEC8B855FAF2C]) [    ] o.a.s.c.c.ConnectionManager Waiting for client to connect to ZooKeeper
   [junit4]   2> 1258465 INFO  (zkCallback-1962-thread-1) [    ] o.a.s.c.c.ConnectionManager Watcher org.apache.solr.common.cloud.ConnectionManager@c61ab5f name:ZooKeeperConnection Watcher:127.0.0.1:40319/solr got event WatchedEvent state:SyncConnected type:None path:null path:null type:None
   [junit4]   2> 1258465 INFO  (TEST-DistribDocExpirationUpdateProcessorTest.test-seed#[DA0EEC8B855FAF2C]) [    ] o.a.s.c.c.ConnectionManager Client is connected to ZooKeeper
   [junit4]   2> 1258467 INFO  (TEST-DistribDocExpirationUpdateProcessorTest.test-seed#[DA0EEC8B855FAF2C]) [    ] o.a.s.c.c.ZkStateReader Updating cluster state from ZooKeeper... 
   [junit4]   2> 1258467 INFO  (TEST-DistribDocExpirationUpdateProcessorTest.test-seed#[DA0EEC8B855FAF2C]) [    ] o.a.s.c.c.ZkStateReader Updated live nodes from ZooKeeper... (0) -> (1)
   [junit4]   2> 1258468 INFO  (TEST-DistribDocExpirationUpdateProcessorTest.test-seed#[DA0EEC8B855FAF2C]) [    ] o.a.s.c.Overseer Overseer (id=null) closing
   [junit4]   2> 1258468 INFO  (TEST-DistribDocExpirationUpdateProcessorTest.test-seed#[DA0EEC8B855FAF2C]) [    ] o.a.s.c.LeaderElector Joined leadership election with path: /overseer_elect/election/95706748106637321-127.0.0.1:34193_-n_0000000001
   [junit4]   2> 1258468 INFO  (TEST-DistribDocExpirationUpdateProcessorTest.test-seed#[DA0EEC8B855FAF2C]) [    ] o.a.s.c.LeaderElector Watching path /overseer_elect/election/95706748106637316-127.0.0.1:43035_-n_0000000000 to know if I could be the leader
   [junit4]   2> 1258468 INFO  (TEST-DistribDocExpirationUpdateProcessorTest.test-seed#[DA0EEC8B855FAF2C]) [    ] o.a.s.c.ZkController Publish node=127.0.0.1:34193_ as DOWN
   [junit4]   2> 1258469 INFO  (OverseerStateUpdate-95706748106637316-127.0.0.1:43035_-n_0000000000) [    ] o.a.s.c.Overseer processMessage: queueSize: 1, message = {
   [junit4]   2>   "operation":"downnode",
   [junit4]   2>   "node_name":"127.0.0.1:34193_"} current state version: 3
   [junit4]   2> 1258469 INFO  (OverseerStateUpdate-95706748106637316-127.0.0.1:43035_-n_0000000000) [    ] o.a.s.c.o.NodeMutator DownNode state invoked for node: 127.0.0.1:34193_
   [junit4]   2> 1258469 INFO  (OverseerStateUpdate-95706748106637316-127.0.0.1:43035_-n_0000000000) [    ] o.a.s.c.o.ZkStateWriter going to create_collection /collections/collection1/state.json
   [junit4]   2> 1258571 INFO  (zkCallback-1956-thread-1) [    ] o.a.s.c.c.ZkStateReader A cluster state change: [WatchedEvent state:SyncConnected type:NodeDataChanged path:/clusterstate.json], has occurred - updating... (live nodes size: [1])
   [junit4]   2> 1258571 INFO  (zkCallback-1962-thread-1) [    ] o.a.s.c.c.ZkStateReader A cluster state change: [WatchedEvent state:SyncConnected type:NodeDataChanged path:/clusterstate.json], has occurred - updating... (live nodes size: [1])
   [junit4]   2> 1258571 INFO  (zkCallback-1954-thread-1) [    ] o.a.s.c.c.ZkStateReader A cluster state change: [WatchedEvent state:SyncConnected type:NodeDataChanged path:/clusterstate.json], has occurred - updating... (live nodes size: [1])
   [junit4]   2> 1259469 INFO  (TEST-DistribDocExpirationUpdateProcessorTest.test-seed#[DA0EEC8B855FAF2C]) [    ] o.a.s.c.ZkController Register node as live in ZooKeeper:/live_nodes/127.0.0.1:34193_
   [junit4]   2> 1259470 INFO  (TEST-DistribDocExpirationUpdateProcessorTest.test-seed#[DA0EEC8B855FAF2C]) [    ] o.a.s.c.c.SolrZkClient makePath: /live_nodes/127.0.0.1:34193_
   [junit4]   2> 1259470 INFO  (zkCallback-1956-thread-1) [    ] o.a.s.c.c.ZkStateReader A live node change: [WatchedEvent state:SyncConnected type:NodeChildrenChanged path:/live_nodes], has occurred - updating... (live nodes size: [1])
   [junit4]   2> 1259470 INFO  (zkCallback-1954-thread-1) [    ] o.a.s.c.c.ZkStateReader A live node change: [WatchedEvent state:SyncConnected type:NodeChildrenChanged path:/live_nodes], has occurred - updating... (live nodes size: [1])
   [junit4]   2> 1259470 INFO  (zkCallback-1962-thread-1) [    ] o.a.s.c.c.ZkStateReader A live node change: [WatchedEvent state:SyncConnected type:NodeChildrenChanged path:/live_nodes], has occurred - updating... (live nodes size: [1])
   [junit4]   2> 1259470 INFO  (zkCallback-1956-thread-1) [    ] o.a.s.c.c.ZkStateReader Updated live nodes from ZooKeeper... (1) -> (2)
   [junit4]   2> 1259470 INFO  (zkCallback-1954-thread-1) [    ] o.a.s.c.c.ZkStateReader Updated live nodes from ZooKeeper... (1) -> (2)
   [junit4]   2> 1259470 INFO  (zkCallback-1962-thread-1) [    ] o.a.s.c.c.ZkStateReader Updated live nodes from ZooKeeper... (1) -> (2)
   [junit4]   2> 1259475 INFO  (TEST-DistribDocExpirationUpdateProcessorTest.test-seed#[DA0EEC8B855FAF2C]) [    ] o.a.s.c.CoreContainer Security conf doesn't exist. Skipping setup for authorization module.
   [junit4]   2> 1259475 INFO  (TEST-DistribDocExpirationUpdateProcessorTest.test-seed#[DA0EEC8B855FAF2C]) [    ] o.a.s.c.CoreContainer No authentication plugin used.
   [junit4]   2> 1259476 INFO  (TEST-DistribDocExpirationUpdateProcessorTest.test-seed#[DA0EEC8B855FAF2C]) [    ] o.a.s.c.CorePropertiesLocator Looking for core definitions underneath /home/jenkins/workspace/Lucene-Solr-6.x-Linux/solr/build/solr-core/test/J1/temp/solr.cloud.DistribDocExpirationUpdateProcessorTest_DA0EEC8B855FAF2C-001/shard-1-001/cores
   [junit4]   2> 1259476 INFO  (TEST-DistribDocExpirationUpdateProcessorTest.test-seed#[DA0EEC8B855FAF2C]) [    ] o.a.s.c.CoreDescriptor Created CoreDescriptor: {name=collection1, config=solrconfig.xml, transient=false, schema=schema.xml, loadOnStartup=true, configSetProperties=configsetprops.json, collection=collection1, coreNodeName=, dataDir=data/, shard=}
   [junit4]   2> 1259476 INFO  (TEST-DistribDocExpirationUpdateProcessorTest.test-seed#[DA0EEC8B855FAF2C]) [    ] o.a.s.c.CorePropertiesLocator Found core collection1 in /home/jenkins/workspace/Lucene-Solr-6.x-Linux/solr/build/solr-core/test/J1/temp/solr.cloud.DistribDocExpirationUpdateProcessorTest_DA0EEC8B855FAF2C-001/shard-1-001/cores/collection1
   [junit4]   2> 1259476 INFO  (TEST-DistribDocExpirationUpdateProcessorTest.test-seed#[DA0EEC8B855FAF2C]) [    ] o.a.s.c.CorePropertiesLocator Found 1 core definitions
   [junit4]   2> 1259477 INFO  (TEST-DistribDocExpirationUpdateProcessorTest.test-seed#[DA0EEC8B855FAF2C]) [    ] o.a.s.s.SolrDispatchFilter user.dir=/home/jenkins/workspace/Lucene-Solr-6.x-Linux/solr/build/solr-core/test/J1
   [junit4]   2> 1259477 INFO  (TEST-DistribDocExpirationUpdateProcessorTest.test-seed#[DA0EEC8B855FAF2C]) [    ] o.a.s.s.SolrDispatchFilter SolrDispatchFilter.init() done
   [junit4]   2> 1259477 INFO  (coreLoadExecutor-5926-thread-1) [    ] o.a.s.c.ZkController publishing state=down
   [junit4]   2> 1259477 INFO  (coreLoadExecutor-5926-thread-1) [    ] o.a.s.c.ZkController numShards not found on descriptor - reading it from system property
   [junit4]   2> 1259478 INFO  (coreLoadExecutor-5926-thread-1) [    ] o.a.s.c.ZkController Registering watch for collection collection1
   [junit4]   2> 1259478 INFO  (coreLoadExecutor-5926-thread-1) [    ] o.a.s.c.c.ZkStateReader addZkWatch [collection1]
   [junit4]   2> 1259478 INFO  (OverseerStateUpdate-95706748106637316-127.0.0.1:43035_-n_0000000000) [    ] o.a.s.c.Overseer processMessage: queueSize: 1, message = {
   [junit4]   2>   "core":"collection1",
   [junit4]   2>   "roles":null,
   [junit4]   2>   "base_url":"http://127.0.0.1:34193",
   [junit4]   2>   "node_name":"127.0.0.1:34193_",
   [junit4]   2>   "numShards":"2",
   [junit4]   2>   "state":"down",
   [junit4]   2>   "shard":null,
   [junit4]   2>   "collection":"collection1",
   [junit4]   2>   "operation":"state"} current state version: 4
   [junit4]   2> 1259478 INFO  (coreLoadExecutor-5926-thread-1) [    ] o.a.s.c.c.ZkStateReader Add data for [collection1] ver [0]
   [junit4]   2> 1259478 INFO  (coreLoadExecutor-5926-thread-1) [    ] o.a.s.c.ZkController look for our core node name
   [junit4]   2> 1259478 INFO  (OverseerStateUpdate-95706748106637316-127.0.0.1:43035_-n_0000000000) [    ] o.a.s.c.o.ReplicaMutator Update state numShards=2 message={
   [junit4]   2>   "core":"collection1",
   [junit4]   2>   "roles":null,
   [junit4]   2>   "base_url":"http://127.0.0.1:34193",
   [junit4]   2>   "node_name":"127.0.0.1:34193_",
   [junit4]   2>   "numShards":"2",
   [junit4]   2>   "state":"down",
   [junit4]   2>   "shard":null,
   [junit4]   2>   "collection":"collection1",
   [junit4]   2>   "operation":"state"}
   [junit4]   2> 1259478 INFO  (OverseerStateUpdate-95706748106637316-127.0.0.1:43035_-n_0000000000) [    ] o.a.s.c.o.ReplicaMutator Collection already exists with numShards=2
   [junit4]   2> 1259478 INFO  (OverseerStateUpdate-95706748106637316-127.0.0.1:43035_-n_0000000000) [    ] o.a.s.c.o.ReplicaMutator Assigning new node to shard shard=shard2
   [junit4]   2> 1259579 INFO  (OverseerStateUpdate-95706748106637316-127.0.0.1:43035_-n_0000000000) [    ] o.a.s.c.o.ZkStateWriter going to update_collection /collections/collection1/state.json version: 0
   [junit4]   2> 1259579 INFO  (zkCallback-1962-thread-1) [    ] o.a.s.c.c.ZkStateReader A cluster state change: [WatchedEvent state:SyncConnected type:NodeDataChanged path:/collections/collection1/state.json] for collection [collection1] has occurred - updating... (live nodes size: [2])
   [junit4]   2> 1259580 INFO  (zkCallback-1962-thread-1) [    ] o.a.s.c.c.ZkStateReader Updating data for [collection1] from [0] to [1]
   [junit4]   2> 1260478 INFO  (coreLoadExecutor-5926-thread-1) [    ] o.a.s.c.ZkController waiting to find shard id in clusterstate for collection1
   [junit4]   2> 1260478 INFO  (coreLoadExecutor-5926-thread-1) [    ] o.a.s.c.ZkController Check for collection zkNode:collection1
   [junit4]   2> 1260478 INFO  (coreLoadExecutor-5926-thread-1) [    ] o.a.s.c.ZkController Collection zkNode exists
   [junit4]   2> 1260478 INFO  (coreLoadExecutor-5926-thread-1) [    ] o.a.s.c.c.ZkStateReader Load collection config from: [/collections/collection1]
   [junit4]   2> 1260479 INFO  (coreLoadExecutor-5926-thread-1) [    ] o.a.s.c.c.ZkStateReader path=[/collections/collection1] [configName]=[conf1] specified config exists in ZooKeeper
   [junit4]   2> 1260479 INFO  (coreLoadExecutor-5926-thread-1) [    ] o.a.s.c.SolrResourceLoader new SolrResourceLoader for directory: '/home/jenkins/workspace/Lucene-Solr-6.x-Linux/solr/build/solr-core/test/J1/temp/solr.cloud.DistribDocExpirationUpdateProcessorTest_DA0EEC8B855FAF2C-001/shard-1-001/cores/collection1'
   [junit4]   2> 1260479 INFO  (coreLoadExecutor-5926-thread-1) [    ] o.a.s.c.SolrResourceLoader JNDI not configured for solr (NoInitialContextEx)
   [junit4]   2> 1260479 INFO  (coreLoadExecutor-5926-thread-1) [    ] o.a.s.c.SolrResourceLoader solr home defaulted to 'solr/' (could not find system property or JNDI)
   [junit4]   2> 1260480 INFO  (coreLoadExecutor-5926-thread-1) [    ] o.a.s.c.Config loaded config solrconfig.xml with version 0 
   [junit4]   2> 1260482 INFO  (coreLoadExecutor-5926-thread-1) [    ] o.a.s.c.SolrConfig current version of requestparams : -1
   [junit4]   2> 1260484 WARN  (coreLoadExecutor-5926-thread-1) [    ] o.a.s.c.Config Beginning with Solr 5.5, <mergePolicy> is deprecated, use <mergePolicyFactory> instead.
   [junit4]   2> 1260484 INFO  (coreLoadExecutor-5926-thread-1) [    ] o.a.s.c.SolrConfig Using Lucene MatchVersion: 6.1.0
   [junit4]   2> 1260506 INFO  (coreLoadExecutor-5926-thread-1) [    ] o.a.s.c.SolrConfig Loaded SolrConfig: solrconfig.xml
   [junit4]   2> 1260509 INFO  (coreLoadExecutor-5926-thread-1) [    ] o.a.s.s.IndexSchema [collection1] Schema name=test
   [junit4]   2> 1260568 INFO  (coreLoadExecutor-5926-thread-1) [    ] o.a.s.s.IndexSchema default search field in schema is text
   [junit4]   2> 1260568 INFO  (coreLoadExecutor-5926-thread-1) [    ] o.a.s.s.IndexSchema unique key field: id
   [junit4]   2> 1260569 INFO  (coreLoadExecutor-5926-thread-1) [    ] o.a.s.s.FileExchangeRateProvider Reloading exchange rates from file currency.xml
   [junit4]   2> 1260570 INFO  (coreLoadExecutor-5926-thread-1) [    ] o.a.s.s.FileExchangeRateProvider Reloading exchange rates from file currency.xml
   [junit4]   2> 1260576 INFO  (coreLoadExecutor-5926-thread-1) [    ] o.a.s.c.ConfigSetProperties Did not find ConfigSet properties, assuming default properties: Can't find resource 'configsetprops.json' in classpath or '/configs/conf1', cwd=/home/jenkins/workspace/Lucene-Solr-6.x-Linux/solr/build/solr-core/test/J1
   [junit4]   2> 1260576 INFO  (coreLoadExecutor-5926-thread-1) [    ] o.a.s.c.CoreContainer Creating SolrCore 'collection1' using configuration from collection collection1
   [junit4]   2> 1260576 INFO  (coreLoadExecutor-5926-thread-1) [    ] o.a.s.c.SolrCore org.apache.solr.core.MockDirectoryFactory
   [junit4]   2> 1260576 INFO  (coreLoadExecutor-5926-thread-1) [    ] o.a.s.c.SolrCore [[collection1] ] Opening new SolrCore at [/home/jenkins/workspace/Lucene-Solr-6.x-Linux/solr/build/solr-core/test/J1/temp/solr.cloud.DistribDocExpirationUpdateProcessorTest_DA0EEC8B855FAF2C-001/shard-1-001/cores/collection1], dataDir=[/home/jenkins/workspace/Lucene-Solr-6.x-Linux/solr/build/solr-core/test/J1/temp/solr.cloud.DistribDocExpirationUpdateProcessorTest_DA0EEC8B855FAF2C-001/shard-1-001/cores/collection1/data/]
   [junit4]   2> 1260576 INFO  (coreLoadExecutor-5926-thread-1) [    ] o.a.s.c.SolrCore JMX monitoring not detected for core: collection1
   [junit4]   2> 1260577 INFO  (coreLoadExecutor-5926-thread-1) [    ] o.a.s.c.CachingDirectoryFactory return new directory for /home/jenkins/workspace/Lucene-Solr-6.x-Linux/solr/build/solr-core/test/J1/temp/solr.cloud.DistribDocExpirationUpdateProcessorTest_DA0EEC8B855FAF2C-001/shard-1-001/cores/collection1/data
   [junit4]   2> 1260577 INFO  (coreLoadExecutor-5926-thread-1) [    ] o.a.s.c.SolrCore New index directory detected: old=null new=/home/jenkins/workspace/Lucene-Solr-6.x-Linux/solr/build/solr-core/test/J1/temp/solr.cloud.DistribDocExpirationUpdateProcessorTest_DA0EEC8B855FAF2C-001/shard-1-001/cores/collection1/data/index/
   [junit4]   2> 1260577 WARN  (coreLoadExecutor-5926-thread-1) [    ] o.a.s.c.SolrCore [collection1] Solr index directory '/home/jenkins/workspace/Lucene-Solr-6.x-Linux/solr/build/solr-core/test/J1/temp/solr.cloud.DistribDocExpirationUpdateProcessorTest_DA0EEC8B855FAF2C-001/shard-1-001/cores/collection1/data/index' doesn't exist. Creating new index...
   [junit4]   2> 1260577 INFO  (coreLoadExecutor-5926-thread-1) [    ] o.a.s.c.CachingDirectoryFactory return new directory for /home/jenkins/workspace/Lucene-Solr-6.x-Linux/solr/build/solr-core/test/J1/temp/solr.cloud.DistribDocExpirationUpdateProcessorTest_DA0EEC8B855FAF2C-001/shard-1-001/cores/collection1/data/index
   [junit4]   2> 1260577 INFO  (coreLoadExecutor-5926-thread-1) [    ] o.a.s.u.RandomMergePolicy RandomMergePolicy wrapping class org.apache.lucene.index.TieredMergePolicy: [TieredMergePolicy: maxMergeAtOnce=34, maxMergeAtOnceExplicit=30, maxMergedSegmentMB=4.421875, floorSegmentMB=0.29296875, forceMergeDeletesPctAllowed=12.334096912585608, segmentsPerTier=22.0, maxCFSSegmentSizeMB=8.796093022207999E12, noCFSRatio=1.0
   [junit4]   2> 1260578 INFO  (coreLoadExecutor-5926-thread-1) [    ] o.a.s.c.SolrDeletionPolicy SolrDeletionPolicy.onCommit: commits: num=1
   [junit4]   2> 	commit{dir=MockDirectoryWrapper(RAMDirectory@30ddafa9 lockFactory=org.apache.lucene.store.SingleInstanceLockFactory@6ff37cfe),segFN=segments_1,generation=1}
   [junit4]   2> 1260578 INFO  (coreLoadExecutor-5926-thread-1) [    ] o.a.s.c.SolrDeletionPolicy newest commit generation = 1
   [junit4]   2> 1260578 INFO  (OldIndexDirectoryCleanupThreadForCore-collection1) [    ] o.a.s.c.SolrCore Looking for old index directories to cleanup for core collection1 in /home/jenkins/workspace/Lucene-Solr-6.x-Linux/solr/build/solr-core/test/J1/temp/solr.cloud.DistribDocExpirationUpdateProcessorTest_DA0EEC8B855FAF2C-001/shard-1-001/cores/collection1/data/
   [junit4]   2> 1260578 WARN  (OldIndexDirectoryCleanupThreadForCore-collection1) [    ] o.a.s.c.DirectoryFactory /home/jenkins/workspace/Lucene-Solr-6.x-Linux/solr/build/solr-core/test/J1/temp/solr.cloud.DistribDocExpirationUpdateProcessorTest_DA0EEC8B855FAF2C-001/shard-1-001/cores/collection1/data/ does not point to a valid data directory; skipping clean-up of old index directories.
   [junit4]   2> 1260579 INFO  (coreLoadExecutor-5926-thread-1) [    ] o.a.s.u.p.UpdateRequestProcessorChain creating updateRequestProcessorChain "convert-ttl-defaults"
   [junit4]   2> 1260579 INFO  (coreLoadExecutor-5926-thread-1) [    ] o.a.s.u.p.UpdateRequestProcessorChain creating updateRequestProcessorChain "convert-ttl-field"
   [junit4]   2> 1260579 INFO  (coreLoadExecutor-5926-thread-1) [    ] o.a.s.u.p.UpdateRequestProcessorChain creating updateRequestProcessorChain "convert-ttl-param"
   [junit4]   2> 1260579 INFO  (coreLoadExecutor-5926-thread-1) [    ] o.a.s.u.p.UpdateRequestProcessorChain creating updateRequestProcessorChain "convert-ttl-field-with-param-default"
   [junit4]   2> 1260579 INFO  (coreLoadExecutor-5926-thread-1) [    ] o.a.s.u.p.UpdateRequestProcessorChain creating updateRequestProcessorChain "scheduled-delete" (default)
   [junit4]   2> 1260579 INFO  (coreLoadExecutor-5926-thread-1) [    ] o.a.s.u.p.UpdateRequestProcessorChain inserting DistributedUpdateProcessorFactory into updateRequestProcessorChain "scheduled-delete" (default)
   [junit4]   2> 1260580 INFO  (coreLoadExecutor-5926-thread-1) [    ] o.a.s.h.l.XMLLoader xsltCacheLifetimeSeconds=60
   [junit4]   2> 1260581 INFO  (coreLoadExecutor-5926-thread-1) [    ] o.a.s.h.l.XMLLoader xsltCacheLifetimeSeconds=60
   [junit4]   2> 1260581 INFO  (coreLoadExecutor-5926-thread-1) [    ] o.a.s.h.l.XMLLoader xsltCacheLifetimeSeconds=60
   [junit4]   2> 1260581 INFO  (coreLoadExecutor-5926-thread-1) [    ] o.a.s.h.l.XMLLoader xsltCacheLifetimeSeconds=60
   [junit4]   2> 1260582 INFO  (coreLoadExecutor-5926-thread-1) [    ] o.a.s.c.RequestHandlers Registered paths: /admin/mbeans,,/update/csv,/sql,/update/json/docs,/admin/luke,/export,/select,/admin/segments,/get,/admin/system,/replication,/admin/properties,/config,/stream,/schema,/admin/plugins,/admin/logging,/update/json,/admin/ping,/admin/threads,/update,/admin/file
   [junit4]   2> 1260582 INFO  (coreLoadExecutor-5926-thread-1) [    ] o.a.s.c.SolrCore Using default statsCache cache: org.apache.solr.search.stats.LocalStatsCache
   [junit4]   2> 1260582 INFO  (coreLoadExecutor-5926-thread-1) [    ] o.a.s.u.UpdateHandler Using UpdateLog implementation: org.apache.solr.update.UpdateLog
   [junit4]   2> 1260582 INFO  (coreLoadExecutor-5926-thread-1) [    ] o.a.s.u.UpdateLog Initializing UpdateLog: dataDir= defaultSyncLevel=FLUSH numRecordsToKeep=100 maxNumLogsToKeep=10 numVersionBuckets=65536
   [junit4]   2> 1260583 INFO  (coreLoadExecutor-5926-thread-1) [    ] o.a.s.u.CommitTracker Hard AutoCommit: disabled
   [junit4]   2> 1260583 INFO  (coreLoadExecutor-5926-thread-1) [    ] o.a.s.u.CommitTracker Soft AutoCommit: disabled
   [junit4]   2> 1260583 INFO  (coreLoadExecutor-5926-thread-1) [    ] o.a.s.u.RandomMergePolicy RandomMergePolicy wrapping class org.apache.lucene.index.LogByteSizeMergePolicy: [LogByteSizeMergePolicy: minMergeSize=1677721, mergeFactor=27, maxMergeSize=2147483648, maxMergeSizeForForcedMerge=9223372036854775807, calibrateSizeByDeletes=true, maxMergeDocs=2147483647, maxCFSSegmentSizeMB=8.796093022207999E12, noCFSRatio=0.562846891021848]
   [junit4]   2> 1260583 INFO  (coreLoadExecutor-5926-thread-1) [    ] o.a.s.c.SolrDeletionPolicy SolrDeletionPolicy.onInit: commits: num=1
   [junit4]   2> 	commit{dir=MockDirectoryWrapper(RAMDirectory@30ddafa9 lockFactory=org.apache.lucene.store.SingleInstanceLockFactory@6ff37cfe),segFN=segments_1,generation=1}
   [junit4]   2> 1260583 INFO  (coreLoadExecutor-5926-thread-1) [    ] o.a.s.c.SolrDeletionPolicy newest commit generation = 1
   [junit4]   2> 1260583 INFO  (coreLoadExecutor-5926-thread-1) [    ] o.a.s.s.SolrIndexSearcher Opening [Searcher@5784b9bb[collection1] main]
   [junit4]   2> 1260583 INFO  (coreLoadExecutor-5926-thread-1) [    ] o.a.s.c.c.ZkStateReader Load collection config from: [/collections/collection1]
   [junit4]   2> 1260584 INFO  (coreLoadExecutor-5926-thread-1) [    ] o.a.s.c.c.ZkStateReader path=[/collections/collection1] [configName]=[conf1] specified config exists in ZooKeeper
   [junit4]   2> 1260584 INFO  (coreLoadExecutor-5926-thread-1) [    ] o.a.s.r.ManagedResourceStorage Setting up ZooKeeper-based storage for the RestManager with znodeBase: /configs/conf1
   [junit4]   2> 1260584 INFO  (coreLoadExecutor-5926-thread-1) [    ] o.a.s.r.ManagedResourceStorage Configured ZooKeeperStorageIO with znodeBase: /configs/conf1
   [junit4]   2> 1260584 INFO  (coreLoadExecutor-5926-thread-1) [    ] o.a.s.r.RestManager Initializing RestManager with initArgs: {}
   [junit4]   2> 1260584 INFO  (coreLoadExecutor-5926-thread-1) [    ] o.a.s.r.ManagedResourceStorage Reading _rest_managed.json using ZooKeeperStorageIO:path=/configs/conf1
   [junit4]   2> 1260584 INFO  (coreLoadExecutor-5926-thread-1) [    ] o.a.s.r.ManagedResourceStorage No data found for znode /configs/conf1/_rest_managed.json
   [junit4]   2> 1260584 INFO  (coreLoadExecutor-5926-thread-1) [    ] o.a.s.r.ManagedResourceStorage Loaded null at path _rest_managed.json using ZooKeeperStorageIO:path=/configs/conf1
   [junit4]   2> 1260584 INFO  (coreLoadExecutor-5926-thread-1) [    ] o.a.s.r.RestManager Initializing 0 registered ManagedResources
   [junit4]   2> 1260584 INFO  (coreLoadExecutor-5926-thread-1) [    ] o.a.s.h.ReplicationHandler Commits will be reserved for  10000
   [junit4]   2> 1260584 INFO  (searcherExecutor-5927-thread-1) [    ] o.a.s.c.SolrCore [collection1] Registered new searcher Searcher@5784b9bb[collection1] main{ExitableDirectoryReader(UninvertingDirectoryReader())}
   [junit4]   2> 1260584 INFO  (coreLoadExecutor-5926-thread-1) [    ] o.a.s.u.UpdateLog Looking up max value of version field to seed version buckets
   [junit4]   2> 1260584 INFO  (coreLoadExecutor-5926-thread-1) [    ] o.a.s.u.VersionInfo Refreshing highest value of _version_ for 65536 version buckets from index
   [junit4]   2> 1260584 INFO  (coreLoadExecutor-5926-thread-1) [    ] o.a.s.u.VersionInfo No terms found for _version_, cannot seed version bucket highest value from index
   [junit4]   2> 1260584 INFO  (coreLoadExecutor-5926-thread-1) [    ] o.a.s.u.UpdateLog Could not find max version in index or recent updates, using new clock 1531307973772574720
   [junit4]   2> 1260586 INFO  (coreLoadExecutor-5926-thread-1) [    ] o.a.s.u.UpdateLog Took 1.0ms to seed version buckets with highest version 1531307973772574720
   [junit4]   2> 1260586 INFO  (coreLoadExecutor-5926-thread-1) [    ] o.a.s.c.ZkController watch zkdir /configs/conf1
   [junit4]   2> 1260586 INFO  (coreLoadExecutor-5926-thread-1) [    ] o.a.s.c.CoreContainer registering core: collection1
   [junit4]   2> 1260587 INFO  (coreZkRegister-5921-thread-1) [    ] o.a.s.c.ZkController Register replica - core:collection1 address:http://127.0.0.1:34193 collection:collection1 shard:shard2
   [junit4]   2> 1260587 INFO  (coreZkRegister-5921-thread-1) [    ] o.a.s.c.c.SolrZkClient makePath: /collections/collection1/leader_elect/shard2/election
   [junit4]   2> 1260588 INFO  (coreZkRegister-5921-thread-1) [    ] o.a.s.c.LeaderElector Joined leadership election with path: /collections/collection1/leader_elect/shard2/election/95706748106637321-core_node1-n_0000000000
   [junit4]   2> 1260588 INFO  (coreZkRegister-5921-thread-1) [    ] o.a.s.c.ShardLeaderElectionContext Running the leader process for shard=shard2 and weAreReplacement=false and leaderVoteWait=10000
   [junit4]   2> 1260589 INFO  (coreZkRegister-5921-thread-1) [    ] o.a.s.c.ShardLeaderElectionContext Enough replicas found to continue.
   [junit4]   2> 1260589 INFO  (coreZkRegister-5921-thread-1) [    ] o.a.s.c.ShardLeaderElectionContext I may be the new leader - try and sync
   [junit4]   2> 1260589 INFO  (coreZkRegister-5921-thread-1) [    ] o.a.s.c.SyncStrategy Sync replicas to http://127.0.0.1:34193/collection1/
   [junit4]   2> 1260589 INFO  (OverseerStateUpdate-95706748106637316-127.0.0.1:43035_-n_0000000000) [    ] o.a.s.c.Overseer processMessage: queueSize: 1, message = {
   [junit4]   2>   "operation":"leader",
   [junit4]   2>   "shard":"shard2",
   [junit4]   2>   "collection":"collection1"} current state version: 4
   [junit4]   2> 1260589 INFO  (coreZkRegister-5921-thread-1) [    ] o.a.s.c.SyncStrategy Sync Success - now sync replicas to me
   [junit4]   2> 1260589 INFO  (coreZkRegister-5921-thread-1) [    ] o.a.s.c.SyncStrategy http://127.0.0.1:34193/collection1/ has no replicas
   [junit4]   2> 1260590 INFO  (coreZkRegister-5921-thread-1) [    ] o.a.s.c.c.SolrZkClient makePath: /collections/collection1/leaders/shard2
   [junit4]   2> 1260590 INFO  (coreZkRegister-5921-thread-1) [    ] o.a.s.c.ShardLeaderElectionContextBase Creating leader registration node /collections/collection1/leaders/shard2/leader after winning as /collections/collection1/leader_elect/shard2/election/95706748106637321-core_node1-n_0000000000
   [junit4]   2> 1260591 INFO  (coreZkRegister-5921-thread-1) [    ] o.a.s.c.ShardLeaderElectionContext I am the new leader: http://127.0.0.1:34193/collection1/ shard2
   [junit4]   2> 1260591 INFO  (OverseerStateUpdate-95706748106637316-127.0.0.1:43035_-n_0000000000) [    ] o.a.s.c.Overseer processMessage: queueSize: 1, message = {
   [junit4]   2>   "operation":"leader",
   [junit4]   2>   "shard":"shard2",
   [junit4]   2>   "collection":"collection1",
   [junit4]   2>   "base_url":"http://127.0.0.1:34193",
   [junit4]   2>   "core":"collection1",
   [junit4]   2>   "state":"active"} current state version: 4
   [junit4]   2> 1260692 INFO  (OverseerStateUpdate-95706748106637316-127.0.0.1:43035_-n_0000000000) [    ] o.a.s.c.o.ZkStateWriter going to update_collection /collections/collection1/state.json version: 1
   [junit4]   2> 1260693 INFO  (zkCallback-1962-thread-1) [    ] o.a.s.c.c.ZkStateReader A cluster state change: [WatchedEvent state:SyncConnected type:NodeDataChanged 

[...truncated too long message...]

ion1/data/index
   [junit4]   2> 1316411 INFO  (zkCallback-1978-thread-1) [    ] o.a.s.c.CachingDirectoryFactory looking to close /home/jenkins/workspace/Lucene-Solr-6.x-Linux/solr/build/solr-core/test/J1/../../../../../../../../../home/jenkins/workspace/Lucene-Solr-6.x-Linux/solr/build/solr-core/test/J1/temp/solr.cloud.DistribDocExpirationUpdateProcessorTest_DA0EEC8B855FAF2C-001/shard-4-001/cores/collection1/data [CachedDir<<refCount=0;path=/home/jenkins/workspace/Lucene-Solr-6.x-Linux/solr/build/solr-core/test/J1/../../../../../../../../../home/jenkins/workspace/Lucene-Solr-6.x-Linux/solr/build/solr-core/test/J1/temp/solr.cloud.DistribDocExpirationUpdateProcessorTest_DA0EEC8B855FAF2C-001/shard-4-001/cores/collection1/data;done=false>>]
   [junit4]   2> 1316411 INFO  (zkCallback-1978-thread-1) [    ] o.a.s.c.CachingDirectoryFactory Closing directory, CoreContainer#isShutdown=true
   [junit4]   2> 1316411 INFO  (zkCallback-1978-thread-1) [    ] o.a.s.c.CachingDirectoryFactory Closing directory: /home/jenkins/workspace/Lucene-Solr-6.x-Linux/solr/build/solr-core/test/J1/../../../../../../../../../home/jenkins/workspace/Lucene-Solr-6.x-Linux/solr/build/solr-core/test/J1/temp/solr.cloud.DistribDocExpirationUpdateProcessorTest_DA0EEC8B855FAF2C-001/shard-4-001/cores/collection1/data
   [junit4]   2> 1316412 INFO  (TEST-DistribDocExpirationUpdateProcessorTest.test-seed#[DA0EEC8B855FAF2C]) [    ] o.e.j.s.ServerConnector Stopped ServerConnector@73b10b88{HTTP/1.1,[http/1.1]}{127.0.0.1:0}
   [junit4]   2> 1316412 INFO  (TEST-DistribDocExpirationUpdateProcessorTest.test-seed#[DA0EEC8B855FAF2C]) [    ] o.e.j.s.h.ContextHandler Stopped o.e.j.s.ServletContextHandler@ca5b142{/,null,UNAVAILABLE}
   [junit4]   2> 1316413 INFO  (TEST-DistribDocExpirationUpdateProcessorTest.test-seed#[DA0EEC8B855FAF2C]) [    ] o.a.s.c.ZkTestServer connecting to 127.0.0.1:40319 40319
   [junit4]   2> 1316477 INFO  (Thread-3769) [    ] o.a.s.c.ZkTestServer connecting to 127.0.0.1:40319 40319
   [junit4]   2> 1316478 WARN  (Thread-3769) [    ] o.a.s.c.ZkTestServer Watch limit violations: 
   [junit4]   2> Maximum concurrent create/delete watches above limit:
   [junit4]   2> 
   [junit4]   2> 	6	/solr/aliases.json
   [junit4]   2> 	5	/solr/security.json
   [junit4]   2> 	5	/solr/configs/conf1
   [junit4]   2> 
   [junit4]   2> Maximum concurrent data watches above limit:
   [junit4]   2> 
   [junit4]   2> 	6	/solr/clusterstate.json
   [junit4]   2> 	4	/solr/collections/collection1/state.json
   [junit4]   2> 
   [junit4]   2> Maximum concurrent children watches above limit:
   [junit4]   2> 
   [junit4]   2> 	6	/solr/live_nodes
   [junit4]   2> 	6	/solr/collections
   [junit4]   2> 	4	/solr/overseer/collection-queue-work
   [junit4]   2> 	3	/solr/overseer/queue
   [junit4]   2> 
   [junit4]   2> NOTE: reproduce with: ant test  -Dtestcase=DistribDocExpirationUpdateProcessorTest -Dtests.method=test -Dtests.seed=DA0EEC8B855FAF2C -Dtests.multiplier=3 -Dtests.slow=true -Dtests.locale=tr -Dtests.timezone=America/Phoenix -Dtests.asserts=true -Dtests.file.encoding=UTF-8
   [junit4] FAILURE 59.8s J1 | DistribDocExpirationUpdateProcessorTest.test <<<
   [junit4]    > Throwable #1: java.lang.AssertionError: Exactly one shard should have changed, instead: [shard2, shard1] nodes=([core_node3(shard2), core_node2(shard1), core_node4(shard1)]) expected:<1> but was:<2>
   [junit4]    > 	at __randomizedtesting.SeedInfo.seed([DA0EEC8B855FAF2C:525AD3512BA3C2D4]:0)
   [junit4]    > 	at org.apache.solr.cloud.DistribDocExpirationUpdateProcessorTest.test(DistribDocExpirationUpdateProcessorTest.java:118)
   [junit4]    > 	at org.apache.solr.BaseDistributedSearchTestCase$ShardsRepeatRule$ShardsFixedStatement.callStatement(BaseDistributedSearchTestCase.java:992)
   [junit4]    > 	at org.apache.solr.BaseDistributedSearchTestCase$ShardsRepeatRule$ShardsStatement.evaluate(BaseDistributedSearchTestCase.java:967)
   [junit4]    > 	at java.lang.Thread.run(java.base@9-ea/Thread.java:804)
   [junit4]   2> 1316481 INFO  (SUITE-DistribDocExpirationUpdateProcessorTest-seed#[DA0EEC8B855FAF2C]-worker) [    ] o.a.s.SolrTestCaseJ4 ###deleteCore
   [junit4]   2> NOTE: leaving temporary files on disk at: /home/jenkins/workspace/Lucene-Solr-6.x-Linux/solr/build/solr-core/test/J1/temp/solr.cloud.DistribDocExpirationUpdateProcessorTest_DA0EEC8B855FAF2C-001
   [junit4]   2> Apr 11, 2016 10:05:40 AM com.carrotsearch.randomizedtesting.ThreadLeakControl checkThreadLeaks
   [junit4]   2> WARNING: Will linger awaiting termination of 1 leaked thread(s).
   [junit4]   2> NOTE: test params are: codec=Asserting(Lucene60): {_version_=PostingsFormat(name=MockRandom), eXpField_tdt=PostingsFormat(name=MockRandom), tTl_s=PostingsFormat(name=MockRandom), id=PostingsFormat(name=Memory doPackFST= true)}, docValues:{}, maxPointsInLeafNode=404, maxMBSortInHeap=4.121444149335351, sim=ClassicSimilarity, locale=tr, timezone=America/Phoenix
   [junit4]   2> NOTE: Linux 4.2.0-34-generic amd64/Oracle Corporation 9-ea (64-bit)/cpus=12,threads=1,free=90262304,total=518979584
   [junit4]   2> NOTE: All tests run in this JVM: [LoggingHandlerTest, ChaosMonkeySafeLeaderTest, ShardRoutingTest, TestFiltering, ShardRoutingCustomTest, TestNonDefinedSimilarityFactory, HdfsNNFailoverTest, ZkSolrClientTest, TestEmbeddedSolrServerConstructors, ResponseHeaderTest, SoftAutoCommitTest, TestConfigSetsAPIExclusivity, CoreAdminRequestStatusTest, SolrCmdDistributorTest, TestRecoveryHdfs, TestSolrDeletionPolicy2, TestFieldSortValues, RemoteQueryErrorTest, NumericFieldsTest, SuggestComponentTest, TestGeoJSONResponseWriter, TestInfoStreamLogging, HLLUtilTest, TestNoOpRegenerator, SpatialFilterTest, ZkCLITest, OverseerStatusTest, SimpleCollectionCreateDeleteTest, SchemaVersionSpecificBehaviorTest, DateRangeFieldTest, DirectSolrSpellCheckerTest, TestQueryTypes, TestLeaderElectionZkExpiry, HdfsRestartWhileUpdatingTest, NotRequiredUniqueKeyTest, TestSystemIdResolver, TestConfigOverlay, ConfigSetsAPITest, IndexBasedSpellCheckerTest, TestManagedSynonymFilterFactory, TestSolrDynamicMBean, TestQueryUtils, SimpleMLTQParserTest, TestDistributedGrouping, TestDocumentBuilder, TestMinMaxOnMultiValuedField, TestSolrConfigHandlerCloud, TestCursorMarkWithoutUniqueKey, ExplicitHLLTest, UUIDUpdateProcessorFallbackTest, AliasIntegrationTest, DataDrivenBlockJoinTest, CollectionsAPIAsyncDistributedZkTest, UpdateRequestProcessorFactoryTest, CSVRequestHandlerTest, TestManagedResourceStorage, TestStressVersions, TestCloudPivotFacet, BasicFunctionalityTest, DistributedExpandComponentTest, FacetPivotSmallTest, TestTolerantUpdateProcessorRandomCloud, TestConfigSets, TestSolrFieldCacheMBean, UniqFieldsUpdateProcessorFactoryTest, SpellCheckComponentTest, DeleteShardTest, BufferStoreTest, TestSolrQueryParserResource, AddBlockUpdateTest, TestMiniSolrCloudClusterBase, VMParamsZkACLAndCredentialsProvidersTest, SpellCheckCollatorTest, TestManagedSchema, DeleteInactiveReplicaTest, TestDFRSimilarityFactory, TestCollapseQParserPlugin, TestExactSharedStatsCache, MinimalSchemaTest, SpatialRPTFieldTypeTest, TestAuthenticationFramework, TimeZoneUtilsTest, TestTrie, TestCoreContainer, AsyncMigrateRouteKeyTest, TestSchemaVersionResource, DocValuesTest, TestDistribDocBasedVersion, HdfsChaosMonkeyNothingIsSafeTest, FileUtilsTest, CursorMarkTest, CollectionsAPIDistributedZkTest, TestJoin, TestSolr4Spatial, PeerSyncTest, TestLazyCores, CurrencyFieldOpenExchangeTest, CurrencyFieldXmlFileTest, SuggesterFSTTest, SuggesterTest, WordBreakSolrSpellCheckerTest, TestWordDelimiterFilterFactory, TestRemoteStreaming, SolrInfoMBeanTest, TestOmitPositions, XmlUpdateRequestHandlerTest, PathHierarchyTokenizerFactoryTest, MoreLikeThisHandlerTest, TestSolrQueryParser, TestJmxIntegration, QueryParsingTest, TestPartialUpdateDeduplication, PingRequestHandlerTest, HighlighterConfigTest, SOLR749Test, UpdateParamsTest, TestQuerySenderNoQuery, SolrIndexConfigTest, MultiTermTest, TestBinaryField, OutputWriterTest, ExternalFileFieldSortTest, TestSolrCoreProperties, SpellPossibilityIteratorTest, TestCodecSupport, TestPerFieldSimilarity, TestLMJelinekMercerSimilarityFactory, TestBM25SimilarityFactory, ResourceLoaderTest, URLClassifyProcessorTest, DateMathParserTest, PrimUtilsTest, TestSuggestSpellingConverter, SpellingQueryConverterTest, DOMUtilTest, RAMDirectoryFactoryTest, TestLRUCache, SystemInfoHandlerTest, DistributedMLTComponentTest, TestRTGBase, CursorPagingTest, DistributedIntervalFacetingTest, BaseCdcrDistributedZkTest, CdcrReplicationHandlerTest, CdcrRequestHandlerTest, CdcrVersionReplicationTest, ConcurrentDeleteAndCreateCollectionTest, ConnectionManagerTest, DistribDocExpirationUpdateProcessorTest]
   [junit4] Completed [451/585 (1!)] on J1 in 60.04s, 1 test, 1 failure <<< FAILURES!

[...truncated 464 lines...]
BUILD FAILED
/home/jenkins/workspace/Lucene-Solr-6.x-Linux/build.xml:740: The following error occurred while executing this line:
/home/jenkins/workspace/Lucene-Solr-6.x-Linux/build.xml:684: The following error occurred while executing this line:
/home/jenkins/workspace/Lucene-Solr-6.x-Linux/build.xml:59: The following error occurred while executing this line:
/home/jenkins/workspace/Lucene-Solr-6.x-Linux/solr/build.xml:233: The following error occurred while executing this line:
/home/jenkins/workspace/Lucene-Solr-6.x-Linux/solr/common-build.xml:529: The following error occurred while executing this line:
/home/jenkins/workspace/Lucene-Solr-6.x-Linux/lucene/common-build.xml:1457: The following error occurred while executing this line:
/home/jenkins/workspace/Lucene-Solr-6.x-Linux/lucene/common-build.xml:1014: There were test failures: 585 suites (10 ignored), 2363 tests, 1 failure, 116 ignored (70 assumptions) [seed: DA0EEC8B855FAF2C]

Total time: 53 minutes 17 seconds
Build step 'Invoke Ant' marked build as failure
Archiving artifacts
[WARNINGS] Skipping publisher since build result is FAILURE
Recording test results
Email was triggered for: Failure - Any
Sending email for trigger: Failure - Any



Mime
View raw message