lucene-dev mailing list archives

Site index · List index
Message view « Date » · « Thread »
Top « Date » · « Thread »
From Michael McCandless <luc...@mikemccandless.com>
Subject Re: [JENKINS] Lucene-Solr-master-Linux (64bit/jdk1.8.0_72) - Build # 16338 - Still Failing!
Date Sat, 26 Mar 2016 09:49:17 GMT
I'll dig ... likely caused by randomized BKD's splitting.

Mike McCandless

http://blog.mikemccandless.com


On Sat, Mar 26, 2016 at 5:47 AM, Policeman Jenkins Server
<jenkins@thetaphi.de> wrote:
> Build: http://jenkins.thetaphi.de/job/Lucene-Solr-master-Linux/16338/
> Java: 64bit/jdk1.8.0_72 -XX:-UseCompressedOops -XX:+UseParallelGC
>
> 1 tests failed.
> FAILED:  org.apache.lucene.search.join.TestBlockJoin.testMultiChildQueriesOfDiffParentLevels
>
> Error Message:
>
>
> Stack Trace:
> java.lang.AssertionError
>         at __randomizedtesting.SeedInfo.seed([301C3433A18EB082:E1F92BFF411849E4]:0)
>         at org.apache.lucene.util.bkd.BKDWriter.build(BKDWriter.java:1145)
>         at org.apache.lucene.util.bkd.BKDWriter.build(BKDWriter.java:1236)
>         at org.apache.lucene.util.bkd.BKDWriter.build(BKDWriter.java:1223)
>         at org.apache.lucene.util.bkd.BKDWriter.build(BKDWriter.java:1223)
>         at org.apache.lucene.util.bkd.BKDWriter.build(BKDWriter.java:1236)
>         at org.apache.lucene.util.bkd.BKDWriter.build(BKDWriter.java:1236)
>         at org.apache.lucene.util.bkd.BKDWriter.build(BKDWriter.java:1236)
>         at org.apache.lucene.util.bkd.BKDWriter.build(BKDWriter.java:1236)
>         at org.apache.lucene.util.bkd.BKDWriter.build(BKDWriter.java:1236)
>         at org.apache.lucene.util.bkd.BKDWriter.finish(BKDWriter.java:861)
>         at org.apache.lucene.index.RandomCodec$1$1.writeField(RandomCodec.java:143)
>         at org.apache.lucene.codecs.PointsWriter.mergeOneField(PointsWriter.java:58)
>         at org.apache.lucene.codecs.PointsWriter.merge(PointsWriter.java:164)
>         at org.apache.lucene.codecs.lucene60.Lucene60PointsWriter.merge(Lucene60PointsWriter.java:129)
>         at org.apache.lucene.codecs.asserting.AssertingPointsFormat$AssertingPointsWriter.merge(AssertingPointsFormat.java:262)
>         at org.apache.lucene.index.SegmentMerger.mergePoints(SegmentMerger.java:168)
>         at org.apache.lucene.index.SegmentMerger.merge(SegmentMerger.java:117)
>         at org.apache.lucene.index.IndexWriter.mergeMiddle(IndexWriter.java:4099)
>         at org.apache.lucene.index.IndexWriter.merge(IndexWriter.java:3679)
>         at org.apache.lucene.index.SerialMergeScheduler.merge(SerialMergeScheduler.java:40)
>         at org.apache.lucene.index.IndexWriter.maybeMerge(IndexWriter.java:1946)
>         at org.apache.lucene.index.IndexWriter.doAfterSegmentFlushed(IndexWriter.java:4741)
>         at org.apache.lucene.index.DocumentsWriter$MergePendingEvent.process(DocumentsWriter.java:689)
>         at org.apache.lucene.index.IndexWriter.processEvents(IndexWriter.java:4779)
>         at org.apache.lucene.index.IndexWriter.processEvents(IndexWriter.java:4770)
>         at org.apache.lucene.index.IndexWriter.updateDocuments(IndexWriter.java:1334)
>         at org.apache.lucene.index.IndexWriter.addDocuments(IndexWriter.java:1312)
>         at org.apache.lucene.index.RandomIndexWriter.addDocuments(RandomIndexWriter.java:200)
>         at org.apache.lucene.search.join.TestBlockJoin.testMultiChildQueriesOfDiffParentLevels(TestBlockJoin.java:1689)
>         at sun.reflect.NativeMethodAccessorImpl.invoke0(Native Method)
>         at sun.reflect.NativeMethodAccessorImpl.invoke(NativeMethodAccessorImpl.java:62)
>         at sun.reflect.DelegatingMethodAccessorImpl.invoke(DelegatingMethodAccessorImpl.java:43)
>         at java.lang.reflect.Method.invoke(Method.java:498)
>         at com.carrotsearch.randomizedtesting.RandomizedRunner.invoke(RandomizedRunner.java:1764)
>         at com.carrotsearch.randomizedtesting.RandomizedRunner$8.evaluate(RandomizedRunner.java:871)
>         at com.carrotsearch.randomizedtesting.RandomizedRunner$9.evaluate(RandomizedRunner.java:907)
>         at com.carrotsearch.randomizedtesting.RandomizedRunner$10.evaluate(RandomizedRunner.java:921)
>         at org.apache.lucene.util.TestRuleSetupTeardownChained$1.evaluate(TestRuleSetupTeardownChained.java:49)
>         at org.apache.lucene.util.AbstractBeforeAfterRule$1.evaluate(AbstractBeforeAfterRule.java:45)
>         at org.apache.lucene.util.TestRuleThreadAndTestName$1.evaluate(TestRuleThreadAndTestName.java:48)
>         at org.apache.lucene.util.TestRuleIgnoreAfterMaxFailures$1.evaluate(TestRuleIgnoreAfterMaxFailures.java:64)
>         at org.apache.lucene.util.TestRuleMarkFailure$1.evaluate(TestRuleMarkFailure.java:47)
>         at com.carrotsearch.randomizedtesting.rules.StatementAdapter.evaluate(StatementAdapter.java:36)
>         at com.carrotsearch.randomizedtesting.ThreadLeakControl$StatementRunner.run(ThreadLeakControl.java:367)
>         at com.carrotsearch.randomizedtesting.ThreadLeakControl.forkTimeoutingTask(ThreadLeakControl.java:809)
>         at com.carrotsearch.randomizedtesting.ThreadLeakControl$3.evaluate(ThreadLeakControl.java:460)
>         at com.carrotsearch.randomizedtesting.RandomizedRunner.runSingleTest(RandomizedRunner.java:880)
>         at com.carrotsearch.randomizedtesting.RandomizedRunner$5.evaluate(RandomizedRunner.java:781)
>         at com.carrotsearch.randomizedtesting.RandomizedRunner$6.evaluate(RandomizedRunner.java:816)
>         at com.carrotsearch.randomizedtesting.RandomizedRunner$7.evaluate(RandomizedRunner.java:827)
>         at org.apache.lucene.util.AbstractBeforeAfterRule$1.evaluate(AbstractBeforeAfterRule.java:45)
>         at com.carrotsearch.randomizedtesting.rules.StatementAdapter.evaluate(StatementAdapter.java:36)
>         at org.apache.lucene.util.TestRuleStoreClassName$1.evaluate(TestRuleStoreClassName.java:41)
>         at com.carrotsearch.randomizedtesting.rules.NoShadowingOrOverridesOnMethodsRule$1.evaluate(NoShadowingOrOverridesOnMethodsRule.java:40)
>         at com.carrotsearch.randomizedtesting.rules.NoShadowingOrOverridesOnMethodsRule$1.evaluate(NoShadowingOrOverridesOnMethodsRule.java:40)
>         at com.carrotsearch.randomizedtesting.rules.StatementAdapter.evaluate(StatementAdapter.java:36)
>         at com.carrotsearch.randomizedtesting.rules.StatementAdapter.evaluate(StatementAdapter.java:36)
>         at com.carrotsearch.randomizedtesting.rules.StatementAdapter.evaluate(StatementAdapter.java:36)
>         at org.apache.lucene.util.TestRuleAssertionsRequired$1.evaluate(TestRuleAssertionsRequired.java:53)
>         at org.apache.lucene.util.TestRuleMarkFailure$1.evaluate(TestRuleMarkFailure.java:47)
>         at org.apache.lucene.util.TestRuleIgnoreAfterMaxFailures$1.evaluate(TestRuleIgnoreAfterMaxFailures.java:64)
>         at org.apache.lucene.util.TestRuleIgnoreTestSuites$1.evaluate(TestRuleIgnoreTestSuites.java:54)
>         at com.carrotsearch.randomizedtesting.rules.StatementAdapter.evaluate(StatementAdapter.java:36)
>         at com.carrotsearch.randomizedtesting.ThreadLeakControl$StatementRunner.run(ThreadLeakControl.java:367)
>         at java.lang.Thread.run(Thread.java:745)
>
>
>
>
> Build Log:
> [...truncated 7155 lines...]
>    [junit4] Suite: org.apache.lucene.search.join.TestBlockJoin
>    [junit4]   2> NOTE: reproduce with: ant test  -Dtestcase=TestBlockJoin -Dtests.method=testMultiChildQueriesOfDiffParentLevels
-Dtests.seed=301C3433A18EB082 -Dtests.multiplier=3 -Dtests.slow=true -Dtests.locale=no-NO
-Dtests.timezone=Europe/Amsterdam -Dtests.asserts=true -Dtests.file.encoding=UTF-8
>    [junit4] FAILURE 4.10s J1 | TestBlockJoin.testMultiChildQueriesOfDiffParentLevels
<<<
>    [junit4]    > Throwable #1: java.lang.AssertionError
>    [junit4]    >        at __randomizedtesting.SeedInfo.seed([301C3433A18EB082:E1F92BFF411849E4]:0)
>    [junit4]    >        at org.apache.lucene.util.bkd.BKDWriter.build(BKDWriter.java:1145)
>    [junit4]    >        at org.apache.lucene.util.bkd.BKDWriter.build(BKDWriter.java:1236)
>    [junit4]    >        at org.apache.lucene.util.bkd.BKDWriter.build(BKDWriter.java:1223)
>    [junit4]    >        at org.apache.lucene.util.bkd.BKDWriter.build(BKDWriter.java:1223)
>    [junit4]    >        at org.apache.lucene.util.bkd.BKDWriter.build(BKDWriter.java:1236)
>    [junit4]    >        at org.apache.lucene.util.bkd.BKDWriter.build(BKDWriter.java:1236)
>    [junit4]    >        at org.apache.lucene.util.bkd.BKDWriter.build(BKDWriter.java:1236)
>    [junit4]    >        at org.apache.lucene.util.bkd.BKDWriter.build(BKDWriter.java:1236)
>    [junit4]    >        at org.apache.lucene.util.bkd.BKDWriter.build(BKDWriter.java:1236)
>    [junit4]    >        at org.apache.lucene.util.bkd.BKDWriter.finish(BKDWriter.java:861)
>    [junit4]    >        at org.apache.lucene.index.RandomCodec$1$1.writeField(RandomCodec.java:143)
>    [junit4]    >        at org.apache.lucene.codecs.PointsWriter.mergeOneField(PointsWriter.java:58)
>    [junit4]    >        at org.apache.lucene.codecs.PointsWriter.merge(PointsWriter.java:164)
>    [junit4]    >        at org.apache.lucene.codecs.lucene60.Lucene60PointsWriter.merge(Lucene60PointsWriter.java:129)
>    [junit4]    >        at org.apache.lucene.codecs.asserting.AssertingPointsFormat$AssertingPointsWriter.merge(AssertingPointsFormat.java:262)
>    [junit4]    >        at org.apache.lucene.index.SegmentMerger.mergePoints(SegmentMerger.java:168)
>    [junit4]    >        at org.apache.lucene.index.SegmentMerger.merge(SegmentMerger.java:117)
>    [junit4]    >        at org.apache.lucene.index.IndexWriter.mergeMiddle(IndexWriter.java:4099)
>    [junit4]    >        at org.apache.lucene.index.IndexWriter.merge(IndexWriter.java:3679)
>    [junit4]    >        at org.apache.lucene.index.SerialMergeScheduler.merge(SerialMergeScheduler.java:40)
>    [junit4]    >        at org.apache.lucene.index.IndexWriter.maybeMerge(IndexWriter.java:1946)
>    [junit4]    >        at org.apache.lucene.index.IndexWriter.doAfterSegmentFlushed(IndexWriter.java:4741)
>    [junit4]    >        at org.apache.lucene.index.DocumentsWriter$MergePendingEvent.process(DocumentsWriter.java:689)
>    [junit4]    >        at org.apache.lucene.index.IndexWriter.processEvents(IndexWriter.java:4779)
>    [junit4]    >        at org.apache.lucene.index.IndexWriter.processEvents(IndexWriter.java:4770)
>    [junit4]    >        at org.apache.lucene.index.IndexWriter.updateDocuments(IndexWriter.java:1334)
>    [junit4]    >        at org.apache.lucene.index.IndexWriter.addDocuments(IndexWriter.java:1312)
>    [junit4]    >        at org.apache.lucene.index.RandomIndexWriter.addDocuments(RandomIndexWriter.java:200)
>    [junit4]    >        at org.apache.lucene.search.join.TestBlockJoin.testMultiChildQueriesOfDiffParentLevels(TestBlockJoin.java:1689)
>    [junit4]    >        at java.lang.Thread.run(Thread.java:745)
>    [junit4]   2> NOTE: leaving temporary files on disk at: /home/jenkins/workspace/Lucene-Solr-master-Linux/lucene/build/join/test/J1/temp/lucene.search.join.TestBlockJoin_301C3433A18EB082-001
>    [junit4]   2> NOTE: test params are: codec=Asserting(Lucene60): {country=PostingsFormat(name=Memory
doPackFST= false), parent=PostingsFormat(name=LuceneFixedGap), isParent=PostingsFormat(name=Memory
doPackFST= false), docType=PostingsFormat(name=Memory doPackFST= false), isparent=PostingsFormat(name=LuceneFixedGap),
child2=PostingsFormat(name=LuceneFixedGap), child0=PostingsFormat(name=Memory doPackFST= false),
child1=PostingsFormat(name=Memory doPackFST= true), foo_parent=Lucene50(blocksize=128), parent0=PostingsFormat(name=LuceneFixedGap),
qualification=Lucene50(blocksize=128), parent1=Lucene50(blocksize=128), skill=PostingsFormat(name=Memory
doPackFST= true), name=Lucene50(blocksize=128), foo_child=Lucene50(blocksize=128), childText=PostingsFormat(name=Memory
doPackFST= true), parentText=Lucene50(blocksize=128), parent2=PostingsFormat(name=Memory doPackFST=
false), child=PostingsFormat(name=LuceneFixedGap)}, docValues:{parent0=DocValuesFormat(name=SimpleText),
parent1=DocValuesFormat(name=Asserting), child2=DocValuesFormat(name=Lucene54), childID=DocValuesFormat(name=Asserting),
parentID=DocValuesFormat(name=Direct), parent2=DocValuesFormat(name=Lucene54), child0=DocValuesFormat(name=Lucene54),
child1=DocValuesFormat(name=Direct)}, maxPointsInLeafNode=1592, maxMBSortInHeap=4.515584869926175,
sim=ClassicSimilarity, locale=no-NO, timezone=Europe/Amsterdam
>    [junit4]   2> NOTE: Linux 4.2.0-34-generic amd64/Oracle Corporation 1.8.0_72 (64-bit)/cpus=12,threads=1,free=348728376,total=524812288
>    [junit4]   2> NOTE: All tests run in this JVM: [TestBlockJoin]
>    [junit4] Completed [6/6 (1!)] on J1 in 20.72s, 19 tests, 1 failure <<< FAILURES!
>
> [...truncated 11 lines...]
> BUILD FAILED
> /home/jenkins/workspace/Lucene-Solr-master-Linux/build.xml:740: The following error occurred
while executing this line:
> /home/jenkins/workspace/Lucene-Solr-master-Linux/build.xml:684: The following error occurred
while executing this line:
> /home/jenkins/workspace/Lucene-Solr-master-Linux/build.xml:59: The following error occurred
while executing this line:
> /home/jenkins/workspace/Lucene-Solr-master-Linux/lucene/build.xml:476: The following
error occurred while executing this line:
> /home/jenkins/workspace/Lucene-Solr-master-Linux/lucene/common-build.xml:2187: The following
error occurred while executing this line:
> /home/jenkins/workspace/Lucene-Solr-master-Linux/lucene/module-build.xml:58: The following
error occurred while executing this line:
> /home/jenkins/workspace/Lucene-Solr-master-Linux/lucene/common-build.xml:1457: The following
error occurred while executing this line:
> /home/jenkins/workspace/Lucene-Solr-master-Linux/lucene/common-build.xml:1014: There
were test failures: 6 suites, 43 tests, 1 failure [seed: 301C3433A18EB082]
>
> Total time: 16 minutes 42 seconds
> Build step 'Invoke Ant' marked build as failure
> Archiving artifacts
> [WARNINGS] Skipping publisher since build result is FAILURE
> Recording test results
> Email was triggered for: Failure - Any
> Sending email for trigger: Failure - Any
>
>
>
>
> ---------------------------------------------------------------------
> To unsubscribe, e-mail: dev-unsubscribe@lucene.apache.org
> For additional commands, e-mail: dev-help@lucene.apache.org

---------------------------------------------------------------------
To unsubscribe, e-mail: dev-unsubscribe@lucene.apache.org
For additional commands, e-mail: dev-help@lucene.apache.org


Mime
View raw message