lucene-dev mailing list archives

Site index · List index
Message view « Date » · « Thread »
Top « Date » · « Thread »
From Policeman Jenkins Server <jenk...@thetaphi.de>
Subject [JENKINS-EA] Lucene-Solr-6.x-Linux (32bit/jdk-9-ea+107) - Build # 89 - Failure!
Date Fri, 11 Mar 2016 04:39:42 GMT
Build: http://jenkins.thetaphi.de/job/Lucene-Solr-6.x-Linux/89/
Java: 32bit/jdk-9-ea+107 -server -XX:+UseParallelGC

1 tests failed.
FAILED:  org.apache.solr.cloud.UnloadDistributedZkTest.test

Error Message:
Captured an uncaught exception in thread: Thread[id=1140, name=testExecutor-499-thread-3, state=RUNNABLE, group=TGRP-UnloadDistributedZkTest]

Stack Trace:
com.carrotsearch.randomizedtesting.UncaughtExceptionError: Captured an uncaught exception in thread: Thread[id=1140, name=testExecutor-499-thread-3, state=RUNNABLE, group=TGRP-UnloadDistributedZkTest]
Caused by: java.lang.RuntimeException: org.apache.solr.client.solrj.SolrServerException: Timeout occured while waiting response from server at: http://127.0.0.1:35829
	at __randomizedtesting.SeedInfo.seed([20630518F2F53822]:0)
	at org.apache.solr.cloud.BasicDistributedZkTest.lambda$createCores$0(BasicDistributedZkTest.java:583)
	at org.apache.solr.common.util.ExecutorUtil$MDCAwareThreadPoolExecutor.lambda$execute$0(ExecutorUtil.java:229)
	at java.util.concurrent.ThreadPoolExecutor.runWorker(ThreadPoolExecutor.java:1158)
	at java.util.concurrent.ThreadPoolExecutor$Worker.run(ThreadPoolExecutor.java:632)
	at java.lang.Thread.run(Thread.java:804)
Caused by: org.apache.solr.client.solrj.SolrServerException: Timeout occured while waiting response from server at: http://127.0.0.1:35829
	at org.apache.solr.client.solrj.impl.HttpSolrClient.executeMethod(HttpSolrClient.java:588)
	at org.apache.solr.client.solrj.impl.HttpSolrClient.request(HttpSolrClient.java:241)
	at org.apache.solr.client.solrj.impl.HttpSolrClient.request(HttpSolrClient.java:230)
	at org.apache.solr.client.solrj.SolrClient.request(SolrClient.java:1219)
	at org.apache.solr.cloud.BasicDistributedZkTest.lambda$createCores$0(BasicDistributedZkTest.java:581)
	... 4 more
Caused by: java.net.SocketTimeoutException: Read timed out
	at java.net.SocketInputStream.socketRead0(Native Method)
	at java.net.SocketInputStream.socketRead(SocketInputStream.java:116)
	at java.net.SocketInputStream.read(SocketInputStream.java:170)
	at java.net.SocketInputStream.read(SocketInputStream.java:141)
	at org.apache.http.impl.io.AbstractSessionInputBuffer.fillBuffer(AbstractSessionInputBuffer.java:160)
	at org.apache.http.impl.io.SocketInputBuffer.fillBuffer(SocketInputBuffer.java:84)
	at org.apache.http.impl.io.AbstractSessionInputBuffer.readLine(AbstractSessionInputBuffer.java:273)
	at org.apache.http.impl.conn.DefaultHttpResponseParser.parseHead(DefaultHttpResponseParser.java:140)
	at org.apache.http.impl.conn.DefaultHttpResponseParser.parseHead(DefaultHttpResponseParser.java:57)
	at org.apache.http.impl.io.AbstractMessageParser.parse(AbstractMessageParser.java:261)
	at org.apache.http.impl.AbstractHttpClientConnection.receiveResponseHeader(AbstractHttpClientConnection.java:283)
	at org.apache.http.impl.conn.DefaultClientConnection.receiveResponseHeader(DefaultClientConnection.java:251)
	at org.apache.http.impl.conn.ManagedClientConnectionImpl.receiveResponseHeader(ManagedClientConnectionImpl.java:197)
	at org.apache.http.protocol.HttpRequestExecutor.doReceiveResponse(HttpRequestExecutor.java:272)
	at org.apache.http.protocol.HttpRequestExecutor.execute(HttpRequestExecutor.java:124)
	at org.apache.http.impl.client.DefaultRequestDirector.tryExecute(DefaultRequestDirector.java:685)
	at org.apache.http.impl.client.DefaultRequestDirector.execute(DefaultRequestDirector.java:487)
	at org.apache.http.impl.client.AbstractHttpClient.doExecute(AbstractHttpClient.java:882)
	at org.apache.http.impl.client.CloseableHttpClient.execute(CloseableHttpClient.java:82)
	at org.apache.http.impl.client.CloseableHttpClient.execute(CloseableHttpClient.java:107)
	at org.apache.http.impl.client.CloseableHttpClient.execute(CloseableHttpClient.java:55)
	at org.apache.solr.client.solrj.impl.HttpSolrClient.executeMethod(HttpSolrClient.java:482)
	... 8 more




Build Log:
[...truncated 10745 lines...]
   [junit4] Suite: org.apache.solr.cloud.UnloadDistributedZkTest
   [junit4]   2> Creating dataDir: /home/jenkins/workspace/Lucene-Solr-6.x-Linux/solr/build/solr-core/test/J2/temp/solr.cloud.UnloadDistributedZkTest_20630518F2F53822-001/init-core-data-001
   [junit4]   2> 103132 INFO  (SUITE-UnloadDistributedZkTest-seed#[20630518F2F53822]-worker) [    ] o.a.s.BaseDistributedSearchTestCase Setting hostContext system property: /
   [junit4]   2> 103134 INFO  (TEST-UnloadDistributedZkTest.test-seed#[20630518F2F53822]) [    ] o.a.s.c.ZkTestServer STARTING ZK TEST SERVER
   [junit4]   2> 103134 INFO  (Thread-312) [    ] o.a.s.c.ZkTestServer client port:0.0.0.0/0.0.0.0:0
   [junit4]   2> 103134 INFO  (Thread-312) [    ] o.a.s.c.ZkTestServer Starting server
   [junit4]   2> 103234 INFO  (TEST-UnloadDistributedZkTest.test-seed#[20630518F2F53822]) [    ] o.a.s.c.ZkTestServer start zk server on port:56295
   [junit4]   2> 103234 INFO  (TEST-UnloadDistributedZkTest.test-seed#[20630518F2F53822]) [    ] o.a.s.c.c.SolrZkClient Using default ZkCredentialsProvider
   [junit4]   2> 103235 INFO  (TEST-UnloadDistributedZkTest.test-seed#[20630518F2F53822]) [    ] o.a.s.c.c.ConnectionManager Waiting for client to connect to ZooKeeper
   [junit4]   2> 103237 INFO  (zkCallback-104-thread-1) [    ] o.a.s.c.c.ConnectionManager Watcher org.apache.solr.common.cloud.ConnectionManager@12ab10c name:ZooKeeperConnection Watcher:127.0.0.1:56295 got event WatchedEvent state:SyncConnected type:None path:null path:null type:None
   [junit4]   2> 103237 INFO  (TEST-UnloadDistributedZkTest.test-seed#[20630518F2F53822]) [    ] o.a.s.c.c.ConnectionManager Client is connected to ZooKeeper
   [junit4]   2> 103237 INFO  (TEST-UnloadDistributedZkTest.test-seed#[20630518F2F53822]) [    ] o.a.s.c.c.SolrZkClient Using default ZkACLProvider
   [junit4]   2> 103237 INFO  (TEST-UnloadDistributedZkTest.test-seed#[20630518F2F53822]) [    ] o.a.s.c.c.SolrZkClient makePath: /solr
   [junit4]   2> 103239 INFO  (TEST-UnloadDistributedZkTest.test-seed#[20630518F2F53822]) [    ] o.a.s.c.c.SolrZkClient Using default ZkCredentialsProvider
   [junit4]   2> 103240 INFO  (TEST-UnloadDistributedZkTest.test-seed#[20630518F2F53822]) [    ] o.a.s.c.c.ConnectionManager Waiting for client to connect to ZooKeeper
   [junit4]   2> 103241 INFO  (zkCallback-105-thread-1) [    ] o.a.s.c.c.ConnectionManager Watcher org.apache.solr.common.cloud.ConnectionManager@182f689 name:ZooKeeperConnection Watcher:127.0.0.1:56295/solr got event WatchedEvent state:SyncConnected type:None path:null path:null type:None
   [junit4]   2> 103241 INFO  (TEST-UnloadDistributedZkTest.test-seed#[20630518F2F53822]) [    ] o.a.s.c.c.ConnectionManager Client is connected to ZooKeeper
   [junit4]   2> 103241 INFO  (TEST-UnloadDistributedZkTest.test-seed#[20630518F2F53822]) [    ] o.a.s.c.c.SolrZkClient Using default ZkACLProvider
   [junit4]   2> 103241 INFO  (TEST-UnloadDistributedZkTest.test-seed#[20630518F2F53822]) [    ] o.a.s.c.c.SolrZkClient makePath: /collections/collection1
   [junit4]   2> 103242 INFO  (TEST-UnloadDistributedZkTest.test-seed#[20630518F2F53822]) [    ] o.a.s.c.c.SolrZkClient makePath: /collections/collection1/shards
   [junit4]   2> 103243 INFO  (TEST-UnloadDistributedZkTest.test-seed#[20630518F2F53822]) [    ] o.a.s.c.c.SolrZkClient makePath: /collections/control_collection
   [junit4]   2> 103243 INFO  (TEST-UnloadDistributedZkTest.test-seed#[20630518F2F53822]) [    ] o.a.s.c.c.SolrZkClient makePath: /collections/control_collection/shards
   [junit4]   2> 103244 INFO  (TEST-UnloadDistributedZkTest.test-seed#[20630518F2F53822]) [    ] o.a.s.c.AbstractZkTestCase put /home/jenkins/workspace/Lucene-Solr-6.x-Linux/solr/core/src/test-files/solr/collection1/conf/solrconfig-tlog.xml to /configs/conf1/solrconfig.xml
   [junit4]   2> 103244 INFO  (TEST-UnloadDistributedZkTest.test-seed#[20630518F2F53822]) [    ] o.a.s.c.c.SolrZkClient makePath: /configs/conf1/solrconfig.xml
   [junit4]   2> 103245 INFO  (TEST-UnloadDistributedZkTest.test-seed#[20630518F2F53822]) [    ] o.a.s.c.AbstractZkTestCase put /home/jenkins/workspace/Lucene-Solr-6.x-Linux/solr/core/src/test-files/solr/collection1/conf/schema.xml to /configs/conf1/schema.xml
   [junit4]   2> 103245 INFO  (TEST-UnloadDistributedZkTest.test-seed#[20630518F2F53822]) [    ] o.a.s.c.c.SolrZkClient makePath: /configs/conf1/schema.xml
   [junit4]   2> 103246 INFO  (TEST-UnloadDistributedZkTest.test-seed#[20630518F2F53822]) [    ] o.a.s.c.AbstractZkTestCase put /home/jenkins/workspace/Lucene-Solr-6.x-Linux/solr/core/src/test-files/solr/collection1/conf/solrconfig.snippet.randomindexconfig.xml to /configs/conf1/solrconfig.snippet.randomindexconfig.xml
   [junit4]   2> 103246 INFO  (TEST-UnloadDistributedZkTest.test-seed#[20630518F2F53822]) [    ] o.a.s.c.c.SolrZkClient makePath: /configs/conf1/solrconfig.snippet.randomindexconfig.xml
   [junit4]   2> 103247 INFO  (TEST-UnloadDistributedZkTest.test-seed#[20630518F2F53822]) [    ] o.a.s.c.AbstractZkTestCase put /home/jenkins/workspace/Lucene-Solr-6.x-Linux/solr/core/src/test-files/solr/collection1/conf/stopwords.txt to /configs/conf1/stopwords.txt
   [junit4]   2> 103247 INFO  (TEST-UnloadDistributedZkTest.test-seed#[20630518F2F53822]) [    ] o.a.s.c.c.SolrZkClient makePath: /configs/conf1/stopwords.txt
   [junit4]   2> 103248 INFO  (TEST-UnloadDistributedZkTest.test-seed#[20630518F2F53822]) [    ] o.a.s.c.AbstractZkTestCase put /home/jenkins/workspace/Lucene-Solr-6.x-Linux/solr/core/src/test-files/solr/collection1/conf/protwords.txt to /configs/conf1/protwords.txt
   [junit4]   2> 103248 INFO  (TEST-UnloadDistributedZkTest.test-seed#[20630518F2F53822]) [    ] o.a.s.c.c.SolrZkClient makePath: /configs/conf1/protwords.txt
   [junit4]   2> 103249 INFO  (TEST-UnloadDistributedZkTest.test-seed#[20630518F2F53822]) [    ] o.a.s.c.AbstractZkTestCase put /home/jenkins/workspace/Lucene-Solr-6.x-Linux/solr/core/src/test-files/solr/collection1/conf/currency.xml to /configs/conf1/currency.xml
   [junit4]   2> 103249 INFO  (TEST-UnloadDistributedZkTest.test-seed#[20630518F2F53822]) [    ] o.a.s.c.c.SolrZkClient makePath: /configs/conf1/currency.xml
   [junit4]   2> 103250 INFO  (TEST-UnloadDistributedZkTest.test-seed#[20630518F2F53822]) [    ] o.a.s.c.AbstractZkTestCase put /home/jenkins/workspace/Lucene-Solr-6.x-Linux/solr/core/src/test-files/solr/collection1/conf/enumsConfig.xml to /configs/conf1/enumsConfig.xml
   [junit4]   2> 103250 INFO  (TEST-UnloadDistributedZkTest.test-seed#[20630518F2F53822]) [    ] o.a.s.c.c.SolrZkClient makePath: /configs/conf1/enumsConfig.xml
   [junit4]   2> 103250 INFO  (TEST-UnloadDistributedZkTest.test-seed#[20630518F2F53822]) [    ] o.a.s.c.AbstractZkTestCase put /home/jenkins/workspace/Lucene-Solr-6.x-Linux/solr/core/src/test-files/solr/collection1/conf/open-exchange-rates.json to /configs/conf1/open-exchange-rates.json
   [junit4]   2> 103250 INFO  (TEST-UnloadDistributedZkTest.test-seed#[20630518F2F53822]) [    ] o.a.s.c.c.SolrZkClient makePath: /configs/conf1/open-exchange-rates.json
   [junit4]   2> 103251 INFO  (TEST-UnloadDistributedZkTest.test-seed#[20630518F2F53822]) [    ] o.a.s.c.AbstractZkTestCase put /home/jenkins/workspace/Lucene-Solr-6.x-Linux/solr/core/src/test-files/solr/collection1/conf/mapping-ISOLatin1Accent.txt to /configs/conf1/mapping-ISOLatin1Accent.txt
   [junit4]   2> 103251 INFO  (TEST-UnloadDistributedZkTest.test-seed#[20630518F2F53822]) [    ] o.a.s.c.c.SolrZkClient makePath: /configs/conf1/mapping-ISOLatin1Accent.txt
   [junit4]   2> 103251 INFO  (TEST-UnloadDistributedZkTest.test-seed#[20630518F2F53822]) [    ] o.a.s.c.AbstractZkTestCase put /home/jenkins/workspace/Lucene-Solr-6.x-Linux/solr/core/src/test-files/solr/collection1/conf/old_synonyms.txt to /configs/conf1/old_synonyms.txt
   [junit4]   2> 103251 INFO  (TEST-UnloadDistributedZkTest.test-seed#[20630518F2F53822]) [    ] o.a.s.c.c.SolrZkClient makePath: /configs/conf1/old_synonyms.txt
   [junit4]   2> 103252 INFO  (TEST-UnloadDistributedZkTest.test-seed#[20630518F2F53822]) [    ] o.a.s.c.AbstractZkTestCase put /home/jenkins/workspace/Lucene-Solr-6.x-Linux/solr/core/src/test-files/solr/collection1/conf/synonyms.txt to /configs/conf1/synonyms.txt
   [junit4]   2> 103252 INFO  (TEST-UnloadDistributedZkTest.test-seed#[20630518F2F53822]) [    ] o.a.s.c.c.SolrZkClient makePath: /configs/conf1/synonyms.txt
   [junit4]   2> 103329 INFO  (TEST-UnloadDistributedZkTest.test-seed#[20630518F2F53822]) [    ] o.a.s.SolrTestCaseJ4 Writing core.properties file to /home/jenkins/workspace/Lucene-Solr-6.x-Linux/solr/build/solr-core/test/J2/temp/solr.cloud.UnloadDistributedZkTest_20630518F2F53822-001/control-001/cores/collection1
   [junit4]   2> 103331 INFO  (TEST-UnloadDistributedZkTest.test-seed#[20630518F2F53822]) [    ] o.e.j.s.Server jetty-9.3.6.v20151106
   [junit4]   2> 103332 INFO  (TEST-UnloadDistributedZkTest.test-seed#[20630518F2F53822]) [    ] o.e.j.s.h.ContextHandler Started o.e.j.s.ServletContextHandler@12e99d4{/,null,AVAILABLE}
   [junit4]   2> 103334 INFO  (TEST-UnloadDistributedZkTest.test-seed#[20630518F2F53822]) [    ] o.e.j.s.ServerConnector Started ServerConnector@12e8641{HTTP/1.1,[http/1.1]}{127.0.0.1:49352}
   [junit4]   2> 103334 INFO  (TEST-UnloadDistributedZkTest.test-seed#[20630518F2F53822]) [    ] o.e.j.s.Server Started @104901ms
   [junit4]   2> 103334 INFO  (TEST-UnloadDistributedZkTest.test-seed#[20630518F2F53822]) [    ] o.a.s.c.s.e.JettySolrRunner Jetty properties: {solr.data.dir=/home/jenkins/workspace/Lucene-Solr-6.x-Linux/solr/build/solr-core/test/J2/temp/solr.cloud.UnloadDistributedZkTest_20630518F2F53822-001/tempDir-001/control/data, hostContext=/, hostPort=49352, coreRootDirectory=/home/jenkins/workspace/Lucene-Solr-6.x-Linux/solr/build/solr-core/test/J2/temp/solr.cloud.UnloadDistributedZkTest_20630518F2F53822-001/control-001/cores}
   [junit4]   2> 103334 INFO  (TEST-UnloadDistributedZkTest.test-seed#[20630518F2F53822]) [    ] o.a.s.s.SolrDispatchFilter SolrDispatchFilter.init(): sun.misc.Launcher$AppClassLoader@163006a
   [junit4]   2> 103334 INFO  (TEST-UnloadDistributedZkTest.test-seed#[20630518F2F53822]) [    ] o.a.s.c.SolrResourceLoader new SolrResourceLoader for directory: '/home/jenkins/workspace/Lucene-Solr-6.x-Linux/solr/build/solr-core/test/J2/temp/solr.cloud.UnloadDistributedZkTest_20630518F2F53822-001/control-001'
   [junit4]   2> 103334 INFO  (TEST-UnloadDistributedZkTest.test-seed#[20630518F2F53822]) [    ] o.a.s.c.SolrResourceLoader JNDI not configured for solr (NoInitialContextEx)
   [junit4]   2> 103334 INFO  (TEST-UnloadDistributedZkTest.test-seed#[20630518F2F53822]) [    ] o.a.s.c.SolrResourceLoader solr home defaulted to 'solr/' (could not find system property or JNDI)
   [junit4]   2> 103334 INFO  (TEST-UnloadDistributedZkTest.test-seed#[20630518F2F53822]) [    ] o.a.s.c.c.SolrZkClient Using default ZkCredentialsProvider
   [junit4]   2> 103335 INFO  (TEST-UnloadDistributedZkTest.test-seed#[20630518F2F53822]) [    ] o.a.s.c.c.ConnectionManager Waiting for client to connect to ZooKeeper
   [junit4]   2> 103336 INFO  (zkCallback-106-thread-1) [    ] o.a.s.c.c.ConnectionManager Watcher org.apache.solr.common.cloud.ConnectionManager@1e4b57a name:ZooKeeperConnection Watcher:127.0.0.1:56295/solr got event WatchedEvent state:SyncConnected type:None path:null path:null type:None
   [junit4]   2> 103336 INFO  (TEST-UnloadDistributedZkTest.test-seed#[20630518F2F53822]) [    ] o.a.s.c.c.ConnectionManager Client is connected to ZooKeeper
   [junit4]   2> 103336 INFO  (TEST-UnloadDistributedZkTest.test-seed#[20630518F2F53822]) [    ] o.a.s.c.c.SolrZkClient Using default ZkACLProvider
   [junit4]   2> 103338 INFO  (TEST-UnloadDistributedZkTest.test-seed#[20630518F2F53822]) [    ] o.a.s.s.SolrDispatchFilter Loading solr.xml from SolrHome (not found in ZooKeeper)
   [junit4]   2> 103338 INFO  (TEST-UnloadDistributedZkTest.test-seed#[20630518F2F53822]) [    ] o.a.s.c.SolrXmlConfig Loading container configuration from /home/jenkins/workspace/Lucene-Solr-6.x-Linux/solr/build/solr-core/test/J2/temp/solr.cloud.UnloadDistributedZkTest_20630518F2F53822-001/control-001/solr.xml
   [junit4]   2> 103342 INFO  (TEST-UnloadDistributedZkTest.test-seed#[20630518F2F53822]) [    ] o.a.s.c.CorePropertiesLocator Config-defined core root directory: /home/jenkins/workspace/Lucene-Solr-6.x-Linux/solr/build/solr-core/test/J2/temp/solr.cloud.UnloadDistributedZkTest_20630518F2F53822-001/control-001/cores
   [junit4]   2> 103342 INFO  (TEST-UnloadDistributedZkTest.test-seed#[20630518F2F53822]) [    ] o.a.s.c.CoreContainer New CoreContainer 1903505
   [junit4]   2> 103342 INFO  (TEST-UnloadDistributedZkTest.test-seed#[20630518F2F53822]) [    ] o.a.s.c.CoreContainer Loading cores into CoreContainer [instanceDir=/home/jenkins/workspace/Lucene-Solr-6.x-Linux/solr/build/solr-core/test/J2/temp/solr.cloud.UnloadDistributedZkTest_20630518F2F53822-001/control-001]
   [junit4]   2> 103342 WARN  (TEST-UnloadDistributedZkTest.test-seed#[20630518F2F53822]) [    ] o.a.s.c.CoreContainer Couldn't add files from /home/jenkins/workspace/Lucene-Solr-6.x-Linux/solr/build/solr-core/test/J2/temp/solr.cloud.UnloadDistributedZkTest_20630518F2F53822-001/control-001/lib to classpath: /home/jenkins/workspace/Lucene-Solr-6.x-Linux/solr/build/solr-core/test/J2/temp/solr.cloud.UnloadDistributedZkTest_20630518F2F53822-001/control-001/lib
   [junit4]   2> 103342 INFO  (TEST-UnloadDistributedZkTest.test-seed#[20630518F2F53822]) [    ] o.a.s.h.c.HttpShardHandlerFactory created with socketTimeout : 90000,urlScheme : ,connTimeout : 15000,maxConnectionsPerHost : 20,maxConnections : 10000,corePoolSize : 0,maximumPoolSize : 2147483647,maxThreadIdleTime : 5,sizeOfQueue : -1,fairnessPolicy : false,useRetries : false,
   [junit4]   2> 103343 INFO  (TEST-UnloadDistributedZkTest.test-seed#[20630518F2F53822]) [    ] o.a.s.u.UpdateShardHandler Creating UpdateShardHandler HTTP client with params: socketTimeout=340000&connTimeout=45000&retry=true
   [junit4]   2> 103343 INFO  (TEST-UnloadDistributedZkTest.test-seed#[20630518F2F53822]) [    ] o.a.s.l.LogWatcher SLF4J impl is org.slf4j.impl.Log4jLoggerFactory
   [junit4]   2> 103343 INFO  (TEST-UnloadDistributedZkTest.test-seed#[20630518F2F53822]) [    ] o.a.s.l.LogWatcher Registering Log Listener [Log4j (org.slf4j.impl.Log4jLoggerFactory)]
   [junit4]   2> 103343 INFO  (TEST-UnloadDistributedZkTest.test-seed#[20630518F2F53822]) [    ] o.a.s.c.ZkContainer Zookeeper client=127.0.0.1:56295/solr
   [junit4]   2> 103343 INFO  (TEST-UnloadDistributedZkTest.test-seed#[20630518F2F53822]) [    ] o.a.s.c.ZkController zkHost includes chroot
   [junit4]   2> 103343 INFO  (TEST-UnloadDistributedZkTest.test-seed#[20630518F2F53822]) [    ] o.a.s.c.c.SolrZkClient Using default ZkCredentialsProvider
   [junit4]   2> 103343 INFO  (TEST-UnloadDistributedZkTest.test-seed#[20630518F2F53822]) [    ] o.a.s.c.c.ConnectionManager Waiting for client to connect to ZooKeeper
   [junit4]   2> 103346 INFO  (zkCallback-109-thread-1) [    ] o.a.s.c.c.ConnectionManager Watcher org.apache.solr.common.cloud.ConnectionManager@b92b2b name:ZooKeeperConnection Watcher:127.0.0.1:56295 got event WatchedEvent state:SyncConnected type:None path:null path:null type:None
   [junit4]   2> 103346 INFO  (TEST-UnloadDistributedZkTest.test-seed#[20630518F2F53822]) [    ] o.a.s.c.c.ConnectionManager Client is connected to ZooKeeper
   [junit4]   2> 103346 INFO  (TEST-UnloadDistributedZkTest.test-seed#[20630518F2F53822]) [    ] o.a.s.c.c.SolrZkClient Using default ZkACLProvider
   [junit4]   2> 103348 INFO  (TEST-UnloadDistributedZkTest.test-seed#[20630518F2F53822]) [    ] o.a.s.c.c.ConnectionManager Waiting for client to connect to ZooKeeper
   [junit4]   2> 103348 INFO  (zkCallback-110-thread-1) [    ] o.a.s.c.c.ConnectionManager Watcher org.apache.solr.common.cloud.ConnectionManager@15b6ec3 name:ZooKeeperConnection Watcher:127.0.0.1:56295/solr got event WatchedEvent state:SyncConnected type:None path:null path:null type:None
   [junit4]   2> 103348 INFO  (TEST-UnloadDistributedZkTest.test-seed#[20630518F2F53822]) [    ] o.a.s.c.c.ConnectionManager Client is connected to ZooKeeper
   [junit4]   2> 103350 INFO  (TEST-UnloadDistributedZkTest.test-seed#[20630518F2F53822]) [    ] o.a.s.c.c.SolrZkClient makePath: /overseer/queue
   [junit4]   2> 103351 INFO  (TEST-UnloadDistributedZkTest.test-seed#[20630518F2F53822]) [    ] o.a.s.c.c.SolrZkClient makePath: /overseer/collection-queue-work
   [junit4]   2> 103352 INFO  (TEST-UnloadDistributedZkTest.test-seed#[20630518F2F53822]) [    ] o.a.s.c.c.SolrZkClient makePath: /overseer/collection-map-running
   [junit4]   2> 103352 INFO  (TEST-UnloadDistributedZkTest.test-seed#[20630518F2F53822]) [    ] o.a.s.c.c.SolrZkClient makePath: /overseer/collection-map-completed
   [junit4]   2> 103353 INFO  (TEST-UnloadDistributedZkTest.test-seed#[20630518F2F53822]) [    ] o.a.s.c.c.SolrZkClient makePath: /overseer/collection-map-failure
   [junit4]   2> 103354 INFO  (TEST-UnloadDistributedZkTest.test-seed#[20630518F2F53822]) [    ] o.a.s.c.c.SolrZkClient makePath: /live_nodes
   [junit4]   2> 103355 INFO  (TEST-UnloadDistributedZkTest.test-seed#[20630518F2F53822]) [    ] o.a.s.c.c.SolrZkClient makePath: /aliases.json
   [junit4]   2> 103355 INFO  (TEST-UnloadDistributedZkTest.test-seed#[20630518F2F53822]) [    ] o.a.s.c.c.SolrZkClient makePath: /clusterstate.json
   [junit4]   2> 103356 INFO  (TEST-UnloadDistributedZkTest.test-seed#[20630518F2F53822]) [    ] o.a.s.c.c.SolrZkClient makePath: /security.json
   [junit4]   2> 103356 INFO  (TEST-UnloadDistributedZkTest.test-seed#[20630518F2F53822]) [    ] o.a.s.c.c.ZkStateReader Updating cluster state from ZooKeeper... 
   [junit4]   2> 103356 INFO  (TEST-UnloadDistributedZkTest.test-seed#[20630518F2F53822]) [    ] o.a.s.c.c.ZkStateReader Updated live nodes from ZooKeeper... (0) -> (0)
   [junit4]   2> 103357 INFO  (TEST-UnloadDistributedZkTest.test-seed#[20630518F2F53822]) [    ] o.a.s.c.c.SolrZkClient makePath: /overseer_elect
   [junit4]   2> 103357 INFO  (TEST-UnloadDistributedZkTest.test-seed#[20630518F2F53822]) [    ] o.a.s.c.c.SolrZkClient makePath: /overseer_elect/election
   [junit4]   2> 103358 INFO  (TEST-UnloadDistributedZkTest.test-seed#[20630518F2F53822]) [    ] o.a.s.c.Overseer Overseer (id=null) closing
   [junit4]   2> 103358 INFO  (TEST-UnloadDistributedZkTest.test-seed#[20630518F2F53822]) [    ] o.a.s.c.LeaderElector Joined leadership election with path: /overseer_elect/election/95529820013723652-127.0.0.1:49352_-n_0000000000
   [junit4]   2> 103358 INFO  (TEST-UnloadDistributedZkTest.test-seed#[20630518F2F53822]) [    ] o.a.s.c.OverseerElectionContext I am going to be the leader 127.0.0.1:49352_
   [junit4]   2> 103358 INFO  (TEST-UnloadDistributedZkTest.test-seed#[20630518F2F53822]) [    ] o.a.s.c.c.SolrZkClient makePath: /overseer_elect/leader
   [junit4]   2> 103359 INFO  (TEST-UnloadDistributedZkTest.test-seed#[20630518F2F53822]) [    ] o.a.s.c.Overseer Overseer (id=95529820013723652-127.0.0.1:49352_-n_0000000000) starting
   [junit4]   2> 103359 INFO  (TEST-UnloadDistributedZkTest.test-seed#[20630518F2F53822]) [    ] o.a.s.c.c.SolrZkClient makePath: /overseer/queue-work
   [junit4]   2> 103361 INFO  (TEST-UnloadDistributedZkTest.test-seed#[20630518F2F53822]) [    ] o.a.s.c.OverseerAutoReplicaFailoverThread Starting OverseerAutoReplicaFailoverThread autoReplicaFailoverWorkLoopDelay=10000 autoReplicaFailoverWaitAfterExpiration=10000 autoReplicaFailoverBadNodeExpiration=60000
   [junit4]   2> 103361 INFO  (OverseerCollectionConfigSetProcessor-95529820013723652-127.0.0.1:49352_-n_0000000000) [    ] o.a.s.c.OverseerTaskProcessor Process current queue of overseer operations
   [junit4]   2> 103361 INFO  (OverseerStateUpdate-95529820013723652-127.0.0.1:49352_-n_0000000000) [    ] o.a.s.c.Overseer Starting to work on the main queue
   [junit4]   2> 103362 INFO  (TEST-UnloadDistributedZkTest.test-seed#[20630518F2F53822]) [    ] o.a.s.c.ZkController Register node as live in ZooKeeper:/live_nodes/127.0.0.1:49352_
   [junit4]   2> 103362 INFO  (TEST-UnloadDistributedZkTest.test-seed#[20630518F2F53822]) [    ] o.a.s.c.c.SolrZkClient makePath: /live_nodes/127.0.0.1:49352_
   [junit4]   2> 103363 INFO  (OverseerStateUpdate-95529820013723652-127.0.0.1:49352_-n_0000000000) [    ] o.a.s.c.c.ZkStateReader Updated live nodes from ZooKeeper... (0) -> (0)
   [junit4]   2> 103363 INFO  (zkCallback-110-thread-1) [    ] o.a.s.c.c.ZkStateReader A live node change: [WatchedEvent state:SyncConnected type:NodeChildrenChanged path:/live_nodes], has occurred - updating... (live nodes size: [0])
   [junit4]   2> 103363 INFO  (zkCallback-110-thread-1) [    ] o.a.s.c.c.ZkStateReader Updated live nodes from ZooKeeper... (0) -> (1)
   [junit4]   2> 103388 INFO  (TEST-UnloadDistributedZkTest.test-seed#[20630518F2F53822]) [    ] o.a.s.c.CoreContainer Security conf doesn't exist. Skipping setup for authorization module.
   [junit4]   2> 103388 INFO  (TEST-UnloadDistributedZkTest.test-seed#[20630518F2F53822]) [    ] o.a.s.c.CoreContainer No authentication plugin used.
   [junit4]   2> 103389 INFO  (TEST-UnloadDistributedZkTest.test-seed#[20630518F2F53822]) [    ] o.a.s.c.CorePropertiesLocator Looking for core definitions underneath /home/jenkins/workspace/Lucene-Solr-6.x-Linux/solr/build/solr-core/test/J2/temp/solr.cloud.UnloadDistributedZkTest_20630518F2F53822-001/control-001/cores
   [junit4]   2> 103390 INFO  (TEST-UnloadDistributedZkTest.test-seed#[20630518F2F53822]) [    ] o.a.s.c.CoreDescriptor Created CoreDescriptor: {name=collection1, config=solrconfig.xml, transient=false, schema=schema.xml, loadOnStartup=true, configSetProperties=configsetprops.json, collection=control_collection, coreNodeName=, dataDir=data/, shard=}
   [junit4]   2> 103390 INFO  (TEST-UnloadDistributedZkTest.test-seed#[20630518F2F53822]) [    ] o.a.s.c.CorePropertiesLocator Found core collection1 in /home/jenkins/workspace/Lucene-Solr-6.x-Linux/solr/build/solr-core/test/J2/temp/solr.cloud.UnloadDistributedZkTest_20630518F2F53822-001/control-001/cores/collection1
   [junit4]   2> 103390 INFO  (TEST-UnloadDistributedZkTest.test-seed#[20630518F2F53822]) [    ] o.a.s.c.CorePropertiesLocator Found 1 core definitions
   [junit4]   2> 103390 INFO  (TEST-UnloadDistributedZkTest.test-seed#[20630518F2F53822]) [    ] o.a.s.s.SolrDispatchFilter user.dir=/home/jenkins/workspace/Lucene-Solr-6.x-Linux/solr/build/solr-core/test/J2
   [junit4]   2> 103390 INFO  (TEST-UnloadDistributedZkTest.test-seed#[20630518F2F53822]) [    ] o.a.s.s.SolrDispatchFilter SolrDispatchFilter.init() done
   [junit4]   2> 103391 INFO  (coreLoadExecutor-421-thread-1) [    ] o.a.s.c.ZkController publishing state=down
   [junit4]   2> 103391 INFO  (coreLoadExecutor-421-thread-1) [    ] o.a.s.c.ZkController numShards not found on descriptor - reading it from system property
   [junit4]   2> 103391 INFO  (OverseerStateUpdate-95529820013723652-127.0.0.1:49352_-n_0000000000) [    ] o.a.s.c.Overseer processMessage: queueSize: 1, message = {
   [junit4]   2>   "core":"collection1",
   [junit4]   2>   "roles":null,
   [junit4]   2>   "base_url":"http://127.0.0.1:49352",
   [junit4]   2>   "node_name":"127.0.0.1:49352_",
   [junit4]   2>   "numShards":"1",
   [junit4]   2>   "state":"down",
   [junit4]   2>   "shard":null,
   [junit4]   2>   "collection":"control_collection",
   [junit4]   2>   "operation":"state"} current state version: 0
   [junit4]   2> 103391 INFO  (coreLoadExecutor-421-thread-1) [    ] o.a.s.c.ZkController look for our core node name
   [junit4]   2> 103392 INFO  (OverseerStateUpdate-95529820013723652-127.0.0.1:49352_-n_0000000000) [    ] o.a.s.c.o.ReplicaMutator Update state numShards=1 message={
   [junit4]   2>   "core":"collection1",
   [junit4]   2>   "roles":null,
   [junit4]   2>   "base_url":"http://127.0.0.1:49352",
   [junit4]   2>   "node_name":"127.0.0.1:49352_",
   [junit4]   2>   "numShards":"1",
   [junit4]   2>   "state":"down",
   [junit4]   2>   "shard":null,
   [junit4]   2>   "collection":"control_collection",
   [junit4]   2>   "operation":"state"}
   [junit4]   2> 103392 INFO  (OverseerStateUpdate-95529820013723652-127.0.0.1:49352_-n_0000000000) [    ] o.a.s.c.o.ClusterStateMutator building a new cName: control_collection
   [junit4]   2> 103392 INFO  (OverseerStateUpdate-95529820013723652-127.0.0.1:49352_-n_0000000000) [    ] o.a.s.c.o.ReplicaMutator Assigning new node to shard shard=shard1
   [junit4]   2> 103392 INFO  (zkCallback-110-thread-1) [    ] o.a.s.c.c.ZkStateReader A cluster state change: [WatchedEvent state:SyncConnected type:NodeDataChanged path:/clusterstate.json], has occurred - updating... (live nodes size: [1])
   [junit4]   2> 104392 INFO  (coreLoadExecutor-421-thread-1) [    ] o.a.s.c.ZkController waiting to find shard id in clusterstate for collection1
   [junit4]   2> 104392 INFO  (coreLoadExecutor-421-thread-1) [    ] o.a.s.c.ZkController Check for collection zkNode:control_collection
   [junit4]   2> 104392 INFO  (coreLoadExecutor-421-thread-1) [    ] o.a.s.c.ZkController Collection zkNode exists
   [junit4]   2> 104392 INFO  (coreLoadExecutor-421-thread-1) [    ] o.a.s.c.c.ZkStateReader Load collection config from: [/collections/control_collection]
   [junit4]   2> 104392 INFO  (coreLoadExecutor-421-thread-1) [    ] o.a.s.c.c.ZkStateReader path=[/collections/control_collection] [configName]=[conf1] specified config exists in ZooKeeper
   [junit4]   2> 104393 INFO  (coreLoadExecutor-421-thread-1) [    ] o.a.s.c.SolrResourceLoader new SolrResourceLoader for directory: '/home/jenkins/workspace/Lucene-Solr-6.x-Linux/solr/build/solr-core/test/J2/temp/solr.cloud.UnloadDistributedZkTest_20630518F2F53822-001/control-001/cores/collection1'
   [junit4]   2> 104393 INFO  (coreLoadExecutor-421-thread-1) [    ] o.a.s.c.SolrResourceLoader JNDI not configured for solr (NoInitialContextEx)
   [junit4]   2> 104393 INFO  (coreLoadExecutor-421-thread-1) [    ] o.a.s.c.SolrResourceLoader solr home defaulted to 'solr/' (could not find system property or JNDI)
   [junit4]   2> 104394 INFO  (coreLoadExecutor-421-thread-1) [    ] o.a.s.c.Config loaded config solrconfig.xml with version 0 
   [junit4]   2> 104397 INFO  (coreLoadExecutor-421-thread-1) [    ] o.a.s.c.SolrConfig current version of requestparams : -1
   [junit4]   2> 104399 WARN  (coreLoadExecutor-421-thread-1) [    ] o.a.s.c.Config Beginning with Solr 5.5, <mergePolicy> is deprecated, use <mergePolicyFactory> instead.
   [junit4]   2> 104399 INFO  (coreLoadExecutor-421-thread-1) [    ] o.a.s.c.SolrConfig Using Lucene MatchVersion: 6.1.0
   [junit4]   2> 104404 INFO  (coreLoadExecutor-421-thread-1) [    ] o.a.s.c.SolrConfig Loaded SolrConfig: solrconfig.xml
   [junit4]   2> 104408 INFO  (coreLoadExecutor-421-thread-1) [    ] o.a.s.s.IndexSchema [collection1] Schema name=test
   [junit4]   2> 104460 INFO  (coreLoadExecutor-421-thread-1) [    ] o.a.s.s.OpenExchangeRatesOrgProvider Initialized with rates=open-exchange-rates.json, refreshInterval=1440.
   [junit4]   2> 104464 INFO  (coreLoadExecutor-421-thread-1) [    ] o.a.s.s.IndexSchema default search field in schema is text
   [junit4]   2> 104464 INFO  (coreLoadExecutor-421-thread-1) [    ] o.a.s.s.IndexSchema unique key field: id
   [junit4]   2> 104468 INFO  (coreLoadExecutor-421-thread-1) [    ] o.a.s.s.FileExchangeRateProvider Reloading exchange rates from file currency.xml
   [junit4]   2> 104469 INFO  (coreLoadExecutor-421-thread-1) [    ] o.a.s.s.FileExchangeRateProvider Reloading exchange rates from file currency.xml
   [junit4]   2> 104470 INFO  (coreLoadExecutor-421-thread-1) [    ] o.a.s.s.OpenExchangeRatesOrgProvider Reloading exchange rates from open-exchange-rates.json
   [junit4]   2> 104470 INFO  (coreLoadExecutor-421-thread-1) [    ] o.a.s.s.OpenExchangeRatesOrgProvider Reloading exchange rates from open-exchange-rates.json
   [junit4]   2> 104471 INFO  (coreLoadExecutor-421-thread-1) [    ] o.a.s.c.ConfigSetProperties Did not find ConfigSet properties, assuming default properties: Can't find resource 'configsetprops.json' in classpath or '/configs/conf1', cwd=/home/jenkins/workspace/Lucene-Solr-6.x-Linux/solr/build/solr-core/test/J2
   [junit4]   2> 104471 INFO  (coreLoadExecutor-421-thread-1) [    ] o.a.s.c.CoreContainer Creating SolrCore 'collection1' using configuration from collection control_collection
   [junit4]   2> 104471 INFO  (coreLoadExecutor-421-thread-1) [    ] o.a.s.c.SolrCore org.apache.solr.core.MockDirectoryFactory
   [junit4]   2> 104471 INFO  (coreLoadExecutor-421-thread-1) [    ] o.a.s.c.SolrCore [[collection1] ] Opening new SolrCore at [/home/jenkins/workspace/Lucene-Solr-6.x-Linux/solr/build/solr-core/test/J2/temp/solr.cloud.UnloadDistributedZkTest_20630518F2F53822-001/control-001/cores/collection1], dataDir=[/home/jenkins/workspace/Lucene-Solr-6.x-Linux/solr/build/solr-core/test/J2/temp/solr.cloud.UnloadDistributedZkTest_20630518F2F53822-001/control-001/cores/collection1/data/]
   [junit4]   2> 104472 INFO  (coreLoadExecutor-421-thread-1) [    ] o.a.s.c.JmxMonitoredMap JMX monitoring is enabled. Adding Solr mbeans to JMX Server: com.sun.jmx.mbeanserver.JmxMBeanServer@14e9e5b
   [junit4]   2> 104472 INFO  (coreLoadExecutor-421-thread-1) [    ] o.a.s.c.CachingDirectoryFactory return new directory for /home/jenkins/workspace/Lucene-Solr-6.x-Linux/solr/build/solr-core/test/J2/temp/solr.cloud.UnloadDistributedZkTest_20630518F2F53822-001/control-001/cores/collection1/data
   [junit4]   2> 104472 INFO  (coreLoadExecutor-421-thread-1) [    ] o.a.s.c.SolrCore New index directory detected: old=null new=/home/jenkins/workspace/Lucene-Solr-6.x-Linux/solr/build/solr-core/test/J2/temp/solr.cloud.UnloadDistributedZkTest_20630518F2F53822-001/control-001/cores/collection1/data/index/
   [junit4]   2> 104472 WARN  (coreLoadExecutor-421-thread-1) [    ] o.a.s.c.SolrCore [collection1] Solr index directory '/home/jenkins/workspace/Lucene-Solr-6.x-Linux/solr/build/solr-core/test/J2/temp/solr.cloud.UnloadDistributedZkTest_20630518F2F53822-001/control-001/cores/collection1/data/index' doesn't exist. Creating new index...
   [junit4]   2> 104472 INFO  (coreLoadExecutor-421-thread-1) [    ] o.a.s.c.CachingDirectoryFactory return new directory for /home/jenkins/workspace/Lucene-Solr-6.x-Linux/solr/build/solr-core/test/J2/temp/solr.cloud.UnloadDistributedZkTest_20630518F2F53822-001/control-001/cores/collection1/data/index
   [junit4]   2> 104472 INFO  (coreLoadExecutor-421-thread-1) [    ] o.a.s.u.RandomMergePolicy RandomMergePolicy wrapping class org.apache.lucene.index.TieredMergePolicy: [TieredMergePolicy: maxMergeAtOnce=50, maxMergeAtOnceExplicit=49, maxMergedSegmentMB=59.7626953125, floorSegmentMB=2.1455078125, forceMergeDeletesPctAllowed=20.994918803017303, segmentsPerTier=33.0, maxCFSSegmentSizeMB=8.796093022207999E12, noCFSRatio=0.37676387351571416
   [junit4]   2> 104473 INFO  (coreLoadExecutor-421-thread-1) [    ] o.a.s.c.SolrDeletionPolicy SolrDeletionPolicy.onCommit: commits: num=1
   [junit4]   2> 	commit{dir=MockDirectoryWrapper(RAMDirectory@c432c lockFactory=org.apache.lucene.store.SingleInstanceLockFactory@a922b7),segFN=segments_1,generation=1}
   [junit4]   2> 104473 INFO  (coreLoadExecutor-421-thread-1) [    ] o.a.s.c.SolrDeletionPolicy newest commit generation = 1
   [junit4]   2> 104473 INFO  (OldIndexDirectoryCleanupThreadForCore-collection1) [    ] o.a.s.c.SolrCore Looking for old index directories to cleanup for core collection1 in /home/jenkins/workspace/Lucene-Solr-6.x-Linux/solr/build/solr-core/test/J2/temp/solr.cloud.UnloadDistributedZkTest_20630518F2F53822-001/control-001/cores/collection1/data/
   [junit4]   2> 104473 WARN  (OldIndexDirectoryCleanupThreadForCore-collection1) [    ] o.a.s.c.DirectoryFactory /home/jenkins/workspace/Lucene-Solr-6.x-Linux/solr/build/solr-core/test/J2/temp/solr.cloud.UnloadDistributedZkTest_20630518F2F53822-001/control-001/cores/collection1/data/ does not point to a valid data directory; skipping clean-up of old index directories.
   [junit4]   2> 104476 INFO  (coreLoadExecutor-421-thread-1) [    ] o.a.s.u.p.UpdateRequestProcessorChain creating updateRequestProcessorChain "nodistrib"
   [junit4]   2> 104476 INFO  (coreLoadExecutor-421-thread-1) [    ] o.a.s.u.p.UpdateRequestProcessorChain creating updateRequestProcessorChain "dedupe"
   [junit4]   2> 104476 INFO  (coreLoadExecutor-421-thread-1) [    ] o.a.s.u.p.UpdateRequestProcessorChain inserting DistributedUpdateProcessorFactory into updateRequestProcessorChain "dedupe"
   [junit4]   2> 104476 INFO  (coreLoadExecutor-421-thread-1) [    ] o.a.s.u.p.UpdateRequestProcessorChain creating updateRequestProcessorChain "stored_sig"
   [junit4]   2> 104476 INFO  (coreLoadExecutor-421-thread-1) [    ] o.a.s.u.p.UpdateRequestProcessorChain inserting DistributedUpdateProcessorFactory into updateRequestProcessorChain "stored_sig"
   [junit4]   2> 104476 INFO  (coreLoadExecutor-421-thread-1) [    ] o.a.s.u.p.UpdateRequestProcessorChain creating updateRequestProcessorChain "distrib-dup-test-chain-explicit"
   [junit4]   2> 104476 INFO  (coreLoadExecutor-421-thread-1) [    ] o.a.s.u.p.UpdateRequestProcessorChain creating updateRequestProcessorChain "distrib-dup-test-chain-implicit"
   [junit4]   2> 104476 INFO  (coreLoadExecutor-421-thread-1) [    ] o.a.s.u.p.UpdateRequestProcessorChain inserting DistributedUpdateProcessorFactory into updateRequestProcessorChain "distrib-dup-test-chain-implicit"
   [junit4]   2> 104476 INFO  (coreLoadExecutor-421-thread-1) [    ] o.a.s.c.SolrCore no updateRequestProcessorChain defined as default, creating implicit default
   [junit4]   2> 104476 WARN  (coreLoadExecutor-421-thread-1) [    ] o.a.s.c.RequestHandlers INVALID paramSet a in requestHandler {type = requestHandler,name = /dump,class = DumpRequestHandler,args = {defaults={a=A,b=B}}}
   [junit4]   2> 104478 INFO  (coreLoadExecutor-421-thread-1) [    ] o.a.s.h.l.XMLLoader xsltCacheLifetimeSeconds=60
   [junit4]   2> 104478 INFO  (coreLoadExecutor-421-thread-1) [    ] o.a.s.h.l.XMLLoader xsltCacheLifetimeSeconds=60
   [junit4]   2> 104479 INFO  (coreLoadExecutor-421-thread-1) [    ] o.a.s.h.l.XMLLoader xsltCacheLifetimeSeconds=60
   [junit4]   2> 104479 INFO  (coreLoadExecutor-421-thread-1) [    ] o.a.s.h.l.XMLLoader xsltCacheLifetimeSeconds=60
   [junit4]   2> 104482 INFO  (coreLoadExecutor-421-thread-1) [    ] o.a.s.c.RequestHandlers Registered paths: /admin/mbeans,standard,/dump,/update/csv,/sql,/update/json/docs,/admin/luke,/export,/admin/segments,/get,/admin/system,/replication,/admin/properties,/config,/stream,/schema,/admin/plugins,/admin/logging,/update/json,/admin/ping,/admin/threads,/update,/admin/file
   [junit4]   2> 104482 INFO  (coreLoadExecutor-421-thread-1) [    ] o.a.s.c.SolrCore Using default statsCache cache: org.apache.solr.search.stats.LocalStatsCache
   [junit4]   2> 104482 INFO  (coreLoadExecutor-421-thread-1) [    ] o.a.s.u.UpdateHandler Using UpdateLog implementation: org.apache.solr.update.UpdateLog
   [junit4]   2> 104482 INFO  (coreLoadExecutor-421-thread-1) [    ] o.a.s.u.UpdateLog Initializing UpdateLog: dataDir= defaultSyncLevel=FLUSH numRecordsToKeep=100 maxNumLogsToKeep=10 numVersionBuckets=65536
   [junit4]   2> 104483 INFO  (coreLoadExecutor-421-thread-1) [    ] o.a.s.u.CommitTracker Hard AutoCommit: disabled
   [junit4]   2> 104483 INFO  (coreLoadExecutor-421-thread-1) [    ] o.a.s.u.CommitTracker Soft AutoCommit: disabled
   [junit4]   2> 104483 INFO  (coreLoadExecutor-421-thread-1) [    ] o.a.s.u.RandomMergePolicy RandomMergePolicy wrapping class org.apache.lucene.index.TieredMergePolicy: [TieredMergePolicy: maxMergeAtOnce=11, maxMergeAtOnceExplicit=27, maxMergedSegmentMB=66.6611328125, floorSegmentMB=0.255859375, forceMergeDeletesPctAllowed=17.98383170457918, segmentsPerTier=38.0, maxCFSSegmentSizeMB=8.796093022207999E12, noCFSRatio=0.6022740657513875
   [junit4]   2> 104483 INFO  (coreLoadExecutor-421-thread-1) [    ] o.a.s.c.SolrDeletionPolicy SolrDeletionPolicy.onInit: commits: num=1
   [junit4]   2> 	commit{dir=MockDirectoryWrapper(RAMDirectory@c432c lockFactory=org.apache.lucene.store.SingleInstanceLockFactory@a922b7),segFN=segments_1,generation=1}
   [junit4]   2> 104483 INFO  (coreLoadExecutor-421-thread-1) [    ] o.a.s.c.SolrDeletionPolicy newest commit generation = 1
   [junit4]   2> 104483 INFO  (coreLoadExecutor-421-thread-1) [    ] o.a.s.s.SolrIndexSearcher Opening [Searcher@7f91a6[collection1] main]
   [junit4]   2> 104483 INFO  (coreLoadExecutor-421-thread-1) [    ] o.a.s.c.c.ZkStateReader Load collection config from: [/collections/control_collection]
   [junit4]   2> 104484 INFO  (coreLoadExecutor-421-thread-1) [    ] o.a.s.c.c.ZkStateReader path=[/collections/control_collection] [configName]=[conf1] specified config exists in ZooKeeper
   [junit4]   2> 104484 INFO  (coreLoadExecutor-421-thread-1) [    ] o.a.s.r.ManagedResourceStorage Setting up ZooKeeper-based storage for the RestManager with znodeBase: /configs/conf1
   [junit4]   2> 104484 INFO  (coreLoadExecutor-421-thread-1) [    ] o.a.s.r.ManagedResourceStorage Configured ZooKeeperStorageIO with znodeBase: /configs/conf1
   [junit4]   2> 104484 INFO  (coreLoadExecutor-421-thread-1) [    ] o.a.s.r.RestManager Initializing RestManager with initArgs: {}
   [junit4]   2> 104484 INFO  (coreLoadExecutor-421-thread-1) [    ] o.a.s.r.ManagedResourceStorage Reading _rest_managed.json using ZooKeeperStorageIO:path=/configs/conf1
   [junit4]   2> 104484 INFO  (coreLoadExecutor-421-thread-1) [    ] o.a.s.r.ManagedResourceStorage No data found for znode /configs/conf1/_rest_managed.json
   [junit4]   2> 104484 INFO  (coreLoadExecutor-421-thread-1) [    ] o.a.s.r.ManagedResourceStorage Loaded null at path _rest_managed.json using ZooKeeperStorageIO:path=/configs/conf1
   [junit4]   2> 104484 INFO  (coreLoadExecutor-421-thread-1) [    ] o.a.s.r.RestManager Initializing 0 registered ManagedResources
   [junit4]   2> 104484 INFO  (coreLoadExecutor-421-thread-1) [    ] o.a.s.h.ReplicationHandler Commits will be reserved for  10000
   [junit4]   2> 104485 INFO  (searcherExecutor-422-thread-1) [    ] o.a.s.c.SolrCore [collection1] Registered new searcher Searcher@7f91a6[collection1] main{ExitableDirectoryReader(UninvertingDirectoryReader())}
   [junit4]   2> 104485 INFO  (coreLoadExecutor-421-thread-1) [    ] o.a.s.u.UpdateLog Looking up max value of version field to seed version buckets
   [junit4]   2> 104485 INFO  (coreLoadExecutor-421-thread-1) [    ] o.a.s.u.VersionInfo Refreshing highest value of _version_ for 65536 version buckets from index
   [junit4]   2> 104485 INFO  (coreLoadExecutor-421-thread-1) [    ] o.a.s.u.VersionInfo No terms found for _version_, cannot seed version bucket highest value from index
   [junit4]   2> 104485 INFO  (coreLoadExecutor-421-thread-1) [    ] o.a.s.u.UpdateLog Could not find max version in index or recent updates, using new clock 1528477121635155968
   [junit4]   2> 104487 INFO  (coreLoadExecutor-421-thread-1) [    ] o.a.s.u.UpdateLog Took 1.0ms to seed version buckets with highest version 1528477121635155968
   [junit4]   2> 104487 INFO  (coreLoadExecutor-421-thread-1) [    ] o.a.s.c.ZkController watch zkdir /configs/conf1
   [junit4]   2> 104487 INFO  (coreLoadExecutor-421-thread-1) [    ] o.a.s.c.CoreContainer registering core: collection1
   [junit4]   2> 104487 INFO  (coreZkRegister-415-thread-1) [    ] o.a.s.c.ZkController Register replica - core:collection1 address:http://127.0.0.1:49352 collection:control_collection shard:shard1
   [junit4]   2> 104488 INFO  (coreZkRegister-415-thread-1) [    ] o.a.s.c.c.SolrZkClient makePath: /collections/control_collection/leader_elect/shard1/election
   [junit4]   2> 104489 INFO  (coreZkRegister-415-thread-1) [    ] o.a.s.c.LeaderElector Joined leadership election with path: /collections/control_collection/leader_elect/shard1/election/95529820013723652-core_node1-n_0000000000
   [junit4]   2> 104489 INFO  (coreZkRegister-415-thread-1) [    ] o.a.s.c.ShardLeaderElectionContext Running the leader process for shard=shard1 and weAreReplacement=false and leaderVoteWait=180000
   [junit4]   2> 104490 INFO  (coreZkRegister-415-thread-1) [    ] o.a.s.c.ShardLeaderElectionContext Enough replicas found to continue.
   [junit4]   2> 104490 INFO  (coreZkRegister-415-thread-1) [    ] o.a.s.c.ShardLeaderElectionContext I may be the new leader - try and sync
   [junit4]   2> 104490 INFO  (coreZkRegister-415-thread-1) [    ] o.a.s.c.SyncStrategy Sync replicas to http://127.0.0.1:49352/collection1/
   [junit4]   2> 104490 INFO  (coreZkRegister-415-thread-1) [    ] o.a.s.c.SyncStrategy Sync Success - now sync replicas to me
   [junit4]   2> 104490 INFO  (OverseerStateUpdate-95529820013723652-127.0.0.1:49352_-n_0000000000) [    ] o.a.s.c.Overseer processMessage: queueSize: 1, message = {
   [junit4]   2>   "operation":"leader",
   [junit4]   2>   "shard":"shard1",
   [junit4]   2>   "collection":"control_collection"} current state version: 1
   [junit4]   2> 104490 INFO  (coreZkRegister-415-thread-1) [    ] o.a.s.c.SyncStrategy http://127.0.0.1:49352/collection1/ has no replicas
   [junit4]   2> 104490 INFO  (coreZkRegister-415-thread-1) [    ] o.a.s.c.c.SolrZkClient makePath: /collections/control_collection/leaders/shard1
   [junit4]   2> 104491 INFO  (coreZkRegister-415-thread-1) [    ] o.a.s.c.ShardLeaderElectionContextBase Creating leader registration node /collections/control_collection/leaders/shard1/leader after winning as /collections/control_collection/leader_elect/shard1/election/95529820013723652-core_node1-n_0000000000
   [junit4]   2> 104492 INFO  (coreZkRegister-415-thread-1) [    ] o.a.s.c.ShardLeaderElectionContext I am the new leader: http://127.0.0.1:49352/collection1/ shard1
   [junit4]   2> 104492 INFO  (OverseerStateUpdate-95529820013723652-127.0.0.1:49352_-n_0000000000) [    ] o.a.s.c.Overseer processMessage: queueSize: 1, message = {
   [junit4]   2>   "operation":"leader",
   [junit4]   2>   "shard":"shard1",
   [junit4]   2>   "collection":"control_collection",
   [junit4]   2>   "base_url":"http://127.0.0.1:49352",
   [junit4]   2>   "core":"collection1",
   [junit4]   2>   "state":"active"} current state version: 1
   [junit4]   2> 104593 INFO  (zkCallback-110-thread-1) [    ] o.a.s.c.c.ZkStateReader A cluster state change: [WatchedEvent state:SyncConnected type:NodeDataChanged path:/clusterstate.json], has occurred - updating... (live nodes size: [1])
   [junit4]   2> 104643 INFO  (coreZkRegister-415-thread-1) [    ] o.a.s.c.ZkController We are http://127.0.0.1:49352/collection1/ and leader is http://127.0.0.1:49352/collection1/
   [junit4]   2> 104643 INFO  (coreZkRegister-415-thread-1) [    ] o.a.s.c.ZkController No LogReplay needed for core=collection1 baseURL=http://127.0.0.1:49352
   [junit4]   2> 104643 INFO  (coreZkRegister-415-thread-1) [    ] o.a.s.c.ZkController I am the leader, no recovery necessary
   [junit4]   2> 104643 INFO  (coreZkRegister-415-thread-1) [    ] o.a.s.c.ZkController publishing state=active
   [junit4]   2> 104643 INFO  (coreZkRegister-415-thread-1) [    ] o.a.s.c.ZkController numShards not found on descriptor - reading it from system property
   [junit4]   2> 104644 INFO  (OverseerStateUpdate-95529820013723652-127.0.0.1:49352_-n_0000000000) [    ] o.a.s.c.Overseer processMessage: queueSize: 1, message = {
   [junit4]   2>   "core":"collection1",
   [junit4]   2>   "core_node_name":"core_node1",
   [junit4]   2>   "roles":null,
   [junit4]   2>   "base_url":"http://127.0.0.1:49352",
   [junit4]   2>   "node_name":"127.0.0.1:49352_",
   [junit4]   2>   "numShards":"1",
   [junit4]   2>   "state":"active",
   [junit4]   2>   "shard":"shard1",
   [junit4]   2>   "collection":"control_collection",
   [junit4]   2>   "operation":"state"} current state version: 2
   [junit4]   2> 104644 INFO  (OverseerStateUpdate-95529820013723652-127.0.0.1:49352_-n_0000000000) [    ] o.a.s.c.o.ReplicaMutator Update state numShards=1 message={
   [junit4]   2>   "core":"collection1",
   [junit4]   2>   "core_node_name":"core_node1",
   [junit4]   2>   "roles":null,
   [junit4]   2>   "base_url":"http://127.0.0.1:49352",
   [junit4]   2>   "node_name":"127.0.0.1:49352_",
   [junit4]   2>   "numShards":"1",
   [junit4]   2>   "state":"active",
   [junit4]   2>   "shard":"shard1",
   [junit4]   2>   "collection":"control_collection",
   [junit4]   2>   "operation":"state"}
   [junit4]   2> 104745 INFO  (zkCallback-110-thread-1) [    ] o.a.s.c.c.ZkStateReader A cluster state change: [WatchedEvent state:SyncConnected type:NodeDataChanged path:/clusterstate.json], has occurred - updating... (live nodes size: [1])
   [junit4]   2> 104892 INFO  (TEST-UnloadDistributedZkTest.test-seed#[20630518F2F53822]) [    ] o.a.s.c.c.SolrZkClient Using default ZkCredentialsProvider
   [junit4]   2> 104892 INFO  (TEST-UnloadDistributedZkTest.test-seed#[20630518F2F53822]) [    ] o.a.s.c.c.ConnectionManager Waiting for client to connect to ZooKeeper
   [junit4]   2> 104894 INFO  (zkCallback-112-thread-1) [    ] o.a.s.c.c.ConnectionManager Watcher org.apache.solr.common.cloud.ConnectionManager@1ab0e96 name:ZooKeeperConnection Watcher:127.0.0.1:56295/solr got event WatchedEvent state:SyncConnected type:None path:null path:null type:None
   [junit4]   2> 104894 INFO  (TEST-UnloadDistributedZkTest.test-seed#[20630518F2F53822]) [    ] o.a.s.c.c.ConnectionManager Client is connected to ZooKeeper
   [junit4]   2> 104894 INFO  (TEST-UnloadDistributedZkTest.test-seed#[20630518F2F53822]) [    ] o.a.s.c.c.SolrZkClient Using default ZkACLProvider
   [junit4]   2> 104894 INFO  (TEST-UnloadDistributedZkTest.test-seed#[20630518F2F53822]) [    ] o.a.s.c.c.ZkStateReader Updating cluster state from ZooKeeper... 
   [junit4]   2> 104895 INFO  (TEST-UnloadDistributedZkTest.test-seed#[20630518F2F53822]) [    ] o.a.s.c.c.ZkStateReader Updated live nodes from ZooKeeper... (0) -> (1)
   [junit4]   2> 104895 INFO  (TEST-UnloadDistributedZkTest.test-seed#[20630518F2F53822]) [    ] o.a.s.c.ChaosMonkey monkey: init - expire sessions:false cause connection loss:false
   [junit4]   2> 104895 INFO  (TEST-UnloadDistributedZkTest.test-seed#[20630518F2F53822]) [    ] o.a.s.c.AbstractFullDistribZkTestBase Creating collection1 with stateFormat=2
   [junit4]   2> 104895 INFO  (TEST-UnloadDistributedZkTest.test-seed#[20630518F2F53822]) [    ] o.a.s.c.c.SolrZkClient Using default ZkCredentialsProvider
   [junit4]   2> 104895 INFO  (TEST-UnloadDistributedZkTest.test-seed#[20630518F2F53822]) [    ] o.a.s.c.c.ConnectionManager Waiting for client to connect to ZooKeeper
   [junit4]   2> 104896 INFO  (zkCallback-113-thread-1) [    ] o.a.s.c.c.ConnectionManager Watcher org.apache.solr.common.cloud.ConnectionManager@fe4469 name:ZooKeeperConnection Watcher:127.0.0.1:56295/solr got event WatchedEvent state:SyncConnected type:None path:null path:null type:None
   [junit4]   2> 104896 INFO  (TEST-UnloadDistributedZkTest.test-seed#[20630518F2F53822]) [    ] o.a.s.c.c.ConnectionManager Client is connected to ZooKeeper
   [junit4]   2> 104896 INFO  (TEST-UnloadDistributedZkTest.test-seed#[20630518F2F53822]) [    ] o.a.s.c.c.SolrZkClient Using default ZkACLProvider
   [junit4]   2> 104898 INFO  (OverseerStateUpdate-95529820013723652-127.0.0.1:49352_-n_0000000000) [    ] o.a.s.c.Overseer processMessage: queueSize: 1, message = {
   [junit4]   2>   "operation":"create",
   [junit4]   2>   "name":"collection1",
   [junit4]   2>   "numShards":"2",
   [junit4]   2>   "stateFormat":"2"} current state version: 3
   [junit4]   2> 104898 INFO  (OverseerStateUpdate-95529820013723652-127.0.0.1:49352_-n_0000000000) [    ] o.a.s.c.o.ClusterStateMutator building a new cName: collection1
   [junit4]   2> 104957 INFO  (TEST-UnloadDistributedZkTest.test-seed#[20630518F2F53822]) [    ] o.a.s.SolrTestCaseJ4 Writing core.properties file to /home/jenkins/workspace/Lucene-Solr-6.x-Linux/solr/build/solr-core/test/J2/temp/solr.cloud.UnloadDistributedZkTest_20630518F2F53822-001/shard-1-001/cores/collection1
   [junit4]   2> 104958 INFO  (TEST-UnloadDistributedZkTest.test-seed#[20630518F2F53822]) [    ] o.a.s.c.AbstractFullDistribZkTestBase create jetty 1 in directory /home/jenkins/workspace/Lucene-Solr-6.x-Linux/solr/build/solr-core/test/J2/temp/solr.cloud.UnloadDistributedZkTest_20630518F2F53822-001/shard-1-001
   [junit4]   2> 104958 INFO  (TEST-UnloadDistributedZkTest.test-seed#[20630518F2F53822]) [    ] o.e.j.s.Server jetty-9.3.6.v20151106
   [junit4]   2> 104959 INFO  (TEST-UnloadDistributedZkTest.test-seed#[20630518F2F53822]) [    ] o.e.j.s.h.ContextHandler Started o.e.j.s.ServletContextHandler@16b5894{/,null,AVAILABLE}
   [junit4]   2> 104960 INFO  (TEST-UnloadDistributedZkTest.test-seed#[20630518F2F53822]) [    ] o.e.j.s.ServerConnector Started ServerConnector@1bc6eb3{HTTP/1.1,[http/1.1]}{127.0.0.1:47598}
   [junit4]   2> 104960 INFO  (TEST-UnloadDistributedZkTest.test-seed#[20630518F2F53822]) [    ] o.e.j.s.Server Started @106527ms
   [junit4]   2> 104960 INFO  (TEST-UnloadDistributedZkTest.test-seed#[20630518F2F53822]) [    ] o.a.s.c.s.e.JettySolrRunner Jetty properties: {solr.data.dir=/home/jenkins/workspace/Lucene-Solr-6.x-Linux/solr/build/solr-core/test/J2/temp/solr.cloud.UnloadDistributedZkTest_20630518F2F53822-001/tempDir-001/jetty1, solrconfig=solrconfig.xml, hostContext=/, hostPort=47598, coreRootDirectory=/home/jenkins/workspace/Lucene-Solr-6.x-Linux/solr/build/solr-core/test/J2/temp/solr.cloud.UnloadDistributedZkTest_20630518F2F53822-001/shard-1-001/cores}
   [junit4]   2> 104960 INFO  (TEST-UnloadDistributedZkTest.test-seed#[20630518F2F53822]) [    ] o.a.s.s.SolrDispatchFilter SolrDispatchFilter.init(): sun.misc.Launcher$AppClassLoader@163006a
   [junit4]   2> 104960 INFO  (TEST-UnloadDistributedZkTest.test-seed#[20630518F2F53822]) [    ] o.a.s.c.SolrResourceLoader new SolrResourceLoader for directory: '/home/jenkins/workspace/Lucene-Solr-6.x-Linux/solr/build/solr-core/test/J2/temp/solr.cloud.UnloadDistributedZkTest_20630518F2F53822-001/shard-1-001'
   [junit4]   2> 104960 INFO  (TEST-UnloadDistributedZkTest.test-seed#[20630518F2F53822]) [    ] o.a.s.c.SolrResourceLoader JNDI not configured for solr (NoInitialContextEx)
   [junit4]   2> 104960 INFO  (TEST-UnloadDistributedZkTest.test-seed#[20630518F2F53822]) [    ] o.a.s.c.SolrResourceLoader solr home defaulted to 'solr/' (could not find system property or JNDI)
   [junit4]   2> 104960 INFO  (TEST-UnloadDistributedZkTest.test-seed#[20630518F2F53822]) [    ] o.a.s.c.c.SolrZkClient Using default ZkCredentialsProvider
   [junit4]   2> 104961 INFO  (TEST-UnloadDistributedZkTest.test-seed#[20630518F2F53822]) [    ] o.a.s.c.c.ConnectionManager Waiting for client to connect to ZooKeeper
   [junit4]   2> 104962 INFO  (zkCallback-114-thread-1) [    ] o.a.s.c.c.ConnectionManager Watcher org.apache.solr.common.cloud.ConnectionManager@1e49a54 name:ZooKeeperConnection Watcher:127.0.0.1:56295/solr got event WatchedEvent state:SyncConnected type:None path:null path:null type:None
   [junit4]   2> 104962 INFO  (TEST-UnloadDistributedZkTest.test-seed#[20630518F2F53822]) [    ] o.a.s.c.c.ConnectionManager Client is connected to ZooKeeper
   [junit4]   2> 104963 INFO  (TEST-UnloadDistributedZkTest.test-seed#[20630518F2F53822]) [    ] o.a.s.c.c.SolrZkClient Using default ZkACLProvider
   [junit4]   2> 104964 INFO  (TEST-UnloadDistributedZkTest.test-seed#[20630518F2F53822]) [    ] o.a.s.s.SolrDispatchFilter Loading solr.xml from SolrHome (not found in ZooKeeper)
   [junit4]   2> 104964 INFO  (TEST-UnloadDistributedZkTest.test-seed#[20630518F2F53822]) [    ] o.a.s.c.SolrXmlConfig Loading container configuration from /home/jenkins/workspace/Lucene-Solr-6.x-Linux/solr/build/solr-core/test/J2/temp/solr.cloud.UnloadDistributedZkTest_20630518F2F53822-001/shard-1-001/solr.xml
   [junit4]   2> 104967 INFO  (TEST-UnloadDistributedZkTest.test-seed#[20630518F2F53822]) [    ] o.a.s.c.CorePropertiesLocator Config-defined core root directory: /home/jenkins/workspace/Lucene-Solr-6.x-Linux/solr/build/solr-core/test/J2/temp/solr.cloud.UnloadDistributedZkTest_20630518F2F53822-001/shard-1-001/cores
   [junit4]   2> 104967 INFO  (TEST-UnloadDistributedZkTest.test-seed#[20630518F2F53822]) [    ] o.a.s.c.CoreContainer New CoreContainer 31314227
   [junit4]   2> 104967 INFO  (TEST-UnloadDistributedZkTest.test-seed#[20630518F2F53822]) [    ] o.a.s.c.CoreContainer Loading cores into CoreContainer [instanceDir=/home/jenkins/workspace/Lucene-Solr-6.x-Linux/solr/build/solr-core/test/J2/temp/solr.cloud.UnloadDistributedZkTest_20630518F2F53822-001/shard-1-001]
   [junit4]   2> 104967 WARN  (TEST-UnloadDistributedZkTest.test-seed#[20630518F2F53822]) [    ] o.a.s.c.CoreContainer Couldn't add files from /home/jenkins/workspace/Lucene-Solr-6.x-Linux/solr/build/solr-core/test/J2/temp/solr.cloud.UnloadDistributedZkTest_20630518F2F53822-001/shard-1-001/lib to classpath: /home/jenkins/workspace/Lucene-Solr-6.x-Linux/solr/build/solr-core/test/J2/temp/solr.cloud.UnloadDistributedZkTest_20630518F2F53822-001/shard-1-001/lib
   [junit4]   2> 104967 INFO  (TEST-UnloadDistributedZkTest.test-seed#[20630518F2F53822]) [    ] o.a.s.h.c.HttpShardHandlerFactory created with socketTimeout : 90000,urlScheme : ,connTimeout : 15000,maxConnectionsPerHost : 20,maxConnections : 10000,corePoolSize : 0,maximumPoolSize : 2147483647,maxThreadIdleTime : 5,sizeOfQueue : -1,fairnessPolicy : false,useRetries : false,
   [junit4]   2> 104968 INFO  (TEST-UnloadDistributedZkTest.test-seed#[20630518F2F53822]) [    ] o.a.s.u.UpdateShardHandler Creating UpdateShardHandler HTTP client with params: socketTimeout=340000&connTimeout=45000&retry=true
   [junit4]   2> 104968 INFO  (TEST-UnloadDistributedZkTest.test-seed#[20630518F2F53822]) [    ] o.a.s.l.LogWatcher SLF4J impl is org.slf4j.impl.Log4jLoggerFactory
   [junit4]   2> 104968 INFO  (TEST-UnloadDistributedZkTest.test-seed#[20630518F2F53822]) [    ] o.a.s.l.LogWatcher Registering Log Listener [Log4j (org.slf4j.impl.Log4jLoggerFactory)]
   [junit4]   2> 104968 INFO  (TEST-UnloadDistributedZkTest.test-seed#[20630518F2F53822]) [    ] o.a.s.c.ZkContainer Zookeeper client=127.0.0.1:56295/solr
   [junit4]   2> 104968 INFO  (TEST-UnloadDistributedZkTest.test-seed#[20630518F2F53822]) [    ] o.a.s.c.ZkController zkHost includes chroot
   [junit4]   2> 104968 INFO  (TEST-UnloadDistributedZkTest.test-seed#[20630518F2F53822]) [    ] o.a.s.c.c.SolrZkClient Using default ZkCredentialsProvider
   [junit4]   2> 104968 INFO  (TEST-UnloadDistributedZkTest.test-seed#[20630518F2F53822]) [    ] o.a.s.c.c.ConnectionManager Waiting for client to connect to ZooKeeper
   [junit4]   2> 104970 INFO  (zkCallback-117-thread-1) [    ] o.a.s.c.c.ConnectionManager Watcher org.apache.solr.common.cloud.ConnectionManager@1d8e43d name:ZooKeeperConnection Watcher:127.0.0.1:56295 got event WatchedEvent state:SyncConnected type:None path:null path:null type:None
   [junit4]   2> 104970 INFO  (TEST-UnloadDistributedZkTest.test-seed#[20630518F2F53822]) [    ] o.a.s.c.c.ConnectionManager Client is connected to ZooKeeper
   [junit4]   2> 104971 INFO  (TEST-UnloadDistributedZkTest.test-seed#[20630518F2F53822]) [    ] o.a.s.c.c.SolrZkClient Using default ZkACLProvider
   [junit4]   2> 104972 INFO  (TEST-UnloadDistributedZkTest.test-seed#[20630518F2F53822]) [    ] o.a.s.c.c.ConnectionManager Waiting for client to connect to ZooKeeper
   [junit4]   2> 104973 INFO  (zkCallback-118-thread-1) [    ] o.a.s.c.c.ConnectionManager Watcher org.apache.solr.common.cloud.ConnectionManager@fd60ec name:ZooKeeperConnection Watcher:127.0.0.1:56295/solr got event WatchedEvent state:SyncConnected type:None path:null path:null type:None
   [junit4]   2> 104973 INFO  (TEST-UnloadDistributedZkTest.test-seed#[20630518F2F53822]) [    ] o.a.s.c.c.ConnectionManager Client is connected to ZooKeeper
   [junit4]   2> 104976 INFO  (TEST-UnloadDistributedZkTest.test-seed#[20630518F2F53822]) [    ] o.a.s.c.c.ZkStateReader Updating cluster state from ZooKeeper... 
   [junit4]   2> 104976 INFO  (TEST-UnloadDistributedZkTest.test-seed#[20630518F2F53822]) [    ] o.a.s.c.c.ZkStateReader Updated live nodes from ZooKeeper... (0) -> (1)
   [junit4]   2> 104977 INFO  (TEST-UnloadDistributedZkTest.test-seed#[20630518F2F53822]) [    ] o.a.s.c.Overseer Overseer (id=null) closing
   [junit4]   2> 104977 INFO  (TEST-UnloadDistributedZkTest.test-seed#[20630518F2F53822]) [    ] o.a.s.c.LeaderElector Joined leadership election with path: /overseer_elect/election/95529820013723657-127.0.0.1:47598_-n_0000000001
   [junit4]   2> 104977 INFO  (TEST-UnloadDistributedZkTest.test-seed#[20630518F2F53822]) [    ] o.a.s.c.LeaderElector Watching path /overseer_elect/election/95529820013723652-127.0.0.1:49352_-n_0000000000 to know if I could be the leader
   [junit4]   2> 104977 INFO  (TEST-UnloadDistributedZkTest.test-seed#[20630518F2F53822]) [    ] o.a.s.c.ZkController Publish node=127.0.0.1:47598_ as DOWN
   [junit4]   2> 104978 INFO  (OverseerStateUpdate-95529820013723652-127.0.0.1:49352_-n_0000000000) [    ] o.a.s.c.Overseer processMessage: queueSize: 1, message = {
   [junit4]   2>   "operation":"downnode",
   [junit4]   2>   "node_name":"127.0.0.1:47598_"} current state version: 3
   [junit4]   2> 104978 INFO  (OverseerStateUpdate-95529820013723652-127.0.0.1:49352_-n_0000000000) [    ] o.a.s.c.o.NodeMutator DownNode state invoked for node: 127.0.0.1:47598_
   [junit4]   2> 104978 INFO  (OverseerStateUpdate-95529820013723652-127.0.0.1:49352_-n_0000000000) [    ] o.a.s.c.o.ZkStateWriter going to create_collection /collections/collection1/state.json
   [junit4]   2> 105080 INFO  (zkCallback-110-thread-1) [    ] o.a.s.c.c.ZkStateReader A cluster state change: [WatchedEvent state:SyncConnected type:NodeDataChanged path:/clusterstate.json], has occurred - updating... (live nodes size: [1])
   [junit4]   2> 105080 INFO  (zkCallback-118-thread-1) [    ] o.a.s.c.c.ZkStateReader A cluster state change: [WatchedEvent state:SyncConnected type:NodeDataChanged path:/clusterstate.json], has occurred - updating... (live nodes size: [1])
   [junit4]   2> 105080 INFO  (zkCallback-112-thread-1) [    ] o.a.s.c.c.ZkStateReader A cluster state change: [WatchedEvent state:SyncConnected type:NodeDataChanged path:/clusterstate.json], has occurred - updating... (live nodes size: [1])
   [junit4]   2> 105978 INFO  (TEST-UnloadDistributedZkTest.test-seed#[20630518F2F53822]) [    ] o.a.s.c.ZkController Register node as live in ZooKeeper:/live_nodes/127.0.0.1:47598_
   [junit4]   2> 105978 INFO  (TEST-UnloadDistributedZkTest.test-seed#[20630518F2F53822]) [    ] o.a.s.c.c.SolrZkClient makePath: /live_nodes/127.0.0.1:47598_
   [junit4]   2> 105979 INFO  (zkCallback-110-thread-1) [    ] o.a.s.c.c.ZkStateReader A live node change: [WatchedEvent state:SyncConnected type:NodeChildrenChanged path:/live_nodes], has occurred - updating... (live nodes size: [1])
   [junit4]   2> 105979 INFO  (zkCallback-118-thread-1) [    ] o.a.s.c.c.ZkStateReader A live node change: [WatchedEvent state:SyncConnected type:NodeChildrenChanged path:/live_nodes], has occurred - updating... (live nodes size: [1])
   [junit4]   2> 105979 INFO  (zkCallback-112-thread-1) [    ] o.a.s.c.c.ZkStateReader A live node change: [WatchedEvent state:SyncConnected type:NodeChildrenChanged path:/live_nodes], has occurred - updating... (live nodes size: [1])
   [junit4]   2> 105979 INFO  (zkCallback-110-thread-1) [    ] o.a.s.c.c.ZkStateReader Updated live nodes from ZooKeeper... (1) -> (2)
   [junit4]   2> 105979 INFO  (zkCallback-118-thread-1) [    ] o.a.s.c.c.ZkStateReader Updated live nodes from ZooKeeper... (1) -> (2)
   [junit4]   2> 105979 INFO  (zkCallback-112-thread-1) [    ] o.a.s.c.c.ZkStateReader Updated live nodes from ZooKeeper... (1) -> (2)
   [junit4]   2> 105989 INFO  (TEST-UnloadDistributedZkTest.test-seed#[20630518F2F53822]) [    ] o.a.s.c.CoreContainer Security conf doesn't exist. Skipping setup for authorization module.
   [junit4]   2> 105989 INFO  (TEST-UnloadDistributedZkTest.test-seed#[20630518F2F53822]) [    ] o.a.s.c.CoreContainer No authentication plugin used.
   [junit4]   2> 105989 INFO  (TEST-UnloadDistributedZkTest.test-seed#[20630518F2F53822]) [    ] o.a.s.c.CorePropertiesLocator Looking for core definitions underneath /home/jenkins/workspace/Lucene-Solr-6.x-Linux/solr/build/solr-core/test/J2/temp/solr.cloud.UnloadDistributedZkTest_20630518F2F53822-001/shard-1-001/cores
   [junit4]   2> 105990 INFO  (TEST-UnloadDistributedZkTest.test-seed#[20630518F2F53822]) [    ] o.a.s.c.CoreDescriptor Created CoreDescriptor: {name=collection1, config=solrconfig.xml, transient=false, schema=schema.xml, loadOnStartup=true, configSetProperties=configsetprops.json, collection=collection1, coreNodeName=, dataDir=data/, shard=}
   [junit4]   2> 105990 INFO  (TEST-UnloadDistributedZkTest.test-seed#[20630518F2F53822]) [    ] o.a.s.c.CorePropertiesLocator Found core collection1 in /home/jenkins/workspace/Lucene-Solr-6.x-Linux/solr/build/solr-core/test/J2/temp/solr.cloud.UnloadDistributedZkTest_20630518F2F53822-001/shard-1-001/cores/collection1
   [junit4]   2> 105990 INFO  (TEST-UnloadDistributedZkTest.test-seed#[20630518F2F53822]) [    ] o.a.s.c.CorePropertiesLocator Found 1 core definitions
   [junit4]   2> 105991 INFO  (TEST-UnloadDistributedZkTest.test-seed#[20630518F2F53822]) [    ] o.a.s.s.SolrDispatchFilter user.dir=/home/jenkins/workspace/Lucene-Solr-6.x-Linux/solr/build/solr-core/test/J2
   [junit4]   2> 105991 INFO  (TEST-UnloadDistributedZkTest.test-seed#[20630518F2F53822]) [    ] o.a.s.s.SolrDispatchFilter SolrDispatchFilter.init() done
   [junit4]   2> 105991 INFO  (coreLoadExecutor-432-thread-1) [    ] o.a.s.c.ZkController publishing state=down
   [junit4]   2> 105991 INFO  (coreLoadExecutor-432-thread-1) [    ] o.a.s.c.ZkController numShards not found on descriptor - reading it from system property
   [junit4]   2> 105991 INFO  (coreLoadExecutor-432-thread-1) [    ] o.a.s.c.ZkController Registering watch for collection collection1
   [junit4]   2> 105991 INFO  (coreLoadExecutor-432-thread-1) [    ] o.a.s.c.c.ZkStateReader addZkWatch [collection1]
   [junit4]   2> 105991 INFO  (coreLoadExecutor-432-thread-1) [    ] o.a.s.c.c.ZkStateReader Add data for [collection1] ver [0]
   [junit4]   2> 105991 INFO  (OverseerStateUpdate-95529820013723652-127.0.0.1:49352_-n_0000000000) [    ] o.a.s.c.Overseer processMessage: queueSize: 1, message = {
   [junit4]   2>   "core":"collection1",
   [junit4]   2>   "roles":null,
   [junit4]   2>   "base_url":"http://127.0.0.1:47598",
   [junit4]   2>   "node_name":"127.0.0.1:47598_",
   [junit4]   2>   "numShards":"2",
   [junit4]   2>   "state":"down",
   [junit4]   2>   "shard":null,
   [junit4]   2>   "collection":"collection1",
   [junit4]   2>   "operation":"state"} current state version: 4
   [junit4]   2> 105991 INFO  (coreLoadExecutor-432-thread-1) [    ] o.a.s.c.ZkController look for our core node name
   [junit4]   2> 105992 INFO  (OverseerStateUpdate-95529820013723652-127.0.0.1:49352_-n_0000000000) [    ] o.a.s.c.o.ReplicaMutator Update state numShards=2 message={
   [junit4]   2>   "core":"collection1",
   [junit4]   2>   "roles":null,
   [junit4]   2>   "base_url":"http://127.0.0.1:47598",
   [junit4]   2>   "node_name":"127.0.0.1:47598_",
   [junit4]   2>   "numShards":"2",
   [junit4]   2>   "state":"down",
   [junit4]   2>   "shard":null,
   [junit4]   2>   "collection":"collection1",
   [junit4]   2>   "operation":"state"}
   [junit4]   2> 105992 INFO  (OverseerStateUpdate-95529820013723652-127.0.0.1:49352_-n_0000000000) [    ] o.a.s.c.o.ReplicaMutator Collection already exists with numShards=2
   [junit4]   2> 105992 INFO  (OverseerStateUpdate-95529820013723652-127.0.0.1:49352_-n_0000000000) [    ] o.a.s.c.o.ReplicaMutator Assigning new node to shard shard=shard2
   [junit4]   2> 106092 INFO  (OverseerStateUpdate-95529820013723652-127.0.0.1:49352_-n_0000000000) [    ] o.a.s.c.o.ZkStateWriter going to update_collection /collections/collection1/state.json version: 0
   [junit4]   2> 106093 INFO  (zkCallback-118-thread-1) [    ] o.a.s.c.c.ZkStateReader A cluster state change: [WatchedEvent state:SyncConnected type:NodeDataChanged path:/collections/collection1/state.json] for collection [collection1] has occurred - updating... (live nodes size: [2])
   [junit4]   2> 106093 INFO  (zkCallback-118-thread-1) [    ] o.a.s.c.c.ZkStateReader Updating data for [collection1] from [0] to [1]
   [junit4]   2> 106992 INFO  (coreLoadExecutor-432-thread-1) [    ] o.a.s.c.ZkController waiting to find shard id in clusterstate for collection1
   [junit4]   2> 106992 INFO  (coreLoadExecutor-432-thread-1) [    ] o.a.s.c.ZkController Check for collection zkNode:collection1
   [junit4]   2> 106992 INFO  (coreLoadExecutor-432-thread-1) [    ] o.a.s.c.ZkController Collection zkNode exists
   [junit4]   2> 106992 INFO  (coreLoadExecutor-432-thread-1) [    ] o.a.s.c.c.ZkStateReader Load collection config from: [/collections/collection1]
   [junit4]   2> 106992 INFO  (coreLoadExecutor-432-thread-1) [    ] o.a.s.c.c.ZkStateReader path=[/collections/collection1] [configName]=[conf1] specified config exists in ZooKeeper
   [junit4]   2> 106992 INFO  (coreLoadExecutor-432-thread-1) [    ] o.a.s.c.SolrResourceLoader new SolrResourceLoader for directory: '/home/jenkins/workspace/Lucene-Solr-6.x-Linux/solr/build/solr-core/test/J2/temp/solr.cloud.UnloadDistributedZkTest_20630518F2F53822-001/shard-1-001/cores/collection1'
   [junit4]   2> 106992 INFO  (coreLoadExecutor-432-thread-1) [    ] o.a.s.c.SolrResourceLoader JNDI not configured for solr (NoInitialContextEx)
   [junit4]   2> 106992 INFO  (coreLoadExecutor-432-thread-1) [    ] o.a.s.c.SolrResourceLoader solr home defaulted to 'solr/' (could not find system property or JNDI)
   [junit4]   2> 106993 INFO  (coreLoadExecutor-432-thread-1) [    ] o.a.s.c.Config loaded config solrconfig.xml with version 0 
   [junit4]   2> 106997 INFO  (coreLoadExecutor-432-thread-1) [    ] o.a.s.c.SolrConfig current version of requestparams : -1
   [junit4]   2> 106998 WARN  (coreLoadExecutor-432-thread-1) [    ] o.a.s.c.Config Beginning with Solr 5.5, <mergePolicy> is deprecated, use <mergePolicyFactory> instead.
   [junit4]   2> 106999 INFO  (coreLoadExecutor-432-thread-1) [    ] o.a.s.c.SolrConfig Using Lucene MatchVersion: 6.1.0
   [junit4]   2> 107009 INFO  (coreLoadExecutor-432-thread-1) [    ] o.a.s.c.SolrConfig Loaded SolrConfig: solrconfig.xml
   [junit4]   2> 107012 INFO  (coreLoadExecutor-432-thread-1) [    ] o.a.s.s.IndexSchema [collection1] Schema name=test
   [junit4]   2> 107056 INFO  (coreLoadExecutor-432-thread-1) [    ] o.a.s.s.OpenExchangeRatesOrgProvider Initialized with rates=open-exchange-rates.json, refreshInterval=1440.
   [junit4]   2> 107060 INFO  (coreLoadExecutor-432-thread-1) [    ] o.a.s.s.IndexSchema default search field in schema is text
   [junit4]   2> 107060 INFO  (coreLoadExecutor-432-thread-1) [    ] o.a.s.s.IndexSchema unique key field: id
   [junit4]   2> 107064 INFO  (coreLoadExecutor-432-thread-1) [    ] o.a.s.s.FileExchangeRateProvider Reloading exchange rates from file currency.xml
   [junit4]   2> 107065 INFO  (coreLoadExecutor-432-thread-1) [    ] o.a.s.s.FileExchangeRateProvider Reloading exchange rates from file currency.xml
   [junit4]   2> 107066 INFO  (coreLoadExecutor-432-thread-1) [    ] o.a.s.s.OpenExchangeRatesOrgProvider Reloading exchange rates from open-exchange-rates.json
   [junit4]   2> 107067 INFO  (coreLoadExecutor-432-thread-1) [    ] o.a.s.s.OpenExchangeRatesOrgProvider Reloading exchange rates from open-exchange-rates.json
   [junit4]   2> 107067 INFO  (coreLoadExecutor-432-thread-1) [    ] o.a.s.c.ConfigSetProperties Did not find ConfigSet properties, assuming default properties: Can't find resource 'configsetprops.json' in classpath or '/configs/conf1', cwd=/home/jenkins/workspace/Lucene-Solr-6.x-Linux/solr/build/solr-core/test/J2
   [junit4]   2> 107068 INFO  (coreLoadExecutor-432-thread-1) [    ] o.a.s.c.CoreContainer Creating SolrCore 'collection1' using configuration from collection collection1
   [junit4]   2> 107068 INFO  (coreLoadExecutor-432-thread-1) [    ] o.a.s.c.SolrCore org.apache.solr.core.MockDirectoryFactory
   [junit4]   2> 107068 INFO  (coreLoadExecutor-432-thread-1) [    ] o.a.s.c.SolrCore [[collection1] ] Opening new SolrCore at [/home/jenkins/workspace/Lucene-Solr-6.x-Linux/solr/build/solr-core/test/J2/temp/solr.cloud.UnloadDistributedZkTest_20630518F2F53822-001/shard-1-001/cores/collection1], dataDir=[/home/jenkins/workspace/Lucene-Solr-6.x-Linux/solr/build/solr-core/test/J2/temp/solr.cloud.UnloadDistributedZkTest_20630518F2F53822-001/shard-1-001/cores/collection1/data/]
   [junit4]   2> 107068 INFO  (coreLoadExecutor-432-thread-1) [    ] o.a.s.c.JmxMonitoredMap JMX monitoring is enabled. Adding Solr mbeans to JMX Server: com.sun.jmx.mbeanserver.JmxMBeanServer@14e9e5b
   [junit4]   2> 107068 INFO  (coreLoadExecutor-432-thread-1) [    ] o.a.s.c.CachingDirectoryFactory return new directory for /home/jenkins/workspace/Lucene-Solr-6.x-Linux/solr/build/solr-core/test/J2/temp/solr.cloud.UnloadDistributedZkTest_20630518F2F53822-001/shard-1-001/cores/collection1/data
   [junit4]   2> 107068 INFO  (coreLoadExecutor-432-thread-1) [    ] o.a.s.c.SolrCore New index directory detected: old=null new=/home/jenkins/workspace/Lucene-Solr-6.x-Linux/solr/build/solr-core/test/J2/temp/solr.cloud.UnloadDistributedZkTest_20630518F2F53822-001/shard-1-001/cores/collection1/data/index/
   [junit4]   2> 107068 WARN  (coreLoadExecutor-432-thread-1) [    ] o.a.s.c.SolrCore [collection1] Solr index directory '/home/jenkins/workspace/Lucene-Solr-6.x-Linux/solr/build/solr-core/test/J2/temp/solr.cloud.UnloadDistributedZkTest_20630518F2F53822-001/shard-1-001/cores/collection1/data/index' doesn't exist. Creating new index...
   [junit4]   2> 107069 INFO  (coreLoadExecutor-432-thread-1) [    ] o.a.s.c.CachingDirectoryFactory return new directory for /home/jenkins/workspace/Lucene-Solr-6.x-Linux/solr/build/solr-core/test/J2/temp/solr.cloud.UnloadDistributedZkTest_20630518F2F53822-001/shard-1-001/cores/collection1/data/index
   [junit4]   2> 107069 INFO  (coreLoadExecutor-432-thread-1) [    ] o.a.s.u.RandomMergePolicy RandomMergePolicy wrapping class org.apache.lucene.index.TieredMergePolicy: [TieredMergePolicy: maxMergeAtOnce=50, maxMergeAtOnceExplicit=49, maxMergedSegmentMB=59.7626953125, floorSegmentMB=2.1455078125, forceMergeDeletesPctAllowed=20.994918803017303, segmentsPerTier=33.0, maxCFSSegmentSizeMB=8.796093022207999E12, noCFSRatio=0.37676387351571416
   [junit4]   2> 107069 INFO  (coreLoadExecutor-432-thread-1) [    ] o.a.s.c.SolrDeletionPolicy SolrDeletionPolicy.onCommit: commits: num=1
   [junit4]   2> 	commit{dir=MockDirectoryWrapper(RAMDirectory@1635d4f lockFactory=org.apache.lucene.store.SingleInstanceLockFactory@131ae0a),segFN=segments_1,generation=1}
   [junit4]   2> 107069 INFO  (coreLoadExecutor-432-thread-1) [    ] o.a.s.c.SolrDeletionPolicy newest commit generation = 1
   [junit4]   2> 107069 INFO  (OldIndexDirectoryCleanupThreadForCore-collection1) [    ] o.a.s.c.SolrCore Looking for old index directories to cleanup for core collection1 in /home/jenkins/workspace/Lucene-Solr-6.x-Linux/solr/build/solr-core/test/J2/temp/solr.cloud.UnloadDistributedZkTest_20630518F2F53822-001/shard-1-001/cores/collection1/data/
   [junit4]   2> 107070 WARN  (OldIndexDirectoryCleanupThreadForCore-collection1) [    ] o.a.s.c.DirectoryFactory /home/jenkins/workspace/Lucene-Solr-6.x-Linux/solr/build/solr-core/test/J2/temp/solr.cloud.UnloadDistributedZkTest_20630518F2F53822-001/shard-1-001/cores/collection1/data/ does not point to a valid data directory; skipping clean-up of old index directories.
   [junit4]   2> 107073 INFO  (coreLoadExecutor-432-thread-1) [    ] o.a.s.u.p.UpdateRequestProcessorChain creating updateRequestProcessorChain "nodistrib"
   [junit4]   2> 107073 INFO  (coreLoadExecutor-432-thread-1) [    ] o.a.s.u.p.UpdateRequestProcessorChain creating updateRequestProcessorChain "dedupe"
   [junit4]   2> 107074 INFO  (coreLoadExecutor-432-thread-1) [    ] o.a.s.u.p.UpdateRequestProcessorChain inserting DistributedUpdateProcessorFactory into updateRequestProcessorChain "dedupe"
   [junit4]   2> 107074 INFO  (coreLoadExecutor-432-thread-1) [    ] o.a.s.u.p.UpdateRequestProcessorChain creating updateRequestProcessorChain "stored_sig"
   [junit4]   2> 107074 INFO  (coreLoadExecutor-432-thread-1) [    ] o.a.s.u.p.UpdateRequestProcessorChain inserting DistributedUpdateProcessorFactory into updateRequestProcessorChain "stored_sig"
   [junit4]   2> 107074 INFO  (coreLoadExecutor-432-thread-1) [    ] o.a.s.u.p.UpdateRequestProcessorChain creating updateRequestProcessorChain "distrib-dup-test-chain-explicit"
   [junit4]   2> 107074 INFO  (coreLoadExecutor-432-thread-1) [    ] o.a.s.u.p.UpdateRequestProcessorChain creating updateRequestProcessorChain "distrib-dup-test-chain-implicit"
   [junit4]   2> 107074 INFO  (coreLoadExecutor-432-thread-1) [    ] o.a.s.u.p.UpdateRequestProcessorChain inserting DistributedUpdateProcessorFactory into updateRequestProcessorChain "distrib-dup-test-chain-implicit"
   [junit4]   2> 107074 INFO  (coreLoadExecutor-432-thread-1) [    ] o.a.s.c.SolrCore no updateRequestProcessorChain defined as default, creating implicit default
   [junit4]   2> 107074 WARN  (coreLoadExecutor-432-thread-1) [    ] o.a.s.c.RequestHandlers INVALID paramSet a in requestHandler {type = requestHandler,name = /dump,class = DumpRequestHandler,args = {defaults={a=A,b=B}}}
   [junit4]   2> 107075 INFO  (coreLoadExecutor-432-thread-1) [    ] o.a.s.h.l.XMLLoader xsltCacheLifetimeSeconds=60
   [junit4]   2> 107080 INFO  (coreLoadExecutor-432-thread-1) [    ] o.a.s.h.l.XMLLoader xsltCacheLifetimeSeconds=60
   [junit4]   2> 107081 INFO  (coreLoadExecutor-432-thread-1) [    ] o.a.s.h.l.XMLLoader xsltCacheLifetimeSeconds=60
   [junit4]   2> 107081 INFO  (coreLoadExecutor-432-thread-1) [    ] o.a.s.h.l.XMLLoader xsltCacheLifetimeSeconds=60
   [junit4]   2> 107084 INFO  (coreLoadExecutor-432-thread-1) [    ] o.a.s.c.RequestHandlers Registered paths: /admin/mbeans,standard,/dump,/update/csv,/sql,/update/json/docs,/admin/luke,/export,/admin/segments,/get,/admin/system,/replication,/admin/properties,/config,/stream,/schema,/admin/plugins,/admin/logging,/update/json,/admin/ping,/admin/threads,/update,/admin/file
   [junit4]   2> 107085 INFO  (coreLoadExecutor-432-thread-1) [    ] o.a.s.c.SolrCore Using default statsCache cache: org.apache.solr.search.stats.LocalStatsCache
   [junit4]   2> 107085 INFO  (coreLoadExecutor-432-thread-1) [    ] o.a.s.u.UpdateHandler Using UpdateLog implementation: org.apache.solr.update.UpdateLog
   [junit4]   2> 107085 INFO  (coreLoadExecutor-432-thread-1) [    ] o.a.s.u.UpdateLog Initializing UpdateLog: dataDir= defaultSyncLevel=FLUSH numRecordsToKeep=100 maxNumLogsToKeep=10 numVersionBuckets=65536
   [junit4]   2> 107086 INFO  (coreLoadExecutor-432-thread-1) [    ] o.a.s.u.CommitTracker Hard AutoCommit: disabled
   [junit4]   2> 107086 INFO  (coreLoadExecutor-432-thread-1) [    ] o.a.s.u.CommitTracker Soft AutoCommit: disabled
   [junit4]   2> 107086 INFO  (coreLoadExecutor-432-thread-1) [    ] o.a.s.u.RandomMergePolicy RandomMergePolicy wrapping class org.apache.lucene.index.TieredMergePolicy: [TieredMergePolicy: maxMergeAtOnce=11, maxMergeAtOnceExplicit=27, maxMergedSegmentMB=66.6611328125, floorSegmentMB=0.255859375, forceMergeDeletesPctAllowed=17.98383170457918, segmentsPerTier=38.0, maxCFSSegmentSizeMB=8.796093022207999E12, noCFSRatio=0.6022740657513875
   [junit4]   2> 107087 INFO  (coreLoadExecutor-432-thread-1) [    ] o.a.s.c.SolrDeletionPolicy SolrDeletionPolicy.onInit: commits: num=1
   [junit4]   2> 	commit{dir=MockDirectoryWrapper(RAMDirectory@1635d4f lockFactory=org.apache.lucene.store.SingleInstanceLockFactory@131ae0a),segFN=segments_1,generation=1}
   [junit4]   2> 107087 INFO  (coreLoadExecutor-432-thread-1) [    ] o.a.s.c.SolrDeletionPolicy newest commit generation = 1
   [junit4]   2> 107087 INFO  (coreLoadExecutor-432-thread-1) [    ] o.a.s.s.SolrIndexSearcher Opening [Searcher@dbec06[collection1] main]
   [junit4]   2> 107087 INFO  (coreLoadExecutor-432-thread-1) [    ] o.a.s.c.c.ZkStateReader Load collection config from: [/collections/collection1]
   [junit4]   2> 107087 INFO  (coreLoadExecutor-432-thread-1) [    ] o.a.s.c.c.ZkStateReader path=[/collections/collection1] [configName]=[conf1] specified config exists in ZooKeeper
   [junit4]   2> 107087 INFO  (coreLoadExecutor-432-thread-1) [    ] o.a.s.r.ManagedResourceStorage Setting up ZooKeeper-based storage for the RestManager with znodeBase: /configs/conf1
   [junit4]   2> 107087 INFO  (coreLoadExecutor-432-thread-1) [    ] o.a.s.r.ManagedResourceStorage Configured ZooKeeperStorageIO with znodeBase: /configs/conf1
   [junit4]   2> 107087 INFO  (coreLoadExecutor-432-thread-1) [    ] o.a.s.r.RestManager Initializing RestManager with initArgs: {}
   [junit4]   2> 107088 INFO  (coreLoadExecutor-432-thread-1) [    ] o.a.s.r.ManagedResourceStorage Reading _rest_managed.json using ZooKeeperStorageIO:path=/configs/conf1
   [junit4]   2> 107088 INFO  (coreLoadExecutor-432-thread-1) [    ] o.a.s.r.ManagedResourceStorage No data found for znode /configs/conf1/_rest_managed.json
   [junit4]   2> 107088 INFO  (coreLoadExecutor-432-thread-1) [    ] o.a.s.r.ManagedResourceStorage Loaded null at path _rest_managed.json using ZooKeeperStorageIO:path=/configs/conf1
   [junit4]   2> 107088 INFO  (coreLoadExecutor-432-thread-1) [    ] o.a.s.r.RestManager Initializing 0 registered ManagedResources
   [junit4]   2> 107088 INFO  (coreLoadExecutor-432-thread-1) [    ] o.a.s.h.ReplicationHandler Commits will be reserved for  10000
   [junit4]   2> 107089 INFO  (searcherExecutor-433-thread-1) [    ] o.a.s.c.SolrCore [collection1] Registered new searcher Searcher@dbec06[collection1] main{ExitableDirectoryReader(UninvertingDirectoryReader())}
   [junit4]   2> 107089 INFO  (coreLoadExecutor-432-thread-1) [    ] o.a.s.u.UpdateLog Looking up max value of version field to seed version buckets
   [junit4]   2> 107089 INFO  (coreLoadExecutor-432-thread-1) [    ] o.a.s.u.VersionInfo Refreshing highest value of _version_ for 65536 version buckets from index
   [junit4]   2> 107089 INFO  (coreLoadExecutor-432-thread-1) [    ] o.a.s.u.VersionInfo No terms found for _version_, cannot seed version bucket highest value from index
   [junit4]   2> 107089 INFO  (coreLoadExecutor-432-thread-1) [    ] o.a.s.u.UpdateLog Could not find max version in index or recent updates, using new clock 1528477124365647872
   [junit4]   2> 107091 INFO  (coreLoadExecutor-432-thread-1) [    ] o.a.s.u.UpdateLog Took 1.0ms to seed version buckets with highest version 1528477124365647872
   [junit4]   2> 107091 INFO  (coreLoadExecutor-432-thread-1) [    ] o.a.s.c.ZkController watch zkdir /configs/conf1
   [junit4]   2> 107091 INFO  (coreLoadExecutor-432-thread-1) [    ] o.a.s.c.CoreContainer registering core: collection1
   [junit4]   2> 107091 INFO  (coreZkRegister-427-thread-1) [    ] o.a.s.c.ZkController Register replica - core:collection1 address:http://127.0.0.1:47598 collection:collection1 shard:shard2
   [junit4]   2> 107092 INFO  (coreZkRegister-427-thread-1) [    ] o.a.s.c.c.SolrZkClient makePath: /collections/collection1/leader_elect/shard2/election
   [junit4]   2> 107092 INFO  (coreZkRegister-427-thread-1) [    ] o.a.s.c.LeaderElector Joined leadership election with path: /collections/collection1/leader_elect/shard2/election/95529820013723657-core_node1-n_0000000000
   [junit4]   2> 107093 INFO  (coreZkRegister-427-thread-1) [    ] o.a.s.c.ShardLeaderElectionContext Running the leader process for shard=shard2 and weAreReplacement=false and leaderVoteWait=180000
   [junit4]   2> 107093 INFO  (coreZkRegister-427-thread-1) [    ] o.a.s.c.ShardLeaderElectionContext Enough replicas found to continue.
   [junit4]   2> 107093 INFO  (coreZkRegister-427-thread-1) [    ] o.a.s.c.ShardLeaderElectionContext I may be the new leader - try and sync
   [junit4]   2> 107093 INFO  (coreZkRegister-427-thread-1) [    ] o.a.s.c.SyncStrategy Sync replicas to http://127.0.0.1:47598/collection1/
   [junit4]   2> 107093 INFO  (coreZkRegister-427-thread-1) [    ] o.a.s.c.SyncStrategy Sync Success - now sync replicas to me
   [junit4]   2> 107093 INFO  (coreZkRegister-427-thread-1) [    ] o.a.s.c.SyncStrategy http://127.0.0.1:47598/collection1/ has no replicas
   [junit4]   2> 107093 INFO  (OverseerStateUpdate-95529820013723652-127.0.0.1:49352_-n_0000000000) [    ] o.a.s.c.Overseer processMessage: queueSize: 1, message = {
   [junit4]   2>   "operation":"leader",
   [junit4]   2>   "shard":"shard2",
   [junit4]   2>   "collection":"collection1"} current state version: 4
   [junit4]   2> 107094 INFO  (coreZkRegister-427-thread-1) [    ] o.a.s.c.c.SolrZkClient makePath: /collections/collection1/leaders/shard2
   [junit4]   2> 107094 INFO  (coreZkRegister-427-thread-1) [    ] o.a.s.c.ShardLeaderElectionContextBase Creating leader registration node /collections/collection1/leaders/shard2/leader after winning as /collections/collection1/leader_elect/shard2/election/95529820013723657-core_node1-n_0000000000
   [junit4]   2> 107095 INFO  (coreZkRegister-427-thread-1) [    ] o.a.s.c.ShardLeaderElectionContext I am the new leader: http://127.0.0.1:47598/collection1/ shard2
   [junit4]   2> 107095 INFO  (OverseerStateUpdate-95529820013723652-127.0.0.1:49352_-n_0000000000) [    ] o.a.s.c.Overseer processMessage: queueSize: 1, message = {
   [junit4]   2>   "operation":"leader",
   [junit4]   2>   "shard":"shard2",
   [junit4]   2>   "collection":"collection1",
   [junit4]   2>   "base_url":"http://127.0.0.1:47598",
   [junit4]   2>   "core":"collection1",
   [junit4]   2>   "state":"active"} current state version: 4
   [junit4]   2> 107196 INFO  (OverseerStateUpdate-95529820013723652-127.0.0.1:49352_-n_0000000000) [    ] o.a.s.c.o.ZkStateWriter going to update_collection /collections/collection1/state.json version: 1
   [junit4]   2> 107197 INFO  (zkCallback-118-thread-1) [    ] o.a.s.c.c.ZkStateReader A cluster state change: [WatchedEvent state:SyncConnected type:NodeDataChanged path:/collections/collection1/state.json] for collection [collection1] has occurred - updating... (live nodes size: [2])
   [junit4]   2> 107197 INFO  (zkCallback-118-thread-1) [    ] o.a.s.c.c.ZkStateReader Updating data for [collection1] from [1] to [2]
   [junit4]   2> 107246 INFO  (coreZkRegister-427-thread-1) [    ] o.a.s.c.ZkController We are http://127.0.0.1:47598/collection1/ and leader is http://127.0.0.1:47598/collection1/
   [junit4]   2> 107246 INFO  (coreZkRegister-427-thread-1) [    ] o.a.s.c.ZkController No LogReplay needed for core=collection1 baseURL=http://127.0.0.1:47598
   [junit4]   2> 107246 INFO  (coreZkRegister-427-thread-1) [    ] o.a.s.c.ZkController I am the leader, no recovery necessary
   [junit4]   2> 107246 INFO  (coreZkRegister-427-thread-1) [    ] o.a.s.c.ZkController publishing state=active
   [junit4]   2> 107246 INFO  (coreZkRegister-427-thread-1) [    ] o.a.s.c.ZkController numShards not found on descriptor - reading it from system property
   [junit4]   2> 107247 INFO  (OverseerStateUpdate-95529820013723652-127.0.0.1:49352_-n_0000000000) [    ] o.a.s.c.Overseer processMessage: queueSize: 1, message = {
   [junit4]   2>   "core":"collection1",
   [junit4]   2>   "core_node_name":"core_node1",
   [junit4]   2>   "roles":null,
   [junit4]   2>   "base_url":"http://127.0.0.1:47598",
   [junit4]   2>   "node_name":"127.0.0.1:47598_",
   [junit4]   2>   "numShards":"2",
   [junit4]   2>   "state":"active",
   [junit4]   2>   "shard":"shard2",
   [junit4]   2>   "collection":"collection1",
   [junit4]   2>   "operation":"state"} current state version: 4
   [junit4]   2> 107247 INFO  (OverseerStateUpdate-95529820013723652-127.0.0.1:49352_-n_0000000000) [    ] o.a.s.c.o.ReplicaMutator Update state numShards=2 message={
   [junit4]   2>   "core":"collection1",
   [junit4]   2>   "core_node_name":"core_node1",
   [junit4]   2>   "roles":null,
   [junit4]   2>   "base_url":"http://127.0.0.1:47598",
   [junit4]   2>   "node_name":"127.0.0.1:47598_",
   [junit4]   2>   "numShards":"2",
   [junit4]   2>   "state":"active",
   [junit4]   2>   "shard":"shard2",
   [junit4]   2>   "collection":"collection1",
   [junit4]   2>   "operation":"state"}
   [junit4]   2> 107348 INFO  (OverseerStateUpdate-95529820013723652-127.0.0.1:49352_-n_0000000000) [    ] o.a.s.c.o.ZkStateWriter going to update_collection /collections/collection1/state.json version: 2
   [junit4]   2> 107348 INFO  (zkCallback-118-thread-1) [    ] o.a.s.c.c.ZkStateReader A cluster state change: [WatchedEvent state:SyncConnected type:NodeDataChanged path:/collections/collection1/state.json] for collection [collection1] has occurred - updating... (live nodes size: [2])
   [junit4]   2> 107348 INFO  (zkCallback-118-thread-1) [    ] o.a.s.c.c.ZkStateReader Updating data for [collection1] from [2] to [3]
   [junit4]   2> 107548 INFO  (TEST-UnloadDistributedZkTest.test-seed#[20630518F2F53822]) [    ] o.a.s.SolrTestCaseJ4 Writing core.properties file to /home/jenkins/workspace/Lucene-Solr-6.x-Linux/solr/build/solr-core/test/J2/temp/solr.cloud.UnloadDistributedZkTest_20630518F2F53822-001/shard-2-001/cores/collection1
   [junit4]   2> 107548 INFO  (TEST-UnloadDistributedZkTest.test-seed#[20630518F2F53822]) [    ] o.a.s.c.AbstractFullDistribZkTestBase create jetty 2 in directory /home/jenkins/workspace/Lucene-Solr-6.x-Linux/solr/build/solr-core/test/J2/temp/solr.cloud.UnloadDistributedZkTest_20630518F2F53822-001/shard-2-001
   [junit4]   2> 107549 INFO  (TEST-UnloadDistributedZkTest.test-seed#[20630518F2F53822]) [    ] o.e.j.s.Server jetty-9.3.6.v20151106
   [junit4]   2> 107550 INFO  (TEST-UnloadDistributedZkTest.test-seed#[20630518F2F53822]) [    ] o.e.j.s.h.ContextHandler Started o.e.j.s.ServletContextHandler@1ca56e6{/,null,AVAILABLE}
   [junit4]   

[...truncated too long message...]

Client.request(SolrClient.java:1219)
   [junit4]    > 	at org.apache.solr.cloud.BasicDistributedZkTest.lambda$createCores$0(BasicDistributedZkTest.java:581)
   [junit4]    > 	... 4 more
   [junit4]    > Caused by: java.net.SocketTimeoutException: Read timed out
   [junit4]    > 	at java.net.SocketInputStream.socketRead0(Native Method)
   [junit4]    > 	at java.net.SocketInputStream.socketRead(SocketInputStream.java:116)
   [junit4]    > 	at java.net.SocketInputStream.read(SocketInputStream.java:170)
   [junit4]    > 	at java.net.SocketInputStream.read(SocketInputStream.java:141)
   [junit4]    > 	at org.apache.http.impl.io.AbstractSessionInputBuffer.fillBuffer(AbstractSessionInputBuffer.java:160)
   [junit4]    > 	at org.apache.http.impl.io.SocketInputBuffer.fillBuffer(SocketInputBuffer.java:84)
   [junit4]    > 	at org.apache.http.impl.io.AbstractSessionInputBuffer.readLine(AbstractSessionInputBuffer.java:273)
   [junit4]    > 	at org.apache.http.impl.conn.DefaultHttpResponseParser.parseHead(DefaultHttpResponseParser.java:140)
   [junit4]    > 	at org.apache.http.impl.conn.DefaultHttpResponseParser.parseHead(DefaultHttpResponseParser.java:57)
   [junit4]    > 	at org.apache.http.impl.io.AbstractMessageParser.parse(AbstractMessageParser.java:261)
   [junit4]    > 	at org.apache.http.impl.AbstractHttpClientConnection.receiveResponseHeader(AbstractHttpClientConnection.java:283)
   [junit4]    > 	at org.apache.http.impl.conn.DefaultClientConnection.receiveResponseHeader(DefaultClientConnection.java:251)
   [junit4]    > 	at org.apache.http.impl.conn.ManagedClientConnectionImpl.receiveResponseHeader(ManagedClientConnectionImpl.java:197)
   [junit4]    > 	at org.apache.http.protocol.HttpRequestExecutor.doReceiveResponse(HttpRequestExecutor.java:272)
   [junit4]    > 	at org.apache.http.protocol.HttpRequestExecutor.execute(HttpRequestExecutor.java:124)
   [junit4]    > 	at org.apache.http.impl.client.DefaultRequestDirector.tryExecute(DefaultRequestDirector.java:685)
   [junit4]    > 	at org.apache.http.impl.client.DefaultRequestDirector.execute(DefaultRequestDirector.java:487)
   [junit4]    > 	at org.apache.http.impl.client.AbstractHttpClient.doExecute(AbstractHttpClient.java:882)
   [junit4]    > 	at org.apache.http.impl.client.CloseableHttpClient.execute(CloseableHttpClient.java:82)
   [junit4]    > 	at org.apache.http.impl.client.CloseableHttpClient.execute(CloseableHttpClient.java:107)
   [junit4]    > 	at org.apache.http.impl.client.CloseableHttpClient.execute(CloseableHttpClient.java:55)
   [junit4]    > 	at org.apache.solr.client.solrj.impl.HttpSolrClient.executeMethod(HttpSolrClient.java:482)
   [junit4]    > 	... 8 moreThrowable #6: com.carrotsearch.randomizedtesting.UncaughtExceptionError: Captured an uncaught exception in thread: Thread[id=1155, name=testExecutor-499-thread-12, state=RUNNABLE, group=TGRP-UnloadDistributedZkTest]
   [junit4]    > Caused by: java.lang.RuntimeException: org.apache.solr.client.solrj.SolrServerException: Timeout occured while waiting response from server at: http://127.0.0.1:35829
   [junit4]    > 	at __randomizedtesting.SeedInfo.seed([20630518F2F53822]:0)
   [junit4]    > 	at org.apache.solr.cloud.BasicDistributedZkTest.lambda$createCores$0(BasicDistributedZkTest.java:583)
   [junit4]    > 	at org.apache.solr.common.util.ExecutorUtil$MDCAwareThreadPoolExecutor.lambda$execute$0(ExecutorUtil.java:229)
   [junit4]    > 	at java.util.concurrent.ThreadPoolExecutor.runWorker(ThreadPoolExecutor.java:1158)
   [junit4]    > 	at java.util.concurrent.ThreadPoolExecutor$Worker.run(ThreadPoolExecutor.java:632)
   [junit4]    > 	at java.lang.Thread.run(Thread.java:804)
   [junit4]    > Caused by: org.apache.solr.client.solrj.SolrServerException: Timeout occured while waiting response from server at: http://127.0.0.1:35829
   [junit4]    > 	at org.apache.solr.client.solrj.impl.HttpSolrClient.executeMethod(HttpSolrClient.java:588)
   [junit4]    > 	at org.apache.solr.client.solrj.impl.HttpSolrClient.request(HttpSolrClient.java:241)
   [junit4]    > 	at org.apache.solr.client.solrj.impl.HttpSolrClient.request(HttpSolrClient.java:230)
   [junit4]    > 	at org.apache.solr.client.solrj.SolrClient.request(SolrClient.java:1219)
   [junit4]    > 	at org.apache.solr.cloud.BasicDistributedZkTest.lambda$createCores$0(BasicDistributedZkTest.java:581)
   [junit4]    > 	... 4 more
   [junit4]    > Caused by: java.net.SocketTimeoutException: Read timed out
   [junit4]    > 	at java.net.SocketInputStream.socketRead0(Native Method)
   [junit4]    > 	at java.net.SocketInputStream.socketRead(SocketInputStream.java:116)
   [junit4]    > 	at java.net.SocketInputStream.read(SocketInputStream.java:170)
   [junit4]    > 	at java.net.SocketInputStream.read(SocketInputStream.java:141)
   [junit4]    > 	at org.apache.http.impl.io.AbstractSessionInputBuffer.fillBuffer(AbstractSessionInputBuffer.java:160)
   [junit4]    > 	at org.apache.http.impl.io.SocketInputBuffer.fillBuffer(SocketInputBuffer.java:84)
   [junit4]    > 	at org.apache.http.impl.io.AbstractSessionInputBuffer.readLine(AbstractSessionInputBuffer.java:273)
   [junit4]    > 	at org.apache.http.impl.conn.DefaultHttpResponseParser.parseHead(DefaultHttpResponseParser.java:140)
   [junit4]    > 	at org.apache.http.impl.conn.DefaultHttpResponseParser.parseHead(DefaultHttpResponseParser.java:57)
   [junit4]    > 	at org.apache.http.impl.io.AbstractMessageParser.parse(AbstractMessageParser.java:261)
   [junit4]    > 	at org.apache.http.impl.AbstractHttpClientConnection.receiveResponseHeader(AbstractHttpClientConnection.java:283)
   [junit4]    > 	at org.apache.http.impl.conn.DefaultClientConnection.receiveResponseHeader(DefaultClientConnection.java:251)
   [junit4]    > 	at org.apache.http.impl.conn.ManagedClientConnectionImpl.receiveResponseHeader(ManagedClientConnectionImpl.java:197)
   [junit4]    > 	at org.apache.http.protocol.HttpRequestExecutor.doReceiveResponse(HttpRequestExecutor.java:272)
   [junit4]    > 	at org.apache.http.protocol.HttpRequestExecutor.execute(HttpRequestExecutor.java:124)
   [junit4]    > 	at org.apache.http.impl.client.DefaultRequestDirector.tryExecute(DefaultRequestDirector.java:685)
   [junit4]    > 	at org.apache.http.impl.client.DefaultRequestDirector.execute(DefaultRequestDirector.java:487)
   [junit4]    > 	at org.apache.http.impl.client.AbstractHttpClient.doExecute(AbstractHttpClient.java:882)
   [junit4]    > 	at org.apache.http.impl.client.CloseableHttpClient.execute(CloseableHttpClient.java:82)
   [junit4]    > 	at org.apache.http.impl.client.CloseableHttpClient.execute(CloseableHttpClient.java:107)
   [junit4]    > 	at org.apache.http.impl.client.CloseableHttpClient.execute(CloseableHttpClient.java:55)
   [junit4]    > 	at org.apache.solr.client.solrj.impl.HttpSolrClient.executeMethod(HttpSolrClient.java:482)
   [junit4]    > 	... 8 more
   [junit4]   2> 237817 INFO  (SUITE-UnloadDistributedZkTest-seed#[20630518F2F53822]-worker) [    ] o.a.s.SolrTestCaseJ4 ###deleteCore
   [junit4]   2> Mar 11, 2016 4:11:47 AM com.carrotsearch.randomizedtesting.ThreadLeakControl checkThreadLeaks
   [junit4]   2> WARNING: Will linger awaiting termination of 1 leaked thread(s).
   [junit4]   2> NOTE: test params are: codec=Asserting(Lucene60): {other_tl1=Lucene50(blocksize=128), range_facet_l_dv=PostingsFormat(name=LuceneVarGapDocFreqInterval), _version_=Lucene50(blocksize=128), multiDefault=PostingsFormat(name=LuceneFixedGap), a_t=Lucene50(blocksize=128), intDefault=Lucene50(blocksize=128), a_i1=Lucene50(blocksize=128), id=PostingsFormat(name=LuceneVarGapDocFreqInterval), range_facet_i_dv=Lucene50(blocksize=128), text=BlockTreeOrds(blocksize=128), range_facet_l=Lucene50(blocksize=128), timestamp=Lucene50(blocksize=128)}, docValues:{range_facet_l_dv=DocValuesFormat(name=Lucene54), range_facet_i_dv=DocValuesFormat(name=Asserting), timestamp=DocValuesFormat(name=Asserting)}, maxPointsInLeafNode=1732, maxMBSortInHeap=4.593396437062402, sim=ClassicSimilarity, locale=lkt, timezone=US/Pacific
   [junit4]   2> NOTE: Linux 3.19.0-51-generic i386/Oracle Corporation 9-ea (32-bit)/cpus=12,threads=1,free=114236760,total=308805632
   [junit4]   2> NOTE: All tests run in this JVM: [TestIndexingPerformance, TestSha256AuthenticationProvider, TestRestManager, FacetPivotSmallTest, BigEndianAscendingWordSerializerTest, TestStressRecovery, SolrCoreCheckLockOnStartupTest, TestBulkSchemaConcurrent, TestDynamicFieldResource, CollectionsAPISolrJTest, TestSweetSpotSimilarityFactory, TestJmxMonitoredMap, VMParamsZkACLAndCredentialsProvidersTest, SharedFSAutoReplicaFailoverTest, TestStressUserVersions, ClusterStateTest, DistanceUnitsTest, UnloadDistributedZkTest]
   [junit4] Completed [72/579 (1!)] on J2 in 135.31s, 1 test, 1 error <<< FAILURES!

[...truncated 1637 lines...]
BUILD FAILED
/home/jenkins/workspace/Lucene-Solr-6.x-Linux/build.xml:740: The following error occurred while executing this line:
/home/jenkins/workspace/Lucene-Solr-6.x-Linux/build.xml:684: The following error occurred while executing this line:
/home/jenkins/workspace/Lucene-Solr-6.x-Linux/build.xml:59: The following error occurred while executing this line:
/home/jenkins/workspace/Lucene-Solr-6.x-Linux/solr/build.xml:233: The following error occurred while executing this line:
/home/jenkins/workspace/Lucene-Solr-6.x-Linux/solr/common-build.xml:524: The following error occurred while executing this line:
/home/jenkins/workspace/Lucene-Solr-6.x-Linux/lucene/common-build.xml:1457: The following error occurred while executing this line:
/home/jenkins/workspace/Lucene-Solr-6.x-Linux/lucene/common-build.xml:1014: There were test failures: 579 suites (10 ignored), 2314 tests, 1 error, 116 ignored (70 assumptions) [seed: 20630518F2F53822]

Total time: 52 minutes 35 seconds
Build step 'Invoke Ant' marked build as failure
Archiving artifacts
[WARNINGS] Skipping publisher since build result is FAILURE
Recording test results
Email was triggered for: Failure - Any
Sending email for trigger: Failure - Any



Mime
View raw message