lucene-dev mailing list archives

Site index · List index
Message view « Date » · « Thread »
Top « Date » · « Thread »
From Apache Jenkins Server <jenk...@builds.apache.org>
Subject [JENKINS] Lucene-Solr-NightlyTests-master - Build # 973 - Still Failing
Date Wed, 30 Mar 2016 22:37:24 GMT
Build: https://builds.apache.org/job/Lucene-Solr-NightlyTests-master/973/

5 tests failed.
FAILED:  org.apache.solr.cloud.BasicDistributedZkTest.test

Error Message:
distrib-dup-test-chain-explicit: doc#8 has wrong value for regex_dup_B_s expected:<x[_x]> but was:<x[]>

Stack Trace:
org.junit.ComparisonFailure: distrib-dup-test-chain-explicit: doc#8 has wrong value for regex_dup_B_s expected:<x[_x]> but was:<x[]>
	at __randomizedtesting.SeedInfo.seed([8BDF4EE617D22F3:80E9CB34CF814F0B]:0)
	at org.junit.Assert.assertEquals(Assert.java:125)
	at org.apache.solr.cloud.BasicDistributedZkTest.testUpdateProcessorsRunOnlyOnce(BasicDistributedZkTest.java:686)
	at org.apache.solr.cloud.BasicDistributedZkTest.test(BasicDistributedZkTest.java:365)
	at sun.reflect.NativeMethodAccessorImpl.invoke0(Native Method)
	at sun.reflect.NativeMethodAccessorImpl.invoke(NativeMethodAccessorImpl.java:62)
	at sun.reflect.DelegatingMethodAccessorImpl.invoke(DelegatingMethodAccessorImpl.java:43)
	at java.lang.reflect.Method.invoke(Method.java:498)
	at com.carrotsearch.randomizedtesting.RandomizedRunner.invoke(RandomizedRunner.java:1764)
	at com.carrotsearch.randomizedtesting.RandomizedRunner$8.evaluate(RandomizedRunner.java:871)
	at com.carrotsearch.randomizedtesting.RandomizedRunner$9.evaluate(RandomizedRunner.java:907)
	at com.carrotsearch.randomizedtesting.RandomizedRunner$10.evaluate(RandomizedRunner.java:921)
	at org.apache.solr.BaseDistributedSearchTestCase$ShardsRepeatRule$ShardsFixedStatement.callStatement(BaseDistributedSearchTestCase.java:996)
	at org.apache.solr.BaseDistributedSearchTestCase$ShardsRepeatRule$ShardsStatement.evaluate(BaseDistributedSearchTestCase.java:971)
	at com.carrotsearch.randomizedtesting.rules.SystemPropertiesRestoreRule$1.evaluate(SystemPropertiesRestoreRule.java:57)
	at org.apache.lucene.util.TestRuleSetupTeardownChained$1.evaluate(TestRuleSetupTeardownChained.java:49)
	at org.apache.lucene.util.AbstractBeforeAfterRule$1.evaluate(AbstractBeforeAfterRule.java:45)
	at org.apache.lucene.util.TestRuleThreadAndTestName$1.evaluate(TestRuleThreadAndTestName.java:48)
	at org.apache.lucene.util.TestRuleIgnoreAfterMaxFailures$1.evaluate(TestRuleIgnoreAfterMaxFailures.java:64)
	at org.apache.lucene.util.TestRuleMarkFailure$1.evaluate(TestRuleMarkFailure.java:47)
	at com.carrotsearch.randomizedtesting.rules.StatementAdapter.evaluate(StatementAdapter.java:36)
	at com.carrotsearch.randomizedtesting.ThreadLeakControl$StatementRunner.run(ThreadLeakControl.java:367)
	at com.carrotsearch.randomizedtesting.ThreadLeakControl.forkTimeoutingTask(ThreadLeakControl.java:809)
	at com.carrotsearch.randomizedtesting.ThreadLeakControl$3.evaluate(ThreadLeakControl.java:460)
	at com.carrotsearch.randomizedtesting.RandomizedRunner.runSingleTest(RandomizedRunner.java:880)
	at com.carrotsearch.randomizedtesting.RandomizedRunner$5.evaluate(RandomizedRunner.java:781)
	at com.carrotsearch.randomizedtesting.RandomizedRunner$6.evaluate(RandomizedRunner.java:816)
	at com.carrotsearch.randomizedtesting.RandomizedRunner$7.evaluate(RandomizedRunner.java:827)
	at com.carrotsearch.randomizedtesting.rules.StatementAdapter.evaluate(StatementAdapter.java:36)
	at com.carrotsearch.randomizedtesting.rules.SystemPropertiesRestoreRule$1.evaluate(SystemPropertiesRestoreRule.java:57)
	at org.apache.lucene.util.AbstractBeforeAfterRule$1.evaluate(AbstractBeforeAfterRule.java:45)
	at com.carrotsearch.randomizedtesting.rules.StatementAdapter.evaluate(StatementAdapter.java:36)
	at org.apache.lucene.util.TestRuleStoreClassName$1.evaluate(TestRuleStoreClassName.java:41)
	at com.carrotsearch.randomizedtesting.rules.NoShadowingOrOverridesOnMethodsRule$1.evaluate(NoShadowingOrOverridesOnMethodsRule.java:40)
	at com.carrotsearch.randomizedtesting.rules.NoShadowingOrOverridesOnMethodsRule$1.evaluate(NoShadowingOrOverridesOnMethodsRule.java:40)
	at com.carrotsearch.randomizedtesting.rules.StatementAdapter.evaluate(StatementAdapter.java:36)
	at com.carrotsearch.randomizedtesting.rules.StatementAdapter.evaluate(StatementAdapter.java:36)
	at com.carrotsearch.randomizedtesting.rules.StatementAdapter.evaluate(StatementAdapter.java:36)
	at org.apache.lucene.util.TestRuleAssertionsRequired$1.evaluate(TestRuleAssertionsRequired.java:53)
	at org.apache.lucene.util.TestRuleMarkFailure$1.evaluate(TestRuleMarkFailure.java:47)
	at org.apache.lucene.util.TestRuleIgnoreAfterMaxFailures$1.evaluate(TestRuleIgnoreAfterMaxFailures.java:64)
	at org.apache.lucene.util.TestRuleIgnoreTestSuites$1.evaluate(TestRuleIgnoreTestSuites.java:54)
	at com.carrotsearch.randomizedtesting.rules.StatementAdapter.evaluate(StatementAdapter.java:36)
	at com.carrotsearch.randomizedtesting.ThreadLeakControl$StatementRunner.run(ThreadLeakControl.java:367)
	at java.lang.Thread.run(Thread.java:745)


FAILED:  org.apache.solr.cloud.CollectionsAPIDistributedZkTest.test

Error Message:
Error from server at https://127.0.0.1:54371: KeeperErrorCode = NoNode for /overseer/collection-queue-work/qnr-0000000110

Stack Trace:
org.apache.solr.client.solrj.impl.HttpSolrClient$RemoteSolrException: Error from server at https://127.0.0.1:54371: KeeperErrorCode = NoNode for /overseer/collection-queue-work/qnr-0000000110
	at org.apache.solr.client.solrj.impl.HttpSolrClient.executeMethod(HttpSolrClient.java:577)
	at org.apache.solr.client.solrj.impl.HttpSolrClient.request(HttpSolrClient.java:241)
	at org.apache.solr.client.solrj.impl.HttpSolrClient.request(HttpSolrClient.java:230)
	at org.apache.solr.client.solrj.SolrClient.request(SolrClient.java:1219)
	at org.apache.solr.cloud.AbstractFullDistribZkTestBase.createCollection(AbstractFullDistribZkTestBase.java:1593)
	at org.apache.solr.cloud.AbstractFullDistribZkTestBase.createCollection(AbstractFullDistribZkTestBase.java:1614)
	at org.apache.solr.cloud.CollectionsAPIDistributedZkTest.deleteCollectionWithDownNodes(CollectionsAPIDistributedZkTest.java:334)
	at org.apache.solr.cloud.CollectionsAPIDistributedZkTest.test(CollectionsAPIDistributedZkTest.java:175)
	at sun.reflect.NativeMethodAccessorImpl.invoke0(Native Method)
	at sun.reflect.NativeMethodAccessorImpl.invoke(NativeMethodAccessorImpl.java:62)
	at sun.reflect.DelegatingMethodAccessorImpl.invoke(DelegatingMethodAccessorImpl.java:43)
	at java.lang.reflect.Method.invoke(Method.java:498)
	at com.carrotsearch.randomizedtesting.RandomizedRunner.invoke(RandomizedRunner.java:1764)
	at com.carrotsearch.randomizedtesting.RandomizedRunner$8.evaluate(RandomizedRunner.java:871)
	at com.carrotsearch.randomizedtesting.RandomizedRunner$9.evaluate(RandomizedRunner.java:907)
	at com.carrotsearch.randomizedtesting.RandomizedRunner$10.evaluate(RandomizedRunner.java:921)
	at org.apache.solr.BaseDistributedSearchTestCase$ShardsRepeatRule$ShardsFixedStatement.callStatement(BaseDistributedSearchTestCase.java:996)
	at org.apache.solr.BaseDistributedSearchTestCase$ShardsRepeatRule$ShardsStatement.evaluate(BaseDistributedSearchTestCase.java:971)
	at com.carrotsearch.randomizedtesting.rules.SystemPropertiesRestoreRule$1.evaluate(SystemPropertiesRestoreRule.java:57)
	at org.apache.lucene.util.TestRuleSetupTeardownChained$1.evaluate(TestRuleSetupTeardownChained.java:49)
	at org.apache.lucene.util.AbstractBeforeAfterRule$1.evaluate(AbstractBeforeAfterRule.java:45)
	at org.apache.lucene.util.TestRuleThreadAndTestName$1.evaluate(TestRuleThreadAndTestName.java:48)
	at org.apache.lucene.util.TestRuleIgnoreAfterMaxFailures$1.evaluate(TestRuleIgnoreAfterMaxFailures.java:64)
	at org.apache.lucene.util.TestRuleMarkFailure$1.evaluate(TestRuleMarkFailure.java:47)
	at com.carrotsearch.randomizedtesting.rules.StatementAdapter.evaluate(StatementAdapter.java:36)
	at com.carrotsearch.randomizedtesting.ThreadLeakControl$StatementRunner.run(ThreadLeakControl.java:367)
	at com.carrotsearch.randomizedtesting.ThreadLeakControl.forkTimeoutingTask(ThreadLeakControl.java:809)
	at com.carrotsearch.randomizedtesting.ThreadLeakControl$3.evaluate(ThreadLeakControl.java:460)
	at com.carrotsearch.randomizedtesting.RandomizedRunner.runSingleTest(RandomizedRunner.java:880)
	at com.carrotsearch.randomizedtesting.RandomizedRunner$5.evaluate(RandomizedRunner.java:781)
	at com.carrotsearch.randomizedtesting.RandomizedRunner$6.evaluate(RandomizedRunner.java:816)
	at com.carrotsearch.randomizedtesting.RandomizedRunner$7.evaluate(RandomizedRunner.java:827)
	at com.carrotsearch.randomizedtesting.rules.StatementAdapter.evaluate(StatementAdapter.java:36)
	at com.carrotsearch.randomizedtesting.rules.SystemPropertiesRestoreRule$1.evaluate(SystemPropertiesRestoreRule.java:57)
	at org.apache.lucene.util.AbstractBeforeAfterRule$1.evaluate(AbstractBeforeAfterRule.java:45)
	at com.carrotsearch.randomizedtesting.rules.StatementAdapter.evaluate(StatementAdapter.java:36)
	at org.apache.lucene.util.TestRuleStoreClassName$1.evaluate(TestRuleStoreClassName.java:41)
	at com.carrotsearch.randomizedtesting.rules.NoShadowingOrOverridesOnMethodsRule$1.evaluate(NoShadowingOrOverridesOnMethodsRule.java:40)
	at com.carrotsearch.randomizedtesting.rules.NoShadowingOrOverridesOnMethodsRule$1.evaluate(NoShadowingOrOverridesOnMethodsRule.java:40)
	at com.carrotsearch.randomizedtesting.rules.StatementAdapter.evaluate(StatementAdapter.java:36)
	at com.carrotsearch.randomizedtesting.rules.StatementAdapter.evaluate(StatementAdapter.java:36)
	at com.carrotsearch.randomizedtesting.rules.StatementAdapter.evaluate(StatementAdapter.java:36)
	at org.apache.lucene.util.TestRuleAssertionsRequired$1.evaluate(TestRuleAssertionsRequired.java:53)
	at org.apache.lucene.util.TestRuleMarkFailure$1.evaluate(TestRuleMarkFailure.java:47)
	at org.apache.lucene.util.TestRuleIgnoreAfterMaxFailures$1.evaluate(TestRuleIgnoreAfterMaxFailures.java:64)
	at org.apache.lucene.util.TestRuleIgnoreTestSuites$1.evaluate(TestRuleIgnoreTestSuites.java:54)
	at com.carrotsearch.randomizedtesting.rules.StatementAdapter.evaluate(StatementAdapter.java:36)
	at com.carrotsearch.randomizedtesting.ThreadLeakControl$StatementRunner.run(ThreadLeakControl.java:367)
	at java.lang.Thread.run(Thread.java:745)


FAILED:  org.apache.solr.cloud.hdfs.HdfsCollectionsAPIDistributedZkTest.test

Error Message:
replicaCount expected:<0> but was:<1>

Stack Trace:
java.lang.AssertionError: replicaCount expected:<0> but was:<1>
	at __randomizedtesting.SeedInfo.seed([8BDF4EE617D22F3:80E9CB34CF814F0B]:0)
	at org.junit.Assert.fail(Assert.java:93)
	at org.junit.Assert.failNotEquals(Assert.java:647)
	at org.junit.Assert.assertEquals(Assert.java:128)
	at org.junit.Assert.assertEquals(Assert.java:472)
	at org.apache.solr.cloud.CollectionsAPIDistributedZkTest.testNoConfigSetExist(CollectionsAPIDistributedZkTest.java:601)
	at org.apache.solr.cloud.CollectionsAPIDistributedZkTest.test(CollectionsAPIDistributedZkTest.java:166)
	at sun.reflect.NativeMethodAccessorImpl.invoke0(Native Method)
	at sun.reflect.NativeMethodAccessorImpl.invoke(NativeMethodAccessorImpl.java:62)
	at sun.reflect.DelegatingMethodAccessorImpl.invoke(DelegatingMethodAccessorImpl.java:43)
	at java.lang.reflect.Method.invoke(Method.java:498)
	at com.carrotsearch.randomizedtesting.RandomizedRunner.invoke(RandomizedRunner.java:1764)
	at com.carrotsearch.randomizedtesting.RandomizedRunner$8.evaluate(RandomizedRunner.java:871)
	at com.carrotsearch.randomizedtesting.RandomizedRunner$9.evaluate(RandomizedRunner.java:907)
	at com.carrotsearch.randomizedtesting.RandomizedRunner$10.evaluate(RandomizedRunner.java:921)
	at org.apache.solr.BaseDistributedSearchTestCase$ShardsRepeatRule$ShardsFixedStatement.callStatement(BaseDistributedSearchTestCase.java:996)
	at org.apache.solr.BaseDistributedSearchTestCase$ShardsRepeatRule$ShardsStatement.evaluate(BaseDistributedSearchTestCase.java:971)
	at com.carrotsearch.randomizedtesting.rules.SystemPropertiesRestoreRule$1.evaluate(SystemPropertiesRestoreRule.java:57)
	at org.apache.lucene.util.TestRuleSetupTeardownChained$1.evaluate(TestRuleSetupTeardownChained.java:49)
	at org.apache.lucene.util.AbstractBeforeAfterRule$1.evaluate(AbstractBeforeAfterRule.java:45)
	at org.apache.lucene.util.TestRuleThreadAndTestName$1.evaluate(TestRuleThreadAndTestName.java:48)
	at org.apache.lucene.util.TestRuleIgnoreAfterMaxFailures$1.evaluate(TestRuleIgnoreAfterMaxFailures.java:64)
	at org.apache.lucene.util.TestRuleMarkFailure$1.evaluate(TestRuleMarkFailure.java:47)
	at com.carrotsearch.randomizedtesting.rules.StatementAdapter.evaluate(StatementAdapter.java:36)
	at com.carrotsearch.randomizedtesting.ThreadLeakControl$StatementRunner.run(ThreadLeakControl.java:367)
	at com.carrotsearch.randomizedtesting.ThreadLeakControl.forkTimeoutingTask(ThreadLeakControl.java:809)
	at com.carrotsearch.randomizedtesting.ThreadLeakControl$3.evaluate(ThreadLeakControl.java:460)
	at com.carrotsearch.randomizedtesting.RandomizedRunner.runSingleTest(RandomizedRunner.java:880)
	at com.carrotsearch.randomizedtesting.RandomizedRunner$5.evaluate(RandomizedRunner.java:781)
	at com.carrotsearch.randomizedtesting.RandomizedRunner$6.evaluate(RandomizedRunner.java:816)
	at com.carrotsearch.randomizedtesting.RandomizedRunner$7.evaluate(RandomizedRunner.java:827)
	at com.carrotsearch.randomizedtesting.rules.StatementAdapter.evaluate(StatementAdapter.java:36)
	at com.carrotsearch.randomizedtesting.rules.SystemPropertiesRestoreRule$1.evaluate(SystemPropertiesRestoreRule.java:57)
	at org.apache.lucene.util.AbstractBeforeAfterRule$1.evaluate(AbstractBeforeAfterRule.java:45)
	at com.carrotsearch.randomizedtesting.rules.StatementAdapter.evaluate(StatementAdapter.java:36)
	at org.apache.lucene.util.TestRuleStoreClassName$1.evaluate(TestRuleStoreClassName.java:41)
	at com.carrotsearch.randomizedtesting.rules.NoShadowingOrOverridesOnMethodsRule$1.evaluate(NoShadowingOrOverridesOnMethodsRule.java:40)
	at com.carrotsearch.randomizedtesting.rules.NoShadowingOrOverridesOnMethodsRule$1.evaluate(NoShadowingOrOverridesOnMethodsRule.java:40)
	at com.carrotsearch.randomizedtesting.rules.StatementAdapter.evaluate(StatementAdapter.java:36)
	at com.carrotsearch.randomizedtesting.rules.StatementAdapter.evaluate(StatementAdapter.java:36)
	at com.carrotsearch.randomizedtesting.rules.StatementAdapter.evaluate(StatementAdapter.java:36)
	at org.apache.lucene.util.TestRuleAssertionsRequired$1.evaluate(TestRuleAssertionsRequired.java:53)
	at org.apache.lucene.util.TestRuleMarkFailure$1.evaluate(TestRuleMarkFailure.java:47)
	at org.apache.lucene.util.TestRuleIgnoreAfterMaxFailures$1.evaluate(TestRuleIgnoreAfterMaxFailures.java:64)
	at org.apache.lucene.util.TestRuleIgnoreTestSuites$1.evaluate(TestRuleIgnoreTestSuites.java:54)
	at com.carrotsearch.randomizedtesting.rules.StatementAdapter.evaluate(StatementAdapter.java:36)
	at com.carrotsearch.randomizedtesting.ThreadLeakControl$StatementRunner.run(ThreadLeakControl.java:367)
	at java.lang.Thread.run(Thread.java:745)


FAILED:  org.apache.solr.handler.TestReplicationHandler.doTestStressReplication

Error Message:
timed out waiting for collection1 startAt time to exceed: Thu Mar 31 01:52:25 YEKT 2016

Stack Trace:
java.lang.AssertionError: timed out waiting for collection1 startAt time to exceed: Thu Mar 31 01:52:25 YEKT 2016
	at __randomizedtesting.SeedInfo.seed([8BDF4EE617D22F3:D316F42864554B40]:0)
	at org.junit.Assert.fail(Assert.java:93)
	at org.apache.solr.handler.TestReplicationHandler.watchCoreStartAt(TestReplicationHandler.java:1422)
	at org.apache.solr.handler.TestReplicationHandler.doTestStressReplication(TestReplicationHandler.java:774)
	at sun.reflect.NativeMethodAccessorImpl.invoke0(Native Method)
	at sun.reflect.NativeMethodAccessorImpl.invoke(NativeMethodAccessorImpl.java:62)
	at sun.reflect.DelegatingMethodAccessorImpl.invoke(DelegatingMethodAccessorImpl.java:43)
	at java.lang.reflect.Method.invoke(Method.java:498)
	at com.carrotsearch.randomizedtesting.RandomizedRunner.invoke(RandomizedRunner.java:1764)
	at com.carrotsearch.randomizedtesting.RandomizedRunner$8.evaluate(RandomizedRunner.java:871)
	at com.carrotsearch.randomizedtesting.RandomizedRunner$9.evaluate(RandomizedRunner.java:907)
	at com.carrotsearch.randomizedtesting.RandomizedRunner$10.evaluate(RandomizedRunner.java:921)
	at com.carrotsearch.randomizedtesting.rules.SystemPropertiesRestoreRule$1.evaluate(SystemPropertiesRestoreRule.java:57)
	at org.apache.lucene.util.TestRuleSetupTeardownChained$1.evaluate(TestRuleSetupTeardownChained.java:49)
	at org.apache.lucene.util.AbstractBeforeAfterRule$1.evaluate(AbstractBeforeAfterRule.java:45)
	at org.apache.lucene.util.TestRuleThreadAndTestName$1.evaluate(TestRuleThreadAndTestName.java:48)
	at org.apache.lucene.util.TestRuleIgnoreAfterMaxFailures$1.evaluate(TestRuleIgnoreAfterMaxFailures.java:64)
	at org.apache.lucene.util.TestRuleMarkFailure$1.evaluate(TestRuleMarkFailure.java:47)
	at com.carrotsearch.randomizedtesting.rules.StatementAdapter.evaluate(StatementAdapter.java:36)
	at com.carrotsearch.randomizedtesting.ThreadLeakControl$StatementRunner.run(ThreadLeakControl.java:367)
	at com.carrotsearch.randomizedtesting.ThreadLeakControl.forkTimeoutingTask(ThreadLeakControl.java:809)
	at com.carrotsearch.randomizedtesting.ThreadLeakControl$3.evaluate(ThreadLeakControl.java:460)
	at com.carrotsearch.randomizedtesting.RandomizedRunner.runSingleTest(RandomizedRunner.java:880)
	at com.carrotsearch.randomizedtesting.RandomizedRunner$5.evaluate(RandomizedRunner.java:781)
	at com.carrotsearch.randomizedtesting.RandomizedRunner$6.evaluate(RandomizedRunner.java:816)
	at com.carrotsearch.randomizedtesting.RandomizedRunner$7.evaluate(RandomizedRunner.java:827)
	at com.carrotsearch.randomizedtesting.rules.StatementAdapter.evaluate(StatementAdapter.java:36)
	at com.carrotsearch.randomizedtesting.rules.SystemPropertiesRestoreRule$1.evaluate(SystemPropertiesRestoreRule.java:57)
	at org.apache.lucene.util.AbstractBeforeAfterRule$1.evaluate(AbstractBeforeAfterRule.java:45)
	at com.carrotsearch.randomizedtesting.rules.StatementAdapter.evaluate(StatementAdapter.java:36)
	at org.apache.lucene.util.TestRuleStoreClassName$1.evaluate(TestRuleStoreClassName.java:41)
	at com.carrotsearch.randomizedtesting.rules.NoShadowingOrOverridesOnMethodsRule$1.evaluate(NoShadowingOrOverridesOnMethodsRule.java:40)
	at com.carrotsearch.randomizedtesting.rules.NoShadowingOrOverridesOnMethodsRule$1.evaluate(NoShadowingOrOverridesOnMethodsRule.java:40)
	at com.carrotsearch.randomizedtesting.rules.StatementAdapter.evaluate(StatementAdapter.java:36)
	at com.carrotsearch.randomizedtesting.rules.StatementAdapter.evaluate(StatementAdapter.java:36)
	at com.carrotsearch.randomizedtesting.rules.StatementAdapter.evaluate(StatementAdapter.java:36)
	at org.apache.lucene.util.TestRuleAssertionsRequired$1.evaluate(TestRuleAssertionsRequired.java:53)
	at org.apache.lucene.util.TestRuleMarkFailure$1.evaluate(TestRuleMarkFailure.java:47)
	at org.apache.lucene.util.TestRuleIgnoreAfterMaxFailures$1.evaluate(TestRuleIgnoreAfterMaxFailures.java:64)
	at org.apache.lucene.util.TestRuleIgnoreTestSuites$1.evaluate(TestRuleIgnoreTestSuites.java:54)
	at com.carrotsearch.randomizedtesting.rules.StatementAdapter.evaluate(StatementAdapter.java:36)
	at com.carrotsearch.randomizedtesting.ThreadLeakControl$StatementRunner.run(ThreadLeakControl.java:367)
	at java.lang.Thread.run(Thread.java:745)


FAILED:  org.apache.solr.search.stats.TestDistribIDF.testMultiCollectionQuery

Error Message:
expected:<2> but was:<1>

Stack Trace:
java.lang.AssertionError: expected:<2> but was:<1>
	at __randomizedtesting.SeedInfo.seed([8BDF4EE617D22F3:19CE33DFBD0B278F]:0)
	at org.junit.Assert.fail(Assert.java:93)
	at org.junit.Assert.failNotEquals(Assert.java:647)
	at org.junit.Assert.assertEquals(Assert.java:128)
	at org.junit.Assert.assertEquals(Assert.java:147)
	at org.apache.solr.search.stats.TestDistribIDF.testMultiCollectionQuery(TestDistribIDF.java:180)
	at sun.reflect.NativeMethodAccessorImpl.invoke0(Native Method)
	at sun.reflect.NativeMethodAccessorImpl.invoke(NativeMethodAccessorImpl.java:62)
	at sun.reflect.DelegatingMethodAccessorImpl.invoke(DelegatingMethodAccessorImpl.java:43)
	at java.lang.reflect.Method.invoke(Method.java:498)
	at com.carrotsearch.randomizedtesting.RandomizedRunner.invoke(RandomizedRunner.java:1764)
	at com.carrotsearch.randomizedtesting.RandomizedRunner$8.evaluate(RandomizedRunner.java:871)
	at com.carrotsearch.randomizedtesting.RandomizedRunner$9.evaluate(RandomizedRunner.java:907)
	at com.carrotsearch.randomizedtesting.RandomizedRunner$10.evaluate(RandomizedRunner.java:921)
	at com.carrotsearch.randomizedtesting.rules.SystemPropertiesRestoreRule$1.evaluate(SystemPropertiesRestoreRule.java:57)
	at org.apache.lucene.util.TestRuleSetupTeardownChained$1.evaluate(TestRuleSetupTeardownChained.java:49)
	at org.apache.lucene.util.AbstractBeforeAfterRule$1.evaluate(AbstractBeforeAfterRule.java:45)
	at org.apache.lucene.util.TestRuleThreadAndTestName$1.evaluate(TestRuleThreadAndTestName.java:48)
	at org.apache.lucene.util.TestRuleIgnoreAfterMaxFailures$1.evaluate(TestRuleIgnoreAfterMaxFailures.java:64)
	at org.apache.lucene.util.TestRuleMarkFailure$1.evaluate(TestRuleMarkFailure.java:47)
	at com.carrotsearch.randomizedtesting.rules.StatementAdapter.evaluate(StatementAdapter.java:36)
	at com.carrotsearch.randomizedtesting.ThreadLeakControl$StatementRunner.run(ThreadLeakControl.java:367)
	at com.carrotsearch.randomizedtesting.ThreadLeakControl.forkTimeoutingTask(ThreadLeakControl.java:809)
	at com.carrotsearch.randomizedtesting.ThreadLeakControl$3.evaluate(ThreadLeakControl.java:460)
	at com.carrotsearch.randomizedtesting.RandomizedRunner.runSingleTest(RandomizedRunner.java:880)
	at com.carrotsearch.randomizedtesting.RandomizedRunner$5.evaluate(RandomizedRunner.java:781)
	at com.carrotsearch.randomizedtesting.RandomizedRunner$6.evaluate(RandomizedRunner.java:816)
	at com.carrotsearch.randomizedtesting.RandomizedRunner$7.evaluate(RandomizedRunner.java:827)
	at com.carrotsearch.randomizedtesting.rules.StatementAdapter.evaluate(StatementAdapter.java:36)
	at com.carrotsearch.randomizedtesting.rules.SystemPropertiesRestoreRule$1.evaluate(SystemPropertiesRestoreRule.java:57)
	at org.apache.lucene.util.AbstractBeforeAfterRule$1.evaluate(AbstractBeforeAfterRule.java:45)
	at com.carrotsearch.randomizedtesting.rules.StatementAdapter.evaluate(StatementAdapter.java:36)
	at org.apache.lucene.util.TestRuleStoreClassName$1.evaluate(TestRuleStoreClassName.java:41)
	at com.carrotsearch.randomizedtesting.rules.NoShadowingOrOverridesOnMethodsRule$1.evaluate(NoShadowingOrOverridesOnMethodsRule.java:40)
	at com.carrotsearch.randomizedtesting.rules.NoShadowingOrOverridesOnMethodsRule$1.evaluate(NoShadowingOrOverridesOnMethodsRule.java:40)
	at com.carrotsearch.randomizedtesting.rules.StatementAdapter.evaluate(StatementAdapter.java:36)
	at com.carrotsearch.randomizedtesting.rules.StatementAdapter.evaluate(StatementAdapter.java:36)
	at com.carrotsearch.randomizedtesting.rules.StatementAdapter.evaluate(StatementAdapter.java:36)
	at org.apache.lucene.util.TestRuleAssertionsRequired$1.evaluate(TestRuleAssertionsRequired.java:53)
	at org.apache.lucene.util.TestRuleMarkFailure$1.evaluate(TestRuleMarkFailure.java:47)
	at org.apache.lucene.util.TestRuleIgnoreAfterMaxFailures$1.evaluate(TestRuleIgnoreAfterMaxFailures.java:64)
	at org.apache.lucene.util.TestRuleIgnoreTestSuites$1.evaluate(TestRuleIgnoreTestSuites.java:54)
	at com.carrotsearch.randomizedtesting.rules.StatementAdapter.evaluate(StatementAdapter.java:36)
	at com.carrotsearch.randomizedtesting.ThreadLeakControl$StatementRunner.run(ThreadLeakControl.java:367)
	at java.lang.Thread.run(Thread.java:745)




Build Log:
[...truncated 11272 lines...]
   [junit4] Suite: org.apache.solr.cloud.BasicDistributedZkTest
   [junit4]   2> Creating dataDir: /x1/jenkins/jenkins-slave/workspace/Lucene-Solr-NightlyTests-master/solr/build/solr-core/test/J0/temp/solr.cloud.BasicDistributedZkTest_8BDF4EE617D22F3-001/init-core-data-001
   [junit4]   2> 145480 INFO  (SUITE-BasicDistributedZkTest-seed#[8BDF4EE617D22F3]-worker) [    ] o.a.s.BaseDistributedSearchTestCase Setting hostContext system property: /
   [junit4]   2> 145489 INFO  (TEST-BasicDistributedZkTest.test-seed#[8BDF4EE617D22F3]) [    ] o.a.s.c.ZkTestServer STARTING ZK TEST SERVER
   [junit4]   2> 145496 INFO  (Thread-1026) [    ] o.a.s.c.ZkTestServer client port:0.0.0.0/0.0.0.0:0
   [junit4]   2> 145496 INFO  (Thread-1026) [    ] o.a.s.c.ZkTestServer Starting server
   [junit4]   2> 145596 INFO  (TEST-BasicDistributedZkTest.test-seed#[8BDF4EE617D22F3]) [    ] o.a.s.c.ZkTestServer start zk server on port:47071
   [junit4]   2> 145596 INFO  (TEST-BasicDistributedZkTest.test-seed#[8BDF4EE617D22F3]) [    ] o.a.s.c.c.SolrZkClient Using default ZkCredentialsProvider
   [junit4]   2> 145612 INFO  (TEST-BasicDistributedZkTest.test-seed#[8BDF4EE617D22F3]) [    ] o.a.s.c.c.ConnectionManager Waiting for client to connect to ZooKeeper
   [junit4]   2> 145642 INFO  (zkCallback-42-thread-1) [    ] o.a.s.c.c.ConnectionManager Watcher org.apache.solr.common.cloud.ConnectionManager@74e96161 name:ZooKeeperConnection Watcher:127.0.0.1:47071 got event WatchedEvent state:SyncConnected type:None path:null path:null type:None
   [junit4]   2> 145642 INFO  (TEST-BasicDistributedZkTest.test-seed#[8BDF4EE617D22F3]) [    ] o.a.s.c.c.ConnectionManager Client is connected to ZooKeeper
   [junit4]   2> 145642 INFO  (TEST-BasicDistributedZkTest.test-seed#[8BDF4EE617D22F3]) [    ] o.a.s.c.c.SolrZkClient Using default ZkACLProvider
   [junit4]   2> 145642 INFO  (TEST-BasicDistributedZkTest.test-seed#[8BDF4EE617D22F3]) [    ] o.a.s.c.c.SolrZkClient makePath: /solr
   [junit4]   2> 145679 INFO  (TEST-BasicDistributedZkTest.test-seed#[8BDF4EE617D22F3]) [    ] o.a.s.c.c.SolrZkClient Using default ZkCredentialsProvider
   [junit4]   2> 145684 INFO  (TEST-BasicDistributedZkTest.test-seed#[8BDF4EE617D22F3]) [    ] o.a.s.c.c.ConnectionManager Waiting for client to connect to ZooKeeper
   [junit4]   2> 145687 INFO  (zkCallback-43-thread-1) [    ] o.a.s.c.c.ConnectionManager Watcher org.apache.solr.common.cloud.ConnectionManager@103c6f34 name:ZooKeeperConnection Watcher:127.0.0.1:47071/solr got event WatchedEvent state:SyncConnected type:None path:null path:null type:None
   [junit4]   2> 145687 INFO  (TEST-BasicDistributedZkTest.test-seed#[8BDF4EE617D22F3]) [    ] o.a.s.c.c.ConnectionManager Client is connected to ZooKeeper
   [junit4]   2> 145687 INFO  (TEST-BasicDistributedZkTest.test-seed#[8BDF4EE617D22F3]) [    ] o.a.s.c.c.SolrZkClient Using default ZkACLProvider
   [junit4]   2> 145688 INFO  (TEST-BasicDistributedZkTest.test-seed#[8BDF4EE617D22F3]) [    ] o.a.s.c.c.SolrZkClient makePath: /collections/collection1
   [junit4]   2> 145691 INFO  (TEST-BasicDistributedZkTest.test-seed#[8BDF4EE617D22F3]) [    ] o.a.s.c.c.SolrZkClient makePath: /collections/collection1/shards
   [junit4]   2> 145696 INFO  (TEST-BasicDistributedZkTest.test-seed#[8BDF4EE617D22F3]) [    ] o.a.s.c.c.SolrZkClient makePath: /collections/control_collection
   [junit4]   2> 145697 INFO  (TEST-BasicDistributedZkTest.test-seed#[8BDF4EE617D22F3]) [    ] o.a.s.c.c.SolrZkClient makePath: /collections/control_collection/shards
   [junit4]   2> 145699 INFO  (TEST-BasicDistributedZkTest.test-seed#[8BDF4EE617D22F3]) [    ] o.a.s.c.AbstractZkTestCase put /x1/jenkins/jenkins-slave/workspace/Lucene-Solr-NightlyTests-master/solr/core/src/test-files/solr/collection1/conf/solrconfig-tlog.xml to /configs/conf1/solrconfig.xml
   [junit4]   2> 145699 INFO  (TEST-BasicDistributedZkTest.test-seed#[8BDF4EE617D22F3]) [    ] o.a.s.c.c.SolrZkClient makePath: /configs/conf1/solrconfig.xml
   [junit4]   2> 145702 INFO  (TEST-BasicDistributedZkTest.test-seed#[8BDF4EE617D22F3]) [    ] o.a.s.c.AbstractZkTestCase put /x1/jenkins/jenkins-slave/workspace/Lucene-Solr-NightlyTests-master/solr/core/src/test-files/solr/collection1/conf/schema.xml to /configs/conf1/schema.xml
   [junit4]   2> 145702 INFO  (TEST-BasicDistributedZkTest.test-seed#[8BDF4EE617D22F3]) [    ] o.a.s.c.c.SolrZkClient makePath: /configs/conf1/schema.xml
   [junit4]   2> 145704 INFO  (TEST-BasicDistributedZkTest.test-seed#[8BDF4EE617D22F3]) [    ] o.a.s.c.AbstractZkTestCase put /x1/jenkins/jenkins-slave/workspace/Lucene-Solr-NightlyTests-master/solr/core/src/test-files/solr/collection1/conf/solrconfig.snippet.randomindexconfig.xml to /configs/conf1/solrconfig.snippet.randomindexconfig.xml
   [junit4]   2> 145704 INFO  (TEST-BasicDistributedZkTest.test-seed#[8BDF4EE617D22F3]) [    ] o.a.s.c.c.SolrZkClient makePath: /configs/conf1/solrconfig.snippet.randomindexconfig.xml
   [junit4]   2> 145706 INFO  (TEST-BasicDistributedZkTest.test-seed#[8BDF4EE617D22F3]) [    ] o.a.s.c.AbstractZkTestCase put /x1/jenkins/jenkins-slave/workspace/Lucene-Solr-NightlyTests-master/solr/core/src/test-files/solr/collection1/conf/stopwords.txt to /configs/conf1/stopwords.txt
   [junit4]   2> 145706 INFO  (TEST-BasicDistributedZkTest.test-seed#[8BDF4EE617D22F3]) [    ] o.a.s.c.c.SolrZkClient makePath: /configs/conf1/stopwords.txt
   [junit4]   2> 145707 INFO  (TEST-BasicDistributedZkTest.test-seed#[8BDF4EE617D22F3]) [    ] o.a.s.c.AbstractZkTestCase put /x1/jenkins/jenkins-slave/workspace/Lucene-Solr-NightlyTests-master/solr/core/src/test-files/solr/collection1/conf/protwords.txt to /configs/conf1/protwords.txt
   [junit4]   2> 145707 INFO  (TEST-BasicDistributedZkTest.test-seed#[8BDF4EE617D22F3]) [    ] o.a.s.c.c.SolrZkClient makePath: /configs/conf1/protwords.txt
   [junit4]   2> 145708 INFO  (TEST-BasicDistributedZkTest.test-seed#[8BDF4EE617D22F3]) [    ] o.a.s.c.AbstractZkTestCase put /x1/jenkins/jenkins-slave/workspace/Lucene-Solr-NightlyTests-master/solr/core/src/test-files/solr/collection1/conf/currency.xml to /configs/conf1/currency.xml
   [junit4]   2> 145709 INFO  (TEST-BasicDistributedZkTest.test-seed#[8BDF4EE617D22F3]) [    ] o.a.s.c.c.SolrZkClient makePath: /configs/conf1/currency.xml
   [junit4]   2> 145710 INFO  (TEST-BasicDistributedZkTest.test-seed#[8BDF4EE617D22F3]) [    ] o.a.s.c.AbstractZkTestCase put /x1/jenkins/jenkins-slave/workspace/Lucene-Solr-NightlyTests-master/solr/core/src/test-files/solr/collection1/conf/enumsConfig.xml to /configs/conf1/enumsConfig.xml
   [junit4]   2> 145710 INFO  (TEST-BasicDistributedZkTest.test-seed#[8BDF4EE617D22F3]) [    ] o.a.s.c.c.SolrZkClient makePath: /configs/conf1/enumsConfig.xml
   [junit4]   2> 145711 INFO  (TEST-BasicDistributedZkTest.test-seed#[8BDF4EE617D22F3]) [    ] o.a.s.c.AbstractZkTestCase put /x1/jenkins/jenkins-slave/workspace/Lucene-Solr-NightlyTests-master/solr/core/src/test-files/solr/collection1/conf/open-exchange-rates.json to /configs/conf1/open-exchange-rates.json
   [junit4]   2> 145711 INFO  (TEST-BasicDistributedZkTest.test-seed#[8BDF4EE617D22F3]) [    ] o.a.s.c.c.SolrZkClient makePath: /configs/conf1/open-exchange-rates.json
   [junit4]   2> 145713 INFO  (TEST-BasicDistributedZkTest.test-seed#[8BDF4EE617D22F3]) [    ] o.a.s.c.AbstractZkTestCase put /x1/jenkins/jenkins-slave/workspace/Lucene-Solr-NightlyTests-master/solr/core/src/test-files/solr/collection1/conf/mapping-ISOLatin1Accent.txt to /configs/conf1/mapping-ISOLatin1Accent.txt
   [junit4]   2> 145713 INFO  (TEST-BasicDistributedZkTest.test-seed#[8BDF4EE617D22F3]) [    ] o.a.s.c.c.SolrZkClient makePath: /configs/conf1/mapping-ISOLatin1Accent.txt
   [junit4]   2> 145714 INFO  (TEST-BasicDistributedZkTest.test-seed#[8BDF4EE617D22F3]) [    ] o.a.s.c.AbstractZkTestCase put /x1/jenkins/jenkins-slave/workspace/Lucene-Solr-NightlyTests-master/solr/core/src/test-files/solr/collection1/conf/old_synonyms.txt to /configs/conf1/old_synonyms.txt
   [junit4]   2> 145714 INFO  (TEST-BasicDistributedZkTest.test-seed#[8BDF4EE617D22F3]) [    ] o.a.s.c.c.SolrZkClient makePath: /configs/conf1/old_synonyms.txt
   [junit4]   2> 145716 INFO  (TEST-BasicDistributedZkTest.test-seed#[8BDF4EE617D22F3]) [    ] o.a.s.c.AbstractZkTestCase put /x1/jenkins/jenkins-slave/workspace/Lucene-Solr-NightlyTests-master/solr/core/src/test-files/solr/collection1/conf/synonyms.txt to /configs/conf1/synonyms.txt
   [junit4]   2> 145716 INFO  (TEST-BasicDistributedZkTest.test-seed#[8BDF4EE617D22F3]) [    ] o.a.s.c.c.SolrZkClient makePath: /configs/conf1/synonyms.txt
   [junit4]   2> 145717 WARN  (NIOServerCxn.Factory:0.0.0.0/0.0.0.0:0) [    ] o.a.z.s.NIOServerCnxn caught end of stream exception
   [junit4]   2> EndOfStreamException: Unable to read additional data from client sessionid 0x153c93c1e9a0001, likely client has closed socket
   [junit4]   2> 	at org.apache.zookeeper.server.NIOServerCnxn.doIO(NIOServerCnxn.java:228)
   [junit4]   2> 	at org.apache.zookeeper.server.NIOServerCnxnFactory.run(NIOServerCnxnFactory.java:208)
   [junit4]   2> 	at java.lang.Thread.run(Thread.java:745)
   [junit4]   2> 145974 INFO  (TEST-BasicDistributedZkTest.test-seed#[8BDF4EE617D22F3]) [    ] o.a.s.SolrTestCaseJ4 Writing core.properties file to /x1/jenkins/jenkins-slave/workspace/Lucene-Solr-NightlyTests-master/solr/build/solr-core/test/J0/temp/solr.cloud.BasicDistributedZkTest_8BDF4EE617D22F3-001/control-001/cores/collection1
   [junit4]   2> 145978 INFO  (TEST-BasicDistributedZkTest.test-seed#[8BDF4EE617D22F3]) [    ] o.e.j.s.Server jetty-9.3.8.v20160314
   [junit4]   2> 146068 INFO  (TEST-BasicDistributedZkTest.test-seed#[8BDF4EE617D22F3]) [    ] o.e.j.s.h.ContextHandler Started o.e.j.s.ServletContextHandler@4cbbf8ca{/,null,AVAILABLE}
   [junit4]   2> 146082 INFO  (TEST-BasicDistributedZkTest.test-seed#[8BDF4EE617D22F3]) [    ] o.e.j.s.ServerConnector Started ServerConnector@2558ca19{HTTP/1.1,[http/1.1]}{127.0.0.1:35825}
   [junit4]   2> 146082 INFO  (TEST-BasicDistributedZkTest.test-seed#[8BDF4EE617D22F3]) [    ] o.e.j.s.Server Started @152094ms
   [junit4]   2> 146082 INFO  (TEST-BasicDistributedZkTest.test-seed#[8BDF4EE617D22F3]) [    ] o.a.s.c.s.e.JettySolrRunner Jetty properties: {solr.data.dir=/x1/jenkins/jenkins-slave/workspace/Lucene-Solr-NightlyTests-master/solr/build/solr-core/test/J0/temp/solr.cloud.BasicDistributedZkTest_8BDF4EE617D22F3-001/tempDir-001/control/data, hostContext=/, hostPort=35825, coreRootDirectory=/x1/jenkins/jenkins-slave/workspace/Lucene-Solr-NightlyTests-master/solr/build/solr-core/test/J0/../../../../../../../../../../x1/jenkins/jenkins-slave/workspace/Lucene-Solr-NightlyTests-master/solr/build/solr-core/test/J0/temp/solr.cloud.BasicDistributedZkTest_8BDF4EE617D22F3-001/control-001/cores}
   [junit4]   2> 146082 INFO  (TEST-BasicDistributedZkTest.test-seed#[8BDF4EE617D22F3]) [    ] o.a.s.s.SolrDispatchFilter SolrDispatchFilter.init(): sun.misc.Launcher$AppClassLoader@73d16e93
   [junit4]   2> 146083 INFO  (TEST-BasicDistributedZkTest.test-seed#[8BDF4EE617D22F3]) [    ] o.a.s.c.SolrResourceLoader new SolrResourceLoader for directory: '/x1/jenkins/jenkins-slave/workspace/Lucene-Solr-NightlyTests-master/solr/build/solr-core/test/J0/temp/solr.cloud.BasicDistributedZkTest_8BDF4EE617D22F3-001/control-001'
   [junit4]   2> 146083 INFO  (TEST-BasicDistributedZkTest.test-seed#[8BDF4EE617D22F3]) [    ] o.a.s.c.SolrResourceLoader JNDI not configured for solr (NoInitialContextEx)
   [junit4]   2> 146083 INFO  (TEST-BasicDistributedZkTest.test-seed#[8BDF4EE617D22F3]) [    ] o.a.s.c.SolrResourceLoader solr home defaulted to 'solr/' (could not find system property or JNDI)
   [junit4]   2> 146083 INFO  (TEST-BasicDistributedZkTest.test-seed#[8BDF4EE617D22F3]) [    ] o.a.s.c.c.SolrZkClient Using default ZkCredentialsProvider
   [junit4]   2> 146096 INFO  (TEST-BasicDistributedZkTest.test-seed#[8BDF4EE617D22F3]) [    ] o.a.s.c.c.ConnectionManager Waiting for client to connect to ZooKeeper
   [junit4]   2> 146129 INFO  (zkCallback-44-thread-1) [    ] o.a.s.c.c.ConnectionManager Watcher org.apache.solr.common.cloud.ConnectionManager@79dd7c21 name:ZooKeeperConnection Watcher:127.0.0.1:47071/solr got event WatchedEvent state:SyncConnected type:None path:null path:null type:None
   [junit4]   2> 146132 INFO  (TEST-BasicDistributedZkTest.test-seed#[8BDF4EE617D22F3]) [    ] o.a.s.c.c.ConnectionManager Client is connected to ZooKeeper
   [junit4]   2> 146132 INFO  (TEST-BasicDistributedZkTest.test-seed#[8BDF4EE617D22F3]) [    ] o.a.s.c.c.SolrZkClient Using default ZkACLProvider
   [junit4]   2> 146140 INFO  (TEST-BasicDistributedZkTest.test-seed#[8BDF4EE617D22F3]) [    ] o.a.s.s.SolrDispatchFilter Loading solr.xml from SolrHome (not found in ZooKeeper)
   [junit4]   2> 146140 INFO  (TEST-BasicDistributedZkTest.test-seed#[8BDF4EE617D22F3]) [    ] o.a.s.c.SolrXmlConfig Loading container configuration from /x1/jenkins/jenkins-slave/workspace/Lucene-Solr-NightlyTests-master/solr/build/solr-core/test/J0/temp/solr.cloud.BasicDistributedZkTest_8BDF4EE617D22F3-001/control-001/solr.xml
   [junit4]   2> 146168 INFO  (TEST-BasicDistributedZkTest.test-seed#[8BDF4EE617D22F3]) [    ] o.a.s.c.CorePropertiesLocator Config-defined core root directory: /x1/jenkins/jenkins-slave/workspace/Lucene-Solr-NightlyTests-master/solr/build/solr-core/test/J0/../../../../../../../../../../x1/jenkins/jenkins-slave/workspace/Lucene-Solr-NightlyTests-master/solr/build/solr-core/test/J0/temp/solr.cloud.BasicDistributedZkTest_8BDF4EE617D22F3-001/control-001/cores
   [junit4]   2> 146194 INFO  (TEST-BasicDistributedZkTest.test-seed#[8BDF4EE617D22F3]) [    ] o.a.s.c.CoreContainer New CoreContainer 862376754
   [junit4]   2> 146194 INFO  (TEST-BasicDistributedZkTest.test-seed#[8BDF4EE617D22F3]) [    ] o.a.s.c.CoreContainer Loading cores into CoreContainer [instanceDir=/x1/jenkins/jenkins-slave/workspace/Lucene-Solr-NightlyTests-master/solr/build/solr-core/test/J0/temp/solr.cloud.BasicDistributedZkTest_8BDF4EE617D22F3-001/control-001]
   [junit4]   2> 146199 WARN  (TEST-BasicDistributedZkTest.test-seed#[8BDF4EE617D22F3]) [    ] o.a.s.c.CoreContainer Couldn't add files from /x1/jenkins/jenkins-slave/workspace/Lucene-Solr-NightlyTests-master/solr/build/solr-core/test/J0/temp/solr.cloud.BasicDistributedZkTest_8BDF4EE617D22F3-001/control-001/lib to classpath: /x1/jenkins/jenkins-slave/workspace/Lucene-Solr-NightlyTests-master/solr/build/solr-core/test/J0/temp/solr.cloud.BasicDistributedZkTest_8BDF4EE617D22F3-001/control-001/lib
   [junit4]   2> 146199 INFO  (TEST-BasicDistributedZkTest.test-seed#[8BDF4EE617D22F3]) [    ] o.a.s.h.c.HttpShardHandlerFactory created with socketTimeout : 90000,urlScheme : ,connTimeout : 15000,maxConnectionsPerHost : 20,maxConnections : 10000,corePoolSize : 0,maximumPoolSize : 2147483647,maxThreadIdleTime : 5,sizeOfQueue : -1,fairnessPolicy : false,useRetries : false,
   [junit4]   2> 146208 INFO  (TEST-BasicDistributedZkTest.test-seed#[8BDF4EE617D22F3]) [    ] o.a.s.u.UpdateShardHandler Creating UpdateShardHandler HTTP client with params: socketTimeout=340000&connTimeout=45000&retry=true
   [junit4]   2> 146209 INFO  (TEST-BasicDistributedZkTest.test-seed#[8BDF4EE617D22F3]) [    ] o.a.s.l.LogWatcher SLF4J impl is org.slf4j.impl.Log4jLoggerFactory
   [junit4]   2> 146209 INFO  (TEST-BasicDistributedZkTest.test-seed#[8BDF4EE617D22F3]) [    ] o.a.s.l.LogWatcher Registering Log Listener [Log4j (org.slf4j.impl.Log4jLoggerFactory)]
   [junit4]   2> 146209 INFO  (TEST-BasicDistributedZkTest.test-seed#[8BDF4EE617D22F3]) [    ] o.a.s.c.ZkContainer Zookeeper client=127.0.0.1:47071/solr
   [junit4]   2> 146209 INFO  (TEST-BasicDistributedZkTest.test-seed#[8BDF4EE617D22F3]) [    ] o.a.s.c.ZkController zkHost includes chroot
   [junit4]   2> 146209 INFO  (TEST-BasicDistributedZkTest.test-seed#[8BDF4EE617D22F3]) [    ] o.a.s.c.c.SolrZkClient Using default ZkCredentialsProvider
   [junit4]   2> 146209 INFO  (TEST-BasicDistributedZkTest.test-seed#[8BDF4EE617D22F3]) [    ] o.a.s.c.c.ConnectionManager Waiting for client to connect to ZooKeeper
   [junit4]   2> 146212 INFO  (zkCallback-47-thread-1) [    ] o.a.s.c.c.ConnectionManager Watcher org.apache.solr.common.cloud.ConnectionManager@6fa3b6ff name:ZooKeeperConnection Watcher:127.0.0.1:47071 got event WatchedEvent state:SyncConnected type:None path:null path:null type:None
   [junit4]   2> 146212 INFO  (TEST-BasicDistributedZkTest.test-seed#[8BDF4EE617D22F3]) [    ] o.a.s.c.c.ConnectionManager Client is connected to ZooKeeper
   [junit4]   2> 146212 INFO  (TEST-BasicDistributedZkTest.test-seed#[8BDF4EE617D22F3]) [    ] o.a.s.c.c.SolrZkClient Using default ZkACLProvider
   [junit4]   2> 146217 INFO  (TEST-BasicDistributedZkTest.test-seed#[8BDF4EE617D22F3]) [n:127.0.0.1:35825_    ] o.a.s.c.c.ConnectionManager Waiting for client to connect to ZooKeeper
   [junit4]   2> 146222 INFO  (zkCallback-48-thread-1-processing-n:127.0.0.1:35825_) [n:127.0.0.1:35825_    ] o.a.s.c.c.ConnectionManager Watcher org.apache.solr.common.cloud.ConnectionManager@10123fae name:ZooKeeperConnection Watcher:127.0.0.1:47071/solr got event WatchedEvent state:SyncConnected type:None path:null path:null type:None
   [junit4]   2> 146222 INFO  (TEST-BasicDistributedZkTest.test-seed#[8BDF4EE617D22F3]) [n:127.0.0.1:35825_    ] o.a.s.c.c.ConnectionManager Client is connected to ZooKeeper
   [junit4]   2> 146230 INFO  (TEST-BasicDistributedZkTest.test-seed#[8BDF4EE617D22F3]) [n:127.0.0.1:35825_    ] o.a.s.c.c.SolrZkClient makePath: /overseer/queue
   [junit4]   2> 146236 INFO  (TEST-BasicDistributedZkTest.test-seed#[8BDF4EE617D22F3]) [n:127.0.0.1:35825_    ] o.a.s.c.c.SolrZkClient makePath: /overseer/collection-queue-work
   [junit4]   2> 146242 INFO  (TEST-BasicDistributedZkTest.test-seed#[8BDF4EE617D22F3]) [n:127.0.0.1:35825_    ] o.a.s.c.c.SolrZkClient makePath: /overseer/collection-map-running
   [junit4]   2> 146245 INFO  (TEST-BasicDistributedZkTest.test-seed#[8BDF4EE617D22F3]) [n:127.0.0.1:35825_    ] o.a.s.c.c.SolrZkClient makePath: /overseer/collection-map-completed
   [junit4]   2> 146246 INFO  (TEST-BasicDistributedZkTest.test-seed#[8BDF4EE617D22F3]) [n:127.0.0.1:35825_    ] o.a.s.c.c.SolrZkClient makePath: /overseer/collection-map-failure
   [junit4]   2> 146250 INFO  (TEST-BasicDistributedZkTest.test-seed#[8BDF4EE617D22F3]) [n:127.0.0.1:35825_    ] o.a.s.c.c.SolrZkClient makePath: /live_nodes
   [junit4]   2> 146254 INFO  (TEST-BasicDistributedZkTest.test-seed#[8BDF4EE617D22F3]) [n:127.0.0.1:35825_    ] o.a.s.c.c.SolrZkClient makePath: /aliases.json
   [junit4]   2> 146257 INFO  (TEST-BasicDistributedZkTest.test-seed#[8BDF4EE617D22F3]) [n:127.0.0.1:35825_    ] o.a.s.c.c.SolrZkClient makePath: /clusterstate.json
   [junit4]   2> 146257 INFO  (TEST-BasicDistributedZkTest.test-seed#[8BDF4EE617D22F3]) [n:127.0.0.1:35825_    ] o.a.s.c.c.SolrZkClient makePath: /security.json
   [junit4]   2> 146258 INFO  (TEST-BasicDistributedZkTest.test-seed#[8BDF4EE617D22F3]) [n:127.0.0.1:35825_    ] o.a.s.c.c.ZkStateReader Updating cluster state from ZooKeeper... 
   [junit4]   2> 146259 INFO  (TEST-BasicDistributedZkTest.test-seed#[8BDF4EE617D22F3]) [n:127.0.0.1:35825_    ] o.a.s.c.c.ZkStateReader Updated live nodes from ZooKeeper... (0) -> (0)
   [junit4]   2> 146265 INFO  (TEST-BasicDistributedZkTest.test-seed#[8BDF4EE617D22F3]) [n:127.0.0.1:35825_    ] o.a.s.c.c.SolrZkClient makePath: /overseer_elect
   [junit4]   2> 146268 INFO  (TEST-BasicDistributedZkTest.test-seed#[8BDF4EE617D22F3]) [n:127.0.0.1:35825_    ] o.a.s.c.c.SolrZkClient makePath: /overseer_elect/election
   [junit4]   2> 146269 INFO  (TEST-BasicDistributedZkTest.test-seed#[8BDF4EE617D22F3]) [n:127.0.0.1:35825_    ] o.a.s.c.Overseer Overseer (id=null) closing
   [junit4]   2> 146270 INFO  (TEST-BasicDistributedZkTest.test-seed#[8BDF4EE617D22F3]) [n:127.0.0.1:35825_    ] o.a.s.c.LeaderElector Joined leadership election with path: /overseer_elect/election/95641277153542148-127.0.0.1:35825_-n_0000000000
   [junit4]   2> 146271 INFO  (TEST-BasicDistributedZkTest.test-seed#[8BDF4EE617D22F3]) [n:127.0.0.1:35825_    ] o.a.s.c.OverseerElectionContext I am going to be the leader 127.0.0.1:35825_
   [junit4]   2> 146271 INFO  (TEST-BasicDistributedZkTest.test-seed#[8BDF4EE617D22F3]) [n:127.0.0.1:35825_    ] o.a.s.c.c.SolrZkClient makePath: /overseer_elect/leader
   [junit4]   2> 146274 INFO  (TEST-BasicDistributedZkTest.test-seed#[8BDF4EE617D22F3]) [n:127.0.0.1:35825_    ] o.a.s.c.Overseer Overseer (id=95641277153542148-127.0.0.1:35825_-n_0000000000) starting
   [junit4]   2> 146281 INFO  (TEST-BasicDistributedZkTest.test-seed#[8BDF4EE617D22F3]) [n:127.0.0.1:35825_    ] o.a.s.c.c.SolrZkClient makePath: /overseer/queue-work
   [junit4]   2> 146302 INFO  (TEST-BasicDistributedZkTest.test-seed#[8BDF4EE617D22F3]) [n:127.0.0.1:35825_    ] o.a.s.c.OverseerAutoReplicaFailoverThread Starting OverseerAutoReplicaFailoverThread autoReplicaFailoverWorkLoopDelay=10000 autoReplicaFailoverWaitAfterExpiration=30000 autoReplicaFailoverBadNodeExpiration=60000
   [junit4]   2> 146321 INFO  (OverseerCollectionConfigSetProcessor-95641277153542148-127.0.0.1:35825_-n_0000000000) [n:127.0.0.1:35825_    ] o.a.s.c.OverseerTaskProcessor Process current queue of overseer operations
   [junit4]   2> 146309 INFO  (OverseerStateUpdate-95641277153542148-127.0.0.1:35825_-n_0000000000) [n:127.0.0.1:35825_    ] o.a.s.c.Overseer Starting to work on the main queue
   [junit4]   2> 146328 INFO  (TEST-BasicDistributedZkTest.test-seed#[8BDF4EE617D22F3]) [n:127.0.0.1:35825_    ] o.a.s.c.ZkController Register node as live in ZooKeeper:/live_nodes/127.0.0.1:35825_
   [junit4]   2> 146336 INFO  (TEST-BasicDistributedZkTest.test-seed#[8BDF4EE617D22F3]) [n:127.0.0.1:35825_    ] o.a.s.c.c.SolrZkClient makePath: /live_nodes/127.0.0.1:35825_
   [junit4]   2> 146341 INFO  (OverseerStateUpdate-95641277153542148-127.0.0.1:35825_-n_0000000000) [n:127.0.0.1:35825_    ] o.a.s.c.c.ZkStateReader Updated live nodes from ZooKeeper... (0) -> (0)
   [junit4]   2> 146348 INFO  (zkCallback-48-thread-1-processing-n:127.0.0.1:35825_) [n:127.0.0.1:35825_    ] o.a.s.c.c.ZkStateReader A live node change: [WatchedEvent state:SyncConnected type:NodeChildrenChanged path:/live_nodes], has occurred - updating... (live nodes size: [0])
   [junit4]   2> 146364 INFO  (zkCallback-48-thread-1-processing-n:127.0.0.1:35825_) [n:127.0.0.1:35825_    ] o.a.s.c.c.ZkStateReader Updated live nodes from ZooKeeper... (0) -> (1)
   [junit4]   2> 146443 INFO  (TEST-BasicDistributedZkTest.test-seed#[8BDF4EE617D22F3]) [n:127.0.0.1:35825_    ] o.a.s.c.CoreContainer Security conf doesn't exist. Skipping setup for authorization module.
   [junit4]   2> 146443 INFO  (TEST-BasicDistributedZkTest.test-seed#[8BDF4EE617D22F3]) [n:127.0.0.1:35825_    ] o.a.s.c.CoreContainer No authentication plugin used.
   [junit4]   2> 146444 INFO  (TEST-BasicDistributedZkTest.test-seed#[8BDF4EE617D22F3]) [n:127.0.0.1:35825_    ] o.a.s.c.CorePropertiesLocator Looking for core definitions underneath /x1/jenkins/jenkins-slave/workspace/Lucene-Solr-NightlyTests-master/solr/build/solr-core/test/J0/../../../../../../../../../../x1/jenkins/jenkins-slave/workspace/Lucene-Solr-NightlyTests-master/solr/build/solr-core/test/J0/temp/solr.cloud.BasicDistributedZkTest_8BDF4EE617D22F3-001/control-001/cores
   [junit4]   2> 146446 INFO  (TEST-BasicDistributedZkTest.test-seed#[8BDF4EE617D22F3]) [n:127.0.0.1:35825_    ] o.a.s.c.CoreDescriptor Created CoreDescriptor: {name=collection1, config=solrconfig.xml, transient=false, schema=schema.xml, loadOnStartup=true, configSetProperties=configsetprops.json, collection=control_collection, coreNodeName=, dataDir=data/, shard=}
   [junit4]   2> 146446 INFO  (TEST-BasicDistributedZkTest.test-seed#[8BDF4EE617D22F3]) [n:127.0.0.1:35825_    ] o.a.s.c.CorePropertiesLocator Found core collection1 in /x1/jenkins/jenkins-slave/workspace/Lucene-Solr-NightlyTests-master/solr/build/solr-core/test/J0/../../../../../../../../../../x1/jenkins/jenkins-slave/workspace/Lucene-Solr-NightlyTests-master/solr/build/solr-core/test/J0/temp/solr.cloud.BasicDistributedZkTest_8BDF4EE617D22F3-001/control-001/cores/collection1
   [junit4]   2> 146446 INFO  (TEST-BasicDistributedZkTest.test-seed#[8BDF4EE617D22F3]) [n:127.0.0.1:35825_    ] o.a.s.c.CorePropertiesLocator Found 1 core definitions
   [junit4]   2> 146456 INFO  (TEST-BasicDistributedZkTest.test-seed#[8BDF4EE617D22F3]) [n:127.0.0.1:35825_    ] o.a.s.s.SolrDispatchFilter user.dir=/x1/jenkins/jenkins-slave/workspace/Lucene-Solr-NightlyTests-master/solr/build/solr-core/test/J0
   [junit4]   2> 146456 INFO  (TEST-BasicDistributedZkTest.test-seed#[8BDF4EE617D22F3]) [n:127.0.0.1:35825_    ] o.a.s.s.SolrDispatchFilter SolrDispatchFilter.init() done
   [junit4]   2> 146456 INFO  (coreLoadExecutor-168-thread-1-processing-n:127.0.0.1:35825_) [n:127.0.0.1:35825_ c:control_collection   x:collection1] o.a.s.c.ZkController publishing state=down
   [junit4]   2> 146456 INFO  (coreLoadExecutor-168-thread-1-processing-n:127.0.0.1:35825_) [n:127.0.0.1:35825_ c:control_collection   x:collection1] o.a.s.c.ZkController numShards not found on descriptor - reading it from system property
   [junit4]   2> 146466 INFO  (OverseerStateUpdate-95641277153542148-127.0.0.1:35825_-n_0000000000) [n:127.0.0.1:35825_    ] o.a.s.c.Overseer processMessage: queueSize: 1, message = {
   [junit4]   2>   "core":"collection1",
   [junit4]   2>   "roles":null,
   [junit4]   2>   "base_url":"http://127.0.0.1:35825",
   [junit4]   2>   "node_name":"127.0.0.1:35825_",
   [junit4]   2>   "numShards":"1",
   [junit4]   2>   "state":"down",
   [junit4]   2>   "shard":null,
   [junit4]   2>   "collection":"control_collection",
   [junit4]   2>   "operation":"state"} current state version: 0
   [junit4]   2> 146472 INFO  (OverseerStateUpdate-95641277153542148-127.0.0.1:35825_-n_0000000000) [n:127.0.0.1:35825_    ] o.a.s.c.o.ReplicaMutator Update state numShards=1 message={
   [junit4]   2>   "core":"collection1",
   [junit4]   2>   "roles":null,
   [junit4]   2>   "base_url":"http://127.0.0.1:35825",
   [junit4]   2>   "node_name":"127.0.0.1:35825_",
   [junit4]   2>   "numShards":"1",
   [junit4]   2>   "state":"down",
   [junit4]   2>   "shard":null,
   [junit4]   2>   "collection":"control_collection",
   [junit4]   2>   "operation":"state"}
   [junit4]   2> 146473 INFO  (OverseerStateUpdate-95641277153542148-127.0.0.1:35825_-n_0000000000) [n:127.0.0.1:35825_    ] o.a.s.c.o.ClusterStateMutator building a new cName: control_collection
   [junit4]   2> 146478 INFO  (OverseerStateUpdate-95641277153542148-127.0.0.1:35825_-n_0000000000) [n:127.0.0.1:35825_    ] o.a.s.c.o.ReplicaMutator Assigning new node to shard shard=shard1
   [junit4]   2> 146490 INFO  (coreLoadExecutor-168-thread-1-processing-n:127.0.0.1:35825_) [n:127.0.0.1:35825_ c:control_collection   x:collection1] o.a.s.c.ZkController look for our core node name
   [junit4]   2> 146491 INFO  (zkCallback-48-thread-1-processing-n:127.0.0.1:35825_) [n:127.0.0.1:35825_    ] o.a.s.c.c.ZkStateReader A cluster state change: [WatchedEvent state:SyncConnected type:NodeDataChanged path:/clusterstate.json], has occurred - updating... (live nodes size: [1])
   [junit4]   2> 147490 INFO  (coreLoadExecutor-168-thread-1-processing-n:127.0.0.1:35825_) [n:127.0.0.1:35825_ c:control_collection   x:collection1] o.a.s.c.ZkController waiting to find shard id in clusterstate for collection1
   [junit4]   2> 147490 INFO  (coreLoadExecutor-168-thread-1-processing-n:127.0.0.1:35825_) [n:127.0.0.1:35825_ c:control_collection   x:collection1] o.a.s.c.ZkController Check for collection zkNode:control_collection
   [junit4]   2> 147491 INFO  (coreLoadExecutor-168-thread-1-processing-n:127.0.0.1:35825_) [n:127.0.0.1:35825_ c:control_collection   x:collection1] o.a.s.c.ZkController Collection zkNode exists
   [junit4]   2> 147491 INFO  (coreLoadExecutor-168-thread-1-processing-n:127.0.0.1:35825_) [n:127.0.0.1:35825_ c:control_collection   x:collection1] o.a.s.c.c.ZkStateReader Load collection config from: [/collections/control_collection]
   [junit4]   2> 147492 INFO  (coreLoadExecutor-168-thread-1-processing-n:127.0.0.1:35825_) [n:127.0.0.1:35825_ c:control_collection   x:collection1] o.a.s.c.c.ZkStateReader path=[/collections/control_collection] [configName]=[conf1] specified config exists in ZooKeeper
   [junit4]   2> 147493 INFO  (coreLoadExecutor-168-thread-1-processing-n:127.0.0.1:35825_) [n:127.0.0.1:35825_ c:control_collection   x:collection1] o.a.s.c.SolrResourceLoader new SolrResourceLoader for directory: '/x1/jenkins/jenkins-slave/workspace/Lucene-Solr-NightlyTests-master/solr/build/solr-core/test/J0/temp/solr.cloud.BasicDistributedZkTest_8BDF4EE617D22F3-001/control-001/cores/collection1'
   [junit4]   2> 147493 INFO  (coreLoadExecutor-168-thread-1-processing-n:127.0.0.1:35825_) [n:127.0.0.1:35825_ c:control_collection   x:collection1] o.a.s.c.SolrResourceLoader JNDI not configured for solr (NoInitialContextEx)
   [junit4]   2> 147493 INFO  (coreLoadExecutor-168-thread-1-processing-n:127.0.0.1:35825_) [n:127.0.0.1:35825_ c:control_collection   x:collection1] o.a.s.c.SolrResourceLoader solr home defaulted to 'solr/' (could not find system property or JNDI)
   [junit4]   2> 147504 INFO  (coreLoadExecutor-168-thread-1-processing-n:127.0.0.1:35825_) [n:127.0.0.1:35825_ c:control_collection   x:collection1] o.a.s.c.Config loaded config solrconfig.xml with version 0 
   [junit4]   2> 147529 INFO  (coreLoadExecutor-168-thread-1-processing-n:127.0.0.1:35825_) [n:127.0.0.1:35825_ c:control_collection   x:collection1] o.a.s.c.SolrConfig current version of requestparams : -1
   [junit4]   2> 147531 WARN  (coreLoadExecutor-168-thread-1-processing-n:127.0.0.1:35825_) [n:127.0.0.1:35825_ c:control_collection   x:collection1] o.a.s.c.Config Beginning with Solr 5.5, <mergePolicy> is deprecated, use <mergePolicyFactory> instead.
   [junit4]   2> 147532 INFO  (coreLoadExecutor-168-thread-1-processing-n:127.0.0.1:35825_) [n:127.0.0.1:35825_ c:control_collection   x:collection1] o.a.s.c.SolrConfig Using Lucene MatchVersion: 7.0.0
   [junit4]   2> 147557 INFO  (coreLoadExecutor-168-thread-1-processing-n:127.0.0.1:35825_) [n:127.0.0.1:35825_ c:control_collection   x:collection1] o.a.s.c.SolrConfig Loaded SolrConfig: solrconfig.xml
   [junit4]   2> 147609 INFO  (coreLoadExecutor-168-thread-1-processing-n:127.0.0.1:35825_) [n:127.0.0.1:35825_ c:control_collection   x:collection1] o.a.s.s.IndexSchema [collection1] Schema name=test
   [junit4]   2> 147963 INFO  (coreLoadExecutor-168-thread-1-processing-n:127.0.0.1:35825_) [n:127.0.0.1:35825_ c:control_collection   x:collection1] o.a.s.s.OpenExchangeRatesOrgProvider Initialized with rates=open-exchange-rates.json, refreshInterval=1440.
   [junit4]   2> 147968 INFO  (coreLoadExecutor-168-thread-1-processing-n:127.0.0.1:35825_) [n:127.0.0.1:35825_ c:control_collection   x:collection1] o.a.s.s.IndexSchema default search field in schema is text
   [junit4]   2> 147969 INFO  (coreLoadExecutor-168-thread-1-processing-n:127.0.0.1:35825_) [n:127.0.0.1:35825_ c:control_collection   x:collection1] o.a.s.s.IndexSchema unique key field: id
   [junit4]   2> 147987 INFO  (coreLoadExecutor-168-thread-1-processing-n:127.0.0.1:35825_) [n:127.0.0.1:35825_ c:control_collection   x:collection1] o.a.s.s.FileExchangeRateProvider Reloading exchange rates from file currency.xml
   [junit4]   2> 147989 INFO  (coreLoadExecutor-168-thread-1-processing-n:127.0.0.1:35825_) [n:127.0.0.1:35825_ c:control_collection   x:collection1] o.a.s.s.FileExchangeRateProvider Reloading exchange rates from file currency.xml
   [junit4]   2> 147993 INFO  (coreLoadExecutor-168-thread-1-processing-n:127.0.0.1:35825_) [n:127.0.0.1:35825_ c:control_collection   x:collection1] o.a.s.s.OpenExchangeRatesOrgProvider Reloading exchange rates from open-exchange-rates.json
   [junit4]   2> 147994 INFO  (coreLoadExecutor-168-thread-1-processing-n:127.0.0.1:35825_) [n:127.0.0.1:35825_ c:control_collection   x:collection1] o.a.s.s.OpenExchangeRatesOrgProvider Reloading exchange rates from open-exchange-rates.json
   [junit4]   2> 147997 INFO  (coreLoadExecutor-168-thread-1-processing-n:127.0.0.1:35825_) [n:127.0.0.1:35825_ c:control_collection   x:collection1] o.a.s.c.ConfigSetProperties Did not find ConfigSet properties, assuming default properties: Can't find resource 'configsetprops.json' in classpath or '/configs/conf1', cwd=/x1/jenkins/jenkins-slave/workspace/Lucene-Solr-NightlyTests-master/solr/build/solr-core/test/J0
   [junit4]   2> 147997 INFO  (coreLoadExecutor-168-thread-1-processing-n:127.0.0.1:35825_) [n:127.0.0.1:35825_ c:control_collection   x:collection1] o.a.s.c.CoreContainer Creating SolrCore 'collection1' using configuration from collection control_collection
   [junit4]   2> 147997 INFO  (coreLoadExecutor-168-thread-1-processing-n:127.0.0.1:35825_) [n:127.0.0.1:35825_ c:control_collection s:shard1 r:core_node1 x:collection1] o.a.s.c.SolrCore org.apache.solr.core.MockDirectoryFactory
   [junit4]   2> 147997 INFO  (coreLoadExecutor-168-thread-1-processing-n:127.0.0.1:35825_) [n:127.0.0.1:35825_ c:control_collection s:shard1 r:core_node1 x:collection1] o.a.s.c.SolrCore [[collection1] ] Opening new SolrCore at [/x1/jenkins/jenkins-slave/workspace/Lucene-Solr-NightlyTests-master/solr/build/solr-core/test/J0/temp/solr.cloud.BasicDistributedZkTest_8BDF4EE617D22F3-001/control-001/cores/collection1], dataDir=[/x1/jenkins/jenkins-slave/workspace/Lucene-Solr-NightlyTests-master/solr/build/solr-core/test/J0/../../../../../../../../../../x1/jenkins/jenkins-slave/workspace/Lucene-Solr-NightlyTests-master/solr/build/solr-core/test/J0/temp/solr.cloud.BasicDistributedZkTest_8BDF4EE617D22F3-001/control-001/cores/collection1/data/]
   [junit4]   2> 147997 INFO  (coreLoadExecutor-168-thread-1-processing-n:127.0.0.1:35825_) [n:127.0.0.1:35825_ c:control_collection s:shard1 r:core_node1 x:collection1] o.a.s.c.JmxMonitoredMap JMX monitoring is enabled. Adding Solr mbeans to JMX Server: com.sun.jmx.mbeanserver.JmxMBeanServer@478d5720
   [junit4]   2> 147998 INFO  (coreLoadExecutor-168-thread-1-processing-n:127.0.0.1:35825_) [n:127.0.0.1:35825_ c:control_collection s:shard1 r:core_node1 x:collection1] o.a.s.c.CachingDirectoryFactory return new directory for /x1/jenkins/jenkins-slave/workspace/Lucene-Solr-NightlyTests-master/solr/build/solr-core/test/J0/../../../../../../../../../../x1/jenkins/jenkins-slave/workspace/Lucene-Solr-NightlyTests-master/solr/build/solr-core/test/J0/temp/solr.cloud.BasicDistributedZkTest_8BDF4EE617D22F3-001/control-001/cores/collection1/data
   [junit4]   2> 147998 INFO  (coreLoadExecutor-168-thread-1-processing-n:127.0.0.1:35825_) [n:127.0.0.1:35825_ c:control_collection s:shard1 r:core_node1 x:collection1] o.a.s.c.SolrCore New index directory detected: old=null new=/x1/jenkins/jenkins-slave/workspace/Lucene-Solr-NightlyTests-master/solr/build/solr-core/test/J0/../../../../../../../../../../x1/jenkins/jenkins-slave/workspace/Lucene-Solr-NightlyTests-master/solr/build/solr-core/test/J0/temp/solr.cloud.BasicDistributedZkTest_8BDF4EE617D22F3-001/control-001/cores/collection1/data/index/
   [junit4]   2> 147998 WARN  (coreLoadExecutor-168-thread-1-processing-n:127.0.0.1:35825_) [n:127.0.0.1:35825_ c:control_collection s:shard1 r:core_node1 x:collection1] o.a.s.c.SolrCore [collection1] Solr index directory '/x1/jenkins/jenkins-slave/workspace/Lucene-Solr-NightlyTests-master/solr/build/solr-core/test/J0/../../../../../../../../../../x1/jenkins/jenkins-slave/workspace/Lucene-Solr-NightlyTests-master/solr/build/solr-core/test/J0/temp/solr.cloud.BasicDistributedZkTest_8BDF4EE617D22F3-001/control-001/cores/collection1/data/index' doesn't exist. Creating new index...
   [junit4]   2> 147998 INFO  (coreLoadExecutor-168-thread-1-processing-n:127.0.0.1:35825_) [n:127.0.0.1:35825_ c:control_collection s:shard1 r:core_node1 x:collection1] o.a.s.c.CachingDirectoryFactory return new directory for /x1/jenkins/jenkins-slave/workspace/Lucene-Solr-NightlyTests-master/solr/build/solr-core/test/J0/../../../../../../../../../../x1/jenkins/jenkins-slave/workspace/Lucene-Solr-NightlyTests-master/solr/build/solr-core/test/J0/temp/solr.cloud.BasicDistributedZkTest_8BDF4EE617D22F3-001/control-001/cores/collection1/data/index
   [junit4]   2> 147998 INFO  (coreLoadExecutor-168-thread-1-processing-n:127.0.0.1:35825_) [n:127.0.0.1:35825_ c:control_collection s:shard1 r:core_node1 x:collection1] o.a.s.u.RandomMergePolicy RandomMergePolicy wrapping class org.apache.lucene.index.LogDocMergePolicy: [LogDocMergePolicy: minMergeSize=1000, mergeFactor=31, maxMergeSize=9223372036854775807, maxMergeSizeForForcedMerge=9223372036854775807, calibrateSizeByDeletes=true, maxMergeDocs=2147483647, maxCFSSegmentSizeMB=8.796093022207999E12, noCFSRatio=0.5813831016235135]
   [junit4]   2> 147999 INFO  (coreLoadExecutor-168-thread-1-processing-n:127.0.0.1:35825_) [n:127.0.0.1:35825_ c:control_collection s:shard1 r:core_node1 x:collection1] o.a.s.c.SolrDeletionPolicy SolrDeletionPolicy.onCommit: commits: num=1
   [junit4]   2> 	commit{dir=MockDirectoryWrapper(RAMDirectory@3a5ae3af lockFactory=org.apache.lucene.store.SingleInstanceLockFactory@3b8043fd),segFN=segments_1,generation=1}
   [junit4]   2> 147999 INFO  (coreLoadExecutor-168-thread-1-processing-n:127.0.0.1:35825_) [n:127.0.0.1:35825_ c:control_collection s:shard1 r:core_node1 x:collection1] o.a.s.c.SolrDeletionPolicy newest commit generation = 1
   [junit4]   2> 147999 INFO  (OldIndexDirectoryCleanupThreadForCore-collection1) [n:127.0.0.1:35825_ c:control_collection s:shard1 r:core_node1 x:collection1] o.a.s.c.SolrCore Looking for old index directories to cleanup for core collection1 in /x1/jenkins/jenkins-slave/workspace/Lucene-Solr-NightlyTests-master/solr/build/solr-core/test/J0/../../../../../../../../../../x1/jenkins/jenkins-slave/workspace/Lucene-Solr-NightlyTests-master/solr/build/solr-core/test/J0/temp/solr.cloud.BasicDistributedZkTest_8BDF4EE617D22F3-001/control-001/cores/collection1/data/
   [junit4]   2> 147999 WARN  (OldIndexDirectoryCleanupThreadForCore-collection1) [n:127.0.0.1:35825_ c:control_collection s:shard1 r:core_node1 x:collection1] o.a.s.c.DirectoryFactory /x1/jenkins/jenkins-slave/workspace/Lucene-Solr-NightlyTests-master/solr/build/solr-core/test/J0/../../../../../../../../../../x1/jenkins/jenkins-slave/workspace/Lucene-Solr-NightlyTests-master/solr/build/solr-core/test/J0/temp/solr.cloud.BasicDistributedZkTest_8BDF4EE617D22F3-001/control-001/cores/collection1/data/ does not point to a valid data directory; skipping clean-up of old index directories.
   [junit4]   2> 148003 INFO  (coreLoadExecutor-168-thread-1-processing-n:127.0.0.1:35825_) [n:127.0.0.1:35825_ c:control_collection s:shard1 r:core_node1 x:collection1] o.a.s.u.p.UpdateRequestProcessorChain creating updateRequestProcessorChain "nodistrib"
   [junit4]   2> 148003 INFO  (coreLoadExecutor-168-thread-1-processing-n:127.0.0.1:35825_) [n:127.0.0.1:35825_ c:control_collection s:shard1 r:core_node1 x:collection1] o.a.s.u.p.UpdateRequestProcessorChain creating updateRequestProcessorChain "dedupe"
   [junit4]   2> 148003 INFO  (coreLoadExecutor-168-thread-1-processing-n:127.0.0.1:35825_) [n:127.0.0.1:35825_ c:control_collection s:shard1 r:core_node1 x:collection1] o.a.s.u.p.UpdateRequestProcessorChain inserting DistributedUpdateProcessorFactory into updateRequestProcessorChain "dedupe"
   [junit4]   2> 148003 INFO  (coreLoadExecutor-168-thread-1-processing-n:127.0.0.1:35825_) [n:127.0.0.1:35825_ c:control_collection s:shard1 r:core_node1 x:collection1] o.a.s.u.p.UpdateRequestProcessorChain creating updateRequestProcessorChain "stored_sig"
   [junit4]   2> 148003 INFO  (coreLoadExecutor-168-thread-1-processing-n:127.0.0.1:35825_) [n:127.0.0.1:35825_ c:control_collection s:shard1 r:core_node1 x:collection1] o.a.s.u.p.UpdateRequestProcessorChain inserting DistributedUpdateProcessorFactory into updateRequestProcessorChain "stored_sig"
   [junit4]   2> 148003 INFO  (coreLoadExecutor-168-thread-1-processing-n:127.0.0.1:35825_) [n:127.0.0.1:35825_ c:control_collection s:shard1 r:core_node1 x:collection1] o.a.s.u.p.UpdateRequestProcessorChain creating updateRequestProcessorChain "distrib-dup-test-chain-explicit"
   [junit4]   2> 148003 INFO  (coreLoadExecutor-168-thread-1-processing-n:127.0.0.1:35825_) [n:127.0.0.1:35825_ c:control_collection s:shard1 r:core_node1 x:collection1] o.a.s.u.p.UpdateRequestProcessorChain creating updateRequestProcessorChain "distrib-dup-test-chain-implicit"
   [junit4]   2> 148003 INFO  (coreLoadExecutor-168-thread-1-processing-n:127.0.0.1:35825_) [n:127.0.0.1:35825_ c:control_collection s:shard1 r:core_node1 x:collection1] o.a.s.u.p.UpdateRequestProcessorChain inserting DistributedUpdateProcessorFactory into updateRequestProcessorChain "distrib-dup-test-chain-implicit"
   [junit4]   2> 148003 INFO  (coreLoadExecutor-168-thread-1-processing-n:127.0.0.1:35825_) [n:127.0.0.1:35825_ c:control_collection s:shard1 r:core_node1 x:collection1] o.a.s.c.SolrCore no updateRequestProcessorChain defined as default, creating implicit default
   [junit4]   2> 148004 WARN  (coreLoadExecutor-168-thread-1-processing-n:127.0.0.1:35825_) [n:127.0.0.1:35825_ c:control_collection s:shard1 r:core_node1 x:collection1] o.a.s.c.RequestHandlers INVALID paramSet a in requestHandler {type = requestHandler,name = /dump,class = DumpRequestHandler,args = {defaults={a=A,b=B}}}
   [junit4]   2> 148005 INFO  (coreLoadExecutor-168-thread-1-processing-n:127.0.0.1:35825_) [n:127.0.0.1:35825_ c:control_collection s:shard1 r:core_node1 x:collection1] o.a.s.h.l.XMLLoader xsltCacheLifetimeSeconds=60
   [junit4]   2> 148006 INFO  (coreLoadExecutor-168-thread-1-processing-n:127.0.0.1:35825_) [n:127.0.0.1:35825_ c:control_collection s:shard1 r:core_node1 x:collection1] o.a.s.h.l.XMLLoader xsltCacheLifetimeSeconds=60
   [junit4]   2> 148007 INFO  (coreLoadExecutor-168-thread-1-processing-n:127.0.0.1:35825_) [n:127.0.0.1:35825_ c:control_collection s:shard1 r:core_node1 x:collection1] o.a.s.h.l.XMLLoader xsltCacheLifetimeSeconds=60
   [junit4]   2> 148008 INFO  (coreLoadExecutor-168-thread-1-processing-n:127.0.0.1:35825_) [n:127.0.0.1:35825_ c:control_collection s:shard1 r:core_node1 x:collection1] o.a.s.h.l.XMLLoader xsltCacheLifetimeSeconds=60
   [junit4]   2> 148011 INFO  (coreLoadExecutor-168-thread-1-processing-n:127.0.0.1:35825_) [n:127.0.0.1:35825_ c:control_collection s:shard1 r:core_node1 x:collection1] o.a.s.c.RequestHandlers Registered paths: /admin/mbeans,standard,/dump,/update/csv,/sql,/update/json/docs,/admin/luke,/export,/admin/segments,/get,/admin/system,/replication,/admin/properties,/config,/stream,/schema,/admin/plugins,/admin/logging,/update/json,/admin/ping,/admin/threads,/update,/admin/file
   [junit4]   2> 148011 INFO  (coreLoadExecutor-168-thread-1-processing-n:127.0.0.1:35825_) [n:127.0.0.1:35825_ c:control_collection s:shard1 r:core_node1 x:collection1] o.a.s.c.SolrCore Using default statsCache cache: org.apache.solr.search.stats.LocalStatsCache
   [junit4]   2> 148011 INFO  (coreLoadExecutor-168-thread-1-processing-n:127.0.0.1:35825_) [n:127.0.0.1:35825_ c:control_collection s:shard1 r:core_node1 x:collection1] o.a.s.u.UpdateHandler Using UpdateLog implementation: org.apache.solr.update.UpdateLog
   [junit4]   2> 148011 INFO  (coreLoadExecutor-168-thread-1-processing-n:127.0.0.1:35825_) [n:127.0.0.1:35825_ c:control_collection s:shard1 r:core_node1 x:collection1] o.a.s.u.UpdateLog Initializing UpdateLog: dataDir= defaultSyncLevel=FLUSH numRecordsToKeep=100 maxNumLogsToKeep=10 numVersionBuckets=65536
   [junit4]   2> 148012 INFO  (coreLoadExecutor-168-thread-1-processing-n:127.0.0.1:35825_) [n:127.0.0.1:35825_ c:control_collection s:shard1 r:core_node1 x:collection1] o.a.s.u.CommitTracker Hard AutoCommit: disabled
   [junit4]   2> 148012 INFO  (coreLoadExecutor-168-thread-1-processing-n:127.0.0.1:35825_) [n:127.0.0.1:35825_ c:control_collection s:shard1 r:core_node1 x:collection1] o.a.s.u.CommitTracker Soft AutoCommit: disabled
   [junit4]   2> 148012 INFO  (coreLoadExecutor-168-thread-1-processing-n:127.0.0.1:35825_) [n:127.0.0.1:35825_ c:control_collection s:shard1 r:core_node1 x:collection1] o.a.s.u.RandomMergePolicy RandomMergePolicy wrapping class org.apache.lucene.index.TieredMergePolicy: [TieredMergePolicy: maxMergeAtOnce=36, maxMergeAtOnceExplicit=43, maxMergedSegmentMB=71.388671875, floorSegmentMB=1.0888671875, forceMergeDeletesPctAllowed=16.8682525717756, segmentsPerTier=34.0, maxCFSSegmentSizeMB=0.8076171875, noCFSRatio=0.8536185501249621
   [junit4]   2> 148012 INFO  (coreLoadExecutor-168-thread-1-processing-n:127.0.0.1:35825_) [n:127.0.0.1:35825_ c:control_collection s:shard1 r:core_node1 x:collection1] o.a.s.c.SolrDeletionPolicy SolrDeletionPolicy.onInit: commits: num=1
   [junit4]   2> 	commit{dir=MockDirectoryWrapper(RAMDirectory@3a5ae3af lockFactory=org.apache.lucene.store.SingleInstanceLockFactory@3b8043fd),segFN=segments_1,generation=1}
   [junit4]   2> 148013 INFO  (coreLoadExecutor-168-thread-1-processing-n:127.0.0.1:35825_) [n:127.0.0.1:35825_ c:control_collection s:shard1 r:core_node1 x:collection1] o.a.s.c.SolrDeletionPolicy newest commit generation = 1
   [junit4]   2> 148013 INFO  (coreLoadExecutor-168-thread-1-processing-n:127.0.0.1:35825_) [n:127.0.0.1:35825_ c:control_collection s:shard1 r:core_node1 x:collection1] o.a.s.s.SolrIndexSearcher Opening [Searcher@7b092684[collection1] main]
   [junit4]   2> 148013 INFO  (coreLoadExecutor-168-thread-1-processing-n:127.0.0.1:35825_) [n:127.0.0.1:35825_ c:control_collection s:shard1 r:core_node1 x:collection1] o.a.s.c.c.ZkStateReader Load collection config from: [/collections/control_collection]
   [junit4]   2> 148016 INFO  (coreLoadExecutor-168-thread-1-processing-n:127.0.0.1:35825_) [n:127.0.0.1:35825_ c:control_collection s:shard1 r:core_node1 x:collection1] o.a.s.c.c.ZkStateReader path=[/collections/control_collection] [configName]=[conf1] specified config exists in ZooKeeper
   [junit4]   2> 148016 INFO  (coreLoadExecutor-168-thread-1-processing-n:127.0.0.1:35825_) [n:127.0.0.1:35825_ c:control_collection s:shard1 r:core_node1 x:collection1] o.a.s.r.ManagedResourceStorage Setting up ZooKeeper-based storage for the RestManager with znodeBase: /configs/conf1
   [junit4]   2> 148018 INFO  (coreLoadExecutor-168-thread-1-processing-n:127.0.0.1:35825_) [n:127.0.0.1:35825_ c:control_collection s:shard1 r:core_node1 x:collection1] o.a.s.r.ManagedResourceStorage Configured ZooKeeperStorageIO with znodeBase: /configs/conf1
   [junit4]   2> 148018 INFO  (coreLoadExecutor-168-thread-1-processing-n:127.0.0.1:35825_) [n:127.0.0.1:35825_ c:control_collection s:shard1 r:core_node1 x:collection1] o.a.s.r.RestManager Initializing RestManager with initArgs: {}
   [junit4]   2> 148018 INFO  (coreLoadExecutor-168-thread-1-processing-n:127.0.0.1:35825_) [n:127.0.0.1:35825_ c:control_collection s:shard1 r:core_node1 x:collection1] o.a.s.r.ManagedResourceStorage Reading _rest_managed.json using ZooKeeperStorageIO:path=/configs/conf1
   [junit4]   2> 148019 INFO  (coreLoadExecutor-168-thread-1-processing-n:127.0.0.1:35825_) [n:127.0.0.1:35825_ c:control_collection s:shard1 r:core_node1 x:collection1] o.a.s.r.ManagedResourceStorage No data found for znode /configs/conf1/_rest_managed.json
   [junit4]   2> 148019 INFO  (coreLoadExecutor-168-thread-1-processing-n:127.0.0.1:35825_) [n:127.0.0.1:35825_ c:control_collection s:shard1 r:core_node1 x:collection1] o.a.s.r.ManagedResourceStorage Loaded null at path _rest_managed.json using ZooKeeperStorageIO:path=/configs/conf1
   [junit4]   2> 148019 INFO  (coreLoadExecutor-168-thread-1-processing-n:127.0.0.1:35825_) [n:127.0.0.1:35825_ c:control_collection s:shard1 r:core_node1 x:collection1] o.a.s.r.RestManager Initializing 0 registered ManagedResources
   [junit4]   2> 148019 INFO  (coreLoadExecutor-168-thread-1-processing-n:127.0.0.1:35825_) [n:127.0.0.1:35825_ c:control_collection s:shard1 r:core_node1 x:collection1] o.a.s.h.ReplicationHandler Commits will be reserved for  10000
   [junit4]   2> 148020 INFO  (searcherExecutor-169-thread-1-processing-n:127.0.0.1:35825_ x:collection1 s:shard1 c:control_collection r:core_node1) [n:127.0.0.1:35825_ c:control_collection s:shard1 r:core_node1 x:collection1] o.a.s.c.SolrCore [collection1] Registered new searcher Searcher@7b092684[collection1] main{ExitableDirectoryReader(UninvertingDirectoryReader())}
   [junit4]   2> 148020 INFO  (coreLoadExecutor-168-thread-1-processing-n:127.0.0.1:35825_) [n:127.0.0.1:35825_ c:control_collection s:shard1 r:core_node1 x:collection1] o.a.s.u.UpdateLog Looking up max value of version field to seed version buckets
   [junit4]   2> 148020 INFO  (coreLoadExecutor-168-thread-1-processing-n:127.0.0.1:35825_) [n:127.0.0.1:35825_ c:control_collection s:shard1 r:core_node1 x:collection1] o.a.s.u.VersionInfo Refreshing highest value of _version_ for 65536 version buckets from index
   [junit4]   2> 148020 INFO  (coreLoadExecutor-168-thread-1-processing-n:127.0.0.1:35825_) [n:127.0.0.1:35825_ c:control_collection s:shard1 r:core_node1 x:collection1] o.a.s.u.VersionInfo No terms found for _version_, cannot seed version bucket highest value from index
   [junit4]   2> 148020 INFO  (coreLoadExecutor-168-thread-1-processing-n:127.0.0.1:35825_) [n:127.0.0.1:35825_ c:control_collection s:shard1 r:core_node1 x:collection1] o.a.s.u.UpdateLog Could not find max version in index or recent updates, using new clock 1530260437102231552
   [junit4]   2> 148022 INFO  (coreLoadExecutor-168-thread-1-processing-n:127.0.0.1:35825_) [n:127.0.0.1:35825_ c:control_collection s:shard1 r:core_node1 x:collection1] o.a.s.u.UpdateLog Took 1.0ms to seed version buckets with highest version 1530260437102231552
   [junit4]   2> 148023 INFO  (coreLoadExecutor-168-thread-1-processing-n:127.0.0.1:35825_) [n:127.0.0.1:35825_ c:control_collection s:shard1 r:core_node1 x:collection1] o.a.s.c.ZkController watch zkdir /configs/conf1
   [junit4]   2> 148024 INFO  (coreLoadExecutor-168-thread-1-processing-n:127.0.0.1:35825_) [n:127.0.0.1:35825_ c:control_collection s:shard1 r:core_node1 x:collection1] o.a.s.c.CoreContainer registering core: collection1
   [junit4]   2> 148029 INFO  (coreZkRegister-162-thread-1-processing-n:127.0.0.1:35825_ x:collection1 s:shard1 c:control_collection r:core_node1) [n:127.0.0.1:35825_ c:control_collection s:shard1 r:core_node1 x:collection1] o.a.s.c.ZkController Register replica - core:collection1 address:http://127.0.0.1:35825 collection:control_collection shard:shard1
   [junit4]   2> 148035 INFO  (coreZkRegister-162-thread-1-processing-n:127.0.0.1:35825_ x:collection1 s:shard1 c:control_collection r:core_node1) [n:127.0.0.1:35825_ c:control_collection s:shard1 r:core_node1 x:collection1] o.a.s.c.c.SolrZkClient makePath: /collections/control_collection/leader_elect/shard1/election
   [junit4]   2> 148039 INFO  (coreZkRegister-162-thread-1-processing-n:127.0.0.1:35825_ x:collection1 s:shard1 c:control_collection r:core_node1) [n:127.0.0.1:35825_ c:control_collection s:shard1 r:core_node1 x:collection1] o.a.s.c.LeaderElector Joined leadership election with path: /collections/control_collection/leader_elect/shard1/election/95641277153542148-core_node1-n_0000000000
   [junit4]   2> 148039 INFO  (coreZkRegister-162-thread-1-processing-n:127.0.0.1:35825_ x:collection1 s:shard1 c:control_collection r:core_node1) [n:127.0.0.1:35825_ c:control_collection s:shard1 r:core_node1 x:collection1] o.a.s.c.ShardLeaderElectionContext Running the leader process for shard=shard1 and weAreReplacement=false and leaderVoteWait=10000
   [junit4]   2> 148041 INFO  (coreZkRegister-162-thread-1-processing-n:127.0.0.1:35825_ x:collection1 s:shard1 c:control_collection r:core_node1) [n:127.0.0.1:35825_ c:control_collection s:shard1 r:core_node1 x:collection1] o.a.s.c.ShardLeaderElectionContext Enough replicas found to continue.
   [junit4]   2> 148041 INFO  (coreZkRegister-162-thread-1-processing-n:127.0.0.1:35825_ x:collection1 s:shard1 c:control_collection r:core_node1) [n:127.0.0.1:35825_ c:control_collection s:shard1 r:core_node1 x:collection1] o.a.s.c.ShardLeaderElectionContext I may be the new leader - try and sync
   [junit4]   2> 148041 INFO  (coreZkRegister-162-thread-1-processing-n:127.0.0.1:35825_ x:collection1 s:shard1 c:control_collection r:core_node1) [n:127.0.0.1:35825_ c:control_collection s:shard1 r:core_node1 x:collection1] o.a.s.c.SyncStrategy Sync replicas to http://127.0.0.1:35825/collection1/
   [junit4]   2> 148041 INFO  (coreZkRegister-162-thread-1-processing-n:127.0.0.1:35825_ x:collection1 s:shard1 c:control_collection r:core_node1) [n:127.0.0.1:35825_ c:control_collection s:shard1 r:core_node1 x:collection1] o.a.s.c.SyncStrategy Sync Success - now sync replicas to me
   [junit4]   2> 148041 INFO  (coreZkRegister-162-thread-1-processing-n:127.0.0.1:35825_ x:collection1 s:shard1 c:control_collection r:core_node1) [n:127.0.0.1:35825_ c:control_collection s:shard1 r:core_node1 x:collection1] o.a.s.c.SyncStrategy http://127.0.0.1:35825/collection1/ has no replicas
   [junit4]   2> 148042 INFO  (coreZkRegister-162-thread-1-processing-n:127.0.0.1:35825_ x:collection1 s:shard1 c:control_collection r:core_node1) [n:127.0.0.1:35825_ c:control_collection s:shard1 r:core_node1 x:collection1] o.a.s.c.c.SolrZkClient makePath: /collections/control_collection/leaders/shard1
   [junit4]   2> 148044 INFO  (OverseerStateUpdate-95641277153542148-127.0.0.1:35825_-n_0000000000) [n:127.0.0.1:35825_    ] o.a.s.c.Overseer processMessage: queueSize: 1, message = {
   [junit4]   2>   "operation":"leader",
   [junit4]   2>   "shard":"shard1",
   [junit4]   2>   "collection":"control_collection"} current state version: 1
   [junit4]   2> 148046 INFO  (coreZkRegister-162-thread-1-processing-n:127.0.0.1:35825_ x:collection1 s:shard1 c:control_collection r:core_node1) [n:127.0.0.1:35825_ c:control_collection s:shard1 r:core_node1 x:collection1] o.a.s.c.ShardLeaderElectionContextBase Creating leader registration node /collections/control_collection/leaders/shard1/leader after winning as /collections/control_collection/leader_elect/shard1/election/95641277153542148-core_node1-n_0000000000
   [junit4]   2> 148048 INFO  (zkCallback-48-thread-1-processing-n:127.0.0.1:35825_) [n:127.0.0.1:35825_    ] o.a.s.c.c.ZkStateReader A cluster state change: [WatchedEvent state:SyncConnected type:NodeDataChanged path:/clusterstate.json], has occurred - updating... (live nodes size: [1])
   [junit4]   2> 148057 INFO  (coreZkRegister-162-thread-1-processing-n:127.0.0.1:35825_ x:collection1 s:shard1 c:control_collection r:core_node1) [n:127.0.0.1:35825_ c:control_collection s:shard1 r:core_node1 x:collection1] o.a.s.c.ShardLeaderElectionContext I am the new leader: http://127.0.0.1:35825/collection1/ shard1
   [junit4]   2> 148058 INFO  (OverseerStateUpdate-95641277153542148-127.0.0.1:35825_-n_0000000000) [n:127.0.0.1:35825_    ] o.a.s.c.Overseer processMessage: queueSize: 1, message = {
   [junit4]   2>   "operation":"leader",
   [junit4]   2>   "shard":"shard1",
   [junit4]   2>   "collection":"control_collection",
   [junit4]   2>   "base_url":"http://127.0.0.1:35825",
   [junit4]   2>   "core":"collection1",
   [junit4]   2>   "state":"active"} current state version: 2
   [junit4]   2> 148168 INFO  (zkCallback-48-thread-1-processing-n:127.0.0.1:35825_) [n:127.0.0.1:35825_    ] o.a.s.c.c.ZkStateReader A cluster state change: [WatchedEvent state:SyncConnected type:NodeDataChanged path:/clusterstate.json], has occurred - updating... (live nodes size: [1])
   [junit4]   2> 148212 INFO  (coreZkRegister-162-thread-1-processing-n:127.0.0.1:35825_ x:collection1 s:shard1 c:control_collection r:core_node1) [n:127.0.0.1:35825_ c:control_collection s:shard1 r:core_node1 x:collection1] o.a.s.c.ZkController We are http://127.0.0.1:35825/collection1/ and leader is http://127.0.0.1:35825/collection1/
   [junit4]   2> 148212 INFO  (coreZkRegister-162-thread-1-processing-n:127.0.0.1:35825_ x:collection1 s:shard1 c:control_collection r:core_node1) [n:127.0.0.1:35825_ c:control_collection s:shard1 r:core_node1 x:collection1] o.a.s.c.ZkController No LogReplay needed for core=collection1 baseURL=http://127.0.0.1:35825
   [junit4]   2> 148212 INFO  (coreZkRegister-162-thread-1-processing-n:127.0.0.1:35825_ x:collection1 s:shard1 c:control_collection r:core_node1) [n:127.0.0.1:35825_ c:control_collection s:shard1 r:core_node1 x:collection1] o.a.s.c.ZkController I am the leader, no recovery necessary
   [junit4]   2> 148212 INFO  (coreZkRegister-162-thread-1-processing-n:127.0.0.1:35825_ x:collection1 s:shard1 c:control_collection r:core_node1) [n:127.0.0.1:35825_ c:control_collection s:shard1 r:core_node1 x:collection1] o.a.s.c.ZkController publishing state=active
   [junit4]   2> 148212 INFO  (coreZkRegister-162-thread-1-processing-n:127.0.0.1:35825_ x:collection1 s:shard1 c:control_collection r:core_node1) [n:127.0.0.1:35825_ c:control_collection s:shard1 r:core_node1 x:collection1] o.a.s.c.ZkController numShards not found on descriptor - reading it from system property
   [junit4]   2> 148214 INFO  (OverseerStateUpdate-95641277153542148-127.0.0.1:35825_-n_0000000000) [n:127.0.0.1:35825_    ] o.a.s.c.Overseer processMessage: queueSize: 1, message = {
   [junit4]   2>   "core":"collection1",
   [junit4]   2>   "core_node_name":"core_node1",
   [junit4]   2>   "roles":null,
   [junit4]   2>   "base_url":"http://127.0.0.1:35825",
   [junit4]   2>   "node_name":"127.0.0.1:35825_",
   [junit4]   2>   "numShards":"1",
   [junit4]   2>   "state":"active",
   [junit4]   2>   "shard":"shard1",
   [junit4]   2>   "collection":"control_collection",
   [junit4]   2>   "operation":"state"} current state version: 3
   [junit4]   2> 148214 INFO  (OverseerStateUpdate-95641277153542148-127.0.0.1:35825_-n_0000000000) [n:127.0.0.1:35825_    ] o.a.s.c.o.ReplicaMutator Update state numShards=1 message={
   [junit4]   2>   "core":"collection1",
   [junit4]   2>   "core_node_name":"core_node1",
   [junit4]   2>   "roles":null,
   [junit4]   2>   "base_url":"http://127.0.0.1:35825",
   [junit4]   2>   "node_name":"127.0.0.1:35825_",
   [junit4]   2>   "numShards":"1",
   [junit4]   2>   "state":"active",
   [junit4]   2>   "shard":"shard1",
   [junit4]   2>   "collection":"control_collection",
   [junit4]   2>   "operation":"state"}
   [junit4]   2> 148317 INFO  (zkCallback-48-thread-1-processing-n:127.0.0.1:35825_) [n:127.0.0.1:35825_    ] o.a.s.c.c.ZkStateReader A cluster state change: [WatchedEvent state:SyncConnected type:NodeDataChanged path:/clusterstate.json], has occurred - updating... (live nodes size: [1])
   [junit4]   2> 148469 INFO  (TEST-BasicDistributedZkTest.test-seed#[8BDF4EE617D22F3]) [    ] o.a.s.c.c.SolrZkClient Using default ZkCredentialsProvider
   [junit4]   2> 148476 INFO  (TEST-BasicDistributedZkTest.test-seed#[8BDF4EE617D22F3]) [    ] o.a.s.c.c.ConnectionManager Waiting for client to connect to ZooKeeper
   [junit4]   2> 148488 INFO  (zkCallback-50-thread-1) [    ] o.a.s.c.c.ConnectionManager Watcher org.apache.solr.common.cloud.ConnectionManager@2841c48 name:ZooKeeperConnection Watcher:127.0.0.1:47071/solr got event WatchedEvent state:SyncConnected type:None path:null path:null type:None
   [junit4]   2> 148492 INFO  (TEST-BasicDistributedZkTest.test-seed#[8BDF4EE617D22F3]) [    ] o.a.s.c.c.ConnectionManager Client is connected to ZooKeeper
   [junit4]   2> 148492 INFO  (TEST-BasicDistributedZkTest.test-seed#[8BDF4EE617D22F3]) [    ] o.a.s.c.c.SolrZkClient Using default ZkACLProvider
   [junit4]   2> 148492 INFO  (TEST-BasicDistributedZkTest.test-seed#[8BDF4EE617D22F3]) [    ] o.a.s.c.c.ZkStateReader Updating cluster state from ZooKeeper... 
   [junit4]   2> 148524 INFO  (TEST-BasicDistributedZkTest.test-seed#[8BDF4EE617D22F3]) [    ] o.a.s.c.c.ZkStateReader Updated live nodes from ZooKeeper... (0) -> (1)
   [junit4]   2> 148530 INFO  (TEST-BasicDistributedZkTest.test-seed#[8BDF4EE617D22F3]) [    ] o.a.s.c.ChaosMonkey monkey: init - expire sessions:false cause connection loss:false
   [junit4]   2> 148592 INFO  (TEST-BasicDistributedZkTest.test-seed#[8BDF4EE617D22F3]) [    ] o.a.s.SolrTestCaseJ4 Writing core.properties file to /x1/jenkins/jenkins-slave/workspace/Lucene-Solr-NightlyTests-master/solr/build/solr-core/test/J0/temp/solr.cloud.BasicDistributedZkTest_8BDF4EE617D22F3-001/shard-1-001/cores/collection1
   [junit4]   2> 148592 INFO  (TEST-BasicDistributedZkTest.test-seed#[8BDF4EE617D22F3]) [    ] o.a.s.c.AbstractFullDistribZkTestBase create jetty 1 in directory /x1/jenkins/jenkins-slave/workspace/Lucene-Solr-NightlyTests-master/solr/build/solr-core/test/J0/temp/solr.cloud.BasicDistributedZkTest_8BDF4EE617D22F3-001/shard-1-001
   [junit4]   2> 148593 INFO  (TEST-BasicDistributedZkTest.test-seed#[8BDF4EE617D22F3]) [    ] o.e.j.s.Server jetty-9.3.8.v20160314
   [junit4]   2> 148595 INFO  (TEST-BasicDistributedZkTest.test-seed#[8BDF4EE617D22F3]) [    ] o.e.j.s.h.ContextHandler Started o.e.j.s.ServletContextHandler@30cbac1b{/,null,AVAILABLE}
   [junit4]   2> 148596 INFO  (TEST-BasicDistributedZkTest.test-seed#[8BDF4EE617D22F3]) [    ] o.e.j.s.ServerConnector Started ServerConnector@303be43e{HTTP/1.1,[http/1.1]}{127.0.0.1:45982}
   [junit4]   2> 148596 INFO  (TEST-BasicDistributedZkTest.test-seed#[8BDF4EE617D22F3]) [    ] o.e.j.s.Server Started @154608ms
   [junit4]   2> 148596 INFO  (TEST-BasicDistributedZkTest.test-seed#[8BDF4EE617D22F3]) [    ] o.a.s.c.s.e.JettySolrRunner Jetty properties: {solr.data.dir=/x1/jenkins/jenkins-slave/workspace/Lucene-Solr-NightlyTests-master/solr/build/solr-core/test/J0/temp/solr.cloud.BasicDistributedZkTest_8BDF4EE617D22F3-001/tempDir-001/jetty1, solrconfig=solrconfig.xml, hostContext=/, hostPort=45982, coreRootDirectory=/x1/jenkins/jenkins-slave/workspace/Lucene-Solr-NightlyTests-master/solr/build/solr-core/test/J0/temp/solr.cloud.BasicDistributedZkTest_8BDF4EE617D22F3-001/shard-1-001/cores}
   [junit4]   2> 148597 INFO  (TEST-BasicDistributedZkTest.test-seed#[8BDF4EE617D22F3]) [    ] o.a.s.s.SolrDispatchFilter SolrDispatchFilter.init(): sun.misc.Launcher$AppClassLoader@73d16e93
   [junit4]   2> 148597 INFO  (TEST-BasicDistributedZkTest.test-seed#[8BDF4EE617D22F3]) [    ] o.a.s.c.SolrResourceLoader new SolrResourceLoader for directory: '/x1/jenkins/jenkins-slave/workspace/Lucene-Solr-NightlyTests-master/solr/build/solr-core/test/J0/temp/solr.cloud.BasicDistributedZkTest_8BDF4EE617D22F3-001/shard-1-001'
   [junit4]   2> 148597 INFO  (TEST-BasicDistributedZkTest.test-seed#[8BDF4EE617D22F3]) [    ] o.a.s.c.SolrResourceLoader JNDI not configured for solr (NoInitialContextEx)
   [junit4]   2> 148597 INFO  (TEST-BasicDistributedZkTest.test-seed#[8BDF4EE617D22F3]) [    ] o.a.s.c.SolrResourceLoader solr home defaulted to 'solr/' (could not find system property or JNDI)
   [junit4]   2> 148598 INFO  (TEST-BasicDistributedZkTest.test-seed#[8BDF4EE617D22F3]) [    ] o.a.s.c.c.SolrZkClient Using default ZkCredentialsProvider
   [junit4]   2> 148598 INFO  (TEST-BasicDistributedZkTest.test-seed#[8BDF4EE617D22F3]) [    ] o.a.s.c.c.ConnectionManager Waiting for client to connect to ZooKeeper
   [junit4]   2> 148624 INFO  (zkCallback-51-thread-1) [    ] o.a.s.c.c.ConnectionManager Watcher org.apache.solr.common.cloud.ConnectionManager@6a79ccd9 name:ZooKeeperConnection Watcher:127.0.0.1:47071/solr got event WatchedEvent state:SyncConnected type:None path:null path:null type:None
   [junit4]   2> 148624 INFO  (TEST-BasicDistributedZkTest.test-seed#[8BDF4EE617D22F3]) [    ] o.a.s.c.c.ConnectionManager Client is connected to ZooKeeper
   [junit4]   2> 148624 INFO  (TEST-BasicDistributedZkTest.test-seed#[8BDF4EE617D22F3]) [    ] o.a.s.c.c.SolrZkClient Using default ZkACLProvider
   [junit4]   2> 148640 INFO  (TEST-BasicDistributedZkTest.test-seed#[8BDF4EE617D22F3]) [    ] o.a.s.s.SolrDispatchFilter Loading solr.xml from SolrHome (not found in ZooKeeper)
   [junit4]   2> 148640 INFO  (TEST-BasicDistributedZkTest.test-seed#[8BDF4EE617D22F3]) [    ] o.a.s.c.SolrXmlConfig Loading container configuration from /x1/jenkins/jenkins-slave/workspace/Lucene-Solr-NightlyTests-master/solr/build/solr-core/test/J0/temp/solr.cloud.BasicDistributedZkTest_8BDF4EE617D22F3-001/shard-1-001/solr.xml
   [junit4]   2> 148656 INFO  (TEST-BasicDistributedZkTest.test-seed#[8BDF4EE617D22F3]) [    ] o.a.s.c.CorePropertiesLocator Config-defined core root directory: /x1/jenkins/jenkins-slave/workspace/Lucene-Solr-NightlyTests-master/solr/build/solr-core/test/J0/temp/solr.cloud.BasicDistributedZkTest_8BDF4EE617D22F3-001/shard-1-001/cores
   [junit4]   2> 148656 INFO  (TEST-BasicDistributedZkTest.test-seed#[8BDF4EE617D22F3]) [    ] o.a.s.c.CoreContainer New CoreContainer 1372618163
   [junit4]   2> 148656 INFO  (TEST-BasicDistributedZkTest.test-seed#[8BDF4EE617D22F3]) [    ] o.a.s.c.CoreContainer Loading cores into CoreContainer [instanceDir=/x1/jenkins/jenkins-slave/workspace/Lucene-Solr-NightlyTests-master/solr/build/solr-core/test/J0/temp/solr.cloud.BasicDistributedZkTest_8BDF4EE617D22F3-001/shard-1-001]
   [junit4]   2> 148656 WARN  (TEST-BasicDistributedZkTest.test-seed#[8BDF4EE617D22F3]) [    ] o.a.s.c.CoreContainer Couldn't add files from /x1/jenkins/jenkins-slave/workspace/Lucene-Solr-NightlyTests-master/solr/build/solr-core/test/J0/temp/solr.cloud.BasicDistributedZkTest_8BDF4EE617D22F3-001/shard-1-001/lib to classpath: /x1/jenkins/jenkins-slave/workspace/Lucene-Solr-NightlyTests-master/solr/build/solr-core/test/J0/temp/solr.cloud.BasicDistributedZkTest_8BDF4EE617D22F3-001/shard-1-001/lib
   [junit4]   2> 148656 INFO  (TEST-BasicDistributedZkTest.test-seed#[8BDF4EE617D22F3]) [    ] o.a.s.h.c.HttpShardHandlerFactory created with socketTimeout : 90000,urlScheme : ,connTimeout : 15000,maxConnectionsPerHost : 20,maxConnections : 10000,corePoolSize : 0,maximumPoolSize : 2147483647,maxThreadIdleTime : 5,sizeOfQueue : -1,fairnessPolicy : false,useRetries : false,
   [junit4]   2> 148657 INFO  (TEST-BasicDistributedZkTest.test-seed#[8BDF4EE617D22F3]) [    ] o.a.s.u.UpdateShardHandler Creating UpdateShardHandler HTTP client with params: socketTimeout=340000&connTimeout=45000&retry=true
   [junit4]   2> 148658 INFO  (TEST-BasicDistributedZkTest.test-seed#[8BDF4EE617D22F3]) [    ] o.a.s.l.LogWatcher SLF4J impl is org.slf4j.impl.Log4jLoggerFactory
   [junit4]   2> 148658 INFO  (TEST-BasicDistributedZkTe

[...truncated too long message...]

ad-2-processing-n:127.0.0.1:41565_solr) [n:127.0.0.1:41565_solr    ] o.a.s.c.c.ZkStateReader A live node change: [WatchedEvent state:SyncConnected type:NodeChildrenChanged path:/live_nodes], has occurred - updating... (live nodes size: [1])
   [junit4]   2> 7076842 WARN  (zkCallback-3990-thread-2-processing-n:127.0.0.1:41565_solr) [n:127.0.0.1:41565_solr    ] o.a.s.c.c.ZkStateReader ZooKeeper watch triggered, but Solr cannot talk to ZK: [KeeperErrorCode = Session expired for /live_nodes]
   [junit4]   2> 7076842 INFO  (jetty-launcher-3975-thread-2) [    ] o.e.j.s.h.ContextHandler Stopped o.e.j.s.ServletContextHandler@7ec15cb4{/solr,null,UNAVAILABLE}
   [junit4]   2> 7076846 INFO  (TEST-TestDistribIDF.testSimpleQuery-seed#[8BDF4EE617D22F3]) [    ] o.a.s.c.ZkTestServer connecting to 127.0.0.1:43614 43614
   [junit4]   2> 7077228 INFO  (Thread-52290) [    ] o.a.s.c.ZkTestServer connecting to 127.0.0.1:43614 43614
   [junit4]   2> 7077229 WARN  (Thread-52290) [    ] o.a.s.c.ZkTestServer Watch limit violations: 
   [junit4]   2> Maximum concurrent create/delete watches above limit:
   [junit4]   2> 
   [junit4]   2> 	4	/solr/aliases.json
   [junit4]   2> 	3	/solr/security.json
   [junit4]   2> 	3	/solr/configs/conf2
   [junit4]   2> 	3	/solr/configs/conf1
   [junit4]   2> 
   [junit4]   2> Maximum concurrent data watches above limit:
   [junit4]   2> 
   [junit4]   2> 	4	/solr/clusterstate.json
   [junit4]   2> 	3	/solr/collections/onecollection/state.json
   [junit4]   2> 	3	/solr/collections/onecollection_local/state.json
   [junit4]   2> 
   [junit4]   2> Maximum concurrent children watches above limit:
   [junit4]   2> 
   [junit4]   2> 	4	/solr/live_nodes
   [junit4]   2> 	4	/solr/collections
   [junit4]   2> 	2	/solr/overseer/queue
   [junit4]   2> 	2	/solr/overseer/collection-queue-work
   [junit4]   2> 
   [junit4]   2> 7077229 INFO  (TEST-TestDistribIDF.testSimpleQuery-seed#[8BDF4EE617D22F3]) [    ] o.a.s.SolrTestCaseJ4 ###Ending testSimpleQuery
   [junit4]   2> 7077230 INFO  (SUITE-TestDistribIDF-seed#[8BDF4EE617D22F3]-worker) [    ] o.a.s.SolrTestCaseJ4 ###deleteCore
   [junit4]   2> NOTE: leaving temporary files on disk at: /x1/jenkins/jenkins-slave/workspace/Lucene-Solr-NightlyTests-master/solr/build/solr-core/test/J2/temp/solr.search.stats.TestDistribIDF_8BDF4EE617D22F3-001
   [junit4]   2> NOTE: test params are: codec=Asserting(Lucene60), sim=ClassicSimilarity, locale=zh, timezone=Europe/Prague
   [junit4]   2> NOTE: Linux 3.13.0-52-generic amd64/Oracle Corporation 1.8.0_74 (64-bit)/cpus=4,threads=1,free=29747400,total=494403584
   [junit4]   2> NOTE: All tests run in this JVM: [TestPostingsSolrHighlighter, DistribJoinFromCollectionTest, TestTolerantSearch, CurrencyFieldXmlFileTest, TestXIncludeConfig, TestBulkSchemaConcurrent, TestFieldTypeCollectionResource, TestCollectionAPI, TestPHPSerializedResponseWriter, TestObjectReleaseTracker, DocValuesMultiTest, TestClassicSimilarityFactory, TestIndexSearcher, HighlighterConfigTest, TestSerializedLuceneMatchVersion, TestCoreDiscovery, PrimitiveFieldTypeTest, WrapperMergePolicyFactoryTest, TestSha256AuthenticationProvider, RegexBoostProcessorTest, TestShardHandlerFactory, TestCSVResponseWriter, TestCopyFieldCollectionResource, ReplicationFactorTest, TestPerFieldSimilarity, AddSchemaFieldsUpdateProcessorFactoryTest, TestJmxIntegration, SuggesterTest, TestFreeTextSuggestions, TestUtils, TestAddFieldRealTimeGet, TestXmlQParser, StatelessScriptUpdateProcessorFactoryTest, TestDownShardTolerantSearch, CdcrUpdateLogTest, TestAnalyzeInfixSuggestions, HLLSerializationTest, TestRestoreCore, HdfsUnloadDistributedZkTest, SimpleFacetsTest, TestJsonRequest, TestSort, TestDistributedMissingSort, TestReload, NoCacheHeaderTest, HdfsSyncSliceTest, TestFilteredDocIdSet, CdcrRequestHandlerTest, HdfsDirectoryFactoryTest, TestAuthorizationFramework, TestSuggestSpellingConverter, DistributedQueryComponentOptimizationTest, TestOrdValues, DirectSolrConnectionTest, TestComplexPhraseQParserPlugin, OverseerTaskQueueTest, TestJettySolrRunner, CircularListTest, TestClusterStateMutator, TestLeaderInitiatedRecoveryThread, CoreAdminHandlerTest, LeaderInitiatedRecoveryOnCommitTest, CachingDirectoryFactoryTest, TestRecovery, TestInitParams, SolrTestCaseJ4Test, AutoCommitTest, BadCopyFieldTest, BlockJoinFacetDistribTest, HdfsChaosMonkeySafeLeaderTest, BaseCdcrDistributedZkTest, LeaderElectionTest, DeleteStatusTest, TlogReplayBufferedWhileIndexingTest, TestCollationField, ScriptEngineTest, TestConfigSetImmutable, GraphQueryTest, DeleteLastCustomShardedReplicaTest, TestSolrIndexConfig, SampleTest, SuggesterTSTTest, HardAutoCommitTest, FullSolrCloudDistribCmdsTest, TestCloudDeleteByQuery, UnloadDistributedZkTest, FieldAnalysisRequestHandlerTest, DateMathParserTest, ConnectionManagerTest, BasicDistributedZk2Test, DirectUpdateHandlerTest, TestRestManager, TestRawResponseWriter, TestConfigSetsAPIZkFailure, CollectionsAPIDistributedZkTest, TestDistributedGrouping, TermVectorComponentDistributedTest, ZkControllerTest, TestStressReorder, TestJoin, TestRangeQuery, TestCoreContainer, SolrCoreTest, StatsComponentTest, TestGroupingSearch, SolrCmdDistributorTest, QueryElevationComponentTest, PeerSyncTest, BadIndexSchemaTest, ConvertedLegacyTest, TestFunctionQuery, HighlighterTest, ShowFileRequestHandlerTest, SimplePostToolTest, TestExtendedDismaxParser, SpellCheckCollatorTest, SuggesterFSTTest, SolrRequestParserTest, DocValuesTest, TestStressLucene, SpatialFilterTest, SuggesterWFSTTest, TestCSVLoader, SolrCoreCheckLockOnStartupTest, TestUpdate, FieldMutatingUpdateProcessorTest, QueryEqualityTest, DirectUpdateHandlerOptimizeTest, TestSolrDeletionPolicy1, SolrInfoMBeanTest, XsltUpdateRequestHandlerTest, DebugComponentTest, IndexBasedSpellCheckerTest, TestSurroundQueryParser, LukeRequestHandlerTest, TestQueryUtils, TestWriterPerf, DirectSolrSpellCheckerTest, TestReversedWildcardFilterFactory, DocumentAnalysisRequestHandlerTest, TestOmitPositions, XmlUpdateRequestHandlerTest, RequestHandlersTest, DocumentBuilderTest, TestValueSourceCache, TestIndexingPerformance, TestSolrQueryParser, FastVectorHighlighterTest, SolrPluginUtilsTest, MBeansHandlerTest, QueryParsingTest, TestAnalyzedSuggestions, UniqFieldsUpdateProcessorFactoryTest, BinaryUpdateRequestHandlerTest, PingRequestHandlerTest, CSVRequestHandlerTest, TestComponentsName, SearchHandlerTest, TestLFUCache, TestQuerySenderListener, UpdateParamsTest, AlternateDirectoryTest, CopyFieldTest, ResponseLogComponentTest, BadComponentTest, TestStressRecovery, AsyncMigrateRouteKeyTest, CdcrReplicationHandlerTest, CdcrVersionReplicationTest, CleanupOldIndexTest, CloudExitableDirectoryReaderTest, CollectionReloadTest, CollectionStateFormat2Test, CollectionsAPISolrJTest, ConcurrentDeleteAndCreateCollectionTest, ConfigSetsAPITest, CustomCollectionTest, DeleteInactiveReplicaTest, DeleteReplicaTest, DistribDocExpirationUpdateProcessorTest, DistributedQueueTest, ForceLeaderTest, OutOfBoxZkACLAndCredentialsProvidersTest, OverriddenZkACLAndCredentialsProvidersTest, OverseerCollectionConfigSetProcessorTest, OverseerRolesTest, RestartWhileUpdatingTest, SharedFSAutoReplicaFailoverTest, SolrXmlInZkTest, TestCloudPivotFacet, TestLeaderElectionZkExpiry, TestMiniSolrCloudClusterSSL, TestRebalanceLeaders, TestSolrCloudWithKerberosAlt, HdfsBasicDistributedZk2Test, HdfsRecoveryZkTest, HdfsTlogReplayBufferedWhileIndexingTest, DirectoryFactoryTest, ExitableDirectoryReaderTest, TestConfigSetProperties, TestDynamicLoading, TestImplicitCoreProperties, TestInfoStreamLogging, TestSolrXml, RequestLoggingTest, TestBlobHandler, TestConfigReload, TestSolrConfigHandlerConcurrent, DistributedFacetPivotLargeTest, DistributedFacetPivotSmallAdvancedTest, DistributedQueryComponentCustomSortTest, FacetPivotSmallTest, SpatialHeatmapFacetsTest, SmileWriterTest, TestChildDocTransformer, TestCustomDocTransformer, TestGeoJSONResponseWriter, TestSortingResponseWriter, TestBulkSchemaAPI, TestDynamicFieldResource, TestFieldCollectionResource, TestFieldResource, TestFieldTypeResource, TestSchemaNameResource, TestSchemaResource, TestSchemaSimilarityResource, TestSchemaVersionResource, TestSolrQueryParserDefaultOperatorResource, TestSolrQueryParserResource, TestUniqueKeyFieldResource, DocValuesMissingTest, TestCloudManagedSchema, TestCloudSchemaless, TestReloadDeadlock, TestSolr4Spatial2, TestStandardQParsers, TestJsonFacets, TestDFISimilarityFactory, TestPerFieldSimilarityWithDefaultOverride, TestDefaultStatsCache, TestDistribIDF]
   [junit4] Completed [557/584 (5!)] on J2 in 38.78s, 2 tests, 1 failure <<< FAILURES!

[...truncated 100 lines...]
BUILD FAILED
/x1/jenkins/jenkins-slave/workspace/Lucene-Solr-NightlyTests-master/build.xml:747: The following error occurred while executing this line:
/x1/jenkins/jenkins-slave/workspace/Lucene-Solr-NightlyTests-master/build.xml:684: The following error occurred while executing this line:
/x1/jenkins/jenkins-slave/workspace/Lucene-Solr-NightlyTests-master/build.xml:59: The following error occurred while executing this line:
/x1/jenkins/jenkins-slave/workspace/Lucene-Solr-NightlyTests-master/solr/build.xml:233: The following error occurred while executing this line:
/x1/jenkins/jenkins-slave/workspace/Lucene-Solr-NightlyTests-master/solr/common-build.xml:529: The following error occurred while executing this line:
/x1/jenkins/jenkins-slave/workspace/Lucene-Solr-NightlyTests-master/lucene/common-build.xml:1457: The following error occurred while executing this line:
/x1/jenkins/jenkins-slave/workspace/Lucene-Solr-NightlyTests-master/lucene/common-build.xml:1014: There were test failures: 584 suites (10 ignored), 2357 tests, 1 error, 4 failures, 32 ignored (16 assumptions) [seed: 8BDF4EE617D22F3]

Total time: 313 minutes 36 seconds
Build step 'Invoke Ant' marked build as failure
Archiving artifacts
No prior successful build to compare, so performing full copy of artifacts
Recording test results
Email was triggered for: Failure - Any
Sending email for trigger: Failure - Any




Mime
View raw message