lucene-dev mailing list archives

Site index · List index
Message view « Date » · « Thread »
Top « Date » · « Thread »
From Policeman Jenkins Server <jenk...@thetaphi.de>
Subject [JENKINS] Lucene-Solr-6.x-Windows (64bit/jdk1.8.0_72) - Build # 8 - Failure!
Date Sat, 05 Mar 2016 00:34:47 GMT
Build: http://jenkins.thetaphi.de/job/Lucene-Solr-6.x-Windows/8/
Java: 64bit/jdk1.8.0_72 -XX:-UseCompressedOops -XX:+UseParallelGC

1 tests failed.
FAILED:  org.apache.solr.cloud.CollectionTooManyReplicasTest.testDownedShards

Error Message:
Should have gotten a message about shard not 

Stack Trace:
java.lang.AssertionError: Should have gotten a message about shard not 
	at __randomizedtesting.SeedInfo.seed([1D1CFFA3D10A3538:7F3457F65AF1787C]:0)
	at org.junit.Assert.fail(Assert.java:93)
	at org.junit.Assert.assertTrue(Assert.java:43)
	at org.apache.solr.cloud.CollectionTooManyReplicasTest.testDownedShards(CollectionTooManyReplicasTest.java:256)
	at sun.reflect.NativeMethodAccessorImpl.invoke0(Native Method)
	at sun.reflect.NativeMethodAccessorImpl.invoke(NativeMethodAccessorImpl.java:62)
	at sun.reflect.DelegatingMethodAccessorImpl.invoke(DelegatingMethodAccessorImpl.java:43)
	at java.lang.reflect.Method.invoke(Method.java:498)
	at com.carrotsearch.randomizedtesting.RandomizedRunner.invoke(RandomizedRunner.java:1764)
	at com.carrotsearch.randomizedtesting.RandomizedRunner$8.evaluate(RandomizedRunner.java:871)
	at com.carrotsearch.randomizedtesting.RandomizedRunner$9.evaluate(RandomizedRunner.java:907)
	at com.carrotsearch.randomizedtesting.RandomizedRunner$10.evaluate(RandomizedRunner.java:921)
	at org.apache.solr.BaseDistributedSearchTestCase$ShardsRepeatRule$ShardsFixedStatement.callStatement(BaseDistributedSearchTestCase.java:996)
	at org.apache.solr.BaseDistributedSearchTestCase$ShardsRepeatRule$ShardsStatement.evaluate(BaseDistributedSearchTestCase.java:971)
	at com.carrotsearch.randomizedtesting.rules.SystemPropertiesRestoreRule$1.evaluate(SystemPropertiesRestoreRule.java:57)
	at org.apache.lucene.util.TestRuleSetupTeardownChained$1.evaluate(TestRuleSetupTeardownChained.java:49)
	at org.apache.lucene.util.AbstractBeforeAfterRule$1.evaluate(AbstractBeforeAfterRule.java:45)
	at org.apache.lucene.util.TestRuleThreadAndTestName$1.evaluate(TestRuleThreadAndTestName.java:48)
	at org.apache.lucene.util.TestRuleIgnoreAfterMaxFailures$1.evaluate(TestRuleIgnoreAfterMaxFailures.java:64)
	at org.apache.lucene.util.TestRuleMarkFailure$1.evaluate(TestRuleMarkFailure.java:47)
	at com.carrotsearch.randomizedtesting.rules.StatementAdapter.evaluate(StatementAdapter.java:36)
	at com.carrotsearch.randomizedtesting.ThreadLeakControl$StatementRunner.run(ThreadLeakControl.java:367)
	at com.carrotsearch.randomizedtesting.ThreadLeakControl.forkTimeoutingTask(ThreadLeakControl.java:809)
	at com.carrotsearch.randomizedtesting.ThreadLeakControl$3.evaluate(ThreadLeakControl.java:460)
	at com.carrotsearch.randomizedtesting.RandomizedRunner.runSingleTest(RandomizedRunner.java:880)
	at com.carrotsearch.randomizedtesting.RandomizedRunner$5.evaluate(RandomizedRunner.java:781)
	at com.carrotsearch.randomizedtesting.RandomizedRunner$6.evaluate(RandomizedRunner.java:816)
	at com.carrotsearch.randomizedtesting.RandomizedRunner$7.evaluate(RandomizedRunner.java:827)
	at com.carrotsearch.randomizedtesting.rules.StatementAdapter.evaluate(StatementAdapter.java:36)
	at com.carrotsearch.randomizedtesting.rules.SystemPropertiesRestoreRule$1.evaluate(SystemPropertiesRestoreRule.java:57)
	at org.apache.lucene.util.AbstractBeforeAfterRule$1.evaluate(AbstractBeforeAfterRule.java:45)
	at com.carrotsearch.randomizedtesting.rules.StatementAdapter.evaluate(StatementAdapter.java:36)
	at org.apache.lucene.util.TestRuleStoreClassName$1.evaluate(TestRuleStoreClassName.java:41)
	at com.carrotsearch.randomizedtesting.rules.NoShadowingOrOverridesOnMethodsRule$1.evaluate(NoShadowingOrOverridesOnMethodsRule.java:40)
	at com.carrotsearch.randomizedtesting.rules.NoShadowingOrOverridesOnMethodsRule$1.evaluate(NoShadowingOrOverridesOnMethodsRule.java:40)
	at com.carrotsearch.randomizedtesting.rules.StatementAdapter.evaluate(StatementAdapter.java:36)
	at com.carrotsearch.randomizedtesting.rules.StatementAdapter.evaluate(StatementAdapter.java:36)
	at com.carrotsearch.randomizedtesting.rules.StatementAdapter.evaluate(StatementAdapter.java:36)
	at org.apache.lucene.util.TestRuleAssertionsRequired$1.evaluate(TestRuleAssertionsRequired.java:53)
	at org.apache.lucene.util.TestRuleMarkFailure$1.evaluate(TestRuleMarkFailure.java:47)
	at org.apache.lucene.util.TestRuleIgnoreAfterMaxFailures$1.evaluate(TestRuleIgnoreAfterMaxFailures.java:64)
	at org.apache.lucene.util.TestRuleIgnoreTestSuites$1.evaluate(TestRuleIgnoreTestSuites.java:54)
	at com.carrotsearch.randomizedtesting.rules.StatementAdapter.evaluate(StatementAdapter.java:36)
	at com.carrotsearch.randomizedtesting.ThreadLeakControl$StatementRunner.run(ThreadLeakControl.java:367)
	at java.lang.Thread.run(Thread.java:745)




Build Log:
[...truncated 10557 lines...]
   [junit4] Suite: org.apache.solr.cloud.CollectionTooManyReplicasTest
   [junit4]   2> Creating dataDir: C:\Users\JenkinsSlave\workspace\Lucene-Solr-6.x-Windows\solr\build\solr-core\test\J1\temp\solr.cloud.CollectionTooManyReplicasTest_1D1CFFA3D10A3538-001\init-core-data-001
   [junit4]   2> 45632 INFO  (SUITE-CollectionTooManyReplicasTest-seed#[1D1CFFA3D10A3538]-worker) [    ] o.a.s.SolrTestCaseJ4 Randomized ssl (false) and clientAuth (false)
   [junit4]   2> 45632 INFO  (SUITE-CollectionTooManyReplicasTest-seed#[1D1CFFA3D10A3538]-worker) [    ] o.a.s.BaseDistributedSearchTestCase Setting hostContext system property: /
   [junit4]   2> 45635 INFO  (TEST-CollectionTooManyReplicasTest.testAddTooManyReplicas-seed#[1D1CFFA3D10A3538]) [    ] o.a.s.c.ZkTestServer STARTING ZK TEST SERVER
   [junit4]   2> 45635 INFO  (Thread-150) [    ] o.a.s.c.ZkTestServer client port:0.0.0.0/0.0.0.0:0
   [junit4]   2> 45635 INFO  (Thread-150) [    ] o.a.s.c.ZkTestServer Starting server
   [junit4]   2> 45724 INFO  (TEST-CollectionTooManyReplicasTest.testAddTooManyReplicas-seed#[1D1CFFA3D10A3538]) [    ] o.a.s.c.ZkTestServer start zk server on port:57739
   [junit4]   2> 45726 INFO  (TEST-CollectionTooManyReplicasTest.testAddTooManyReplicas-seed#[1D1CFFA3D10A3538]) [    ] o.a.s.c.c.SolrZkClient Using default ZkCredentialsProvider
   [junit4]   2> 45727 INFO  (TEST-CollectionTooManyReplicasTest.testAddTooManyReplicas-seed#[1D1CFFA3D10A3538]) [    ] o.a.s.c.c.ConnectionManager Waiting for client to connect to ZooKeeper
   [junit4]   2> 45731 INFO  (zkCallback-45-thread-1) [    ] o.a.s.c.c.ConnectionManager Watcher org.apache.solr.common.cloud.ConnectionManager@88521eb name:ZooKeeperConnection Watcher:127.0.0.1:57739 got event WatchedEvent state:SyncConnected type:None path:null path:null type:None
   [junit4]   2> 45731 INFO  (TEST-CollectionTooManyReplicasTest.testAddTooManyReplicas-seed#[1D1CFFA3D10A3538]) [    ] o.a.s.c.c.ConnectionManager Client is connected to ZooKeeper
   [junit4]   2> 45731 INFO  (TEST-CollectionTooManyReplicasTest.testAddTooManyReplicas-seed#[1D1CFFA3D10A3538]) [    ] o.a.s.c.c.SolrZkClient Using default ZkACLProvider
   [junit4]   2> 45731 INFO  (TEST-CollectionTooManyReplicasTest.testAddTooManyReplicas-seed#[1D1CFFA3D10A3538]) [    ] o.a.s.c.c.SolrZkClient makePath: /solr
   [junit4]   2> 45738 INFO  (TEST-CollectionTooManyReplicasTest.testAddTooManyReplicas-seed#[1D1CFFA3D10A3538]) [    ] o.a.s.c.c.SolrZkClient Using default ZkCredentialsProvider
   [junit4]   2> 45738 WARN  (NIOServerCxn.Factory:0.0.0.0/0.0.0.0:0) [    ] o.a.z.s.NIOServerCnxn caught end of stream exception
   [junit4]   2> EndOfStreamException: Unable to read additional data from client sessionid 0x15343fe2f2a0000, likely client has closed socket
   [junit4]   2> 	at org.apache.zookeeper.server.NIOServerCnxn.doIO(NIOServerCnxn.java:228)
   [junit4]   2> 	at org.apache.zookeeper.server.NIOServerCnxnFactory.run(NIOServerCnxnFactory.java:208)
   [junit4]   2> 	at java.lang.Thread.run(Thread.java:745)
   [junit4]   2> 45740 INFO  (TEST-CollectionTooManyReplicasTest.testAddTooManyReplicas-seed#[1D1CFFA3D10A3538]) [    ] o.a.s.c.c.ConnectionManager Waiting for client to connect to ZooKeeper
   [junit4]   2> 45743 INFO  (zkCallback-46-thread-1) [    ] o.a.s.c.c.ConnectionManager Watcher org.apache.solr.common.cloud.ConnectionManager@239418c3 name:ZooKeeperConnection Watcher:127.0.0.1:57739/solr got event WatchedEvent state:SyncConnected type:None path:null path:null type:None
   [junit4]   2> 45743 INFO  (TEST-CollectionTooManyReplicasTest.testAddTooManyReplicas-seed#[1D1CFFA3D10A3538]) [    ] o.a.s.c.c.ConnectionManager Client is connected to ZooKeeper
   [junit4]   2> 45744 INFO  (TEST-CollectionTooManyReplicasTest.testAddTooManyReplicas-seed#[1D1CFFA3D10A3538]) [    ] o.a.s.c.c.SolrZkClient Using default ZkACLProvider
   [junit4]   2> 45747 INFO  (TEST-CollectionTooManyReplicasTest.testAddTooManyReplicas-seed#[1D1CFFA3D10A3538]) [    ] o.a.s.c.c.SolrZkClient makePath: /collections/collection1
   [junit4]   2> 45751 INFO  (TEST-CollectionTooManyReplicasTest.testAddTooManyReplicas-seed#[1D1CFFA3D10A3538]) [    ] o.a.s.c.c.SolrZkClient makePath: /collections/collection1/shards
   [junit4]   2> 45753 INFO  (TEST-CollectionTooManyReplicasTest.testAddTooManyReplicas-seed#[1D1CFFA3D10A3538]) [    ] o.a.s.c.c.SolrZkClient makePath: /collections/control_collection
   [junit4]   2> 45755 INFO  (TEST-CollectionTooManyReplicasTest.testAddTooManyReplicas-seed#[1D1CFFA3D10A3538]) [    ] o.a.s.c.c.SolrZkClient makePath: /collections/control_collection/shards
   [junit4]   2> 45759 INFO  (TEST-CollectionTooManyReplicasTest.testAddTooManyReplicas-seed#[1D1CFFA3D10A3538]) [    ] o.a.s.c.AbstractZkTestCase put C:\Users\JenkinsSlave\workspace\Lucene-Solr-6.x-Windows\solr\core\src\test-files\solr\collection1\conf\solrconfig-tlog.xml to /configs/conf1/solrconfig.xml
   [junit4]   2> 45759 INFO  (TEST-CollectionTooManyReplicasTest.testAddTooManyReplicas-seed#[1D1CFFA3D10A3538]) [    ] o.a.s.c.c.SolrZkClient makePath: /configs/conf1/solrconfig.xml
   [junit4]   2> 45764 INFO  (TEST-CollectionTooManyReplicasTest.testAddTooManyReplicas-seed#[1D1CFFA3D10A3538]) [    ] o.a.s.c.AbstractZkTestCase put C:\Users\JenkinsSlave\workspace\Lucene-Solr-6.x-Windows\solr\core\src\test-files\solr\collection1\conf\schema.xml to /configs/conf1/schema.xml
   [junit4]   2> 45764 INFO  (TEST-CollectionTooManyReplicasTest.testAddTooManyReplicas-seed#[1D1CFFA3D10A3538]) [    ] o.a.s.c.c.SolrZkClient makePath: /configs/conf1/schema.xml
   [junit4]   2> 45766 INFO  (TEST-CollectionTooManyReplicasTest.testAddTooManyReplicas-seed#[1D1CFFA3D10A3538]) [    ] o.a.s.c.AbstractZkTestCase put C:\Users\JenkinsSlave\workspace\Lucene-Solr-6.x-Windows\solr\core\src\test-files\solr\collection1\conf\solrconfig.snippet.randomindexconfig.xml to /configs/conf1/solrconfig.snippet.randomindexconfig.xml
   [junit4]   2> 45767 INFO  (TEST-CollectionTooManyReplicasTest.testAddTooManyReplicas-seed#[1D1CFFA3D10A3538]) [    ] o.a.s.c.c.SolrZkClient makePath: /configs/conf1/solrconfig.snippet.randomindexconfig.xml
   [junit4]   2> 45770 INFO  (TEST-CollectionTooManyReplicasTest.testAddTooManyReplicas-seed#[1D1CFFA3D10A3538]) [    ] o.a.s.c.AbstractZkTestCase put C:\Users\JenkinsSlave\workspace\Lucene-Solr-6.x-Windows\solr\core\src\test-files\solr\collection1\conf\stopwords.txt to /configs/conf1/stopwords.txt
   [junit4]   2> 45770 INFO  (TEST-CollectionTooManyReplicasTest.testAddTooManyReplicas-seed#[1D1CFFA3D10A3538]) [    ] o.a.s.c.c.SolrZkClient makePath: /configs/conf1/stopwords.txt
   [junit4]   2> 45772 INFO  (TEST-CollectionTooManyReplicasTest.testAddTooManyReplicas-seed#[1D1CFFA3D10A3538]) [    ] o.a.s.c.AbstractZkTestCase put C:\Users\JenkinsSlave\workspace\Lucene-Solr-6.x-Windows\solr\core\src\test-files\solr\collection1\conf\protwords.txt to /configs/conf1/protwords.txt
   [junit4]   2> 45773 INFO  (TEST-CollectionTooManyReplicasTest.testAddTooManyReplicas-seed#[1D1CFFA3D10A3538]) [    ] o.a.s.c.c.SolrZkClient makePath: /configs/conf1/protwords.txt
   [junit4]   2> 45773 INFO  (TEST-CollectionTooManyReplicasTest.testAddTooManyReplicas-seed#[1D1CFFA3D10A3538]) [    ] o.a.s.c.AbstractZkTestCase put C:\Users\JenkinsSlave\workspace\Lucene-Solr-6.x-Windows\solr\core\src\test-files\solr\collection1\conf\currency.xml to /configs/conf1/currency.xml
   [junit4]   2> 45774 INFO  (TEST-CollectionTooManyReplicasTest.testAddTooManyReplicas-seed#[1D1CFFA3D10A3538]) [    ] o.a.s.c.c.SolrZkClient makePath: /configs/conf1/currency.xml
   [junit4]   2> 45777 INFO  (TEST-CollectionTooManyReplicasTest.testAddTooManyReplicas-seed#[1D1CFFA3D10A3538]) [    ] o.a.s.c.AbstractZkTestCase put C:\Users\JenkinsSlave\workspace\Lucene-Solr-6.x-Windows\solr\core\src\test-files\solr\collection1\conf\enumsConfig.xml to /configs/conf1/enumsConfig.xml
   [junit4]   2> 45777 INFO  (TEST-CollectionTooManyReplicasTest.testAddTooManyReplicas-seed#[1D1CFFA3D10A3538]) [    ] o.a.s.c.c.SolrZkClient makePath: /configs/conf1/enumsConfig.xml
   [junit4]   2> 45779 INFO  (TEST-CollectionTooManyReplicasTest.testAddTooManyReplicas-seed#[1D1CFFA3D10A3538]) [    ] o.a.s.c.AbstractZkTestCase put C:\Users\JenkinsSlave\workspace\Lucene-Solr-6.x-Windows\solr\core\src\test-files\solr\collection1\conf\open-exchange-rates.json to /configs/conf1/open-exchange-rates.json
   [junit4]   2> 45779 INFO  (TEST-CollectionTooManyReplicasTest.testAddTooManyReplicas-seed#[1D1CFFA3D10A3538]) [    ] o.a.s.c.c.SolrZkClient makePath: /configs/conf1/open-exchange-rates.json
   [junit4]   2> 45781 INFO  (TEST-CollectionTooManyReplicasTest.testAddTooManyReplicas-seed#[1D1CFFA3D10A3538]) [    ] o.a.s.c.AbstractZkTestCase put C:\Users\JenkinsSlave\workspace\Lucene-Solr-6.x-Windows\solr\core\src\test-files\solr\collection1\conf\mapping-ISOLatin1Accent.txt to /configs/conf1/mapping-ISOLatin1Accent.txt
   [junit4]   2> 45781 INFO  (TEST-CollectionTooManyReplicasTest.testAddTooManyReplicas-seed#[1D1CFFA3D10A3538]) [    ] o.a.s.c.c.SolrZkClient makePath: /configs/conf1/mapping-ISOLatin1Accent.txt
   [junit4]   2> 45784 INFO  (TEST-CollectionTooManyReplicasTest.testAddTooManyReplicas-seed#[1D1CFFA3D10A3538]) [    ] o.a.s.c.AbstractZkTestCase put C:\Users\JenkinsSlave\workspace\Lucene-Solr-6.x-Windows\solr\core\src\test-files\solr\collection1\conf\old_synonyms.txt to /configs/conf1/old_synonyms.txt
   [junit4]   2> 45784 INFO  (TEST-CollectionTooManyReplicasTest.testAddTooManyReplicas-seed#[1D1CFFA3D10A3538]) [    ] o.a.s.c.c.SolrZkClient makePath: /configs/conf1/old_synonyms.txt
   [junit4]   2> 45786 INFO  (TEST-CollectionTooManyReplicasTest.testAddTooManyReplicas-seed#[1D1CFFA3D10A3538]) [    ] o.a.s.c.AbstractZkTestCase put C:\Users\JenkinsSlave\workspace\Lucene-Solr-6.x-Windows\solr\core\src\test-files\solr\collection1\conf\synonyms.txt to /configs/conf1/synonyms.txt
   [junit4]   2> 45786 INFO  (TEST-CollectionTooManyReplicasTest.testAddTooManyReplicas-seed#[1D1CFFA3D10A3538]) [    ] o.a.s.c.c.SolrZkClient makePath: /configs/conf1/synonyms.txt
   [junit4]   2> 46204 INFO  (TEST-CollectionTooManyReplicasTest.testAddTooManyReplicas-seed#[1D1CFFA3D10A3538]) [    ] o.a.s.SolrTestCaseJ4 Writing core.properties file to C:\Users\JenkinsSlave\workspace\Lucene-Solr-6.x-Windows\solr\build\solr-core\test\J1\temp\solr.cloud.CollectionTooManyReplicasTest_1D1CFFA3D10A3538-001\control-001\cores\collection1
   [junit4]   2> 46209 INFO  (TEST-CollectionTooManyReplicasTest.testAddTooManyReplicas-seed#[1D1CFFA3D10A3538]) [    ] o.e.j.s.Server jetty-9.3.6.v20151106
   [junit4]   2> 46210 INFO  (TEST-CollectionTooManyReplicasTest.testAddTooManyReplicas-seed#[1D1CFFA3D10A3538]) [    ] o.e.j.s.h.ContextHandler Started o.e.j.s.ServletContextHandler@57d2ac68{/,null,AVAILABLE}
   [junit4]   2> 46214 INFO  (TEST-CollectionTooManyReplicasTest.testAddTooManyReplicas-seed#[1D1CFFA3D10A3538]) [    ] o.e.j.s.ServerConnector Started ServerConnector@250f5b75{HTTP/1.1,[http/1.1]}{127.0.0.1:57746}
   [junit4]   2> 46214 INFO  (TEST-CollectionTooManyReplicasTest.testAddTooManyReplicas-seed#[1D1CFFA3D10A3538]) [    ] o.e.j.s.Server Started @53206ms
   [junit4]   2> 46214 INFO  (TEST-CollectionTooManyReplicasTest.testAddTooManyReplicas-seed#[1D1CFFA3D10A3538]) [    ] o.a.s.c.s.e.JettySolrRunner Jetty properties: {solr.data.dir=C:\Users\JenkinsSlave\workspace\Lucene-Solr-6.x-Windows\solr\build\solr-core\test\J1\temp\solr.cloud.CollectionTooManyReplicasTest_1D1CFFA3D10A3538-001\tempDir-001/control/data, hostContext=/, hostPort=57746, coreRootDirectory=C:\Users\JenkinsSlave\workspace\Lucene-Solr-6.x-Windows\solr\build\solr-core\test\J1\temp\solr.cloud.CollectionTooManyReplicasTest_1D1CFFA3D10A3538-001\control-001\cores}
   [junit4]   2> 46215 INFO  (TEST-CollectionTooManyReplicasTest.testAddTooManyReplicas-seed#[1D1CFFA3D10A3538]) [    ] o.a.s.s.SolrDispatchFilter SolrDispatchFilter.init(): sun.misc.Launcher$AppClassLoader@73d16e93
   [junit4]   2> 46215 INFO  (TEST-CollectionTooManyReplicasTest.testAddTooManyReplicas-seed#[1D1CFFA3D10A3538]) [    ] o.a.s.c.SolrResourceLoader new SolrResourceLoader for directory: 'C:\Users\JenkinsSlave\workspace\Lucene-Solr-6.x-Windows\solr\build\solr-core\test\J1\temp\solr.cloud.CollectionTooManyReplicasTest_1D1CFFA3D10A3538-001\control-001'
   [junit4]   2> 46215 INFO  (TEST-CollectionTooManyReplicasTest.testAddTooManyReplicas-seed#[1D1CFFA3D10A3538]) [    ] o.a.s.c.SolrResourceLoader JNDI not configured for solr (NoInitialContextEx)
   [junit4]   2> 46215 INFO  (TEST-CollectionTooManyReplicasTest.testAddTooManyReplicas-seed#[1D1CFFA3D10A3538]) [    ] o.a.s.c.SolrResourceLoader solr home defaulted to 'solr/' (could not find system property or JNDI)
   [junit4]   2> 46216 INFO  (TEST-CollectionTooManyReplicasTest.testAddTooManyReplicas-seed#[1D1CFFA3D10A3538]) [    ] o.a.s.c.c.SolrZkClient Using default ZkCredentialsProvider
   [junit4]   2> 46217 INFO  (TEST-CollectionTooManyReplicasTest.testAddTooManyReplicas-seed#[1D1CFFA3D10A3538]) [    ] o.a.s.c.c.ConnectionManager Waiting for client to connect to ZooKeeper
   [junit4]   2> 46219 INFO  (zkCallback-47-thread-1) [    ] o.a.s.c.c.ConnectionManager Watcher org.apache.solr.common.cloud.ConnectionManager@5b9ab026 name:ZooKeeperConnection Watcher:127.0.0.1:57739/solr got event WatchedEvent state:SyncConnected type:None path:null path:null type:None
   [junit4]   2> 46219 INFO  (TEST-CollectionTooManyReplicasTest.testAddTooManyReplicas-seed#[1D1CFFA3D10A3538]) [    ] o.a.s.c.c.ConnectionManager Client is connected to ZooKeeper
   [junit4]   2> 46219 INFO  (TEST-CollectionTooManyReplicasTest.testAddTooManyReplicas-seed#[1D1CFFA3D10A3538]) [    ] o.a.s.c.c.SolrZkClient Using default ZkACLProvider
   [junit4]   2> 46221 INFO  (TEST-CollectionTooManyReplicasTest.testAddTooManyReplicas-seed#[1D1CFFA3D10A3538]) [    ] o.a.s.s.SolrDispatchFilter Loading solr.xml from SolrHome (not found in ZooKeeper)
   [junit4]   2> 46221 INFO  (TEST-CollectionTooManyReplicasTest.testAddTooManyReplicas-seed#[1D1CFFA3D10A3538]) [    ] o.a.s.c.SolrXmlConfig Loading container configuration from C:\Users\JenkinsSlave\workspace\Lucene-Solr-6.x-Windows\solr\build\solr-core\test\J1\temp\solr.cloud.CollectionTooManyReplicasTest_1D1CFFA3D10A3538-001\control-001\solr.xml
   [junit4]   2> 46232 INFO  (TEST-CollectionTooManyReplicasTest.testAddTooManyReplicas-seed#[1D1CFFA3D10A3538]) [    ] o.a.s.c.CorePropertiesLocator Config-defined core root directory: C:\Users\JenkinsSlave\workspace\Lucene-Solr-6.x-Windows\solr\build\solr-core\test\J1\temp\solr.cloud.CollectionTooManyReplicasTest_1D1CFFA3D10A3538-001\control-001\cores
   [junit4]   2> 46232 INFO  (TEST-CollectionTooManyReplicasTest.testAddTooManyReplicas-seed#[1D1CFFA3D10A3538]) [    ] o.a.s.c.CoreContainer New CoreContainer 1119908561
   [junit4]   2> 46232 INFO  (TEST-CollectionTooManyReplicasTest.testAddTooManyReplicas-seed#[1D1CFFA3D10A3538]) [    ] o.a.s.c.CoreContainer Loading cores into CoreContainer [instanceDir=C:\Users\JenkinsSlave\workspace\Lucene-Solr-6.x-Windows\solr\build\solr-core\test\J1\temp\solr.cloud.CollectionTooManyReplicasTest_1D1CFFA3D10A3538-001\control-001]
   [junit4]   2> 46232 WARN  (TEST-CollectionTooManyReplicasTest.testAddTooManyReplicas-seed#[1D1CFFA3D10A3538]) [    ] o.a.s.c.CoreContainer Couldn't add files from C:\Users\JenkinsSlave\workspace\Lucene-Solr-6.x-Windows\solr\build\solr-core\test\J1\temp\solr.cloud.CollectionTooManyReplicasTest_1D1CFFA3D10A3538-001\control-001\lib to classpath: C:\Users\JenkinsSlave\workspace\Lucene-Solr-6.x-Windows\solr\build\solr-core\test\J1\temp\solr.cloud.CollectionTooManyReplicasTest_1D1CFFA3D10A3538-001\control-001\lib
   [junit4]   2> 46233 INFO  (TEST-CollectionTooManyReplicasTest.testAddTooManyReplicas-seed#[1D1CFFA3D10A3538]) [    ] o.a.s.h.c.HttpShardHandlerFactory created with socketTimeout : 90000,urlScheme : ,connTimeout : 15000,maxConnectionsPerHost : 20,maxConnections : 10000,corePoolSize : 0,maximumPoolSize : 2147483647,maxThreadIdleTime : 5,sizeOfQueue : -1,fairnessPolicy : false,useRetries : false,
   [junit4]   2> 46236 INFO  (TEST-CollectionTooManyReplicasTest.testAddTooManyReplicas-seed#[1D1CFFA3D10A3538]) [    ] o.a.s.u.UpdateShardHandler Creating UpdateShardHandler HTTP client with params: socketTimeout=340000&connTimeout=45000&retry=true
   [junit4]   2> 46238 INFO  (TEST-CollectionTooManyReplicasTest.testAddTooManyReplicas-seed#[1D1CFFA3D10A3538]) [    ] o.a.s.l.LogWatcher SLF4J impl is org.slf4j.impl.Log4jLoggerFactory
   [junit4]   2> 46238 INFO  (TEST-CollectionTooManyReplicasTest.testAddTooManyReplicas-seed#[1D1CFFA3D10A3538]) [    ] o.a.s.l.LogWatcher Registering Log Listener [Log4j (org.slf4j.impl.Log4jLoggerFactory)]
   [junit4]   2> 46238 INFO  (TEST-CollectionTooManyReplicasTest.testAddTooManyReplicas-seed#[1D1CFFA3D10A3538]) [    ] o.a.s.c.ZkContainer Zookeeper client=127.0.0.1:57739/solr
   [junit4]   2> 46270 INFO  (TEST-CollectionTooManyReplicasTest.testAddTooManyReplicas-seed#[1D1CFFA3D10A3538]) [    ] o.a.s.c.ZkController zkHost includes chroot
   [junit4]   2> 46270 INFO  (TEST-CollectionTooManyReplicasTest.testAddTooManyReplicas-seed#[1D1CFFA3D10A3538]) [    ] o.a.s.c.c.SolrZkClient Using default ZkCredentialsProvider
   [junit4]   2> 46271 INFO  (TEST-CollectionTooManyReplicasTest.testAddTooManyReplicas-seed#[1D1CFFA3D10A3538]) [    ] o.a.s.c.c.ConnectionManager Waiting for client to connect to ZooKeeper
   [junit4]   2> 46274 INFO  (zkCallback-50-thread-1) [    ] o.a.s.c.c.ConnectionManager Watcher org.apache.solr.common.cloud.ConnectionManager@2e6b77c2 name:ZooKeeperConnection Watcher:127.0.0.1:57739 got event WatchedEvent state:SyncConnected type:None path:null path:null type:None
   [junit4]   2> 46274 INFO  (TEST-CollectionTooManyReplicasTest.testAddTooManyReplicas-seed#[1D1CFFA3D10A3538]) [    ] o.a.s.c.c.ConnectionManager Client is connected to ZooKeeper
   [junit4]   2> 46275 INFO  (TEST-CollectionTooManyReplicasTest.testAddTooManyReplicas-seed#[1D1CFFA3D10A3538]) [    ] o.a.s.c.c.SolrZkClient Using default ZkACLProvider
   [junit4]   2> 46282 INFO  (TEST-CollectionTooManyReplicasTest.testAddTooManyReplicas-seed#[1D1CFFA3D10A3538]) [n:127.0.0.1:57746_    ] o.a.s.c.c.ConnectionManager Waiting for client to connect to ZooKeeper
   [junit4]   2> 46284 INFO  (zkCallback-51-thread-1-processing-n:127.0.0.1:57746_) [n:127.0.0.1:57746_    ] o.a.s.c.c.ConnectionManager Watcher org.apache.solr.common.cloud.ConnectionManager@51a365c6 name:ZooKeeperConnection Watcher:127.0.0.1:57739/solr got event WatchedEvent state:SyncConnected type:None path:null path:null type:None
   [junit4]   2> 46284 INFO  (TEST-CollectionTooManyReplicasTest.testAddTooManyReplicas-seed#[1D1CFFA3D10A3538]) [n:127.0.0.1:57746_    ] o.a.s.c.c.ConnectionManager Client is connected to ZooKeeper
   [junit4]   2> 46294 INFO  (TEST-CollectionTooManyReplicasTest.testAddTooManyReplicas-seed#[1D1CFFA3D10A3538]) [n:127.0.0.1:57746_    ] o.a.s.c.c.SolrZkClient makePath: /overseer/queue
   [junit4]   2> 46302 INFO  (TEST-CollectionTooManyReplicasTest.testAddTooManyReplicas-seed#[1D1CFFA3D10A3538]) [n:127.0.0.1:57746_    ] o.a.s.c.c.SolrZkClient makePath: /overseer/collection-queue-work
   [junit4]   2> 46307 INFO  (TEST-CollectionTooManyReplicasTest.testAddTooManyReplicas-seed#[1D1CFFA3D10A3538]) [n:127.0.0.1:57746_    ] o.a.s.c.c.SolrZkClient makePath: /overseer/collection-map-running
   [junit4]   2> 46312 INFO  (TEST-CollectionTooManyReplicasTest.testAddTooManyReplicas-seed#[1D1CFFA3D10A3538]) [n:127.0.0.1:57746_    ] o.a.s.c.c.SolrZkClient makePath: /overseer/collection-map-completed
   [junit4]   2> 46314 INFO  (TEST-CollectionTooManyReplicasTest.testAddTooManyReplicas-seed#[1D1CFFA3D10A3538]) [n:127.0.0.1:57746_    ] o.a.s.c.c.SolrZkClient makePath: /overseer/collection-map-failure
   [junit4]   2> 46327 INFO  (TEST-CollectionTooManyReplicasTest.testAddTooManyReplicas-seed#[1D1CFFA3D10A3538]) [n:127.0.0.1:57746_    ] o.a.s.c.c.SolrZkClient makePath: /live_nodes
   [junit4]   2> 46329 INFO  (TEST-CollectionTooManyReplicasTest.testAddTooManyReplicas-seed#[1D1CFFA3D10A3538]) [n:127.0.0.1:57746_    ] o.a.s.c.c.SolrZkClient makePath: /aliases.json
   [junit4]   2> 46332 INFO  (TEST-CollectionTooManyReplicasTest.testAddTooManyReplicas-seed#[1D1CFFA3D10A3538]) [n:127.0.0.1:57746_    ] o.a.s.c.c.SolrZkClient makePath: /clusterstate.json
   [junit4]   2> 46333 INFO  (TEST-CollectionTooManyReplicasTest.testAddTooManyReplicas-seed#[1D1CFFA3D10A3538]) [n:127.0.0.1:57746_    ] o.a.s.c.c.SolrZkClient makePath: /security.json
   [junit4]   2> 46335 INFO  (TEST-CollectionTooManyReplicasTest.testAddTooManyReplicas-seed#[1D1CFFA3D10A3538]) [n:127.0.0.1:57746_    ] o.a.s.c.c.ZkStateReader Updating cluster state from ZooKeeper... 
   [junit4]   2> 46351 INFO  (TEST-CollectionTooManyReplicasTest.testAddTooManyReplicas-seed#[1D1CFFA3D10A3538]) [n:127.0.0.1:57746_    ] o.a.s.c.c.ZkStateReader Updated live nodes from ZooKeeper... (0) -> (0)
   [junit4]   2> 46362 INFO  (TEST-CollectionTooManyReplicasTest.testAddTooManyReplicas-seed#[1D1CFFA3D10A3538]) [n:127.0.0.1:57746_    ] o.a.s.c.c.SolrZkClient makePath: /overseer_elect
   [junit4]   2> 46364 INFO  (TEST-CollectionTooManyReplicasTest.testAddTooManyReplicas-seed#[1D1CFFA3D10A3538]) [n:127.0.0.1:57746_    ] o.a.s.c.c.SolrZkClient makePath: /overseer_elect/election
   [junit4]   2> 46365 INFO  (TEST-CollectionTooManyReplicasTest.testAddTooManyReplicas-seed#[1D1CFFA3D10A3538]) [n:127.0.0.1:57746_    ] o.a.s.c.Overseer Overseer (id=null) closing
   [junit4]   2> 46367 INFO  (TEST-CollectionTooManyReplicasTest.testAddTooManyReplicas-seed#[1D1CFFA3D10A3538]) [n:127.0.0.1:57746_    ] o.a.s.c.LeaderElector Joined leadership election with path: /overseer_elect/election/95494776096948228-127.0.0.1:57746_-n_0000000000
   [junit4]   2> 46368 INFO  (TEST-CollectionTooManyReplicasTest.testAddTooManyReplicas-seed#[1D1CFFA3D10A3538]) [n:127.0.0.1:57746_    ] o.a.s.c.OverseerElectionContext I am going to be the leader 127.0.0.1:57746_
   [junit4]   2> 46368 INFO  (TEST-CollectionTooManyReplicasTest.testAddTooManyReplicas-seed#[1D1CFFA3D10A3538]) [n:127.0.0.1:57746_    ] o.a.s.c.c.SolrZkClient makePath: /overseer_elect/leader
   [junit4]   2> 46370 INFO  (TEST-CollectionTooManyReplicasTest.testAddTooManyReplicas-seed#[1D1CFFA3D10A3538]) [n:127.0.0.1:57746_    ] o.a.s.c.Overseer Overseer (id=95494776096948228-127.0.0.1:57746_-n_0000000000) starting
   [junit4]   2> 46383 INFO  (TEST-CollectionTooManyReplicasTest.testAddTooManyReplicas-seed#[1D1CFFA3D10A3538]) [n:127.0.0.1:57746_    ] o.a.s.c.c.SolrZkClient makePath: /overseer/queue-work
   [junit4]   2> 46420 INFO  (TEST-CollectionTooManyReplicasTest.testAddTooManyReplicas-seed#[1D1CFFA3D10A3538]) [n:127.0.0.1:57746_    ] o.a.s.c.OverseerAutoReplicaFailoverThread Starting OverseerAutoReplicaFailoverThread autoReplicaFailoverWorkLoopDelay=10000 autoReplicaFailoverWaitAfterExpiration=30000 autoReplicaFailoverBadNodeExpiration=60000
   [junit4]   2> 46425 INFO  (OverseerCollectionConfigSetProcessor-95494776096948228-127.0.0.1:57746_-n_0000000000) [n:127.0.0.1:57746_    ] o.a.s.c.OverseerTaskProcessor Process current queue of overseer operations
   [junit4]   2> 46426 INFO  (TEST-CollectionTooManyReplicasTest.testAddTooManyReplicas-seed#[1D1CFFA3D10A3538]) [n:127.0.0.1:57746_    ] o.a.s.c.ZkController Register node as live in ZooKeeper:/live_nodes/127.0.0.1:57746_
   [junit4]   2> 46427 INFO  (TEST-CollectionTooManyReplicasTest.testAddTooManyReplicas-seed#[1D1CFFA3D10A3538]) [n:127.0.0.1:57746_    ] o.a.s.c.c.SolrZkClient makePath: /live_nodes/127.0.0.1:57746_
   [junit4]   2> 46429 INFO  (zkCallback-51-thread-1-processing-n:127.0.0.1:57746_) [n:127.0.0.1:57746_    ] o.a.s.c.c.ZkStateReader A live node change: [WatchedEvent state:SyncConnected type:NodeChildrenChanged path:/live_nodes], has occurred - updating... (live nodes size: [0])
   [junit4]   2> 46429 INFO  (OverseerStateUpdate-95494776096948228-127.0.0.1:57746_-n_0000000000) [n:127.0.0.1:57746_    ] o.a.s.c.Overseer Starting to work on the main queue
   [junit4]   2> 46430 INFO  (zkCallback-51-thread-1-processing-n:127.0.0.1:57746_) [n:127.0.0.1:57746_    ] o.a.s.c.c.ZkStateReader Updated live nodes from ZooKeeper... (0) -> (1)
   [junit4]   2> 46431 INFO  (OverseerStateUpdate-95494776096948228-127.0.0.1:57746_-n_0000000000) [n:127.0.0.1:57746_    ] o.a.s.c.c.ZkStateReader Updated live nodes from ZooKeeper... (1) -> (1)
   [junit4]   2> 46506 INFO  (TEST-CollectionTooManyReplicasTest.testAddTooManyReplicas-seed#[1D1CFFA3D10A3538]) [n:127.0.0.1:57746_    ] o.a.s.c.CoreContainer Security conf doesn't exist. Skipping setup for authorization module.
   [junit4]   2> 46506 INFO  (TEST-CollectionTooManyReplicasTest.testAddTooManyReplicas-seed#[1D1CFFA3D10A3538]) [n:127.0.0.1:57746_    ] o.a.s.c.CoreContainer No authentication plugin used.
   [junit4]   2> 46507 INFO  (TEST-CollectionTooManyReplicasTest.testAddTooManyReplicas-seed#[1D1CFFA3D10A3538]) [n:127.0.0.1:57746_    ] o.a.s.c.CorePropertiesLocator Looking for core definitions underneath C:\Users\JenkinsSlave\workspace\Lucene-Solr-6.x-Windows\solr\build\solr-core\test\J1\temp\solr.cloud.CollectionTooManyReplicasTest_1D1CFFA3D10A3538-001\control-001\cores
   [junit4]   2> 46512 INFO  (TEST-CollectionTooManyReplicasTest.testAddTooManyReplicas-seed#[1D1CFFA3D10A3538]) [n:127.0.0.1:57746_    ] o.a.s.c.CoreDescriptor Created CoreDescriptor: {name=collection1, config=solrconfig.xml, transient=false, schema=schema.xml, loadOnStartup=true, configSetProperties=configsetprops.json, collection=control_collection, coreNodeName=, dataDir=data\, shard=}
   [junit4]   2> 46512 INFO  (TEST-CollectionTooManyReplicasTest.testAddTooManyReplicas-seed#[1D1CFFA3D10A3538]) [n:127.0.0.1:57746_    ] o.a.s.c.CorePropertiesLocator Found core collection1 in C:\Users\JenkinsSlave\workspace\Lucene-Solr-6.x-Windows\solr\build\solr-core\test\J1\temp\solr.cloud.CollectionTooManyReplicasTest_1D1CFFA3D10A3538-001\control-001\cores\collection1
   [junit4]   2> 46512 INFO  (TEST-CollectionTooManyReplicasTest.testAddTooManyReplicas-seed#[1D1CFFA3D10A3538]) [n:127.0.0.1:57746_    ] o.a.s.c.CorePropertiesLocator Found 1 core definitions
   [junit4]   2> 46513 INFO  (TEST-CollectionTooManyReplicasTest.testAddTooManyReplicas-seed#[1D1CFFA3D10A3538]) [n:127.0.0.1:57746_    ] o.a.s.s.SolrDispatchFilter user.dir=C:\Users\JenkinsSlave\workspace\Lucene-Solr-6.x-Windows\solr\build\solr-core\test\J1
   [junit4]   2> 46513 INFO  (TEST-CollectionTooManyReplicasTest.testAddTooManyReplicas-seed#[1D1CFFA3D10A3538]) [n:127.0.0.1:57746_    ] o.a.s.s.SolrDispatchFilter SolrDispatchFilter.init() done
   [junit4]   2> 46513 INFO  (coreLoadExecutor-208-thread-1-processing-n:127.0.0.1:57746_) [n:127.0.0.1:57746_ c:control_collection   x:collection1] o.a.s.c.ZkController publishing state=down
   [junit4]   2> 46514 INFO  (coreLoadExecutor-208-thread-1-processing-n:127.0.0.1:57746_) [n:127.0.0.1:57746_ c:control_collection   x:collection1] o.a.s.c.ZkController numShards not found on descriptor - reading it from system property
   [junit4]   2> 46520 INFO  (OverseerStateUpdate-95494776096948228-127.0.0.1:57746_-n_0000000000) [n:127.0.0.1:57746_    ] o.a.s.c.Overseer processMessage: queueSize: 1, message = {
   [junit4]   2>   "core":"collection1",
   [junit4]   2>   "roles":null,
   [junit4]   2>   "base_url":"http://127.0.0.1:57746",
   [junit4]   2>   "node_name":"127.0.0.1:57746_",
   [junit4]   2>   "numShards":"1",
   [junit4]   2>   "state":"down",
   [junit4]   2>   "shard":null,
   [junit4]   2>   "collection":"control_collection",
   [junit4]   2>   "operation":"state"} current state version: 0
   [junit4]   2> 46520 INFO  (coreLoadExecutor-208-thread-1-processing-n:127.0.0.1:57746_) [n:127.0.0.1:57746_ c:control_collection   x:collection1] o.a.s.c.ZkController look for our core node name
   [junit4]   2> 46543 INFO  (OverseerStateUpdate-95494776096948228-127.0.0.1:57746_-n_0000000000) [n:127.0.0.1:57746_    ] o.a.s.c.o.ReplicaMutator Update state numShards=1 message={
   [junit4]   2>   "core":"collection1",
   [junit4]   2>   "roles":null,
   [junit4]   2>   "base_url":"http://127.0.0.1:57746",
   [junit4]   2>   "node_name":"127.0.0.1:57746_",
   [junit4]   2>   "numShards":"1",
   [junit4]   2>   "state":"down",
   [junit4]   2>   "shard":null,
   [junit4]   2>   "collection":"control_collection",
   [junit4]   2>   "operation":"state"}
   [junit4]   2> 46547 INFO  (OverseerStateUpdate-95494776096948228-127.0.0.1:57746_-n_0000000000) [n:127.0.0.1:57746_    ] o.a.s.c.o.ClusterStateMutator building a new cName: control_collection
   [junit4]   2> 46562 INFO  (OverseerStateUpdate-95494776096948228-127.0.0.1:57746_-n_0000000000) [n:127.0.0.1:57746_    ] o.a.s.c.o.ReplicaMutator Assigning new node to shard shard=shard1
   [junit4]   2> 46570 INFO  (zkCallback-51-thread-1-processing-n:127.0.0.1:57746_) [n:127.0.0.1:57746_    ] o.a.s.c.c.ZkStateReader A cluster state change: [WatchedEvent state:SyncConnected type:NodeDataChanged path:/clusterstate.json], has occurred - updating... (live nodes size: [1])
   [junit4]   2> 47408 INFO  (coreLoadExecutor-208-thread-1-processing-n:127.0.0.1:57746_) [n:127.0.0.1:57746_ c:control_collection   x:collection1] o.a.s.c.ZkController waiting to find shard id in clusterstate for collection1
   [junit4]   2> 47408 INFO  (coreLoadExecutor-208-thread-1-processing-n:127.0.0.1:57746_) [n:127.0.0.1:57746_ c:control_collection   x:collection1] o.a.s.c.ZkController Check for collection zkNode:control_collection
   [junit4]   2> 47408 INFO  (coreLoadExecutor-208-thread-1-processing-n:127.0.0.1:57746_) [n:127.0.0.1:57746_ c:control_collection   x:collection1] o.a.s.c.ZkController Collection zkNode exists
   [junit4]   2> 47408 INFO  (coreLoadExecutor-208-thread-1-processing-n:127.0.0.1:57746_) [n:127.0.0.1:57746_ c:control_collection   x:collection1] o.a.s.c.c.ZkStateReader Load collection config from: [/collections/control_collection]
   [junit4]   2> 47409 INFO  (coreLoadExecutor-208-thread-1-processing-n:127.0.0.1:57746_) [n:127.0.0.1:57746_ c:control_collection   x:collection1] o.a.s.c.c.ZkStateReader path=[/collections/control_collection] [configName]=[conf1] specified config exists in ZooKeeper
   [junit4]   2> 47409 INFO  (coreLoadExecutor-208-thread-1-processing-n:127.0.0.1:57746_) [n:127.0.0.1:57746_ c:control_collection   x:collection1] o.a.s.c.SolrResourceLoader new SolrResourceLoader for directory: 'C:\Users\JenkinsSlave\workspace\Lucene-Solr-6.x-Windows\solr\build\solr-core\test\J1\temp\solr.cloud.CollectionTooManyReplicasTest_1D1CFFA3D10A3538-001\control-001\cores\collection1'
   [junit4]   2> 47409 INFO  (coreLoadExecutor-208-thread-1-processing-n:127.0.0.1:57746_) [n:127.0.0.1:57746_ c:control_collection   x:collection1] o.a.s.c.SolrResourceLoader JNDI not configured for solr (NoInitialContextEx)
   [junit4]   2> 47410 INFO  (coreLoadExecutor-208-thread-1-processing-n:127.0.0.1:57746_) [n:127.0.0.1:57746_ c:control_collection   x:collection1] o.a.s.c.SolrResourceLoader solr home defaulted to 'solr/' (could not find system property or JNDI)
   [junit4]   2> 47414 INFO  (coreLoadExecutor-208-thread-1-processing-n:127.0.0.1:57746_) [n:127.0.0.1:57746_ c:control_collection   x:collection1] o.a.s.c.Config loaded config solrconfig.xml with version 0 
   [junit4]   2> 47424 INFO  (coreLoadExecutor-208-thread-1-processing-n:127.0.0.1:57746_) [n:127.0.0.1:57746_ c:control_collection   x:collection1] o.a.s.c.SolrConfig current version of requestparams : -1
   [junit4]   2> 47427 WARN  (coreLoadExecutor-208-thread-1-processing-n:127.0.0.1:57746_) [n:127.0.0.1:57746_ c:control_collection   x:collection1] o.a.s.c.Config Beginning with Solr 5.5, <mergePolicy> is deprecated, use <mergePolicyFactory> instead.
   [junit4]   2> 47427 INFO  (coreLoadExecutor-208-thread-1-processing-n:127.0.0.1:57746_) [n:127.0.0.1:57746_ c:control_collection   x:collection1] o.a.s.c.SolrConfig Using Lucene MatchVersion: 6.1.0
   [junit4]   2> 47474 INFO  (coreLoadExecutor-208-thread-1-processing-n:127.0.0.1:57746_) [n:127.0.0.1:57746_ c:control_collection   x:collection1] o.a.s.c.SolrConfig Loaded SolrConfig: solrconfig.xml
   [junit4]   2> 47483 INFO  (coreLoadExecutor-208-thread-1-processing-n:127.0.0.1:57746_) [n:127.0.0.1:57746_ c:control_collection   x:collection1] o.a.s.s.IndexSchema [collection1] Schema name=test
   [junit4]   2> 47582 INFO  (coreLoadExecutor-208-thread-1-processing-n:127.0.0.1:57746_) [n:127.0.0.1:57746_ c:control_collection   x:collection1] o.a.s.s.OpenExchangeRatesOrgProvider Initialized with rates=open-exchange-rates.json, refreshInterval=1440.
   [junit4]   2> 47597 INFO  (coreLoadExecutor-208-thread-1-processing-n:127.0.0.1:57746_) [n:127.0.0.1:57746_ c:control_collection   x:collection1] o.a.s.s.IndexSchema default search field in schema is text
   [junit4]   2> 47599 INFO  (coreLoadExecutor-208-thread-1-processing-n:127.0.0.1:57746_) [n:127.0.0.1:57746_ c:control_collection   x:collection1] o.a.s.s.IndexSchema unique key field: id
   [junit4]   2> 47614 INFO  (coreLoadExecutor-208-thread-1-processing-n:127.0.0.1:57746_) [n:127.0.0.1:57746_ c:control_collection   x:collection1] o.a.s.s.FileExchangeRateProvider Reloading exchange rates from file currency.xml
   [junit4]   2> 47617 INFO  (coreLoadExecutor-208-thread-1-processing-n:127.0.0.1:57746_) [n:127.0.0.1:57746_ c:control_collection   x:collection1] o.a.s.s.FileExchangeRateProvider Reloading exchange rates from file currency.xml
   [junit4]   2> 47620 INFO  (coreLoadExecutor-208-thread-1-processing-n:127.0.0.1:57746_) [n:127.0.0.1:57746_ c:control_collection   x:collection1] o.a.s.s.OpenExchangeRatesOrgProvider Reloading exchange rates from open-exchange-rates.json
   [junit4]   2> 47621 INFO  (coreLoadExecutor-208-thread-1-processing-n:127.0.0.1:57746_) [n:127.0.0.1:57746_ c:control_collection   x:collection1] o.a.s.s.OpenExchangeRatesOrgProvider Reloading exchange rates from open-exchange-rates.json
   [junit4]   2> 47625 INFO  (coreLoadExecutor-208-thread-1-processing-n:127.0.0.1:57746_) [n:127.0.0.1:57746_ c:control_collection   x:collection1] o.a.s.c.ConfigSetProperties Did not find ConfigSet properties, assuming default properties: Can't find resource 'configsetprops.json' in classpath or '/configs/conf1', cwd=C:\Users\JenkinsSlave\workspace\Lucene-Solr-6.x-Windows\solr\build\solr-core\test\J1
   [junit4]   2> 47625 INFO  (coreLoadExecutor-208-thread-1-processing-n:127.0.0.1:57746_) [n:127.0.0.1:57746_ c:control_collection   x:collection1] o.a.s.c.CoreContainer Creating SolrCore 'collection1' using configuration from collection control_collection
   [junit4]   2> 47625 INFO  (coreLoadExecutor-208-thread-1-processing-n:127.0.0.1:57746_) [n:127.0.0.1:57746_ c:control_collection s:shard1 r:core_node1 x:collection1] o.a.s.c.SolrCore org.apache.solr.core.MockDirectoryFactory
   [junit4]   2> 47626 INFO  (coreLoadExecutor-208-thread-1-processing-n:127.0.0.1:57746_) [n:127.0.0.1:57746_ c:control_collection s:shard1 r:core_node1 x:collection1] o.a.s.c.SolrCore [[collection1] ] Opening new SolrCore at [C:\Users\JenkinsSlave\workspace\Lucene-Solr-6.x-Windows\solr\build\solr-core\test\J1\temp\solr.cloud.CollectionTooManyReplicasTest_1D1CFFA3D10A3538-001\control-001\cores\collection1], dataDir=[C:\Users\JenkinsSlave\workspace\Lucene-Solr-6.x-Windows\solr\build\solr-core\test\J1\temp\solr.cloud.CollectionTooManyReplicasTest_1D1CFFA3D10A3538-001\control-001\cores\collection1\data\]
   [junit4]   2> 47626 INFO  (coreLoadExecutor-208-thread-1-processing-n:127.0.0.1:57746_) [n:127.0.0.1:57746_ c:control_collection s:shard1 r:core_node1 x:collection1] o.a.s.c.JmxMonitoredMap JMX monitoring is enabled. Adding Solr mbeans to JMX Server: com.sun.jmx.mbeanserver.JmxMBeanServer@7b0d7b96
   [junit4]   2> 47626 INFO  (coreLoadExecutor-208-thread-1-processing-n:127.0.0.1:57746_) [n:127.0.0.1:57746_ c:control_collection s:shard1 r:core_node1 x:collection1] o.a.s.c.CachingDirectoryFactory return new directory for C:\Users\JenkinsSlave\workspace\Lucene-Solr-6.x-Windows\solr\build\solr-core\test\J1\temp\solr.cloud.CollectionTooManyReplicasTest_1D1CFFA3D10A3538-001\control-001\cores\collection1\data\
   [junit4]   2> 47626 INFO  (coreLoadExecutor-208-thread-1-processing-n:127.0.0.1:57746_) [n:127.0.0.1:57746_ c:control_collection s:shard1 r:core_node1 x:collection1] o.a.s.c.SolrCore New index directory detected: old=null new=C:\Users\JenkinsSlave\workspace\Lucene-Solr-6.x-Windows\solr\build\solr-core\test\J1\temp\solr.cloud.CollectionTooManyReplicasTest_1D1CFFA3D10A3538-001\control-001\cores\collection1\data\index/
   [junit4]   2> 47626 WARN  (coreLoadExecutor-208-thread-1-processing-n:127.0.0.1:57746_) [n:127.0.0.1:57746_ c:control_collection s:shard1 r:core_node1 x:collection1] o.a.s.c.SolrCore [collection1] Solr index directory 'C:\Users\JenkinsSlave\workspace\Lucene-Solr-6.x-Windows\solr\build\solr-core\test\J1\temp\solr.cloud.CollectionTooManyReplicasTest_1D1CFFA3D10A3538-001\control-001\cores\collection1\data\index' doesn't exist. Creating new index...
   [junit4]   2> 47627 INFO  (coreLoadExecutor-208-thread-1-processing-n:127.0.0.1:57746_) [n:127.0.0.1:57746_ c:control_collection s:shard1 r:core_node1 x:collection1] o.a.s.c.CachingDirectoryFactory return new directory for C:\Users\JenkinsSlave\workspace\Lucene-Solr-6.x-Windows\solr\build\solr-core\test\J1\temp\solr.cloud.CollectionTooManyReplicasTest_1D1CFFA3D10A3538-001\control-001\cores\collection1\data\index
   [junit4]   2> 47627 INFO  (coreLoadExecutor-208-thread-1-processing-n:127.0.0.1:57746_) [n:127.0.0.1:57746_ c:control_collection s:shard1 r:core_node1 x:collection1] o.a.s.u.RandomMergePolicy RandomMergePolicy wrapping class org.apache.lucene.index.LogDocMergePolicy: [LogDocMergePolicy: minMergeSize=1000, mergeFactor=33, maxMergeSize=9223372036854775807, maxMergeSizeForForcedMerge=9223372036854775807, calibrateSizeByDeletes=true, maxMergeDocs=2147483647, maxCFSSegmentSizeMB=8.796093022207999E12, noCFSRatio=1.0]
   [junit4]   2> 47627 INFO  (coreLoadExecutor-208-thread-1-processing-n:127.0.0.1:57746_) [n:127.0.0.1:57746_ c:control_collection s:shard1 r:core_node1 x:collection1] o.a.s.c.SolrDeletionPolicy SolrDeletionPolicy.onCommit: commits: num=1
   [junit4]   2> 	commit{dir=MockDirectoryWrapper(RAMDirectory@7ef1ba6d lockFactory=org.apache.lucene.store.SingleInstanceLockFactory@13dd47a2),segFN=segments_1,generation=1}
   [junit4]   2> 47627 INFO  (coreLoadExecutor-208-thread-1-processing-n:127.0.0.1:57746_) [n:127.0.0.1:57746_ c:control_collection s:shard1 r:core_node1 x:collection1] o.a.s.c.SolrDeletionPolicy newest commit generation = 1
   [junit4]   2> 47627 INFO  (OldIndexDirectoryCleanupThreadForCore-collection1) [n:127.0.0.1:57746_ c:control_collection s:shard1 r:core_node1 x:collection1] o.a.s.c.SolrCore Looking for old index directories to cleanup for core collection1 in C:\Users\JenkinsSlave\workspace\Lucene-Solr-6.x-Windows\solr\build\solr-core\test\J1\temp\solr.cloud.CollectionTooManyReplicasTest_1D1CFFA3D10A3538-001\control-001\cores\collection1\data\
   [junit4]   2> 47627 WARN  (OldIndexDirectoryCleanupThreadForCore-collection1) [n:127.0.0.1:57746_ c:control_collection s:shard1 r:core_node1 x:collection1] o.a.s.c.DirectoryFactory C:\Users\JenkinsSlave\workspace\Lucene-Solr-6.x-Windows\solr\build\solr-core\test\J1\temp\solr.cloud.CollectionTooManyReplicasTest_1D1CFFA3D10A3538-001\control-001\cores\collection1\data\ does not point to a valid data directory; skipping clean-up of old index directories.
   [junit4]   2> 47639 INFO  (coreLoadExecutor-208-thread-1-processing-n:127.0.0.1:57746_) [n:127.0.0.1:57746_ c:control_collection s:shard1 r:core_node1 x:collection1] o.a.s.u.p.UpdateRequestProcessorChain creating updateRequestProcessorChain "nodistrib"
   [junit4]   2> 47678 INFO  (coreLoadExecutor-208-thread-1-processing-n:127.0.0.1:57746_) [n:127.0.0.1:57746_ c:control_collection s:shard1 r:core_node1 x:collection1] o.a.s.u.p.UpdateRequestProcessorChain creating updateRequestProcessorChain "dedupe"
   [junit4]   2> 47679 INFO  (coreLoadExecutor-208-thread-1-processing-n:127.0.0.1:57746_) [n:127.0.0.1:57746_ c:control_collection s:shard1 r:core_node1 x:collection1] o.a.s.u.p.UpdateRequestProcessorChain inserting DistributedUpdateProcessorFactory into updateRequestProcessorChain "dedupe"
   [junit4]   2> 47679 INFO  (coreLoadExecutor-208-thread-1-processing-n:127.0.0.1:57746_) [n:127.0.0.1:57746_ c:control_collection s:shard1 r:core_node1 x:collection1] o.a.s.u.p.UpdateRequestProcessorChain creating updateRequestProcessorChain "stored_sig"
   [junit4]   2> 47679 INFO  (coreLoadExecutor-208-thread-1-processing-n:127.0.0.1:57746_) [n:127.0.0.1:57746_ c:control_collection s:shard1 r:core_node1 x:collection1] o.a.s.u.p.UpdateRequestProcessorChain inserting DistributedUpdateProcessorFactory into updateRequestProcessorChain "stored_sig"
   [junit4]   2> 47679 INFO  (coreLoadExecutor-208-thread-1-processing-n:127.0.0.1:57746_) [n:127.0.0.1:57746_ c:control_collection s:shard1 r:core_node1 x:collection1] o.a.s.u.p.UpdateRequestProcessorChain creating updateRequestProcessorChain "distrib-dup-test-chain-explicit"
   [junit4]   2> 47679 INFO  (coreLoadExecutor-208-thread-1-processing-n:127.0.0.1:57746_) [n:127.0.0.1:57746_ c:control_collection s:shard1 r:core_node1 x:collection1] o.a.s.u.p.UpdateRequestProcessorChain creating updateRequestProcessorChain "distrib-dup-test-chain-implicit"
   [junit4]   2> 47679 INFO  (coreLoadExecutor-208-thread-1-processing-n:127.0.0.1:57746_) [n:127.0.0.1:57746_ c:control_collection s:shard1 r:core_node1 x:collection1] o.a.s.u.p.UpdateRequestProcessorChain inserting DistributedUpdateProcessorFactory into updateRequestProcessorChain "distrib-dup-test-chain-implicit"
   [junit4]   2> 47679 INFO  (coreLoadExecutor-208-thread-1-processing-n:127.0.0.1:57746_) [n:127.0.0.1:57746_ c:control_collection s:shard1 r:core_node1 x:collection1] o.a.s.c.SolrCore no updateRequestProcessorChain defined as default, creating implicit default
   [junit4]   2> 47679 WARN  (coreLoadExecutor-208-thread-1-processing-n:127.0.0.1:57746_) [n:127.0.0.1:57746_ c:control_collection s:shard1 r:core_node1 x:collection1] o.a.s.c.RequestHandlers INVALID paramSet a in requestHandler {type = requestHandler,name = /dump,class = DumpRequestHandler,args = {defaults={a=A,b=B}}}
   [junit4]   2> 47685 INFO  (coreLoadExecutor-208-thread-1-processing-n:127.0.0.1:57746_) [n:127.0.0.1:57746_ c:control_collection s:shard1 r:core_node1 x:collection1] o.a.s.h.l.XMLLoader xsltCacheLifetimeSeconds=60
   [junit4]   2> 47685 INFO  (coreLoadExecutor-208-thread-1-processing-n:127.0.0.1:57746_) [n:127.0.0.1:57746_ c:control_collection s:shard1 r:core_node1 x:collection1] o.a.s.h.l.XMLLoader xsltCacheLifetimeSeconds=60
   [junit4]   2> 47687 INFO  (coreLoadExecutor-208-thread-1-processing-n:127.0.0.1:57746_) [n:127.0.0.1:57746_ c:control_collection s:shard1 r:core_node1 x:collection1] o.a.s.h.l.XMLLoader xsltCacheLifetimeSeconds=60
   [junit4]   2> 47688 INFO  (coreLoadExecutor-208-thread-1-processing-n:127.0.0.1:57746_) [n:127.0.0.1:57746_ c:control_collection s:shard1 r:core_node1 x:collection1] o.a.s.h.l.XMLLoader xsltCacheLifetimeSeconds=60
   [junit4]   2> 47711 INFO  (coreLoadExecutor-208-thread-1-processing-n:127.0.0.1:57746_) [n:127.0.0.1:57746_ c:control_collection s:shard1 r:core_node1 x:collection1] o.a.s.c.RequestHandlers Registered paths: /admin/mbeans,standard,/dump,/update/csv,/sql,/update/json/docs,/admin/luke,/export,/admin/segments,/get,/admin/system,/replication,/admin/properties,/config,/stream,/schema,/admin/plugins,/admin/logging,/update/json,/admin/ping,/admin/threads,/update,/admin/file
   [junit4]   2> 47711 INFO  (coreLoadExecutor-208-thread-1-processing-n:127.0.0.1:57746_) [n:127.0.0.1:57746_ c:control_collection s:shard1 r:core_node1 x:collection1] o.a.s.c.SolrCore Using default statsCache cache: org.apache.solr.search.stats.LocalStatsCache
   [junit4]   2> 47713 INFO  (coreLoadExecutor-208-thread-1-processing-n:127.0.0.1:57746_) [n:127.0.0.1:57746_ c:control_collection s:shard1 r:core_node1 x:collection1] o.a.s.u.UpdateHandler Using UpdateLog implementation: org.apache.solr.update.UpdateLog
   [junit4]   2> 47713 INFO  (coreLoadExecutor-208-thread-1-processing-n:127.0.0.1:57746_) [n:127.0.0.1:57746_ c:control_collection s:shard1 r:core_node1 x:collection1] o.a.s.u.UpdateLog Initializing UpdateLog: dataDir= defaultSyncLevel=FLUSH numRecordsToKeep=100 maxNumLogsToKeep=10 numVersionBuckets=65536
   [junit4]   2> 47714 INFO  (coreLoadExecutor-208-thread-1-processing-n:127.0.0.1:57746_) [n:127.0.0.1:57746_ c:control_collection s:shard1 r:core_node1 x:collection1] o.a.s.u.CommitTracker Hard AutoCommit: disabled
   [junit4]   2> 47714 INFO  (coreLoadExecutor-208-thread-1-processing-n:127.0.0.1:57746_) [n:127.0.0.1:57746_ c:control_collection s:shard1 r:core_node1 x:collection1] o.a.s.u.CommitTracker Soft AutoCommit: disabled
   [junit4]   2> 47715 INFO  (coreLoadExecutor-208-thread-1-processing-n:127.0.0.1:57746_) [n:127.0.0.1:57746_ c:control_collection s:shard1 r:core_node1 x:collection1] o.a.s.u.RandomMergePolicy RandomMergePolicy wrapping class org.apache.lucene.index.TieredMergePolicy: [TieredMergePolicy: maxMergeAtOnce=37, maxMergeAtOnceExplicit=16, maxMergedSegmentMB=23.3984375, floorSegmentMB=1.5859375, forceMergeDeletesPctAllowed=24.729567066470697, segmentsPerTier=40.0, maxCFSSegmentSizeMB=8.796093022207999E12, noCFSRatio=1.0
   [junit4]   2> 47715 INFO  (coreLoadExecutor-208-thread-1-processing-n:127.0.0.1:57746_) [n:127.0.0.1:57746_ c:control_collection s:shard1 r:core_node1 x:collection1] o.a.s.c.SolrDeletionPolicy SolrDeletionPolicy.onInit: commits: num=1
   [junit4]   2> 	commit{dir=MockDirectoryWrapper(RAMDirectory@7ef1ba6d lockFactory=org.apache.lucene.store.SingleInstanceLockFactory@13dd47a2),segFN=segments_1,generation=1}
   [junit4]   2> 47715 INFO  (coreLoadExecutor-208-thread-1-processing-n:127.0.0.1:57746_) [n:127.0.0.1:57746_ c:control_collection s:shard1 r:core_node1 x:collection1] o.a.s.c.SolrDeletionPolicy newest commit generation = 1
   [junit4]   2> 47715 INFO  (coreLoadExecutor-208-thread-1-processing-n:127.0.0.1:57746_) [n:127.0.0.1:57746_ c:control_collection s:shard1 r:core_node1 x:collection1] o.a.s.s.SolrIndexSearcher Opening [Searcher@7e41fc6[collection1] main]
   [junit4]   2> 47716 INFO  (coreLoadExecutor-208-thread-1-processing-n:127.0.0.1:57746_) [n:127.0.0.1:57746_ c:control_collection s:shard1 r:core_node1 x:collection1] o.a.s.c.c.ZkStateReader Load collection config from: [/collections/control_collection]
   [junit4]   2> 47718 INFO  (coreLoadExecutor-208-thread-1-processing-n:127.0.0.1:57746_) [n:127.0.0.1:57746_ c:control_collection s:shard1 r:core_node1 x:collection1] o.a.s.c.c.ZkStateReader path=[/collections/control_collection] [configName]=[conf1] specified config exists in ZooKeeper
   [junit4]   2> 47718 INFO  (coreLoadExecutor-208-thread-1-processing-n:127.0.0.1:57746_) [n:127.0.0.1:57746_ c:control_collection s:shard1 r:core_node1 x:collection1] o.a.s.r.ManagedResourceStorage Setting up ZooKeeper-based storage for the RestManager with znodeBase: /configs/conf1
   [junit4]   2> 47722 INFO  (coreLoadExecutor-208-thread-1-processing-n:127.0.0.1:57746_) [n:127.0.0.1:57746_ c:control_collection s:shard1 r:core_node1 x:collection1] o.a.s.r.ManagedResourceStorage Configured ZooKeeperStorageIO with znodeBase: /configs/conf1
   [junit4]   2> 47722 INFO  (coreLoadExecutor-208-thread-1-processing-n:127.0.0.1:57746_) [n:127.0.0.1:57746_ c:control_collection s:shard1 r:core_node1 x:collection1] o.a.s.r.RestManager Initializing RestManager with initArgs: {}
   [junit4]   2> 47722 INFO  (coreLoadExecutor-208-thread-1-processing-n:127.0.0.1:57746_) [n:127.0.0.1:57746_ c:control_collection s:shard1 r:core_node1 x:collection1] o.a.s.r.ManagedResourceStorage Reading _rest_managed.json using ZooKeeperStorageIO:path=/configs/conf1
   [junit4]   2> 47722 INFO  (coreLoadExecutor-208-thread-1-processing-n:127.0.0.1:57746_) [n:127.0.0.1:57746_ c:control_collection s:shard1 r:core_node1 x:collection1] o.a.s.r.ManagedResourceStorage No data found for znode /configs/conf1/_rest_managed.json
   [junit4]   2> 47723 INFO  (coreLoadExecutor-208-thread-1-processing-n:127.0.0.1:57746_) [n:127.0.0.1:57746_ c:control_collection s:shard1 r:core_node1 x:collection1] o.a.s.r.ManagedResourceStorage Loaded null at path _rest_managed.json using ZooKeeperStorageIO:path=/configs/conf1
   [junit4]   2> 47723 INFO  (coreLoadExecutor-208-thread-1-processing-n:127.0.0.1:57746_) [n:127.0.0.1:57746_ c:control_collection s:shard1 r:core_node1 x:collection1] o.a.s.r.RestManager Initializing 0 registered ManagedResources
   [junit4]   2> 47723 INFO  (coreLoadExecutor-208-thread-1-processing-n:127.0.0.1:57746_) [n:127.0.0.1:57746_ c:control_collection s:shard1 r:core_node1 x:collection1] o.a.s.h.ReplicationHandler Commits will be reserved for  10000
   [junit4]   2> 47724 INFO  (searcherExecutor-209-thread-1-processing-n:127.0.0.1:57746_ x:collection1 s:shard1 c:control_collection r:core_node1) [n:127.0.0.1:57746_ c:control_collection s:shard1 r:core_node1 x:collection1] o.a.s.c.SolrCore [collection1] Registered new searcher Searcher@7e41fc6[collection1] main{ExitableDirectoryReader(UninvertingDirectoryReader())}
   [junit4]   2> 47724 INFO  (coreLoadExecutor-208-thread-1-processing-n:127.0.0.1:57746_) [n:127.0.0.1:57746_ c:control_collection s:shard1 r:core_node1 x:collection1] o.a.s.u.UpdateLog Looking up max value of version field to seed version buckets
   [junit4]   2> 47724 INFO  (coreLoadExecutor-208-thread-1-processing-n:127.0.0.1:57746_) [n:127.0.0.1:57746_ c:control_collection s:shard1 r:core_node1 x:collection1] o.a.s.u.VersionInfo Refreshing highest value of _version_ for 65536 version buckets from index
   [junit4]   2> 47724 INFO  (coreLoadExecutor-208-thread-1-processing-n:127.0.0.1:57746_) [n:127.0.0.1:57746_ c:control_collection s:shard1 r:core_node1 x:collection1] o.a.s.u.VersionInfo No terms found for _version_, cannot seed version bucket highest value from index
   [junit4]   2> 47724 INFO  (coreLoadExecutor-208-thread-1-processing-n:127.0.0.1:57746_) [n:127.0.0.1:57746_ c:control_collection s:shard1 r:core_node1 x:collection1] o.a.s.u.UpdateLog Could not find max version in index or recent updates, using new clock 1527916419738501120
   [junit4]   2> 47724 INFO  (coreLoadExecutor-208-thread-1-processing-n:127.0.0.1:57746_) [n:127.0.0.1:57746_ c:control_collection s:shard1 r:core_node1 x:collection1] o.a.s.u.UpdateLog Took 1.0ms to seed version buckets with highest version 1527916419738501120
   [junit4]   2> 47725 INFO  (coreLoadExecutor-208-thread-1-processing-n:127.0.0.1:57746_) [n:127.0.0.1:57746_ c:control_collection s:shard1 r:core_node1 x:collection1] o.a.s.c.ZkController watch zkdir /configs/conf1
   [junit4]   2> 47727 INFO  (coreLoadExecutor-208-thread-1-processing-n:127.0.0.1:57746_) [n:127.0.0.1:57746_ c:control_collection s:shard1 r:core_node1 x:collection1] o.a.s.c.CoreContainer registering core: collection1
   [junit4]   2> 47729 INFO  (coreZkRegister-202-thread-1-processing-n:127.0.0.1:57746_ x:collection1 s:shard1 c:control_collection r:core_node1) [n:127.0.0.1:57746_ c:control_collection s:shard1 r:core_node1 x:collection1] o.a.s.c.ZkController Register replica - core:collection1 address:http://127.0.0.1:57746 collection:control_collection shard:shard1
   [junit4]   2> 47738 INFO  (coreZkRegister-202-thread-1-processing-n:127.0.0.1:57746_ x:collection1 s:shard1 c:control_collection r:core_node1) [n:127.0.0.1:57746_ c:control_collection s:shard1 r:core_node1 x:collection1] o.a.s.c.c.SolrZkClient makePath: /collections/control_collection/leader_elect/shard1/election
   [junit4]   2> 47743 INFO  (coreZkRegister-202-thread-1-processing-n:127.0.0.1:57746_ x:collection1 s:shard1 c:control_collection r:core_node1) [n:127.0.0.1:57746_ c:control_collection s:shard1 r:core_node1 x:collection1] o.a.s.c.LeaderElector Joined leadership election with path: /collections/control_collection/leader_elect/shard1/election/95494776096948228-core_node1-n_0000000000
   [junit4]   2> 47744 INFO  (coreZkRegister-202-thread-1-processing-n:127.0.0.1:57746_ x:collection1 s:shard1 c:control_collection r:core_node1) [n:127.0.0.1:57746_ c:control_collection s:shard1 r:core_node1 x:collection1] o.a.s.c.ShardLeaderElectionContext Running the leader process for shard=shard1 and weAreReplacement=false and leaderVoteWait=10000
   [junit4]   2> 47746 INFO  (coreZkRegister-202-thread-1-processing-n:127.0.0.1:57746_ x:collection1 s:shard1 c:control_collection r:core_node1) [n:127.0.0.1:57746_ c:control_collection s:shard1 r:core_node1 x:collection1] o.a.s.c.ShardLeaderElectionContext Enough replicas found to continue.
   [junit4]   2> 47746 INFO  (coreZkRegister-202-thread-1-processing-n:127.0.0.1:57746_ x:collection1 s:shard1 c:control_collection r:core_node1) [n:127.0.0.1:57746_ c:control_collection s:shard1 r:core_node1 x:collection1] o.a.s.c.ShardLeaderElectionContext I may be the new leader - try and sync
   [junit4]   2> 47747 INFO  (OverseerStateUpdate-95494776096948228-127.0.0.1:57746_-n_0000000000) [n:127.0.0.1:57746_    ] o.a.s.c.Overseer processMessage: queueSize: 1, message = {
   [junit4]   2>   "operation":"leader",
   [junit4]   2>   "shard":"shard1",
   [junit4]   2>   "collection":"control_collection"} current state version: 1
   [junit4]   2> 47748 INFO  (coreZkRegister-202-thread-1-processing-n:127.0.0.1:57746_ x:collection1 s:shard1 c:control_collection r:core_node1) [n:127.0.0.1:57746_ c:control_collection s:shard1 r:core_node1 x:collection1] o.a.s.c.SyncStrategy Sync replicas to http://127.0.0.1:57746/collection1/
   [junit4]   2> 47748 INFO  (coreZkRegister-202-thread-1-processing-n:127.0.0.1:57746_ x:collection1 s:shard1 c:control_collection r:core_node1) [n:127.0.0.1:57746_ c:control_collection s:shard1 r:core_node1 x:collection1] o.a.s.c.SyncStrategy Sync Success - now sync replicas to me
   [junit4]   2> 47748 INFO  (coreZkRegister-202-thread-1-processing-n:127.0.0.1:57746_ x:collection1 s:shard1 c:control_collection r:core_node1) [n:127.0.0.1:57746_ c:control_collection s:shard1 r:core_node1 x:collection1] o.a.s.c.SyncStrategy http://127.0.0.1:57746/collection1/ has no replicas
   [junit4]   2> 47755 INFO  (coreZkRegister-202-thread-1-processing-n:127.0.0.1:57746_ x:collection1 s:shard1 c:control_collection r:core_node1) [n:127.0.0.1:57746_ c:control_collection s:shard1 r:core_node1 x:collection1] o.a.s.c.c.SolrZkClient makePath: /collections/control_collection/leaders/shard1
   [junit4]   2> 47761 INFO  (coreZkRegister-202-thread-1-processing-n:127.0.0.1:57746_ x:collection1 s:shard1 c:control_collection r:core_node1) [n:127.0.0.1:57746_ c:control_collection s:shard1 r:core_node1 x:collection1] o.a.s.c.ShardLeaderElectionContextBase Creating leader registration node /collections/control_collection/leaders/shard1/leader after winning as /collections/control_collection/leader_elect/shard1/election/95494776096948228-core_node1-n_0000000000
   [junit4]   2> 47783 INFO  (coreZkRegister-202-thread-1-processing-n:127.0.0.1:57746_ x:collection1 s:shard1 c:control_collection r:core_node1) [n:127.0.0.1:57746_ c:control_collection s:shard1 r:core_node1 x:collection1] o.a.s.c.ShardLeaderElectionContext I am the new leader: http://127.0.0.1:57746/collection1/ shard1
   [junit4]   2> 47785 INFO  (OverseerStateUpdate-95494776096948228-127.0.0.1:57746_-n_0000000000) [n:127.0.0.1:57746_    ] o.a.s.c.Overseer processMessage: queueSize: 1, message = {
   [junit4]   2>   "operation":"leader",
   [junit4]   2>   "shard":"shard1",
   [junit4]   2>   "collection":"control_collection",
   [junit4]   2>   "base_url":"http://127.0.0.1:57746",
   [junit4]   2>   "core":"collection1",
   [junit4]   2>   "state":"active"} current state version: 1
   [junit4]   2> 47854 INFO  (TEST-CollectionTooManyReplicasTest.testAddTooManyReplicas-seed#[1D1CFFA3D10A3538]) [    ] o.a.s.c.c.SolrZkClient Using default ZkCredentialsProvider
   [junit4]   2> 47855 INFO  (TEST-CollectionTooManyReplicasTest.testAddTooManyReplicas-seed#[1D1CFFA3D10A3538]) [    ] o.a.s.c.c.ConnectionManager Waiting for client to connect to ZooKeeper
   [junit4]   2> 47857 INFO  (zkCallback-53-thread-1) [    ] o.a.s.c.c.ConnectionManager Watcher org.apache.solr.common.cloud.ConnectionManager@1add3658 name:ZooKeeperConnection Watcher:127.0.0.1:57739/solr got event WatchedEvent state:SyncConnected type:None path:null path:null type:None
   [junit4]   2> 47857 INFO  (TEST-CollectionTooManyReplicasTest.testAddTooManyReplicas-seed#[1D1CFFA3D10A3538]) [    ] o.a.s.c.c.ConnectionManager Client is connected to ZooKeeper
   [junit4]   2> 47857 INFO  (TEST-CollectionTooManyReplicasTest.testAddTooManyReplicas-seed#[1D1CFFA3D10A3538]) [    ] o.a.s.c.c.SolrZkClient Using default ZkACLProvider
   [junit4]   2> 47857 INFO  (TEST-CollectionTooManyReplicasTest.testAddTooManyReplicas-seed#[1D1CFFA3D10A3538]) [    ] o.a.s.c.c.ZkStateReader Updating cluster state from ZooKeeper... 
   [junit4]   2> 47859 INFO  (TEST-CollectionTooManyReplicasTest.testAddTooManyReplicas-seed#[1D1CFFA3D10A3538]) [    ] o.a.s.c.c.ZkStateReader Updated live nodes from ZooKeeper... (0) -> (1)
   [junit4]   2> 47862 INFO  (TEST-CollectionTooManyReplicasTest.testAddTooManyReplicas-seed#[1D1CFFA3D10A3538]) [    ] o.a.s.c.ChaosMonkey monkey: init - expire sessions:false cause connection loss:false
   [junit4]   2> 47880 INFO  (zkCallback-51-thread-1-processing-n:127.0.0.1:57746_) [n:127.0.0.1:57746_    ] o.a.s.c.c.ZkStateReader A cluster state change: [WatchedEvent state:SyncConnected type:NodeDataChanged path:/clusterstate.json], has occurred - updating... (live nodes size: [1])
   [junit4]   2> 47881 INFO  (zkCallback-53-thread-1) [    ] o.a.s.c.c.ZkStateReader A cluster state change: [WatchedEvent state:SyncConnected type:NodeDataChanged path:/clusterstate.json], has occurred - updating... (live nodes size: [1])
   [junit4]   2> 47921 INFO  (coreZkRegister-202-thread-1-processing-n:127.0.0.1:57746_ x:collection1 s:shard1 c:control_collection r:core_node1) [n:127.0.0.1:57746_ c:control_collection s:shard1 r:core_node1 x:collection1] o.a.s.c.ZkController We are http://127.0.0.1:57746/collection1/ and leader is http://127.0.0.1:57746/collection1/
   [junit4]   2> 47921 INFO  (coreZkRegister-202-thread-1-processing-n:127.0.0.1:57746_ x:collection1 s:shard1 c:control_collection r:core_node1) [n:127.0.0.1:57746_ c:control_collection s:shard1 r:core_node1 x:collection1] o.a.s.c.ZkController No LogReplay needed for core=collection1 baseURL=http://127.0.0.1:57746
   [junit4]   2> 47921 INFO  (coreZkRegister-202-thread-1-processing-n:127.0.0.1:57746_ x:collection1 s:shard1 c:control_collection r:core_node1) [n:127.0.0.1:57746_ c:control_collection s:shard1 r:core_node1 x:collection1] o.a.s.c.ZkController I am the leader, no recovery necessary
   [junit4]   2> 47921 INFO  (coreZkRegister-202-thread-1-processing-n:127.0.0.1:57746_ x:collection1 s:shard1 c:control_collection r:core_node1) [n:127.0.0.1:57746_ c:control_collection s:shard1 r:core_node1 x:collection1] o.a.s.c.ZkController publishing state=active
   [junit4]   2> 47921 INFO  (coreZkRegister-202-thread-1-processing-n:127.0.0.1:57746_ x:collection1 s:shard1 c:control_collection r:core_node1) [n:127.0.0.1:57746_ c:control_collection s:shard1 r:core_node1 x:collection1] o.a.s.c.ZkController numShards not found on descriptor - reading it from system property
   [junit4]   2> 47924 INFO  (coreZkRegister-202-thread-1-processing-n:127.0.0.1:57746_ x:collection1 s:shard1 c:control_collection r:core_node1) [n:127.0.0.1:57746_ c:control_collection s:shard1 r:core_node1 x:collection1] o.a.s.c.c.ZkStateReader Updated live nodes from ZooKeeper... (1) -> (1)
   [junit4]   2> 47926 INFO  (OverseerStateUpdate-95494776096948228-127.0.0.1:57746_-n_0000000000) [n:127.0.0.1:57746_    ] o.a.s.c.Overseer processMessage: queueSize: 1, message = {
   [junit4]   2>   "core":"collection1",
   [junit4]   2>   "core_node_name":"core_node1",
   [junit4]   2>   "roles":null,
   [junit4]   2>   "base_url":"http://127.0.0.1:57746",
   [junit4]   2>   "node_name":"127.0.0.1:57746_",
   [junit4]   2>   "numShards":"1",
   [junit4]   2>   "state":"active",
   [junit4]   2>   "shard":"shard1",
   [junit4]   2>   "collection":"control_collection",
   [junit4]   2>   "operation":"state"} current state version: 2
   [junit4]   2> 47926 INFO  (OverseerStateUpdate-95494776096948228-127.0.0.1:57746_-n_0000000000) [n:127.0.0.1:57746_    ] o.a.s.c.o.ReplicaMutator Update state numShards=1 message={
   [junit4]   2>   "core":"collection1",
   [junit4]   2>   "core_node_name":"core_node1",
   [junit4]   2>   "roles":null,
   [junit4]   2>   "base_url":"http://127.0.0.1:57746",
   [junit4]   2>   "node_name":"127.0.0.1:57746_",
   [junit4]   2>   "numShards":"1",
   [junit4]   2>   "state":"active",
   [junit4]   2>   "shard":"shard1",
   [junit4]   2>   "collection":"control_collection",
   [junit4]   2>   "operation":"state"}
   [junit4]   2> 48020 INFO  (zkCallback-53-thread-1) [    ] o.a.s.c.c.ZkStateReader A cluster state change: [WatchedEvent state:SyncConnected type:NodeDataChanged path:/clusterstate.json], has occurred - updating... (live nodes size: [1])
   [junit4]   2> 48020 INFO  (zkCallback-51-thread-1-processing-n:127.0.0.1:57746_) [n:127.0.0.1:57746_    ] o.a.s.c.c.ZkStateReader A cluster state change: [WatchedEvent state:SyncConnected type:NodeDataChanged path:/clusterstate.json], has occurred - updating... (live nodes size: [1])
   [junit4]   2> 48244 INFO  (TEST-CollectionTooManyReplicasTest.testAddTooManyReplicas-seed#[1D1CFFA3D10A3538]) [    ] o.a.s.SolrTestCaseJ4 Writing core.properties file to C:\Users\JenkinsSlave\workspace\Lucene-Solr-6.x-Windows\solr\build\solr-core\test\J1\temp\solr.cloud.CollectionTooManyReplicasTest_1D1CFFA3D10A3538-001\shard-1-001\cores\collection1
   [junit4]   2> 48247 INFO  (TEST-CollectionTooManyReplicasTest.testAddTooManyReplicas-seed#[1D1CFFA3D10A3538]) [    ] o.a.s.c.AbstractFullDistribZkTestBase create jetty 1 in directory C:\Users\JenkinsSlave\workspace\Lucene-Solr-6.x-Windows\solr\build\solr-core\test\J1\temp\solr.cloud.CollectionTooManyReplicasTest_1D1CFFA3D10A3538-001\shard-1-001
   [junit4]   2> 48248 INFO  (TEST-CollectionTooManyReplicasTest.testAddTooManyReplicas-seed#[1D1CFFA3D10A3538]) [    ] o.e.j.s.Server jetty-9.3.6.v20151106
   [junit4]   2> 48250 INFO  (TEST-CollectionTooManyReplicasTest.testAddTooManyReplicas-seed#[1D1CFFA3D10A3538]) [    ] o.e.j.s.h.ContextHandler Started o.e.j.s.ServletContextHandler@260e09a6{/,null,AVAILABLE}
   [junit4]   2> 48252 INFO  (TEST-CollectionTooManyReplicasTest.testAddTooManyReplicas-seed#[1D1CFFA3D10A3538]) [    ] o.e.j.s.ServerConnector Started ServerConnector@6f6b547c{HTTP/1.1,[http/1.1]}{127.0.0.1:57761}
   [junit4]   2> 48252 INFO  (TEST-CollectionTooManyReplicasTest.testAddTooManyReplicas-seed#[1D1CFFA3D10A3538]) [    ] o.e.j.s.Server Started @55497ms
   [junit4]   2> 48252 INFO  (TEST-CollectionTooManyReplicasTest.testAddTooManyReplicas-seed#[1D1CFFA3D10A3538]) [    ] o.a.s.c.s.e.JettySolrRunner Jetty properties: {solr.data.dir=C:\Users\JenkinsSlave\workspace\Lucene-Solr-6.x-Windows\solr\build\solr-core\test\J1\temp\solr.cloud.CollectionTooManyReplicasTest_1D1CFFA3D10A3538-001\tempDir-001/jetty1, solrconfig=solrconfig.xml, hostContext=/, hostPort=57761, coreRootDirectory=C:\Users\JenkinsSlave\workspace\Lucene-Solr-6.x-Windows\solr\build\solr-core\test\J1\temp\solr.cloud.CollectionTooManyReplicasTest_1D1CFFA3D10A3538-001\shard-1-001\cores}
   [junit4]   2> 48252 INFO  (TEST-CollectionTooManyReplicasTest.testAddTooManyReplicas-seed#[1D1CFFA3D10A3538]) [    ] o.a.s.s.SolrDispatchFilter SolrDispatchFilter.init(): sun.misc.Launcher$AppClassLoader@73d16e93
   [junit4]   2> 48252 INFO  (TEST-CollectionTooManyReplicasTest.testAddTooManyReplicas-seed#[1D1CFFA3D10A3538]) [    ] o.a.s.c.SolrResourceLoader new SolrResourceLoader for directory: 'C:\Users\JenkinsSlave\workspace\Lucene-Solr-6.x-Windows\solr\build\solr-core\test\J1\temp\solr.cloud.CollectionTooManyReplicasTest_1D1CFFA3D10A3538-001\shard-1-001'
   [junit4]   2> 48253 INFO  (TEST-CollectionTooManyReplicasTest.testAddTooManyReplicas-seed#[1D1CFFA3D10A3538]) [    ] o.a.s.c.SolrResourceLoader JNDI not configured for solr (NoInitialContextEx)
   [junit4]   2> 48253 INFO  (TEST-CollectionTooManyReplicasTest.testAddTooManyReplicas-seed#[1D1CFFA3D10A3538]) [    ] o.a.s.c.SolrResourceLoader solr home defaulted to 'solr/' (could not find system property or JNDI)
   [junit4]   2> 48253 INFO  (TEST-CollectionTooManyReplicasTest.testAddTooManyReplicas-seed#[1D1CFFA3D10A3538]) [    ] o.a.s.c.c.SolrZkClient Using default ZkCredentialsProvider
   [junit4]   2> 48254 INFO  (TEST-CollectionTooManyReplicasTest.testAddTooManyReplicas-seed#[1D1CFFA3D10A3538]) [    ] o.a.s.c.c.ConnectionManager Waiting for client to connect to ZooKeeper
   [junit4]   2> 48256 INFO  (zkCallback-54-thread-1) [    ] o.a.s.c.c.ConnectionManager Watcher org.apache.solr.common.cloud.ConnectionManager@ae3f4f6 name:ZooKeeperConnection Watcher:127.0.0.1:57739/solr got event WatchedEvent state:SyncConnected type:None path:null path:null type:None
   [junit4]   2> 48256 INFO  (TEST-CollectionTooManyReplicasTest.testAddTooManyReplicas-seed#[1D1CFFA3D10A3538]) [    ] o.a.s.c.c.ConnectionManager Client is connected to ZooKeeper
   [junit4]   2> 48256 INFO  (TEST-CollectionTooManyReplicasTest.testAddTooManyReplicas-seed#[1D1CFFA3D10A3538]) [    ] o.a.s.c.c.SolrZkClient Using default ZkACLProvider
   [junit4]   2> 48258 WARN  (NIOServerCxn.Factory:0.0.0.0/0.0.0.0:0) [    ] o.a.z.s.NIOServerCnxn caught end of stream exception
   [junit4]   2> EndOfStreamException: Unable to read additional data from client sessionid 0x15343fe2f2a0006, likely client has closed socket
   [junit4]   2> 	at org.apache.zookeeper.server.NIOServerCnxn.doIO(NIOServerCnxn.java:228)
   [junit4]   2> 	at org.apache.zookeeper.server.NIOServerCnxnFactory.run(NIOServerCnxnFactory.java:208)
   [junit4]   2> 	at java.lang.Thread.run(Thread.java:745)
   [junit4]   2> 48258 INFO  (TEST-CollectionTooManyReplicasTest.testAddTooManyReplicas-seed#[1D1CFFA3D10A3538]) [    ] o.a.s.s.SolrDispatchFilter Loading solr.xml from SolrHome (not found in ZooKeeper)
   [junit4]   2> 48258 INFO  (TEST-CollectionTooManyReplicasTest.testAddTooManyReplicas-seed#[1D1CFFA3D10A3538]) [    ] o.a.s.c.SolrXmlConfig Loading container configuration from C:\Users\JenkinsSlave\workspace\Lucene-Solr-6.x-Windows\solr\build\solr-core\test\J1\temp\solr.cloud.CollectionTooManyReplicasTest_1D1CFFA3D10A3538-001\shard-1-001\solr.xml
   [junit4]   2> 48268 INFO  (TEST-CollectionTooManyReplicasTest.testAddTooManyReplicas-seed#[1D1CFFA3D10A3538]) [    ] o.a.s.c.CorePropertiesLocator Config-defined core root directory: C:\Users\JenkinsSlave\workspace\Lucene-Solr-6.x-Windows\solr\build\solr-core\test\J1\temp\solr.cloud.CollectionTooManyReplicasTest_1D1CFFA3D10A3538-001\shard-1-001\cores
   [junit4]   2> 48268 INFO  (TEST-CollectionTooManyReplicasTest.testAddTooManyReplicas-seed#[1D1CFFA3D10A3538]) [    ] o.a.s.c.CoreContainer New CoreContainer 225875691
   [junit4]   2> 48268 INFO  (TEST-CollectionTooManyReplicasTest.testAddTooManyReplicas-seed#[1D1CFFA3D10A3538]) [    ] o.a.s.c.CoreContainer Loading cores into CoreContainer [instanceDir=C:\Users\JenkinsSlave\workspace\Lucene-Solr-6.x-Windows\solr\build\solr-core\test\J1\temp\solr.cloud.CollectionTooManyReplicasTest_1D1CFFA3D10A3538-001\shard-1-001]
   [junit4]   2> 48268 WARN  (TEST-CollectionTooManyReplicasTest.testAddTooManyReplicas-seed#[1D1CFFA3D10A3538]) [    ] o.a.s.c.CoreContainer Couldn't add files from C:\Users\JenkinsSlave\workspace\Lucene-Solr-6.x-Windows\solr\build\solr-core\test\J1\temp\solr.cloud.CollectionTooManyReplicasTest_1D1CFFA3D10A3538-001\shard-1-001\lib to classpath: C:\Users\JenkinsSlave\workspace\Lucene-Solr-6.x-Windows\solr\build\solr-core\test\J1\temp\solr.cloud.CollectionTooManyReplicasTest_1D1CFFA3D10A3538-001\shard-1-001\lib
   [junit4]   2> 48269 INFO  (TEST-CollectionTooManyReplicasTest.testAddTooManyReplicas-seed#[1D1CFFA3D10A3538]) [    ] o.a.s.h.c.HttpShardHandlerFactory created with socketTimeout : 90000,urlScheme : ,connTimeout : 15000,maxConnectionsPerHost : 20,maxConnections : 10000,corePoolSize : 0,maximumPoolSize : 2147483647,maxThreadIdleTime : 5,sizeOfQueue : -1,fairnessPolicy : false,useRetries : false,
   [junit4]   2> 48272 INFO  (TEST-CollectionTooManyReplicasTest.testAddTooManyReplicas-seed#[1D1CFFA3D10A3538]) [    ] o.a.s.u.UpdateShardHandler Creating UpdateShardHandler HTTP client with params: socketTimeout=340000&connTimeout=45000&retry=true
   [junit4]   2> 48273 INFO  (TEST-CollectionTooManyReplicasTest.testAddTooManyReplicas-seed#[1D1CFFA3D10A3538]) [    ] o.a.s.l.LogWatcher SLF4J impl is org.slf4j.impl.Log4jLoggerFactory
   [junit4]   2> 48273 INFO  (TEST-CollectionTooManyReplicasTest.testAddTooManyReplicas-seed#[1D1CFFA3D10A3538]) [    ] o.a.s.l.LogWatcher Registering Log Listener [Log4j (org.slf4j.impl.Log4jLoggerFactory)]
   [junit4]   2> 48273 INFO  (TEST-CollectionTooManyReplicasTest.testAddTooManyReplicas-seed#[1D1CFFA3D10A3538]) [    ] o.a.s.c.ZkContainer Zookeeper client=127.0.0.1:57739/solr
   [junit4]   2> 48273 INFO  (TEST-CollectionTooManyReplicasTest.testAddTooManyReplicas-seed#[1D1CFFA3D10A3538]) [    ] o.a.s.c.ZkController zkHost includes chroot
   [junit4]   2> 48273 INFO  (TEST-CollectionTooManyReplicasTest.testAddTooManyReplicas-seed#[1D1CFFA3D10A3538]) [    ] o.a.s.c.c.SolrZkClient Using default ZkCredentialsProvider
   [junit4]   2> 48273 INFO  (TEST-CollectionTooManyReplicasTest.testAddTooManyReplicas-seed#[1D1CFFA3D10A3538]) [    ] o.a.s.c.c.ConnectionManager Waiting for client to connect to ZooKeeper
   [junit4]   2> 48275 INFO  (zkCallback-57-thread-1) [    ] o.a.s.c.c.ConnectionManager Watcher org.apache.solr.common.cloud.ConnectionManager@6f809776 name:ZooKeeperConnection Watcher:127.0.0.1:57739 got event WatchedEvent state:SyncConnected type:None path:null path:null type:None
   [junit4]   2> 48276 INFO  (TEST-CollectionTooManyReplicasTest.testAddTooManyReplicas-seed#[1D1CFFA3D10A3538]) [    ] o.a.s.c.c.ConnectionManager Client is connected to ZooKeeper
   [junit4]   2> 48276 INFO  (TEST-CollectionTooManyReplicasTest.testAddTooManyReplicas-seed#[1D1CFFA3D10A3538]) [    ] o.a.s.c.c.SolrZkClient Using default ZkACLProvider
   [junit4]   2> 48280 INFO  (TEST-CollectionTooManyReplicasTest.testAddTooManyReplicas-seed#[1D1CFFA3D10A3538]) [n:127.0.0.1:57761_    ] o.a.s.c.c.ConnectionManager Waiting for client to connect to ZooKeeper
   [junit4]   2> 48283 INFO  (zkCallback-58-thread-1-processing-n:127.0.0.1:57761_) [n:127.0.0.1:57761_    ] o.a.s.c.c.ConnectionManager Watcher org.apache.solr.common.cloud.ConnectionManager@18e2a14d name:ZooKeeperConnection Watcher:127.0.0.1:57739/solr got event WatchedEvent state:SyncConnected type:None path:null path:null type:None
   [junit4]   2> 48283 INFO  (TEST-CollectionTooManyReplicasTest.testAddTooManyReplicas-seed#[1D1CFFA3D10A3538]) [n:127.0.0.1:57761_    ] o.a.s.c.c.ConnectionManager Client is connected to ZooKeeper
   [junit4]   2> 48293 INFO  (TEST-CollectionTooManyReplicasTest.testAddTooManyReplicas-seed#[1D1CFFA3D10A3538]) [n:127.0.0.1:57761_    ] o.a.s.c.c.ZkStateReader Updating cluster state from ZooKeeper... 
   [junit4]   2> 48295 INFO  (TEST-CollectionTooManyReplicasTest.testAddTooManyReplicas-seed#[1D1CFFA3D10A3538]) [n:127.0.0.1:57761_    ] o.a.s.c.c.ZkStateReader Updated live nodes from ZooKeeper... (0) -> (1)
   [junit4]   2> 48298 INFO  (TEST-CollectionTooManyReplicasTest.testAddTooManyReplicas-seed#[1D1CFFA3D10A3538]) [n:127.0.0.1:57761_    ] o.a.s.c.Overseer Overseer (id=null) closing
   [junit4]   2> 48299 INFO  (TEST-CollectionTooManyReplicasTest.testAddTooManyReplicas-seed#[1D1CFFA3D10A3538]) [n:127.0.0.1:57761_    ] o.a.s.c.LeaderElector Joined leadership election with path: /overseer_elect/election/95494776096948232-127.0.0.1:57761_-n_0000000001
   [junit4]   2> 48301 INFO  (TEST-CollectionTooManyReplicasTest.testAddTooManyReplicas-seed#[1D1CFFA3D10A3538]) [n:127.0.0.1:57761_    ] o.a.s.c.LeaderElector Watching path /overseer_elect/election/95494776096948228-127.0.0.1:57746_-n_0000000000 to know if I could be the leader
   [junit4]   2> 48302 INFO  (TEST-CollectionTooManyReplicasTest.testAddTooManyReplicas-seed#[1D1CFFA3D10A3538]) [n:127.0.0.1:57761_    ] o.a.s.c.ZkController Publish node=127.0.0.1:57761_ as DOWN
   [junit4]   2> 48304 INFO  (OverseerStateUpdate-95494776096948228-127.0.0.1:57746_-n_0000000000) [n:127.0.0.1:57746_    ] o.a.s.c.Overseer processMessage: queueSize: 1, message = {
   [junit4]   2>   "operation":"downnode",
   [junit4]   2>   "node_name":"127.0.0.1:57761_"} current state version: 3
   [junit4]   2> 48307 INFO  (OverseerStateUpdate-95494776096948228-127.0.0.1:57746_-n_0000000000) [n:127.0.0.1:57746_    ] o.a.s.c.o.NodeMutator DownNode state invoked for node: 127.0.0.1:57761_
   [junit4]   2> 48409 INFO  (zkCallback-58-thread-1-processing-n:127.0.0.1:57761_) [n:127.0.0.1:57761_    ] o.a.s.c.c.ZkStateReader A cluster state change: [WatchedEvent state:SyncConnected type:NodeDataChanged path:/clusterstate.json], has occurred - updating... (live nodes size: [1])
   [junit4]   2> 48409 INFO  (zkCallback-51-thread-1-processing-n:127.0.0.1:57746_) [n:127.0.0.1:57746_    ] o.a.s.c.c.ZkStateReader A cluster state change: [WatchedEvent state:SyncConnected type:NodeDataChanged path:/clusterstate.json], has occurred - updating... (live nodes size: [1])
   [junit4]   2> 48409 INFO  (zkCallback-53-thread-1) [    ] o.a.s.c.c.ZkStateReader A cluster state change: [WatchedEvent state:SyncConnected type:NodeDataChanged path:/clusterstate.json], has occurred - updating... (live nodes size: [1])
   [junit4]   2> 49279 INFO  (TEST-CollectionTooManyReplicasTest.testAddTooManyReplicas-seed#[1D1CFFA3D10A3538]) [n:127.0.0.1:57761_    ] o.a.s.c.ZkController Register node as live in ZooKeeper:/live_nodes/127.0.0.1:57761_
   [junit4]   2> 49279 INFO  (TEST-CollectionTooManyReplicasTest.testAddTooManyReplicas-seed#[1D1CFFA3D10A3538]) [n:127.0.0.1:57761_    ] o.a.s.c.c.SolrZkClient makePath: /live_nodes/127.0.0.1:57761_
   [junit4]   2> 49281 INFO  (zkCallback-58-thread-1-processing-n:127.0.0.1:57761_) [n:127.0.0.1:57761_    ] o.a.s.c.c.ZkStateReader A live node change: [WatchedEvent state:SyncConnected type:NodeChildrenChanged path:/live_nodes], has occurred - updating... (live nodes size: [1])
   [junit4]   2> 49281 INFO  (zkCallback-51-thread-1-processing-n:127.0.0.1:57746_) [n:127.0.0.1:57746_    ] o.a.s.c.c.ZkStateReader A live node change: [WatchedEvent state:SyncConnected type:NodeChildrenChanged path:/live_nodes], has occurred - updating... (live nodes size: [1])
   [junit4]   2> 49281 INFO  (zkCallback-53-thread-1) [    ] o.a.s.c.c.ZkStateReader A live node change: [WatchedEvent state:SyncConnected type:NodeChildrenChanged path:/live_nodes], has occurred - updating... (live nodes size: [1])
   [junit4]   2> 49282 INFO  (zkCallback-58-thread-1-processing-n:127.0.0.1:57761_) [n:127.0.0.1:57761_    ] o.a.s.c.c.ZkStateReader Updated live nodes from ZooKeeper... (1) -> (2)
   [junit4]   2> 49282 INFO  (zkCallback-51-thread-1-processing-n:127.0.0.1:57746_) [n:127.0.0.1:57746_    ] o.a.s.c.c.ZkStateReader Updated live nodes from ZooKeeper... (1) -> (2)
   [junit4]   2> 49282 INFO  (zkCallback-53-thread-1) [    ] o.a.s.c.c.ZkStateReader Updated live nodes from ZooKeeper... (1) -> (2)
   [junit4]   2> 49309 INFO  (TEST-CollectionTooManyReplicasTest.testAddTooManyReplicas-seed#[1D1CFFA3D10A3538]) [n:127.0.0.1:57761_    ] o.a.s.c.CoreContainer Security conf doesn't exist. Skipping setup for authorization module.
   [junit4]   2> 49309 INFO  (TEST-CollectionTooManyReplicasTest.testAddTooManyReplicas-seed#[1D1CFFA3D10A3538]) [n:127.0.0.1:57761_    ] o.a.s.c.CoreContainer No authentication plugin used.
   [junit4]   2> 49309 INFO  (TEST-CollectionTooManyReplicasTest.testAddTooManyReplicas-seed#[1D1CFFA3D10A3538]) [n:127.0.0.1:57761_    ] o.a.s.c.CorePropertiesLocator Looking for core definitions underneath C:\Users\JenkinsSlave\workspace\Lucene-Solr-6.x-Windows\solr\build\solr-core\test\J1\temp\solr.cloud.CollectionTooManyReplicasTest_1D1CFFA3D10A3538-001\shard-1-001\cores
   [junit4]   2> 49311 INFO  (TEST-CollectionTooManyReplicasTest.testAddTooManyReplicas-seed#[1D1CFFA3D10A3538]) [n:127.0.0.1:57761_    ] o.a.s.c.CoreDescriptor Created CoreDescriptor: {name=collection1, config=solrconfig.xml, transient=false, schema=schema.xml, loadOnStartup=true, configSetProperties=configsetprops.json, collection=collection1, coreNodeName=, dataDir=data\, shard=}
   [junit4]   2> 49311 INFO  (TEST-CollectionTooManyReplicasTest.testAddTooManyReplicas-seed#[1D1CFFA3D10A3538]) [n:127.0.0.1:57761_    ] o.a.s.c.CorePropertiesLocator Found core collection1 in C:\Users\JenkinsSlave\workspace\Lucene-Solr-6.x-Windows\solr\build\solr-core\test\J1\temp\solr.cloud.CollectionTooManyReplicasTest_1D1CFFA3D10A3538-001\shard-1-001\cores\collection1
   [junit4]   2> 49311 INFO  (TEST-CollectionTooManyReplicasTest.testAddTooManyReplicas-seed#[1D1CFFA3D10A3538]) [n:127.0.0.1:57761_    ] o.a.s.c.CorePropertiesLocator Found 1 core definitions
   [junit4]   2> 49313 INFO  (coreLoadExecutor-219-thread-1-processing-n:127.0.0.1:57761_) [n:127.0.0.1:57761_ c:collection1   x:collection1] o.a.s.c.ZkController publishing state=down
   [junit4]   2> 49313 INFO  (coreLoadExecutor-219-thread-1-processing-n:127.0.0.1:57761_) [n:127.0.0.1:57761_ c:collection1   x:collection1] o.a.s.c.ZkController numShards not found on descriptor - reading it from system property
   [junit4]   2> 49313 INFO  (TEST-CollectionTooManyReplicasTest.testAddTooManyReplicas-seed#[1D1CFFA3D10A3538]) [n:127.0.0.1:57761_    ] o.a.s.s.SolrDispatchFilter user.dir=C:\Users\JenkinsSlave\workspace\Lucene-Solr-6.x-Windows\solr\build\solr-core\test\J1
   [junit4]   2> 49313 INFO  (TEST-CollectionTooManyReplicasTest.testAddTooManyReplicas-seed#[1D1CFFA3D10A3538]) [n:127.0.0.1:57761_    ] o.a.s.s.SolrDispatchFilter SolrDispatchFilter.init() done
   [junit4]   2> 49315 INFO  (coreLoadExecutor-219-thread-1-processing-n:127.0.0.1:57761_) [n:127.0.0.1:57761_ c:collection1   x:collection1] o.a.s.c.ZkController look for our core node name
   [junit4]   2> 49316 INFO  (OverseerStateUpdate-95494776096948228-127.0.0.1:57746_-n_0000000000) [n:127.0.0.1:57746_    ] o.a.s.c.Overseer processMessage: queueSize: 1, message = {
   [junit4]   2>   "core":"collection1",
   [junit4]   2>   "roles":null,
   [junit4]   2>   "base_url":"http://127.0.0.1:57761",
   [junit4]   2>   "node_name":"127.0.0.1:57761_",
   [junit4]   2>   "numShards":"1",
   [junit4]   2>   "state":"down",
   [junit4]   2>   "shard":null,
   [junit4]   2>   "collection":"collection1",
   [junit4]   2>   "operation":"state"} current state version: 4
   [junit4]   2> 49316 INFO  (OverseerStateUpdate-95494776096948228-127.0.0.1:57746_-n_0000000000) [n:127.0.0.1:57746_    ] o.a.s.c.o.ReplicaMutator Update state numShards=1 message={
   [junit4]   2>   "core":"collection1",
   [junit4]   2>   "roles":null,
   [junit4]   2>   "base_url":"http://127.0.0.1:57761",
   [junit4]   2>   "node_name":"127.0.0.1:57761_",
   [junit4]   2>   "numShards":"1",
   [junit4]   2>   "state":"down",
   [junit4]   2>   "shard":null,
   [junit4]   2>   "collection":"collection1",
   [junit4]   2>   "operation":"state"}
   [junit4]   2> 49316 INFO  (OverseerStateUpdate-95494776096948228-127.0.0.1:57746_-n_0000000000) [n:127.0.0.1:57746_    ] o.a.s.c.o.ClusterStateMutator building a new cName: collection1
   [junit4]   2> 49317 INFO  (OverseerStateUpdate-95494776096948228-127.0.0.1:57746_-n_0000000000) [n:127.0.0.1:57746_    ] o.a.s.c.o.ReplicaMutator Assigning new node to shard shard=shard1
   [junit4]   2> 49419 INFO  (zkCallback-51-thread-2-processing-n:127.0.0.1:57746_) [n:127.0.0.1:57746_    ] o.a.s.c.c.ZkStateReader A cluster state change: [WatchedEvent state:SyncConnected type:NodeDataChanged path:/clusterstate.json], has occurred - updating... (live nodes size: [2])
   [junit4]   2> 49419 INFO  (zkCallback-58-thread-1-processing-n:127.0.0.1:57761_) [n:127.0.0.1:57761_    ] o.a.s.c.c.ZkStateReader A cluster state change: [WatchedEvent state:SyncConnected type:NodeDataChanged path:/clusterstate.json], has occurred - updating... (live nodes size: [2])
   [junit4]   2> 49419 INFO  (zkCallback-53-thread-1) [    ] o.a.s.c.c.ZkStateReader A cluster state change: [WatchedEvent state:SyncConnected type:NodeDataChanged path:/clusterstate.json], has occurred - updating... (live nodes size: [2])
   [junit4]   2> 50293 INFO  (coreLoadExecutor-219-thread-1-processing-n:127.0.0.1:57761_) [n:127.0.0.1:57761_ c:collection1   x:collection1] o.a.s.c.ZkController waiting to find shard id in clusterstate for collection1
   [junit4]   2> 50293 INFO  (coreLoadExecutor-219-thread-1-processing-n:127.0.0.1:57761_) [n:127.0.0.1:57761_ c:collection1   x:collection1] o.a.s.c.ZkController Check for collection zkNode:collection1
   [junit4]   2> 50296 INFO  (coreLoadExecutor-219-thread-1-processing-n:127.0.0.1:57761_) [n:127.0.0.1:57761_ c:collection1   x:collection1] o.a.s.c.ZkController Collection zkNode exists
   [junit4]   2> 50296 INFO  (coreLoadExecutor-219-thread-1-processing-n:127.0.0.1:57761_) [n:127.0.0.1:57761_ c:collection1   x:collection1] o.a.s.c.c.ZkStateReader Load collection config from: [/collections/collection1]
   [junit4]   2> 50297 INFO  (coreLoadExecutor-219-thread-1-processing-n:127.0.0.1:57761_) [n:127.0.0.1:57761_ c:collection1   x:collection1] o.a.s.c.c.ZkStateReader path=[/collections/collection1] [configName]=[conf1] specified config exists in ZooKeeper
   [junit4]   2> 50297 INFO  (coreLoadExecutor-219-thread-1-processing-n:127.0.0.1:57761_) [n:127.0.0.1:57761_ c:collection1   x:collection1] o.a.s.c.SolrResourceLoader new SolrResourceLoader for directory: 'C:\Users\JenkinsSlave\workspace\Lucene-Solr-6.x-Windows\solr\build\solr-core\test\J1\temp\solr.cloud.CollectionTooManyReplicasTest_1D1CFFA3D10A3538-001\shard-1-001\cores\collection1'
   [junit4]   2> 50297 INFO  (coreLoadExecutor-219-thread-1-processing-n:127.0.0.1:57761_) [n:127.0.0.1:57761_ c:collection1   x:collection1] o.a.s.c.SolrResourceLoader JNDI not configured for solr (NoInitialContextEx)
   [junit4]   2> 50297 INFO  (coreLoadExecutor-219-thread-1-processing-n:127.0.0.1:57761_) [n:127.0.0.1:57761_ c:collection1   x:collection1] o.a.s.c.SolrResourceLoader solr home defaulted to 'solr/' (could not find system property or JNDI)
   [junit4]   2> 50299 INFO  (coreLoadExecutor-219-thread-1-processing-n:127.0.0.1:57761_) [n:127.0.0.1:57761_ c:collection1   x:collection1] o.a.s.c.Config loaded config solrconfig.xml with version 0 
   [junit4]   2> 50340 INFO  (coreLoadExecutor-219-thread-1-processing-n:127.0.0.1:57761_) [n:127.0.0.1:57761_ c:collection1   x:collection1] o.a.s.c.SolrConfig current version of requestparams : -1
   [junit4]   2> 50343 WARN  (coreLoadExecutor-219-thread-1-processing-n:127.0.0.1:57761_) [n:127.0.0.1:57761_ c:collection1   x:collection1] o.a.s.c.Config Beginning with Solr 5.5, <mergePolicy> is deprecated, use <mergePolicyFactory> instead.
   [junit4]   2> 50343 INFO  (coreLoadExecutor-219-thread-1-processing-n:127.0.0.1:57761_) [n:127.0.0.1:57761_ c:collection1   x:collection1] o.a.s.c.SolrConfig Using Lucene MatchVersion: 6.1.0
   [junit4]   2> 50349 INFO  (coreLoadExecutor-219-thread-1-processing-n:127.0.0.1:57761_) [n:127.0.0.1:57761_ c:collection1   x:collection1] o.a.s.c.SolrConfig Loaded SolrConfig: solrconfig.xml
   [junit4]   2> 50418 INFO  (coreLoadExecutor-219-thread-1-processing-n:127.0.0.1:57761_) [n:127.0.0.1:57761_ c:collection1   x:collection1] o.a.s.s.IndexSchema [collection1] Schema name=test
   [junit4]   2> 50505 INFO  (coreLoadExecutor-219-thread-1-processing-n:127.0.0.1:57761_) [n:127.0.0.1:57761_ c:collection1   x:collection1] o.a.s.s.OpenExchangeRatesOrgProvider Initialized with rates=open-exchange-rates.json, refreshInterval=1440.
   [junit4]   2> 50531 INFO  (coreLoadExecutor-219-thread-1-processing-n:127.0.0.1:57761_) [n:127.0.0.1:57761_ c:collection1   x:collection1] o.a.s.s.IndexSchema default search field in schema is text
   [junit4]   2> 50532 INFO  (coreLoadExecutor-219-thread-1-processing-n:127.0.0.1:57761_) [n:127.0.0.1:57761_ c:collection1   x:collection1] o.a.s.s.IndexSchema unique key field: id
   [junit4]   2> 50557 INFO  (coreLoadExecutor-219-thread-1-processing-n:127.0.0.1:57761_) [n:127.0.0.1:57761_ c:collection1   x:collection1] o.a.s.s.FileExchangeRateProvider Reloading exchange rates from file currency

[...truncated too long message...]

rd2 r:core_node6 x:TooManyReplicasWhenAddingShards_shard2_replica1] o.a.s.c.SolrCore [TooManyReplicasWhenAddingShards_shard2_replica1] Closing main searcher on request.
   [junit4]   2> 136180 INFO  (recoveryExecutor-103-thread-1-processing-n:127.0.0.1:58036_ x:TooManyReplicasWhenAddingShards_shard2_replica1 s:shard2 c:TooManyReplicasWhenAddingShards r:core_node6) [n:127.0.0.1:58036_ c:TooManyReplicasWhenAddingShards s:shard2 r:core_node6 x:TooManyReplicasWhenAddingShards_shard2_replica1] o.a.s.c.CachingDirectoryFactory Closing MockDirectoryFactory - 2 directories currently being tracked
   [junit4]   2> 136180 INFO  (recoveryExecutor-103-thread-1-processing-n:127.0.0.1:58036_ x:TooManyReplicasWhenAddingShards_shard2_replica1 s:shard2 c:TooManyReplicasWhenAddingShards r:core_node6) [n:127.0.0.1:58036_ c:TooManyReplicasWhenAddingShards s:shard2 r:core_node6 x:TooManyReplicasWhenAddingShards_shard2_replica1] o.a.s.c.CachingDirectoryFactory looking to close C:\Users\JenkinsSlave\workspace\Lucene-Solr-6.x-Windows\solr\build\solr-core\test\J1\..\..\..\..\..\..\..\..\..\Users\JenkinsSlave\workspace\Lucene-Solr-6.x-Windows\solr\build\solr-core\test\J1\temp\solr.cloud.CollectionTooManyReplicasTest_1D1CFFA3D10A3538-001\shard-2-002\cores\TooManyReplicasWhenAddingShards_shard2_replica1\data\index [CachedDir<<refCount=0;path=C:\Users\JenkinsSlave\workspace\Lucene-Solr-6.x-Windows\solr\build\solr-core\test\J1\..\..\..\..\..\..\..\..\..\Users\JenkinsSlave\workspace\Lucene-Solr-6.x-Windows\solr\build\solr-core\test\J1\temp\solr.cloud.CollectionTooManyReplicasTest_1D1CFFA3D10A3538-001\shard-2-002\cores\TooManyReplicasWhenAddingShards_shard2_replica1\data\index;done=false>>]
   [junit4]   2> 136180 INFO  (recoveryExecutor-103-thread-1-processing-n:127.0.0.1:58036_ x:TooManyReplicasWhenAddingShards_shard2_replica1 s:shard2 c:TooManyReplicasWhenAddingShards r:core_node6) [n:127.0.0.1:58036_ c:TooManyReplicasWhenAddingShards s:shard2 r:core_node6 x:TooManyReplicasWhenAddingShards_shard2_replica1] o.a.s.c.CachingDirectoryFactory Closing directory: C:\Users\JenkinsSlave\workspace\Lucene-Solr-6.x-Windows\solr\build\solr-core\test\J1\..\..\..\..\..\..\..\..\..\Users\JenkinsSlave\workspace\Lucene-Solr-6.x-Windows\solr\build\solr-core\test\J1\temp\solr.cloud.CollectionTooManyReplicasTest_1D1CFFA3D10A3538-001\shard-2-002\cores\TooManyReplicasWhenAddingShards_shard2_replica1\data\index
   [junit4]   2> 136180 INFO  (recoveryExecutor-103-thread-1-processing-n:127.0.0.1:58036_ x:TooManyReplicasWhenAddingShards_shard2_replica1 s:shard2 c:TooManyReplicasWhenAddingShards r:core_node6) [n:127.0.0.1:58036_ c:TooManyReplicasWhenAddingShards s:shard2 r:core_node6 x:TooManyReplicasWhenAddingShards_shard2_replica1] o.a.s.c.CachingDirectoryFactory looking to close C:\Users\JenkinsSlave\workspace\Lucene-Solr-6.x-Windows\solr\build\solr-core\test\J1\..\..\..\..\..\..\..\..\..\Users\JenkinsSlave\workspace\Lucene-Solr-6.x-Windows\solr\build\solr-core\test\J1\temp\solr.cloud.CollectionTooManyReplicasTest_1D1CFFA3D10A3538-001\shard-2-002\cores\TooManyReplicasWhenAddingShards_shard2_replica1\data\ [CachedDir<<refCount=0;path=C:\Users\JenkinsSlave\workspace\Lucene-Solr-6.x-Windows\solr\build\solr-core\test\J1\..\..\..\..\..\..\..\..\..\Users\JenkinsSlave\workspace\Lucene-Solr-6.x-Windows\solr\build\solr-core\test\J1\temp\solr.cloud.CollectionTooManyReplicasTest_1D1CFFA3D10A3538-001\shard-2-002\cores\TooManyReplicasWhenAddingShards_shard2_replica1\data\;done=false>>]
   [junit4]   2> 136180 INFO  (recoveryExecutor-103-thread-1-processing-n:127.0.0.1:58036_ x:TooManyReplicasWhenAddingShards_shard2_replica1 s:shard2 c:TooManyReplicasWhenAddingShards r:core_node6) [n:127.0.0.1:58036_ c:TooManyReplicasWhenAddingShards s:shard2 r:core_node6 x:TooManyReplicasWhenAddingShards_shard2_replica1] o.a.s.c.CachingDirectoryFactory Closing directory: C:\Users\JenkinsSlave\workspace\Lucene-Solr-6.x-Windows\solr\build\solr-core\test\J1\..\..\..\..\..\..\..\..\..\Users\JenkinsSlave\workspace\Lucene-Solr-6.x-Windows\solr\build\solr-core\test\J1\temp\solr.cloud.CollectionTooManyReplicasTest_1D1CFFA3D10A3538-001\shard-2-002\cores\TooManyReplicasWhenAddingShards_shard2_replica1\data\
   [junit4]   2> 136180 INFO  (TEST-CollectionTooManyReplicasTest.testAddShard-seed#[1D1CFFA3D10A3538]) [    ] o.a.s.c.Overseer Overseer (id=95494779529003020-127.0.0.1:58036_-n_0000000002) closing
   [junit4]   2> 136180 INFO  (OverseerStateUpdate-95494779529003020-127.0.0.1:58036_-n_0000000002) [n:127.0.0.1:58036_    ] o.a.s.c.Overseer Overseer Loop exiting : 127.0.0.1:58036_
   [junit4]   2> 136182 INFO  (zkCallback-111-thread-1) [    ] o.a.s.c.c.ZkStateReader A live node change: [WatchedEvent state:SyncConnected type:NodeChildrenChanged path:/live_nodes], has occurred - updating... (live nodes size: [1])
   [junit4]   2> 136182 INFO  (zkCallback-105-thread-2-processing-n:127.0.0.1:58036_) [n:127.0.0.1:58036_    ] o.a.s.c.c.ZkStateReader A live node change: [WatchedEvent state:SyncConnected type:NodeChildrenChanged path:/live_nodes], has occurred - updating... (live nodes size: [1])
   [junit4]   2> 136182 INFO  (zkCallback-94-thread-1) [    ] o.a.s.c.c.ZkStateReader A live node change: [WatchedEvent state:SyncConnected type:NodeChildrenChanged path:/live_nodes], has occurred - updating... (live nodes size: [1])
   [junit4]   2> 136183 INFO  (zkCallback-111-thread-1) [    ] o.a.s.c.c.ZkStateReader Updated live nodes from ZooKeeper... (1) -> (0)
   [junit4]   2> 136183 INFO  (zkCallback-94-thread-1) [    ] o.a.s.c.c.ZkStateReader Updated live nodes from ZooKeeper... (1) -> (0)
   [junit4]   2> 137331 WARN  (zkCallback-105-thread-2-processing-n:127.0.0.1:58036_) [n:127.0.0.1:58036_    ] o.a.s.c.c.ZkStateReader ZooKeeper watch triggered, but Solr cannot talk to ZK: [KeeperErrorCode = Session expired for /live_nodes]
   [junit4]   2> 137332 INFO  (TEST-CollectionTooManyReplicasTest.testAddShard-seed#[1D1CFFA3D10A3538]) [    ] o.e.j.s.ServerConnector Stopped ServerConnector@7b12634e{HTTP/1.1,[http/1.1]}{127.0.0.1:0}
   [junit4]   2> 137332 INFO  (TEST-CollectionTooManyReplicasTest.testAddShard-seed#[1D1CFFA3D10A3538]) [    ] o.e.j.s.h.ContextHandler Stopped o.e.j.s.ServletContextHandler@70edc9bf{/,null,UNAVAILABLE}
   [junit4]   2> 137337 INFO  (TEST-CollectionTooManyReplicasTest.testAddShard-seed#[1D1CFFA3D10A3538]) [    ] o.a.s.c.ChaosMonkey monkey: stop shard! 58005
   [junit4]   2> 137339 INFO  (TEST-CollectionTooManyReplicasTest.testAddShard-seed#[1D1CFFA3D10A3538]) [    ] o.a.s.c.ZkTestServer connecting to 127.0.0.1:57986 57986
   [junit4]   2> 139064 INFO  (Thread-243) [    ] o.a.s.c.ZkTestServer connecting to 127.0.0.1:57986 57986
   [junit4]   2> 139065 WARN  (Thread-243) [    ] o.a.s.c.ZkTestServer Watch limit violations: 
   [junit4]   2> Maximum concurrent create/delete watches above limit:
   [junit4]   2> 
   [junit4]   2> 	5	/solr/aliases.json
   [junit4]   2> 	3	/solr/security.json
   [junit4]   2> 	3	/solr/configs/conf1
   [junit4]   2> 
   [junit4]   2> Maximum concurrent data watches above limit:
   [junit4]   2> 
   [junit4]   2> 	5	/solr/clusterstate.json
   [junit4]   2> 	3	/solr/collections/TooManyReplicasWhenAddingShards/state.json
   [junit4]   2> 	2	/solr/collections/collection1/state.json
   [junit4]   2> 
   [junit4]   2> Maximum concurrent children watches above limit:
   [junit4]   2> 
   [junit4]   2> 	5	/solr/live_nodes
   [junit4]   2> 	5	/solr/collections
   [junit4]   2> 	3	/solr/overseer/queue
   [junit4]   2> 	3	/solr/overseer/collection-queue-work
   [junit4]   2> 	2	/solr/overseer/queue-work
   [junit4]   2> 
   [junit4]   2> 139067 INFO  (SUITE-CollectionTooManyReplicasTest-seed#[1D1CFFA3D10A3538]-worker) [    ] o.a.s.SolrTestCaseJ4 ###deleteCore
   [junit4]   2> NOTE: leaving temporary files on disk at: C:\Users\JenkinsSlave\workspace\Lucene-Solr-6.x-Windows\solr\build\solr-core\test\J1\temp\solr.cloud.CollectionTooManyReplicasTest_1D1CFFA3D10A3538-001
   [junit4]   2> NOTE: test params are: codec=Asserting(Lucene60): {}, docValues:{}, maxPointsInLeafNode=1971, maxMBSortInHeap=5.921689047718384, sim=RandomSimilarity(queryNorm=true,coord=crazy): {}, locale=es-PE, timezone=Antarctica/Casey
   [junit4]   2> NOTE: Windows 7 6.1 amd64/Oracle Corporation 1.8.0_72 (64-bit)/cpus=3,threads=1,free=61970344,total=278396928
   [junit4]   2> NOTE: All tests run in this JVM: [TestMinMaxOnMultiValuedField, DocValuesMissingTest, OverseerTaskQueueTest, DistributedTermsComponentTest, TestBadConfig, HdfsRecoveryZkTest, CollectionTooManyReplicasTest]
   [junit4] Completed [23/582 (1!)] on J1 in 93.46s, 3 tests, 1 failure <<< FAILURES!

[...truncated 1835 lines...]
BUILD FAILED
C:\Users\JenkinsSlave\workspace\Lucene-Solr-6.x-Windows\build.xml:740: The following error occurred while executing this line:
C:\Users\JenkinsSlave\workspace\Lucene-Solr-6.x-Windows\build.xml:684: The following error occurred while executing this line:
C:\Users\JenkinsSlave\workspace\Lucene-Solr-6.x-Windows\build.xml:59: The following error occurred while executing this line:
C:\Users\JenkinsSlave\workspace\Lucene-Solr-6.x-Windows\solr\build.xml:233: The following error occurred while executing this line:
C:\Users\JenkinsSlave\workspace\Lucene-Solr-6.x-Windows\solr\common-build.xml:524: The following error occurred while executing this line:
C:\Users\JenkinsSlave\workspace\Lucene-Solr-6.x-Windows\lucene\common-build.xml:1457: The following error occurred while executing this line:
C:\Users\JenkinsSlave\workspace\Lucene-Solr-6.x-Windows\lucene\common-build.xml:1014: There were test failures: 582 suites (8 ignored), 2351 tests, 1 failure, 126 ignored (81 assumptions) [seed: 1D1CFFA3D10A3538]

Total time: 80 minutes 52 seconds
Build step 'Invoke Ant' marked build as failure
Archiving artifacts
[WARNINGS] Skipping publisher since build result is FAILURE
Recording test results
Email was triggered for: Failure - Any
Sending email for trigger: Failure - Any



Mime
View raw message