lucene-dev mailing list archives

Site index · List index
Message view « Date » · « Thread »
Top « Date » · « Thread »
From Policeman Jenkins Server <jenk...@thetaphi.de>
Subject [JENKINS] Lucene-Solr-6.x-Linux (32bit/jdk1.8.0_72) - Build # 66 - Still Failing!
Date Wed, 09 Mar 2016 02:28:25 GMT
Build: http://jenkins.thetaphi.de/job/Lucene-Solr-6.x-Linux/66/
Java: 32bit/jdk1.8.0_72 -client -XX:+UseSerialGC

1 tests failed.
FAILED:  org.apache.solr.cloud.UnloadDistributedZkTest.test

Error Message:
Captured an uncaught exception in thread: Thread[id=6049, name=testExecutor-3062-thread-2, state=RUNNABLE, group=TGRP-UnloadDistributedZkTest]

Stack Trace:
com.carrotsearch.randomizedtesting.UncaughtExceptionError: Captured an uncaught exception in thread: Thread[id=6049, name=testExecutor-3062-thread-2, state=RUNNABLE, group=TGRP-UnloadDistributedZkTest]
Caused by: java.lang.RuntimeException: org.apache.solr.client.solrj.SolrServerException: Timeout occured while waiting response from server at: http://127.0.0.1:58831
	at __randomizedtesting.SeedInfo.seed([2696F42C902DEC34]:0)
	at org.apache.solr.cloud.BasicDistributedZkTest.lambda$createCores$0(BasicDistributedZkTest.java:583)
	at org.apache.solr.common.util.ExecutorUtil$MDCAwareThreadPoolExecutor.lambda$execute$0(ExecutorUtil.java:229)
	at java.util.concurrent.ThreadPoolExecutor.runWorker(ThreadPoolExecutor.java:1142)
	at java.util.concurrent.ThreadPoolExecutor$Worker.run(ThreadPoolExecutor.java:617)
	at java.lang.Thread.run(Thread.java:745)
Caused by: org.apache.solr.client.solrj.SolrServerException: Timeout occured while waiting response from server at: http://127.0.0.1:58831
	at org.apache.solr.client.solrj.impl.HttpSolrClient.executeMethod(HttpSolrClient.java:588)
	at org.apache.solr.client.solrj.impl.HttpSolrClient.request(HttpSolrClient.java:241)
	at org.apache.solr.client.solrj.impl.HttpSolrClient.request(HttpSolrClient.java:230)
	at org.apache.solr.client.solrj.SolrClient.request(SolrClient.java:1219)
	at org.apache.solr.cloud.BasicDistributedZkTest.lambda$createCores$0(BasicDistributedZkTest.java:581)
	... 4 more
Caused by: java.net.SocketTimeoutException: Read timed out
	at java.net.SocketInputStream.socketRead0(Native Method)
	at java.net.SocketInputStream.socketRead(SocketInputStream.java:116)
	at java.net.SocketInputStream.read(SocketInputStream.java:170)
	at java.net.SocketInputStream.read(SocketInputStream.java:141)
	at org.apache.http.impl.io.AbstractSessionInputBuffer.fillBuffer(AbstractSessionInputBuffer.java:160)
	at org.apache.http.impl.io.SocketInputBuffer.fillBuffer(SocketInputBuffer.java:84)
	at org.apache.http.impl.io.AbstractSessionInputBuffer.readLine(AbstractSessionInputBuffer.java:273)
	at org.apache.http.impl.conn.DefaultHttpResponseParser.parseHead(DefaultHttpResponseParser.java:140)
	at org.apache.http.impl.conn.DefaultHttpResponseParser.parseHead(DefaultHttpResponseParser.java:57)
	at org.apache.http.impl.io.AbstractMessageParser.parse(AbstractMessageParser.java:261)
	at org.apache.http.impl.AbstractHttpClientConnection.receiveResponseHeader(AbstractHttpClientConnection.java:283)
	at org.apache.http.impl.conn.DefaultClientConnection.receiveResponseHeader(DefaultClientConnection.java:251)
	at org.apache.http.impl.conn.ManagedClientConnectionImpl.receiveResponseHeader(ManagedClientConnectionImpl.java:197)
	at org.apache.http.protocol.HttpRequestExecutor.doReceiveResponse(HttpRequestExecutor.java:272)
	at org.apache.http.protocol.HttpRequestExecutor.execute(HttpRequestExecutor.java:124)
	at org.apache.http.impl.client.DefaultRequestDirector.tryExecute(DefaultRequestDirector.java:685)
	at org.apache.http.impl.client.DefaultRequestDirector.execute(DefaultRequestDirector.java:487)
	at org.apache.http.impl.client.AbstractHttpClient.doExecute(AbstractHttpClient.java:882)
	at org.apache.http.impl.client.CloseableHttpClient.execute(CloseableHttpClient.java:82)
	at org.apache.http.impl.client.CloseableHttpClient.execute(CloseableHttpClient.java:107)
	at org.apache.http.impl.client.CloseableHttpClient.execute(CloseableHttpClient.java:55)
	at org.apache.solr.client.solrj.impl.HttpSolrClient.executeMethod(HttpSolrClient.java:482)
	... 8 more




Build Log:
[...truncated 11431 lines...]
   [junit4] Suite: org.apache.solr.cloud.UnloadDistributedZkTest
   [junit4]   2> Creating dataDir: /home/jenkins/workspace/Lucene-Solr-6.x-Linux/solr/build/solr-core/test/J2/temp/solr.cloud.UnloadDistributedZkTest_2696F42C902DEC34-001/init-core-data-001
   [junit4]   2> 553494 INFO  (SUITE-UnloadDistributedZkTest-seed#[2696F42C902DEC34]-worker) [    ] o.a.s.BaseDistributedSearchTestCase Setting hostContext system property: /
   [junit4]   2> 553497 INFO  (TEST-UnloadDistributedZkTest.test-seed#[2696F42C902DEC34]) [    ] o.a.s.c.ZkTestServer STARTING ZK TEST SERVER
   [junit4]   2> 553497 INFO  (Thread-1981) [    ] o.a.s.c.ZkTestServer client port:0.0.0.0/0.0.0.0:0
   [junit4]   2> 553498 INFO  (Thread-1981) [    ] o.a.s.c.ZkTestServer Starting server
   [junit4]   2> 553598 INFO  (TEST-UnloadDistributedZkTest.test-seed#[2696F42C902DEC34]) [    ] o.a.s.c.ZkTestServer start zk server on port:52353
   [junit4]   2> 553598 INFO  (TEST-UnloadDistributedZkTest.test-seed#[2696F42C902DEC34]) [    ] o.a.s.c.c.SolrZkClient Using default ZkCredentialsProvider
   [junit4]   2> 553598 INFO  (TEST-UnloadDistributedZkTest.test-seed#[2696F42C902DEC34]) [    ] o.a.s.c.c.ConnectionManager Waiting for client to connect to ZooKeeper
   [junit4]   2> 553600 INFO  (zkCallback-1126-thread-1) [    ] o.a.s.c.c.ConnectionManager Watcher org.apache.solr.common.cloud.ConnectionManager@13ecd37 name:ZooKeeperConnection Watcher:127.0.0.1:52353 got event WatchedEvent state:SyncConnected type:None path:null path:null type:None
   [junit4]   2> 553600 INFO  (TEST-UnloadDistributedZkTest.test-seed#[2696F42C902DEC34]) [    ] o.a.s.c.c.ConnectionManager Client is connected to ZooKeeper
   [junit4]   2> 553600 INFO  (TEST-UnloadDistributedZkTest.test-seed#[2696F42C902DEC34]) [    ] o.a.s.c.c.SolrZkClient Using default ZkACLProvider
   [junit4]   2> 553600 INFO  (TEST-UnloadDistributedZkTest.test-seed#[2696F42C902DEC34]) [    ] o.a.s.c.c.SolrZkClient makePath: /solr
   [junit4]   2> 553602 INFO  (TEST-UnloadDistributedZkTest.test-seed#[2696F42C902DEC34]) [    ] o.a.s.c.c.SolrZkClient Using default ZkCredentialsProvider
   [junit4]   2> 553603 INFO  (TEST-UnloadDistributedZkTest.test-seed#[2696F42C902DEC34]) [    ] o.a.s.c.c.ConnectionManager Waiting for client to connect to ZooKeeper
   [junit4]   2> 553604 INFO  (zkCallback-1127-thread-1) [    ] o.a.s.c.c.ConnectionManager Watcher org.apache.solr.common.cloud.ConnectionManager@1ce8b80 name:ZooKeeperConnection Watcher:127.0.0.1:52353/solr got event WatchedEvent state:SyncConnected type:None path:null path:null type:None
   [junit4]   2> 553604 INFO  (TEST-UnloadDistributedZkTest.test-seed#[2696F42C902DEC34]) [    ] o.a.s.c.c.ConnectionManager Client is connected to ZooKeeper
   [junit4]   2> 553604 INFO  (TEST-UnloadDistributedZkTest.test-seed#[2696F42C902DEC34]) [    ] o.a.s.c.c.SolrZkClient Using default ZkACLProvider
   [junit4]   2> 553604 INFO  (TEST-UnloadDistributedZkTest.test-seed#[2696F42C902DEC34]) [    ] o.a.s.c.c.SolrZkClient makePath: /collections/collection1
   [junit4]   2> 553605 INFO  (TEST-UnloadDistributedZkTest.test-seed#[2696F42C902DEC34]) [    ] o.a.s.c.c.SolrZkClient makePath: /collections/collection1/shards
   [junit4]   2> 553606 INFO  (TEST-UnloadDistributedZkTest.test-seed#[2696F42C902DEC34]) [    ] o.a.s.c.c.SolrZkClient makePath: /collections/control_collection
   [junit4]   2> 553607 INFO  (TEST-UnloadDistributedZkTest.test-seed#[2696F42C902DEC34]) [    ] o.a.s.c.c.SolrZkClient makePath: /collections/control_collection/shards
   [junit4]   2> 553607 INFO  (TEST-UnloadDistributedZkTest.test-seed#[2696F42C902DEC34]) [    ] o.a.s.c.AbstractZkTestCase put /home/jenkins/workspace/Lucene-Solr-6.x-Linux/solr/core/src/test-files/solr/collection1/conf/solrconfig-tlog.xml to /configs/conf1/solrconfig.xml
   [junit4]   2> 553607 INFO  (TEST-UnloadDistributedZkTest.test-seed#[2696F42C902DEC34]) [    ] o.a.s.c.c.SolrZkClient makePath: /configs/conf1/solrconfig.xml
   [junit4]   2> 553609 INFO  (TEST-UnloadDistributedZkTest.test-seed#[2696F42C902DEC34]) [    ] o.a.s.c.AbstractZkTestCase put /home/jenkins/workspace/Lucene-Solr-6.x-Linux/solr/core/src/test-files/solr/collection1/conf/schema.xml to /configs/conf1/schema.xml
   [junit4]   2> 553609 INFO  (TEST-UnloadDistributedZkTest.test-seed#[2696F42C902DEC34]) [    ] o.a.s.c.c.SolrZkClient makePath: /configs/conf1/schema.xml
   [junit4]   2> 553610 INFO  (TEST-UnloadDistributedZkTest.test-seed#[2696F42C902DEC34]) [    ] o.a.s.c.AbstractZkTestCase put /home/jenkins/workspace/Lucene-Solr-6.x-Linux/solr/core/src/test-files/solr/collection1/conf/solrconfig.snippet.randomindexconfig.xml to /configs/conf1/solrconfig.snippet.randomindexconfig.xml
   [junit4]   2> 553610 INFO  (TEST-UnloadDistributedZkTest.test-seed#[2696F42C902DEC34]) [    ] o.a.s.c.c.SolrZkClient makePath: /configs/conf1/solrconfig.snippet.randomindexconfig.xml
   [junit4]   2> 553611 INFO  (TEST-UnloadDistributedZkTest.test-seed#[2696F42C902DEC34]) [    ] o.a.s.c.AbstractZkTestCase put /home/jenkins/workspace/Lucene-Solr-6.x-Linux/solr/core/src/test-files/solr/collection1/conf/stopwords.txt to /configs/conf1/stopwords.txt
   [junit4]   2> 553611 INFO  (TEST-UnloadDistributedZkTest.test-seed#[2696F42C902DEC34]) [    ] o.a.s.c.c.SolrZkClient makePath: /configs/conf1/stopwords.txt
   [junit4]   2> 553612 INFO  (TEST-UnloadDistributedZkTest.test-seed#[2696F42C902DEC34]) [    ] o.a.s.c.AbstractZkTestCase put /home/jenkins/workspace/Lucene-Solr-6.x-Linux/solr/core/src/test-files/solr/collection1/conf/protwords.txt to /configs/conf1/protwords.txt
   [junit4]   2> 553612 INFO  (TEST-UnloadDistributedZkTest.test-seed#[2696F42C902DEC34]) [    ] o.a.s.c.c.SolrZkClient makePath: /configs/conf1/protwords.txt
   [junit4]   2> 553612 INFO  (TEST-UnloadDistributedZkTest.test-seed#[2696F42C902DEC34]) [    ] o.a.s.c.AbstractZkTestCase put /home/jenkins/workspace/Lucene-Solr-6.x-Linux/solr/core/src/test-files/solr/collection1/conf/currency.xml to /configs/conf1/currency.xml
   [junit4]   2> 553612 INFO  (TEST-UnloadDistributedZkTest.test-seed#[2696F42C902DEC34]) [    ] o.a.s.c.c.SolrZkClient makePath: /configs/conf1/currency.xml
   [junit4]   2> 553613 INFO  (TEST-UnloadDistributedZkTest.test-seed#[2696F42C902DEC34]) [    ] o.a.s.c.AbstractZkTestCase put /home/jenkins/workspace/Lucene-Solr-6.x-Linux/solr/core/src/test-files/solr/collection1/conf/enumsConfig.xml to /configs/conf1/enumsConfig.xml
   [junit4]   2> 553613 INFO  (TEST-UnloadDistributedZkTest.test-seed#[2696F42C902DEC34]) [    ] o.a.s.c.c.SolrZkClient makePath: /configs/conf1/enumsConfig.xml
   [junit4]   2> 553614 INFO  (TEST-UnloadDistributedZkTest.test-seed#[2696F42C902DEC34]) [    ] o.a.s.c.AbstractZkTestCase put /home/jenkins/workspace/Lucene-Solr-6.x-Linux/solr/core/src/test-files/solr/collection1/conf/open-exchange-rates.json to /configs/conf1/open-exchange-rates.json
   [junit4]   2> 553614 INFO  (TEST-UnloadDistributedZkTest.test-seed#[2696F42C902DEC34]) [    ] o.a.s.c.c.SolrZkClient makePath: /configs/conf1/open-exchange-rates.json
   [junit4]   2> 553615 INFO  (TEST-UnloadDistributedZkTest.test-seed#[2696F42C902DEC34]) [    ] o.a.s.c.AbstractZkTestCase put /home/jenkins/workspace/Lucene-Solr-6.x-Linux/solr/core/src/test-files/solr/collection1/conf/mapping-ISOLatin1Accent.txt to /configs/conf1/mapping-ISOLatin1Accent.txt
   [junit4]   2> 553615 INFO  (TEST-UnloadDistributedZkTest.test-seed#[2696F42C902DEC34]) [    ] o.a.s.c.c.SolrZkClient makePath: /configs/conf1/mapping-ISOLatin1Accent.txt
   [junit4]   2> 553616 INFO  (TEST-UnloadDistributedZkTest.test-seed#[2696F42C902DEC34]) [    ] o.a.s.c.AbstractZkTestCase put /home/jenkins/workspace/Lucene-Solr-6.x-Linux/solr/core/src/test-files/solr/collection1/conf/old_synonyms.txt to /configs/conf1/old_synonyms.txt
   [junit4]   2> 553616 INFO  (TEST-UnloadDistributedZkTest.test-seed#[2696F42C902DEC34]) [    ] o.a.s.c.c.SolrZkClient makePath: /configs/conf1/old_synonyms.txt
   [junit4]   2> 553617 INFO  (TEST-UnloadDistributedZkTest.test-seed#[2696F42C902DEC34]) [    ] o.a.s.c.AbstractZkTestCase put /home/jenkins/workspace/Lucene-Solr-6.x-Linux/solr/core/src/test-files/solr/collection1/conf/synonyms.txt to /configs/conf1/synonyms.txt
   [junit4]   2> 553617 INFO  (TEST-UnloadDistributedZkTest.test-seed#[2696F42C902DEC34]) [    ] o.a.s.c.c.SolrZkClient makePath: /configs/conf1/synonyms.txt
   [junit4]   2> 553685 INFO  (TEST-UnloadDistributedZkTest.test-seed#[2696F42C902DEC34]) [    ] o.a.s.SolrTestCaseJ4 Writing core.properties file to /home/jenkins/workspace/Lucene-Solr-6.x-Linux/solr/build/solr-core/test/J2/temp/solr.cloud.UnloadDistributedZkTest_2696F42C902DEC34-001/control-001/cores/collection1
   [junit4]   2> 553687 INFO  (TEST-UnloadDistributedZkTest.test-seed#[2696F42C902DEC34]) [    ] o.e.j.s.Server jetty-9.3.6.v20151106
   [junit4]   2> 553688 INFO  (TEST-UnloadDistributedZkTest.test-seed#[2696F42C902DEC34]) [    ] o.e.j.s.h.ContextHandler Started o.e.j.s.ServletContextHandler@14a2d5b{/,null,AVAILABLE}
   [junit4]   2> 553689 INFO  (TEST-UnloadDistributedZkTest.test-seed#[2696F42C902DEC34]) [    ] o.e.j.s.ServerConnector Started ServerConnector@49e97c{HTTP/1.1,[http/1.1]}{127.0.0.1:60671}
   [junit4]   2> 553689 INFO  (TEST-UnloadDistributedZkTest.test-seed#[2696F42C902DEC34]) [    ] o.e.j.s.Server Started @554768ms
   [junit4]   2> 553689 INFO  (TEST-UnloadDistributedZkTest.test-seed#[2696F42C902DEC34]) [    ] o.a.s.c.s.e.JettySolrRunner Jetty properties: {solr.data.dir=/home/jenkins/workspace/Lucene-Solr-6.x-Linux/solr/build/solr-core/test/J2/temp/solr.cloud.UnloadDistributedZkTest_2696F42C902DEC34-001/tempDir-001/control/data, hostContext=/, hostPort=60671, coreRootDirectory=/home/jenkins/workspace/Lucene-Solr-6.x-Linux/solr/build/solr-core/test/J2/../../../../../../../../../home/jenkins/workspace/Lucene-Solr-6.x-Linux/solr/build/solr-core/test/J2/temp/solr.cloud.UnloadDistributedZkTest_2696F42C902DEC34-001/control-001/cores}
   [junit4]   2> 553689 INFO  (TEST-UnloadDistributedZkTest.test-seed#[2696F42C902DEC34]) [    ] o.a.s.s.SolrDispatchFilter SolrDispatchFilter.init(): sun.misc.Launcher$AppClassLoader@1d16e93
   [junit4]   2> 553689 INFO  (TEST-UnloadDistributedZkTest.test-seed#[2696F42C902DEC34]) [    ] o.a.s.c.SolrResourceLoader new SolrResourceLoader for directory: '/home/jenkins/workspace/Lucene-Solr-6.x-Linux/solr/build/solr-core/test/J2/temp/solr.cloud.UnloadDistributedZkTest_2696F42C902DEC34-001/control-001'
   [junit4]   2> 553690 INFO  (TEST-UnloadDistributedZkTest.test-seed#[2696F42C902DEC34]) [    ] o.a.s.c.SolrResourceLoader JNDI not configured for solr (NoInitialContextEx)
   [junit4]   2> 553690 INFO  (TEST-UnloadDistributedZkTest.test-seed#[2696F42C902DEC34]) [    ] o.a.s.c.SolrResourceLoader solr home defaulted to 'solr/' (could not find system property or JNDI)
   [junit4]   2> 553690 INFO  (TEST-UnloadDistributedZkTest.test-seed#[2696F42C902DEC34]) [    ] o.a.s.c.c.SolrZkClient Using default ZkCredentialsProvider
   [junit4]   2> 553690 INFO  (TEST-UnloadDistributedZkTest.test-seed#[2696F42C902DEC34]) [    ] o.a.s.c.c.ConnectionManager Waiting for client to connect to ZooKeeper
   [junit4]   2> 553691 INFO  (zkCallback-1128-thread-1) [    ] o.a.s.c.c.ConnectionManager Watcher org.apache.solr.common.cloud.ConnectionManager@1329abd name:ZooKeeperConnection Watcher:127.0.0.1:52353/solr got event WatchedEvent state:SyncConnected type:None path:null path:null type:None
   [junit4]   2> 553691 INFO  (TEST-UnloadDistributedZkTest.test-seed#[2696F42C902DEC34]) [    ] o.a.s.c.c.ConnectionManager Client is connected to ZooKeeper
   [junit4]   2> 553692 INFO  (TEST-UnloadDistributedZkTest.test-seed#[2696F42C902DEC34]) [    ] o.a.s.c.c.SolrZkClient Using default ZkACLProvider
   [junit4]   2> 553693 INFO  (TEST-UnloadDistributedZkTest.test-seed#[2696F42C902DEC34]) [    ] o.a.s.s.SolrDispatchFilter Loading solr.xml from SolrHome (not found in ZooKeeper)
   [junit4]   2> 553693 INFO  (TEST-UnloadDistributedZkTest.test-seed#[2696F42C902DEC34]) [    ] o.a.s.c.SolrXmlConfig Loading container configuration from /home/jenkins/workspace/Lucene-Solr-6.x-Linux/solr/build/solr-core/test/J2/temp/solr.cloud.UnloadDistributedZkTest_2696F42C902DEC34-001/control-001/solr.xml
   [junit4]   2> 553703 INFO  (TEST-UnloadDistributedZkTest.test-seed#[2696F42C902DEC34]) [    ] o.a.s.c.CorePropertiesLocator Config-defined core root directory: /home/jenkins/workspace/Lucene-Solr-6.x-Linux/solr/build/solr-core/test/J2/../../../../../../../../../home/jenkins/workspace/Lucene-Solr-6.x-Linux/solr/build/solr-core/test/J2/temp/solr.cloud.UnloadDistributedZkTest_2696F42C902DEC34-001/control-001/cores
   [junit4]   2> 553703 INFO  (TEST-UnloadDistributedZkTest.test-seed#[2696F42C902DEC34]) [    ] o.a.s.c.CoreContainer New CoreContainer 23272125
   [junit4]   2> 553703 INFO  (TEST-UnloadDistributedZkTest.test-seed#[2696F42C902DEC34]) [    ] o.a.s.c.CoreContainer Loading cores into CoreContainer [instanceDir=/home/jenkins/workspace/Lucene-Solr-6.x-Linux/solr/build/solr-core/test/J2/temp/solr.cloud.UnloadDistributedZkTest_2696F42C902DEC34-001/control-001]
   [junit4]   2> 553703 WARN  (TEST-UnloadDistributedZkTest.test-seed#[2696F42C902DEC34]) [    ] o.a.s.c.CoreContainer Couldn't add files from /home/jenkins/workspace/Lucene-Solr-6.x-Linux/solr/build/solr-core/test/J2/temp/solr.cloud.UnloadDistributedZkTest_2696F42C902DEC34-001/control-001/lib to classpath: /home/jenkins/workspace/Lucene-Solr-6.x-Linux/solr/build/solr-core/test/J2/temp/solr.cloud.UnloadDistributedZkTest_2696F42C902DEC34-001/control-001/lib
   [junit4]   2> 553704 INFO  (TEST-UnloadDistributedZkTest.test-seed#[2696F42C902DEC34]) [    ] o.a.s.h.c.HttpShardHandlerFactory created with socketTimeout : 90000,urlScheme : ,connTimeout : 15000,maxConnectionsPerHost : 20,maxConnections : 10000,corePoolSize : 0,maximumPoolSize : 2147483647,maxThreadIdleTime : 5,sizeOfQueue : -1,fairnessPolicy : false,useRetries : false,
   [junit4]   2> 553705 INFO  (TEST-UnloadDistributedZkTest.test-seed#[2696F42C902DEC34]) [    ] o.a.s.u.UpdateShardHandler Creating UpdateShardHandler HTTP client with params: socketTimeout=340000&connTimeout=45000&retry=true
   [junit4]   2> 553705 INFO  (TEST-UnloadDistributedZkTest.test-seed#[2696F42C902DEC34]) [    ] o.a.s.l.LogWatcher SLF4J impl is org.slf4j.impl.Log4jLoggerFactory
   [junit4]   2> 553705 INFO  (TEST-UnloadDistributedZkTest.test-seed#[2696F42C902DEC34]) [    ] o.a.s.l.LogWatcher Registering Log Listener [Log4j (org.slf4j.impl.Log4jLoggerFactory)]
   [junit4]   2> 553705 INFO  (TEST-UnloadDistributedZkTest.test-seed#[2696F42C902DEC34]) [    ] o.a.s.c.ZkContainer Zookeeper client=127.0.0.1:52353/solr
   [junit4]   2> 553705 INFO  (TEST-UnloadDistributedZkTest.test-seed#[2696F42C902DEC34]) [    ] o.a.s.c.ZkController zkHost includes chroot
   [junit4]   2> 553705 INFO  (TEST-UnloadDistributedZkTest.test-seed#[2696F42C902DEC34]) [    ] o.a.s.c.c.SolrZkClient Using default ZkCredentialsProvider
   [junit4]   2> 553706 INFO  (TEST-UnloadDistributedZkTest.test-seed#[2696F42C902DEC34]) [    ] o.a.s.c.c.ConnectionManager Waiting for client to connect to ZooKeeper
   [junit4]   2> 553707 INFO  (zkCallback-1131-thread-1) [    ] o.a.s.c.c.ConnectionManager Watcher org.apache.solr.common.cloud.ConnectionManager@9c3587 name:ZooKeeperConnection Watcher:127.0.0.1:52353 got event WatchedEvent state:SyncConnected type:None path:null path:null type:None
   [junit4]   2> 553707 INFO  (TEST-UnloadDistributedZkTest.test-seed#[2696F42C902DEC34]) [    ] o.a.s.c.c.ConnectionManager Client is connected to ZooKeeper
   [junit4]   2> 553707 INFO  (TEST-UnloadDistributedZkTest.test-seed#[2696F42C902DEC34]) [    ] o.a.s.c.c.SolrZkClient Using default ZkACLProvider
   [junit4]   2> 553708 INFO  (TEST-UnloadDistributedZkTest.test-seed#[2696F42C902DEC34]) [n:127.0.0.1:60671_    ] o.a.s.c.c.ConnectionManager Waiting for client to connect to ZooKeeper
   [junit4]   2> 553709 INFO  (zkCallback-1132-thread-1-processing-n:127.0.0.1:60671_) [n:127.0.0.1:60671_    ] o.a.s.c.c.ConnectionManager Watcher org.apache.solr.common.cloud.ConnectionManager@52f61 name:ZooKeeperConnection Watcher:127.0.0.1:52353/solr got event WatchedEvent state:SyncConnected type:None path:null path:null type:None
   [junit4]   2> 553709 INFO  (TEST-UnloadDistributedZkTest.test-seed#[2696F42C902DEC34]) [n:127.0.0.1:60671_    ] o.a.s.c.c.ConnectionManager Client is connected to ZooKeeper
   [junit4]   2> 553711 INFO  (TEST-UnloadDistributedZkTest.test-seed#[2696F42C902DEC34]) [n:127.0.0.1:60671_    ] o.a.s.c.c.SolrZkClient makePath: /overseer/queue
   [junit4]   2> 553712 INFO  (TEST-UnloadDistributedZkTest.test-seed#[2696F42C902DEC34]) [n:127.0.0.1:60671_    ] o.a.s.c.c.SolrZkClient makePath: /overseer/collection-queue-work
   [junit4]   2> 553713 INFO  (TEST-UnloadDistributedZkTest.test-seed#[2696F42C902DEC34]) [n:127.0.0.1:60671_    ] o.a.s.c.c.SolrZkClient makePath: /overseer/collection-map-running
   [junit4]   2> 553715 INFO  (TEST-UnloadDistributedZkTest.test-seed#[2696F42C902DEC34]) [n:127.0.0.1:60671_    ] o.a.s.c.c.SolrZkClient makePath: /overseer/collection-map-completed
   [junit4]   2> 553715 INFO  (TEST-UnloadDistributedZkTest.test-seed#[2696F42C902DEC34]) [n:127.0.0.1:60671_    ] o.a.s.c.c.SolrZkClient makePath: /overseer/collection-map-failure
   [junit4]   2> 553716 INFO  (TEST-UnloadDistributedZkTest.test-seed#[2696F42C902DEC34]) [n:127.0.0.1:60671_    ] o.a.s.c.c.SolrZkClient makePath: /live_nodes
   [junit4]   2> 553717 INFO  (TEST-UnloadDistributedZkTest.test-seed#[2696F42C902DEC34]) [n:127.0.0.1:60671_    ] o.a.s.c.c.SolrZkClient makePath: /aliases.json
   [junit4]   2> 553717 INFO  (TEST-UnloadDistributedZkTest.test-seed#[2696F42C902DEC34]) [n:127.0.0.1:60671_    ] o.a.s.c.c.SolrZkClient makePath: /clusterstate.json
   [junit4]   2> 553718 INFO  (TEST-UnloadDistributedZkTest.test-seed#[2696F42C902DEC34]) [n:127.0.0.1:60671_    ] o.a.s.c.c.SolrZkClient makePath: /security.json
   [junit4]   2> 553719 INFO  (TEST-UnloadDistributedZkTest.test-seed#[2696F42C902DEC34]) [n:127.0.0.1:60671_    ] o.a.s.c.c.ZkStateReader Updating cluster state from ZooKeeper... 
   [junit4]   2> 553719 INFO  (TEST-UnloadDistributedZkTest.test-seed#[2696F42C902DEC34]) [n:127.0.0.1:60671_    ] o.a.s.c.c.ZkStateReader Updated live nodes from ZooKeeper... (0) -> (0)
   [junit4]   2> 553720 INFO  (TEST-UnloadDistributedZkTest.test-seed#[2696F42C902DEC34]) [n:127.0.0.1:60671_    ] o.a.s.c.c.SolrZkClient makePath: /overseer_elect
   [junit4]   2> 553721 INFO  (TEST-UnloadDistributedZkTest.test-seed#[2696F42C902DEC34]) [n:127.0.0.1:60671_    ] o.a.s.c.c.SolrZkClient makePath: /overseer_elect/election
   [junit4]   2> 553721 INFO  (TEST-UnloadDistributedZkTest.test-seed#[2696F42C902DEC34]) [n:127.0.0.1:60671_    ] o.a.s.c.Overseer Overseer (id=null) closing
   [junit4]   2> 553722 INFO  (TEST-UnloadDistributedZkTest.test-seed#[2696F42C902DEC34]) [n:127.0.0.1:60671_    ] o.a.s.c.LeaderElector Joined leadership election with path: /overseer_elect/election/95518007370842116-127.0.0.1:60671_-n_0000000000
   [junit4]   2> 553722 INFO  (TEST-UnloadDistributedZkTest.test-seed#[2696F42C902DEC34]) [n:127.0.0.1:60671_    ] o.a.s.c.OverseerElectionContext I am going to be the leader 127.0.0.1:60671_
   [junit4]   2> 553722 INFO  (TEST-UnloadDistributedZkTest.test-seed#[2696F42C902DEC34]) [n:127.0.0.1:60671_    ] o.a.s.c.c.SolrZkClient makePath: /overseer_elect/leader
   [junit4]   2> 553723 INFO  (TEST-UnloadDistributedZkTest.test-seed#[2696F42C902DEC34]) [n:127.0.0.1:60671_    ] o.a.s.c.Overseer Overseer (id=95518007370842116-127.0.0.1:60671_-n_0000000000) starting
   [junit4]   2> 553724 INFO  (TEST-UnloadDistributedZkTest.test-seed#[2696F42C902DEC34]) [n:127.0.0.1:60671_    ] o.a.s.c.c.SolrZkClient makePath: /overseer/queue-work
   [junit4]   2> 553727 INFO  (TEST-UnloadDistributedZkTest.test-seed#[2696F42C902DEC34]) [n:127.0.0.1:60671_    ] o.a.s.c.OverseerAutoReplicaFailoverThread Starting OverseerAutoReplicaFailoverThread autoReplicaFailoverWorkLoopDelay=10000 autoReplicaFailoverWaitAfterExpiration=10000 autoReplicaFailoverBadNodeExpiration=60000
   [junit4]   2> 553727 INFO  (OverseerCollectionConfigSetProcessor-95518007370842116-127.0.0.1:60671_-n_0000000000) [n:127.0.0.1:60671_    ] o.a.s.c.OverseerTaskProcessor Process current queue of overseer operations
   [junit4]   2> 553727 INFO  (TEST-UnloadDistributedZkTest.test-seed#[2696F42C902DEC34]) [n:127.0.0.1:60671_    ] o.a.s.c.ZkController Register node as live in ZooKeeper:/live_nodes/127.0.0.1:60671_
   [junit4]   2> 553727 INFO  (OverseerStateUpdate-95518007370842116-127.0.0.1:60671_-n_0000000000) [n:127.0.0.1:60671_    ] o.a.s.c.Overseer Starting to work on the main queue
   [junit4]   2> 553728 INFO  (TEST-UnloadDistributedZkTest.test-seed#[2696F42C902DEC34]) [n:127.0.0.1:60671_    ] o.a.s.c.c.SolrZkClient makePath: /live_nodes/127.0.0.1:60671_
   [junit4]   2> 553729 INFO  (zkCallback-1132-thread-1-processing-n:127.0.0.1:60671_) [n:127.0.0.1:60671_    ] o.a.s.c.c.ZkStateReader A live node change: [WatchedEvent state:SyncConnected type:NodeChildrenChanged path:/live_nodes], has occurred - updating... (live nodes size: [0])
   [junit4]   2> 553729 INFO  (OverseerStateUpdate-95518007370842116-127.0.0.1:60671_-n_0000000000) [n:127.0.0.1:60671_    ] o.a.s.c.c.ZkStateReader Updated live nodes from ZooKeeper... (0) -> (1)
   [junit4]   2> 553729 INFO  (zkCallback-1132-thread-1-processing-n:127.0.0.1:60671_) [n:127.0.0.1:60671_    ] o.a.s.c.c.ZkStateReader Updated live nodes from ZooKeeper... (1) -> (1)
   [junit4]   2> 553773 INFO  (TEST-UnloadDistributedZkTest.test-seed#[2696F42C902DEC34]) [n:127.0.0.1:60671_    ] o.a.s.c.CoreContainer Security conf doesn't exist. Skipping setup for authorization module.
   [junit4]   2> 553774 INFO  (TEST-UnloadDistributedZkTest.test-seed#[2696F42C902DEC34]) [n:127.0.0.1:60671_    ] o.a.s.c.CoreContainer No authentication plugin used.
   [junit4]   2> 553774 INFO  (TEST-UnloadDistributedZkTest.test-seed#[2696F42C902DEC34]) [n:127.0.0.1:60671_    ] o.a.s.c.CorePropertiesLocator Looking for core definitions underneath /home/jenkins/workspace/Lucene-Solr-6.x-Linux/solr/build/solr-core/test/J2/../../../../../../../../../home/jenkins/workspace/Lucene-Solr-6.x-Linux/solr/build/solr-core/test/J2/temp/solr.cloud.UnloadDistributedZkTest_2696F42C902DEC34-001/control-001/cores
   [junit4]   2> 553775 INFO  (TEST-UnloadDistributedZkTest.test-seed#[2696F42C902DEC34]) [n:127.0.0.1:60671_    ] o.a.s.c.CoreDescriptor Created CoreDescriptor: {name=collection1, config=solrconfig.xml, transient=false, schema=schema.xml, loadOnStartup=true, configSetProperties=configsetprops.json, collection=control_collection, coreNodeName=, dataDir=data/, shard=}
   [junit4]   2> 553775 INFO  (TEST-UnloadDistributedZkTest.test-seed#[2696F42C902DEC34]) [n:127.0.0.1:60671_    ] o.a.s.c.CorePropertiesLocator Found core collection1 in /home/jenkins/workspace/Lucene-Solr-6.x-Linux/solr/build/solr-core/test/J2/../../../../../../../../../home/jenkins/workspace/Lucene-Solr-6.x-Linux/solr/build/solr-core/test/J2/temp/solr.cloud.UnloadDistributedZkTest_2696F42C902DEC34-001/control-001/cores/collection1
   [junit4]   2> 553776 INFO  (TEST-UnloadDistributedZkTest.test-seed#[2696F42C902DEC34]) [n:127.0.0.1:60671_    ] o.a.s.c.CorePropertiesLocator Found 1 core definitions
   [junit4]   2> 553776 INFO  (TEST-UnloadDistributedZkTest.test-seed#[2696F42C902DEC34]) [n:127.0.0.1:60671_    ] o.a.s.s.SolrDispatchFilter user.dir=/home/jenkins/workspace/Lucene-Solr-6.x-Linux/solr/build/solr-core/test/J2
   [junit4]   2> 553776 INFO  (TEST-UnloadDistributedZkTest.test-seed#[2696F42C902DEC34]) [n:127.0.0.1:60671_    ] o.a.s.s.SolrDispatchFilter SolrDispatchFilter.init() done
   [junit4]   2> 553776 INFO  (coreLoadExecutor-2984-thread-1-processing-n:127.0.0.1:60671_) [n:127.0.0.1:60671_ c:control_collection   x:collection1] o.a.s.c.ZkController publishing state=down
   [junit4]   2> 553776 INFO  (coreLoadExecutor-2984-thread-1-processing-n:127.0.0.1:60671_) [n:127.0.0.1:60671_ c:control_collection   x:collection1] o.a.s.c.ZkController numShards not found on descriptor - reading it from system property
   [junit4]   2> 553777 INFO  (coreLoadExecutor-2984-thread-1-processing-n:127.0.0.1:60671_) [n:127.0.0.1:60671_ c:control_collection   x:collection1] o.a.s.c.ZkController look for our core node name
   [junit4]   2> 553777 INFO  (OverseerStateUpdate-95518007370842116-127.0.0.1:60671_-n_0000000000) [n:127.0.0.1:60671_    ] o.a.s.c.Overseer processMessage: queueSize: 1, message = {
   [junit4]   2>   "core":"collection1",
   [junit4]   2>   "roles":null,
   [junit4]   2>   "base_url":"http://127.0.0.1:60671",
   [junit4]   2>   "node_name":"127.0.0.1:60671_",
   [junit4]   2>   "numShards":"1",
   [junit4]   2>   "state":"down",
   [junit4]   2>   "shard":null,
   [junit4]   2>   "collection":"control_collection",
   [junit4]   2>   "operation":"state"} current state version: 0
   [junit4]   2> 553777 INFO  (OverseerStateUpdate-95518007370842116-127.0.0.1:60671_-n_0000000000) [n:127.0.0.1:60671_    ] o.a.s.c.o.ReplicaMutator Update state numShards=1 message={
   [junit4]   2>   "core":"collection1",
   [junit4]   2>   "roles":null,
   [junit4]   2>   "base_url":"http://127.0.0.1:60671",
   [junit4]   2>   "node_name":"127.0.0.1:60671_",
   [junit4]   2>   "numShards":"1",
   [junit4]   2>   "state":"down",
   [junit4]   2>   "shard":null,
   [junit4]   2>   "collection":"control_collection",
   [junit4]   2>   "operation":"state"}
   [junit4]   2> 553778 INFO  (OverseerStateUpdate-95518007370842116-127.0.0.1:60671_-n_0000000000) [n:127.0.0.1:60671_    ] o.a.s.c.o.ClusterStateMutator building a new cName: control_collection
   [junit4]   2> 553778 INFO  (OverseerStateUpdate-95518007370842116-127.0.0.1:60671_-n_0000000000) [n:127.0.0.1:60671_    ] o.a.s.c.o.ReplicaMutator Assigning new node to shard shard=shard1
   [junit4]   2> 553779 INFO  (zkCallback-1132-thread-1-processing-n:127.0.0.1:60671_) [n:127.0.0.1:60671_    ] o.a.s.c.c.ZkStateReader A cluster state change: [WatchedEvent state:SyncConnected type:NodeDataChanged path:/clusterstate.json], has occurred - updating... (live nodes size: [1])
   [junit4]   2> 554777 INFO  (coreLoadExecutor-2984-thread-1-processing-n:127.0.0.1:60671_) [n:127.0.0.1:60671_ c:control_collection   x:collection1] o.a.s.c.ZkController waiting to find shard id in clusterstate for collection1
   [junit4]   2> 554777 INFO  (coreLoadExecutor-2984-thread-1-processing-n:127.0.0.1:60671_) [n:127.0.0.1:60671_ c:control_collection   x:collection1] o.a.s.c.ZkController Check for collection zkNode:control_collection
   [junit4]   2> 554778 INFO  (coreLoadExecutor-2984-thread-1-processing-n:127.0.0.1:60671_) [n:127.0.0.1:60671_ c:control_collection   x:collection1] o.a.s.c.ZkController Collection zkNode exists
   [junit4]   2> 554778 INFO  (coreLoadExecutor-2984-thread-1-processing-n:127.0.0.1:60671_) [n:127.0.0.1:60671_ c:control_collection   x:collection1] o.a.s.c.c.ZkStateReader Load collection config from: [/collections/control_collection]
   [junit4]   2> 554779 INFO  (coreLoadExecutor-2984-thread-1-processing-n:127.0.0.1:60671_) [n:127.0.0.1:60671_ c:control_collection   x:collection1] o.a.s.c.c.ZkStateReader path=[/collections/control_collection] [configName]=[conf1] specified config exists in ZooKeeper
   [junit4]   2> 554779 INFO  (coreLoadExecutor-2984-thread-1-processing-n:127.0.0.1:60671_) [n:127.0.0.1:60671_ c:control_collection   x:collection1] o.a.s.c.SolrResourceLoader new SolrResourceLoader for directory: '/home/jenkins/workspace/Lucene-Solr-6.x-Linux/solr/build/solr-core/test/J2/temp/solr.cloud.UnloadDistributedZkTest_2696F42C902DEC34-001/control-001/cores/collection1'
   [junit4]   2> 554779 INFO  (coreLoadExecutor-2984-thread-1-processing-n:127.0.0.1:60671_) [n:127.0.0.1:60671_ c:control_collection   x:collection1] o.a.s.c.SolrResourceLoader JNDI not configured for solr (NoInitialContextEx)
   [junit4]   2> 554779 INFO  (coreLoadExecutor-2984-thread-1-processing-n:127.0.0.1:60671_) [n:127.0.0.1:60671_ c:control_collection   x:collection1] o.a.s.c.SolrResourceLoader solr home defaulted to 'solr/' (could not find system property or JNDI)
   [junit4]   2> 554780 INFO  (coreLoadExecutor-2984-thread-1-processing-n:127.0.0.1:60671_) [n:127.0.0.1:60671_ c:control_collection   x:collection1] o.a.s.c.Config loaded config solrconfig.xml with version 0 
   [junit4]   2> 554787 INFO  (coreLoadExecutor-2984-thread-1-processing-n:127.0.0.1:60671_) [n:127.0.0.1:60671_ c:control_collection   x:collection1] o.a.s.c.SolrConfig current version of requestparams : -1
   [junit4]   2> 554807 WARN  (coreLoadExecutor-2984-thread-1-processing-n:127.0.0.1:60671_) [n:127.0.0.1:60671_ c:control_collection   x:collection1] o.a.s.c.Config Beginning with Solr 5.5, <mergePolicy> is deprecated, use <mergePolicyFactory> instead.
   [junit4]   2> 554808 INFO  (coreLoadExecutor-2984-thread-1-processing-n:127.0.0.1:60671_) [n:127.0.0.1:60671_ c:control_collection   x:collection1] o.a.s.c.SolrConfig Using Lucene MatchVersion: 6.1.0
   [junit4]   2> 554821 INFO  (coreLoadExecutor-2984-thread-1-processing-n:127.0.0.1:60671_) [n:127.0.0.1:60671_ c:control_collection   x:collection1] o.a.s.c.SolrConfig Loaded SolrConfig: solrconfig.xml
   [junit4]   2> 554834 INFO  (coreLoadExecutor-2984-thread-1-processing-n:127.0.0.1:60671_) [n:127.0.0.1:60671_ c:control_collection   x:collection1] o.a.s.s.IndexSchema [collection1] Schema name=test
   [junit4]   2> 554936 INFO  (coreLoadExecutor-2984-thread-1-processing-n:127.0.0.1:60671_) [n:127.0.0.1:60671_ c:control_collection   x:collection1] o.a.s.s.OpenExchangeRatesOrgProvider Initialized with rates=open-exchange-rates.json, refreshInterval=1440.
   [junit4]   2> 554944 INFO  (coreLoadExecutor-2984-thread-1-processing-n:127.0.0.1:60671_) [n:127.0.0.1:60671_ c:control_collection   x:collection1] o.a.s.s.IndexSchema default search field in schema is text
   [junit4]   2> 554945 INFO  (coreLoadExecutor-2984-thread-1-processing-n:127.0.0.1:60671_) [n:127.0.0.1:60671_ c:control_collection   x:collection1] o.a.s.s.IndexSchema unique key field: id
   [junit4]   2> 554954 INFO  (coreLoadExecutor-2984-thread-1-processing-n:127.0.0.1:60671_) [n:127.0.0.1:60671_ c:control_collection   x:collection1] o.a.s.s.FileExchangeRateProvider Reloading exchange rates from file currency.xml
   [junit4]   2> 554956 INFO  (coreLoadExecutor-2984-thread-1-processing-n:127.0.0.1:60671_) [n:127.0.0.1:60671_ c:control_collection   x:collection1] o.a.s.s.FileExchangeRateProvider Reloading exchange rates from file currency.xml
   [junit4]   2> 554958 INFO  (coreLoadExecutor-2984-thread-1-processing-n:127.0.0.1:60671_) [n:127.0.0.1:60671_ c:control_collection   x:collection1] o.a.s.s.OpenExchangeRatesOrgProvider Reloading exchange rates from open-exchange-rates.json
   [junit4]   2> 554958 INFO  (coreLoadExecutor-2984-thread-1-processing-n:127.0.0.1:60671_) [n:127.0.0.1:60671_ c:control_collection   x:collection1] o.a.s.s.OpenExchangeRatesOrgProvider Reloading exchange rates from open-exchange-rates.json
   [junit4]   2> 554959 INFO  (coreLoadExecutor-2984-thread-1-processing-n:127.0.0.1:60671_) [n:127.0.0.1:60671_ c:control_collection   x:collection1] o.a.s.c.ConfigSetProperties Did not find ConfigSet properties, assuming default properties: Can't find resource 'configsetprops.json' in classpath or '/configs/conf1', cwd=/home/jenkins/workspace/Lucene-Solr-6.x-Linux/solr/build/solr-core/test/J2
   [junit4]   2> 554959 INFO  (coreLoadExecutor-2984-thread-1-processing-n:127.0.0.1:60671_) [n:127.0.0.1:60671_ c:control_collection   x:collection1] o.a.s.c.CoreContainer Creating SolrCore 'collection1' using configuration from collection control_collection
   [junit4]   2> 554960 INFO  (coreLoadExecutor-2984-thread-1-processing-n:127.0.0.1:60671_) [n:127.0.0.1:60671_ c:control_collection s:shard1 r:core_node1 x:collection1] o.a.s.c.SolrCore org.apache.solr.core.MockDirectoryFactory
   [junit4]   2> 554960 INFO  (coreLoadExecutor-2984-thread-1-processing-n:127.0.0.1:60671_) [n:127.0.0.1:60671_ c:control_collection s:shard1 r:core_node1 x:collection1] o.a.s.c.SolrCore [[collection1] ] Opening new SolrCore at [/home/jenkins/workspace/Lucene-Solr-6.x-Linux/solr/build/solr-core/test/J2/temp/solr.cloud.UnloadDistributedZkTest_2696F42C902DEC34-001/control-001/cores/collection1], dataDir=[/home/jenkins/workspace/Lucene-Solr-6.x-Linux/solr/build/solr-core/test/J2/../../../../../../../../../home/jenkins/workspace/Lucene-Solr-6.x-Linux/solr/build/solr-core/test/J2/temp/solr.cloud.UnloadDistributedZkTest_2696F42C902DEC34-001/control-001/cores/collection1/data/]
   [junit4]   2> 554960 INFO  (coreLoadExecutor-2984-thread-1-processing-n:127.0.0.1:60671_) [n:127.0.0.1:60671_ c:control_collection s:shard1 r:core_node1 x:collection1] o.a.s.c.JmxMonitoredMap JMX monitoring is enabled. Adding Solr mbeans to JMX Server: com.sun.jmx.mbeanserver.JmxMBeanServer@105694f
   [junit4]   2> 554960 INFO  (coreLoadExecutor-2984-thread-1-processing-n:127.0.0.1:60671_) [n:127.0.0.1:60671_ c:control_collection s:shard1 r:core_node1 x:collection1] o.a.s.c.CachingDirectoryFactory return new directory for /home/jenkins/workspace/Lucene-Solr-6.x-Linux/solr/build/solr-core/test/J2/../../../../../../../../../home/jenkins/workspace/Lucene-Solr-6.x-Linux/solr/build/solr-core/test/J2/temp/solr.cloud.UnloadDistributedZkTest_2696F42C902DEC34-001/control-001/cores/collection1/data
   [junit4]   2> 554961 INFO  (coreLoadExecutor-2984-thread-1-processing-n:127.0.0.1:60671_) [n:127.0.0.1:60671_ c:control_collection s:shard1 r:core_node1 x:collection1] o.a.s.c.SolrCore New index directory detected: old=null new=/home/jenkins/workspace/Lucene-Solr-6.x-Linux/solr/build/solr-core/test/J2/../../../../../../../../../home/jenkins/workspace/Lucene-Solr-6.x-Linux/solr/build/solr-core/test/J2/temp/solr.cloud.UnloadDistributedZkTest_2696F42C902DEC34-001/control-001/cores/collection1/data/index/
   [junit4]   2> 554961 WARN  (coreLoadExecutor-2984-thread-1-processing-n:127.0.0.1:60671_) [n:127.0.0.1:60671_ c:control_collection s:shard1 r:core_node1 x:collection1] o.a.s.c.SolrCore [collection1] Solr index directory '/home/jenkins/workspace/Lucene-Solr-6.x-Linux/solr/build/solr-core/test/J2/../../../../../../../../../home/jenkins/workspace/Lucene-Solr-6.x-Linux/solr/build/solr-core/test/J2/temp/solr.cloud.UnloadDistributedZkTest_2696F42C902DEC34-001/control-001/cores/collection1/data/index' doesn't exist. Creating new index...
   [junit4]   2> 554961 INFO  (coreLoadExecutor-2984-thread-1-processing-n:127.0.0.1:60671_) [n:127.0.0.1:60671_ c:control_collection s:shard1 r:core_node1 x:collection1] o.a.s.c.CachingDirectoryFactory return new directory for /home/jenkins/workspace/Lucene-Solr-6.x-Linux/solr/build/solr-core/test/J2/../../../../../../../../../home/jenkins/workspace/Lucene-Solr-6.x-Linux/solr/build/solr-core/test/J2/temp/solr.cloud.UnloadDistributedZkTest_2696F42C902DEC34-001/control-001/cores/collection1/data/index
   [junit4]   2> 554961 INFO  (coreLoadExecutor-2984-thread-1-processing-n:127.0.0.1:60671_) [n:127.0.0.1:60671_ c:control_collection s:shard1 r:core_node1 x:collection1] o.a.s.u.RandomMergePolicy RandomMergePolicy wrapping class org.apache.lucene.index.LogByteSizeMergePolicy: [LogByteSizeMergePolicy: minMergeSize=1677721, mergeFactor=48, maxMergeSize=2147483648, maxMergeSizeForForcedMerge=9223372036854775807, calibrateSizeByDeletes=true, maxMergeDocs=2147483647, maxCFSSegmentSizeMB=8.796093022207999E12, noCFSRatio=0.3384830349798703]
   [junit4]   2> 554962 INFO  (coreLoadExecutor-2984-thread-1-processing-n:127.0.0.1:60671_) [n:127.0.0.1:60671_ c:control_collection s:shard1 r:core_node1 x:collection1] o.a.s.c.SolrDeletionPolicy SolrDeletionPolicy.onCommit: commits: num=1
   [junit4]   2> 	commit{dir=MockDirectoryWrapper(RAMDirectory@9b7383 lockFactory=org.apache.lucene.store.SingleInstanceLockFactory@13e5164),segFN=segments_1,generation=1}
   [junit4]   2> 554962 INFO  (coreLoadExecutor-2984-thread-1-processing-n:127.0.0.1:60671_) [n:127.0.0.1:60671_ c:control_collection s:shard1 r:core_node1 x:collection1] o.a.s.c.SolrDeletionPolicy newest commit generation = 1
   [junit4]   2> 554962 INFO  (OldIndexDirectoryCleanupThreadForCore-collection1) [n:127.0.0.1:60671_ c:control_collection s:shard1 r:core_node1 x:collection1] o.a.s.c.SolrCore Looking for old index directories to cleanup for core collection1 in /home/jenkins/workspace/Lucene-Solr-6.x-Linux/solr/build/solr-core/test/J2/../../../../../../../../../home/jenkins/workspace/Lucene-Solr-6.x-Linux/solr/build/solr-core/test/J2/temp/solr.cloud.UnloadDistributedZkTest_2696F42C902DEC34-001/control-001/cores/collection1/data/
   [junit4]   2> 554962 WARN  (OldIndexDirectoryCleanupThreadForCore-collection1) [n:127.0.0.1:60671_ c:control_collection s:shard1 r:core_node1 x:collection1] o.a.s.c.DirectoryFactory /home/jenkins/workspace/Lucene-Solr-6.x-Linux/solr/build/solr-core/test/J2/../../../../../../../../../home/jenkins/workspace/Lucene-Solr-6.x-Linux/solr/build/solr-core/test/J2/temp/solr.cloud.UnloadDistributedZkTest_2696F42C902DEC34-001/control-001/cores/collection1/data/ does not point to a valid data directory; skipping clean-up of old index directories.
   [junit4]   2> 554965 INFO  (coreLoadExecutor-2984-thread-1-processing-n:127.0.0.1:60671_) [n:127.0.0.1:60671_ c:control_collection s:shard1 r:core_node1 x:collection1] o.a.s.u.p.UpdateRequestProcessorChain creating updateRequestProcessorChain "nodistrib"
   [junit4]   2> 554966 INFO  (coreLoadExecutor-2984-thread-1-processing-n:127.0.0.1:60671_) [n:127.0.0.1:60671_ c:control_collection s:shard1 r:core_node1 x:collection1] o.a.s.u.p.UpdateRequestProcessorChain creating updateRequestProcessorChain "dedupe"
   [junit4]   2> 554966 INFO  (coreLoadExecutor-2984-thread-1-processing-n:127.0.0.1:60671_) [n:127.0.0.1:60671_ c:control_collection s:shard1 r:core_node1 x:collection1] o.a.s.u.p.UpdateRequestProcessorChain inserting DistributedUpdateProcessorFactory into updateRequestProcessorChain "dedupe"
   [junit4]   2> 554966 INFO  (coreLoadExecutor-2984-thread-1-processing-n:127.0.0.1:60671_) [n:127.0.0.1:60671_ c:control_collection s:shard1 r:core_node1 x:collection1] o.a.s.u.p.UpdateRequestProcessorChain creating updateRequestProcessorChain "stored_sig"
   [junit4]   2> 554966 INFO  (coreLoadExecutor-2984-thread-1-processing-n:127.0.0.1:60671_) [n:127.0.0.1:60671_ c:control_collection s:shard1 r:core_node1 x:collection1] o.a.s.u.p.UpdateRequestProcessorChain inserting DistributedUpdateProcessorFactory into updateRequestProcessorChain "stored_sig"
   [junit4]   2> 554966 INFO  (coreLoadExecutor-2984-thread-1-processing-n:127.0.0.1:60671_) [n:127.0.0.1:60671_ c:control_collection s:shard1 r:core_node1 x:collection1] o.a.s.u.p.UpdateRequestProcessorChain creating updateRequestProcessorChain "distrib-dup-test-chain-explicit"
   [junit4]   2> 554966 INFO  (coreLoadExecutor-2984-thread-1-processing-n:127.0.0.1:60671_) [n:127.0.0.1:60671_ c:control_collection s:shard1 r:core_node1 x:collection1] o.a.s.u.p.UpdateRequestProcessorChain creating updateRequestProcessorChain "distrib-dup-test-chain-implicit"
   [junit4]   2> 554966 INFO  (coreLoadExecutor-2984-thread-1-processing-n:127.0.0.1:60671_) [n:127.0.0.1:60671_ c:control_collection s:shard1 r:core_node1 x:collection1] o.a.s.u.p.UpdateRequestProcessorChain inserting DistributedUpdateProcessorFactory into updateRequestProcessorChain "distrib-dup-test-chain-implicit"
   [junit4]   2> 554966 INFO  (coreLoadExecutor-2984-thread-1-processing-n:127.0.0.1:60671_) [n:127.0.0.1:60671_ c:control_collection s:shard1 r:core_node1 x:collection1] o.a.s.c.SolrCore no updateRequestProcessorChain defined as default, creating implicit default
   [junit4]   2> 554967 WARN  (coreLoadExecutor-2984-thread-1-processing-n:127.0.0.1:60671_) [n:127.0.0.1:60671_ c:control_collection s:shard1 r:core_node1 x:collection1] o.a.s.c.RequestHandlers INVALID paramSet a in requestHandler {type = requestHandler,name = /dump,class = DumpRequestHandler,args = {defaults={a=A,b=B}}}
   [junit4]   2> 554968 INFO  (coreLoadExecutor-2984-thread-1-processing-n:127.0.0.1:60671_) [n:127.0.0.1:60671_ c:control_collection s:shard1 r:core_node1 x:collection1] o.a.s.h.l.XMLLoader xsltCacheLifetimeSeconds=60
   [junit4]   2> 554969 INFO  (coreLoadExecutor-2984-thread-1-processing-n:127.0.0.1:60671_) [n:127.0.0.1:60671_ c:control_collection s:shard1 r:core_node1 x:collection1] o.a.s.h.l.XMLLoader xsltCacheLifetimeSeconds=60
   [junit4]   2> 554971 INFO  (coreLoadExecutor-2984-thread-1-processing-n:127.0.0.1:60671_) [n:127.0.0.1:60671_ c:control_collection s:shard1 r:core_node1 x:collection1] o.a.s.h.l.XMLLoader xsltCacheLifetimeSeconds=60
   [junit4]   2> 554972 INFO  (coreLoadExecutor-2984-thread-1-processing-n:127.0.0.1:60671_) [n:127.0.0.1:60671_ c:control_collection s:shard1 r:core_node1 x:collection1] o.a.s.h.l.XMLLoader xsltCacheLifetimeSeconds=60
   [junit4]   2> 554989 INFO  (coreLoadExecutor-2984-thread-1-processing-n:127.0.0.1:60671_) [n:127.0.0.1:60671_ c:control_collection s:shard1 r:core_node1 x:collection1] o.a.s.c.RequestHandlers Registered paths: /admin/mbeans,standard,/dump,/update/csv,/sql,/update/json/docs,/admin/luke,/export,/admin/segments,/get,/admin/system,/replication,/admin/properties,/config,/stream,/schema,/admin/plugins,/admin/logging,/update/json,/admin/ping,/admin/threads,/update,/admin/file
   [junit4]   2> 554989 INFO  (coreLoadExecutor-2984-thread-1-processing-n:127.0.0.1:60671_) [n:127.0.0.1:60671_ c:control_collection s:shard1 r:core_node1 x:collection1] o.a.s.c.SolrCore Using default statsCache cache: org.apache.solr.search.stats.LocalStatsCache
   [junit4]   2> 554989 INFO  (coreLoadExecutor-2984-thread-1-processing-n:127.0.0.1:60671_) [n:127.0.0.1:60671_ c:control_collection s:shard1 r:core_node1 x:collection1] o.a.s.u.UpdateHandler Using UpdateLog implementation: org.apache.solr.update.UpdateLog
   [junit4]   2> 554989 INFO  (coreLoadExecutor-2984-thread-1-processing-n:127.0.0.1:60671_) [n:127.0.0.1:60671_ c:control_collection s:shard1 r:core_node1 x:collection1] o.a.s.u.UpdateLog Initializing UpdateLog: dataDir= defaultSyncLevel=FLUSH numRecordsToKeep=100 maxNumLogsToKeep=10 numVersionBuckets=65536
   [junit4]   2> 554991 INFO  (coreLoadExecutor-2984-thread-1-processing-n:127.0.0.1:60671_) [n:127.0.0.1:60671_ c:control_collection s:shard1 r:core_node1 x:collection1] o.a.s.u.CommitTracker Hard AutoCommit: disabled
   [junit4]   2> 554991 INFO  (coreLoadExecutor-2984-thread-1-processing-n:127.0.0.1:60671_) [n:127.0.0.1:60671_ c:control_collection s:shard1 r:core_node1 x:collection1] o.a.s.u.CommitTracker Soft AutoCommit: disabled
   [junit4]   2> 554991 INFO  (coreLoadExecutor-2984-thread-1-processing-n:127.0.0.1:60671_) [n:127.0.0.1:60671_ c:control_collection s:shard1 r:core_node1 x:collection1] o.a.s.u.RandomMergePolicy RandomMergePolicy wrapping class org.apache.lucene.index.LogDocMergePolicy: [LogDocMergePolicy: minMergeSize=1000, mergeFactor=43, maxMergeSize=9223372036854775807, maxMergeSizeForForcedMerge=9223372036854775807, calibrateSizeByDeletes=true, maxMergeDocs=2147483647, maxCFSSegmentSizeMB=8.796093022207999E12, noCFSRatio=0.4669561077985457]
   [junit4]   2> 554992 INFO  (coreLoadExecutor-2984-thread-1-processing-n:127.0.0.1:60671_) [n:127.0.0.1:60671_ c:control_collection s:shard1 r:core_node1 x:collection1] o.a.s.c.SolrDeletionPolicy SolrDeletionPolicy.onInit: commits: num=1
   [junit4]   2> 	commit{dir=MockDirectoryWrapper(RAMDirectory@9b7383 lockFactory=org.apache.lucene.store.SingleInstanceLockFactory@13e5164),segFN=segments_1,generation=1}
   [junit4]   2> 554992 INFO  (coreLoadExecutor-2984-thread-1-processing-n:127.0.0.1:60671_) [n:127.0.0.1:60671_ c:control_collection s:shard1 r:core_node1 x:collection1] o.a.s.c.SolrDeletionPolicy newest commit generation = 1
   [junit4]   2> 554992 INFO  (coreLoadExecutor-2984-thread-1-processing-n:127.0.0.1:60671_) [n:127.0.0.1:60671_ c:control_collection s:shard1 r:core_node1 x:collection1] o.a.s.s.SolrIndexSearcher Opening [Searcher@116516[collection1] main]
   [junit4]   2> 554992 INFO  (coreLoadExecutor-2984-thread-1-processing-n:127.0.0.1:60671_) [n:127.0.0.1:60671_ c:control_collection s:shard1 r:core_node1 x:collection1] o.a.s.c.c.ZkStateReader Load collection config from: [/collections/control_collection]
   [junit4]   2> 554993 INFO  (coreLoadExecutor-2984-thread-1-processing-n:127.0.0.1:60671_) [n:127.0.0.1:60671_ c:control_collection s:shard1 r:core_node1 x:collection1] o.a.s.c.c.ZkStateReader path=[/collections/control_collection] [configName]=[conf1] specified config exists in ZooKeeper
   [junit4]   2> 554993 INFO  (coreLoadExecutor-2984-thread-1-processing-n:127.0.0.1:60671_) [n:127.0.0.1:60671_ c:control_collection s:shard1 r:core_node1 x:collection1] o.a.s.r.ManagedResourceStorage Setting up ZooKeeper-based storage for the RestManager with znodeBase: /configs/conf1
   [junit4]   2> 554993 INFO  (coreLoadExecutor-2984-thread-1-processing-n:127.0.0.1:60671_) [n:127.0.0.1:60671_ c:control_collection s:shard1 r:core_node1 x:collection1] o.a.s.r.ManagedResourceStorage Configured ZooKeeperStorageIO with znodeBase: /configs/conf1
   [junit4]   2> 554993 INFO  (coreLoadExecutor-2984-thread-1-processing-n:127.0.0.1:60671_) [n:127.0.0.1:60671_ c:control_collection s:shard1 r:core_node1 x:collection1] o.a.s.r.RestManager Initializing RestManager with initArgs: {}
   [junit4]   2> 554993 INFO  (coreLoadExecutor-2984-thread-1-processing-n:127.0.0.1:60671_) [n:127.0.0.1:60671_ c:control_collection s:shard1 r:core_node1 x:collection1] o.a.s.r.ManagedResourceStorage Reading _rest_managed.json using ZooKeeperStorageIO:path=/configs/conf1
   [junit4]   2> 554994 INFO  (coreLoadExecutor-2984-thread-1-processing-n:127.0.0.1:60671_) [n:127.0.0.1:60671_ c:control_collection s:shard1 r:core_node1 x:collection1] o.a.s.r.ManagedResourceStorage No data found for znode /configs/conf1/_rest_managed.json
   [junit4]   2> 554994 INFO  (coreLoadExecutor-2984-thread-1-processing-n:127.0.0.1:60671_) [n:127.0.0.1:60671_ c:control_collection s:shard1 r:core_node1 x:collection1] o.a.s.r.ManagedResourceStorage Loaded null at path _rest_managed.json using ZooKeeperStorageIO:path=/configs/conf1
   [junit4]   2> 554994 INFO  (coreLoadExecutor-2984-thread-1-processing-n:127.0.0.1:60671_) [n:127.0.0.1:60671_ c:control_collection s:shard1 r:core_node1 x:collection1] o.a.s.r.RestManager Initializing 0 registered ManagedResources
   [junit4]   2> 554994 INFO  (coreLoadExecutor-2984-thread-1-processing-n:127.0.0.1:60671_) [n:127.0.0.1:60671_ c:control_collection s:shard1 r:core_node1 x:collection1] o.a.s.h.ReplicationHandler Commits will be reserved for  10000
   [junit4]   2> 554995 INFO  (searcherExecutor-2985-thread-1-processing-n:127.0.0.1:60671_ x:collection1 s:shard1 c:control_collection r:core_node1) [n:127.0.0.1:60671_ c:control_collection s:shard1 r:core_node1 x:collection1] o.a.s.c.SolrCore [collection1] Registered new searcher Searcher@116516[collection1] main{ExitableDirectoryReader(UninvertingDirectoryReader())}
   [junit4]   2> 554996 INFO  (coreLoadExecutor-2984-thread-1-processing-n:127.0.0.1:60671_) [n:127.0.0.1:60671_ c:control_collection s:shard1 r:core_node1 x:collection1] o.a.s.u.UpdateLog Looking up max value of version field to seed version buckets
   [junit4]   2> 554996 INFO  (coreLoadExecutor-2984-thread-1-processing-n:127.0.0.1:60671_) [n:127.0.0.1:60671_ c:control_collection s:shard1 r:core_node1 x:collection1] o.a.s.u.VersionInfo Refreshing highest value of _version_ for 65536 version buckets from index
   [junit4]   2> 554996 INFO  (coreLoadExecutor-2984-thread-1-processing-n:127.0.0.1:60671_) [n:127.0.0.1:60671_ c:control_collection s:shard1 r:core_node1 x:collection1] o.a.s.u.VersionInfo No terms found for _version_, cannot seed version bucket highest value from index
   [junit4]   2> 554996 INFO  (coreLoadExecutor-2984-thread-1-processing-n:127.0.0.1:60671_) [n:127.0.0.1:60671_ c:control_collection s:shard1 r:core_node1 x:collection1] o.a.s.u.UpdateLog Could not find max version in index or recent updates, using new clock 1528288119504240640
   [junit4]   2> 554998 INFO  (coreLoadExecutor-2984-thread-1-processing-n:127.0.0.1:60671_) [n:127.0.0.1:60671_ c:control_collection s:shard1 r:core_node1 x:collection1] o.a.s.u.UpdateLog Took 2.0ms to seed version buckets with highest version 1528288119504240640
   [junit4]   2> 554998 INFO  (coreLoadExecutor-2984-thread-1-processing-n:127.0.0.1:60671_) [n:127.0.0.1:60671_ c:control_collection s:shard1 r:core_node1 x:collection1] o.a.s.c.ZkController watch zkdir /configs/conf1
   [junit4]   2> 554998 INFO  (coreLoadExecutor-2984-thread-1-processing-n:127.0.0.1:60671_) [n:127.0.0.1:60671_ c:control_collection s:shard1 r:core_node1 x:collection1] o.a.s.c.CoreContainer registering core: collection1
   [junit4]   2> 554999 INFO  (coreZkRegister-2978-thread-1-processing-n:127.0.0.1:60671_ x:collection1 s:shard1 c:control_collection r:core_node1) [n:127.0.0.1:60671_ c:control_collection s:shard1 r:core_node1 x:collection1] o.a.s.c.ZkController Register replica - core:collection1 address:http://127.0.0.1:60671 collection:control_collection shard:shard1
   [junit4]   2> 554999 INFO  (coreZkRegister-2978-thread-1-processing-n:127.0.0.1:60671_ x:collection1 s:shard1 c:control_collection r:core_node1) [n:127.0.0.1:60671_ c:control_collection s:shard1 r:core_node1 x:collection1] o.a.s.c.c.SolrZkClient makePath: /collections/control_collection/leader_elect/shard1/election
   [junit4]   2> 555001 INFO  (coreZkRegister-2978-thread-1-processing-n:127.0.0.1:60671_ x:collection1 s:shard1 c:control_collection r:core_node1) [n:127.0.0.1:60671_ c:control_collection s:shard1 r:core_node1 x:collection1] o.a.s.c.LeaderElector Joined leadership election with path: /collections/control_collection/leader_elect/shard1/election/95518007370842116-core_node1-n_0000000000
   [junit4]   2> 555001 INFO  (coreZkRegister-2978-thread-1-processing-n:127.0.0.1:60671_ x:collection1 s:shard1 c:control_collection r:core_node1) [n:127.0.0.1:60671_ c:control_collection s:shard1 r:core_node1 x:collection1] o.a.s.c.ShardLeaderElectionContext Running the leader process for shard=shard1 and weAreReplacement=false and leaderVoteWait=180000
   [junit4]   2> 555002 INFO  (coreZkRegister-2978-thread-1-processing-n:127.0.0.1:60671_ x:collection1 s:shard1 c:control_collection r:core_node1) [n:127.0.0.1:60671_ c:control_collection s:shard1 r:core_node1 x:collection1] o.a.s.c.ShardLeaderElectionContext Enough replicas found to continue.
   [junit4]   2> 555002 INFO  (coreZkRegister-2978-thread-1-processing-n:127.0.0.1:60671_ x:collection1 s:shard1 c:control_collection r:core_node1) [n:127.0.0.1:60671_ c:control_collection s:shard1 r:core_node1 x:collection1] o.a.s.c.ShardLeaderElectionContext I may be the new leader - try and sync
   [junit4]   2> 555002 INFO  (coreZkRegister-2978-thread-1-processing-n:127.0.0.1:60671_ x:collection1 s:shard1 c:control_collection r:core_node1) [n:127.0.0.1:60671_ c:control_collection s:shard1 r:core_node1 x:collection1] o.a.s.c.SyncStrategy Sync replicas to http://127.0.0.1:60671/collection1/
   [junit4]   2> 555002 INFO  (coreZkRegister-2978-thread-1-processing-n:127.0.0.1:60671_ x:collection1 s:shard1 c:control_collection r:core_node1) [n:127.0.0.1:60671_ c:control_collection s:shard1 r:core_node1 x:collection1] o.a.s.c.SyncStrategy Sync Success - now sync replicas to me
   [junit4]   2> 555002 INFO  (OverseerStateUpdate-95518007370842116-127.0.0.1:60671_-n_0000000000) [n:127.0.0.1:60671_    ] o.a.s.c.Overseer processMessage: queueSize: 1, message = {
   [junit4]   2>   "operation":"leader",
   [junit4]   2>   "shard":"shard1",
   [junit4]   2>   "collection":"control_collection"} current state version: 1
   [junit4]   2> 555002 INFO  (coreZkRegister-2978-thread-1-processing-n:127.0.0.1:60671_ x:collection1 s:shard1 c:control_collection r:core_node1) [n:127.0.0.1:60671_ c:control_collection s:shard1 r:core_node1 x:collection1] o.a.s.c.SyncStrategy http://127.0.0.1:60671/collection1/ has no replicas
   [junit4]   2> 555003 INFO  (coreZkRegister-2978-thread-1-processing-n:127.0.0.1:60671_ x:collection1 s:shard1 c:control_collection r:core_node1) [n:127.0.0.1:60671_ c:control_collection s:shard1 r:core_node1 x:collection1] o.a.s.c.c.SolrZkClient makePath: /collections/control_collection/leaders/shard1
   [junit4]   2> 555004 INFO  (coreZkRegister-2978-thread-1-processing-n:127.0.0.1:60671_ x:collection1 s:shard1 c:control_collection r:core_node1) [n:127.0.0.1:60671_ c:control_collection s:shard1 r:core_node1 x:collection1] o.a.s.c.ShardLeaderElectionContextBase Creating leader registration node /collections/control_collection/leaders/shard1/leader after winning as /collections/control_collection/leader_elect/shard1/election/95518007370842116-core_node1-n_0000000000
   [junit4]   2> 555005 INFO  (coreZkRegister-2978-thread-1-processing-n:127.0.0.1:60671_ x:collection1 s:shard1 c:control_collection r:core_node1) [n:127.0.0.1:60671_ c:control_collection s:shard1 r:core_node1 x:collection1] o.a.s.c.ShardLeaderElectionContext I am the new leader: http://127.0.0.1:60671/collection1/ shard1
   [junit4]   2> 555005 INFO  (OverseerStateUpdate-95518007370842116-127.0.0.1:60671_-n_0000000000) [n:127.0.0.1:60671_    ] o.a.s.c.Overseer processMessage: queueSize: 1, message = {
   [junit4]   2>   "operation":"leader",
   [junit4]   2>   "shard":"shard1",
   [junit4]   2>   "collection":"control_collection",
   [junit4]   2>   "base_url":"http://127.0.0.1:60671",
   [junit4]   2>   "core":"collection1",
   [junit4]   2>   "state":"active"} current state version: 1
   [junit4]   2> 555107 INFO  (zkCallback-1132-thread-1-processing-n:127.0.0.1:60671_) [n:127.0.0.1:60671_    ] o.a.s.c.c.ZkStateReader A cluster state change: [WatchedEvent state:SyncConnected type:NodeDataChanged path:/clusterstate.json], has occurred - updating... (live nodes size: [1])
   [junit4]   2> 555156 INFO  (coreZkRegister-2978-thread-1-processing-n:127.0.0.1:60671_ x:collection1 s:shard1 c:control_collection r:core_node1) [n:127.0.0.1:60671_ c:control_collection s:shard1 r:core_node1 x:collection1] o.a.s.c.ZkController We are http://127.0.0.1:60671/collection1/ and leader is http://127.0.0.1:60671/collection1/
   [junit4]   2> 555156 INFO  (coreZkRegister-2978-thread-1-processing-n:127.0.0.1:60671_ x:collection1 s:shard1 c:control_collection r:core_node1) [n:127.0.0.1:60671_ c:control_collection s:shard1 r:core_node1 x:collection1] o.a.s.c.ZkController No LogReplay needed for core=collection1 baseURL=http://127.0.0.1:60671
   [junit4]   2> 555156 INFO  (coreZkRegister-2978-thread-1-processing-n:127.0.0.1:60671_ x:collection1 s:shard1 c:control_collection r:core_node1) [n:127.0.0.1:60671_ c:control_collection s:shard1 r:core_node1 x:collection1] o.a.s.c.ZkController I am the leader, no recovery necessary
   [junit4]   2> 555156 INFO  (coreZkRegister-2978-thread-1-processing-n:127.0.0.1:60671_ x:collection1 s:shard1 c:control_collection r:core_node1) [n:127.0.0.1:60671_ c:control_collection s:shard1 r:core_node1 x:collection1] o.a.s.c.ZkController publishing state=active
   [junit4]   2> 555156 INFO  (coreZkRegister-2978-thread-1-processing-n:127.0.0.1:60671_ x:collection1 s:shard1 c:control_collection r:core_node1) [n:127.0.0.1:60671_ c:control_collection s:shard1 r:core_node1 x:collection1] o.a.s.c.ZkController numShards not found on descriptor - reading it from system property
   [junit4]   2> 555157 INFO  (OverseerStateUpdate-95518007370842116-127.0.0.1:60671_-n_0000000000) [n:127.0.0.1:60671_    ] o.a.s.c.Overseer processMessage: queueSize: 1, message = {
   [junit4]   2>   "core":"collection1",
   [junit4]   2>   "core_node_name":"core_node1",
   [junit4]   2>   "roles":null,
   [junit4]   2>   "base_url":"http://127.0.0.1:60671",
   [junit4]   2>   "node_name":"127.0.0.1:60671_",
   [junit4]   2>   "numShards":"1",
   [junit4]   2>   "state":"active",
   [junit4]   2>   "shard":"shard1",
   [junit4]   2>   "collection":"control_collection",
   [junit4]   2>   "operation":"state"} current state version: 2
   [junit4]   2> 555157 INFO  (OverseerStateUpdate-95518007370842116-127.0.0.1:60671_-n_0000000000) [n:127.0.0.1:60671_    ] o.a.s.c.o.ReplicaMutator Update state numShards=1 message={
   [junit4]   2>   "core":"collection1",
   [junit4]   2>   "core_node_name":"core_node1",
   [junit4]   2>   "roles":null,
   [junit4]   2>   "base_url":"http://127.0.0.1:60671",
   [junit4]   2>   "node_name":"127.0.0.1:60671_",
   [junit4]   2>   "numShards":"1",
   [junit4]   2>   "state":"active",
   [junit4]   2>   "shard":"shard1",
   [junit4]   2>   "collection":"control_collection",
   [junit4]   2>   "operation":"state"}
   [junit4]   2> 555258 INFO  (zkCallback-1132-thread-1-processing-n:127.0.0.1:60671_) [n:127.0.0.1:60671_    ] o.a.s.c.c.ZkStateReader A cluster state change: [WatchedEvent state:SyncConnected type:NodeDataChanged path:/clusterstate.json], has occurred - updating... (live nodes size: [1])
   [junit4]   2> 555277 INFO  (TEST-UnloadDistributedZkTest.test-seed#[2696F42C902DEC34]) [    ] o.a.s.c.c.SolrZkClient Using default ZkCredentialsProvider
   [junit4]   2> 555278 INFO  (TEST-UnloadDistributedZkTest.test-seed#[2696F42C902DEC34]) [    ] o.a.s.c.c.ConnectionManager Waiting for client to connect to ZooKeeper
   [junit4]   2> 555279 INFO  (zkCallback-1134-thread-1) [    ] o.a.s.c.c.ConnectionManager Watcher org.apache.solr.common.cloud.ConnectionManager@1f46d5e name:ZooKeeperConnection Watcher:127.0.0.1:52353/solr got event WatchedEvent state:SyncConnected type:None path:null path:null type:None
   [junit4]   2> 555279 INFO  (TEST-UnloadDistributedZkTest.test-seed#[2696F42C902DEC34]) [    ] o.a.s.c.c.ConnectionManager Client is connected to ZooKeeper
   [junit4]   2> 555279 INFO  (TEST-UnloadDistributedZkTest.test-seed#[2696F42C902DEC34]) [    ] o.a.s.c.c.SolrZkClient Using default ZkACLProvider
   [junit4]   2> 555280 INFO  (TEST-UnloadDistributedZkTest.test-seed#[2696F42C902DEC34]) [    ] o.a.s.c.c.ZkStateReader Updating cluster state from ZooKeeper... 
   [junit4]   2> 555280 INFO  (TEST-UnloadDistributedZkTest.test-seed#[2696F42C902DEC34]) [    ] o.a.s.c.c.ZkStateReader Updated live nodes from ZooKeeper... (0) -> (1)
   [junit4]   2> 555281 INFO  (TEST-UnloadDistributedZkTest.test-seed#[2696F42C902DEC34]) [    ] o.a.s.c.ChaosMonkey monkey: init - expire sessions:false cause connection loss:false
   [junit4]   2> 555281 INFO  (TEST-UnloadDistributedZkTest.test-seed#[2696F42C902DEC34]) [    ] o.a.s.c.AbstractFullDistribZkTestBase Creating collection1 with stateFormat=2
   [junit4]   2> 555281 INFO  (TEST-UnloadDistributedZkTest.test-seed#[2696F42C902DEC34]) [    ] o.a.s.c.c.SolrZkClient Using default ZkCredentialsProvider
   [junit4]   2> 555281 INFO  (TEST-UnloadDistributedZkTest.test-seed#[2696F42C902DEC34]) [    ] o.a.s.c.c.ConnectionManager Waiting for client to connect to ZooKeeper
   [junit4]   2> 555282 INFO  (zkCallback-1135-thread-1) [    ] o.a.s.c.c.ConnectionManager Watcher org.apache.solr.common.cloud.ConnectionManager@932812 name:ZooKeeperConnection Watcher:127.0.0.1:52353/solr got event WatchedEvent state:SyncConnected type:None path:null path:null type:None
   [junit4]   2> 555282 INFO  (TEST-UnloadDistributedZkTest.test-seed#[2696F42C902DEC34]) [    ] o.a.s.c.c.ConnectionManager Client is connected to ZooKeeper
   [junit4]   2> 555282 INFO  (TEST-UnloadDistributedZkTest.test-seed#[2696F42C902DEC34]) [    ] o.a.s.c.c.SolrZkClient Using default ZkACLProvider
   [junit4]   2> 555283 INFO  (OverseerStateUpdate-95518007370842116-127.0.0.1:60671_-n_0000000000) [n:127.0.0.1:60671_    ] o.a.s.c.Overseer processMessage: queueSize: 1, message = {
   [junit4]   2>   "operation":"create",
   [junit4]   2>   "name":"collection1",
   [junit4]   2>   "numShards":"2",
   [junit4]   2>   "stateFormat":"2"} current state version: 3
   [junit4]   2> 555284 INFO  (OverseerStateUpdate-95518007370842116-127.0.0.1:60671_-n_0000000000) [n:127.0.0.1:60671_    ] o.a.s.c.o.ClusterStateMutator building a new cName: collection1
   [junit4]   2> 555349 INFO  (TEST-UnloadDistributedZkTest.test-seed#[2696F42C902DEC34]) [    ] o.a.s.SolrTestCaseJ4 Writing core.properties file to /home/jenkins/workspace/Lucene-Solr-6.x-Linux/solr/build/solr-core/test/J2/temp/solr.cloud.UnloadDistributedZkTest_2696F42C902DEC34-001/shard-1-001/cores/collection1
   [junit4]   2> 555349 INFO  (TEST-UnloadDistributedZkTest.test-seed#[2696F42C902DEC34]) [    ] o.a.s.c.AbstractFullDistribZkTestBase create jetty 1 in directory /home/jenkins/workspace/Lucene-Solr-6.x-Linux/solr/build/solr-core/test/J2/temp/solr.cloud.UnloadDistributedZkTest_2696F42C902DEC34-001/shard-1-001
   [junit4]   2> 555350 INFO  (TEST-UnloadDistributedZkTest.test-seed#[2696F42C902DEC34]) [    ] o.e.j.s.Server jetty-9.3.6.v20151106
   [junit4]   2> 555351 INFO  (TEST-UnloadDistributedZkTest.test-seed#[2696F42C902DEC34]) [    ] o.e.j.s.h.ContextHandler Started o.e.j.s.ServletContextHandler@bfe23c{/,null,AVAILABLE}
   [junit4]   2> 555352 INFO  (TEST-UnloadDistributedZkTest.test-seed#[2696F42C902DEC34]) [    ] o.e.j.s.ServerConnector Started ServerConnector@e61561{HTTP/1.1,[http/1.1]}{127.0.0.1:39019}
   [junit4]   2> 555352 INFO  (TEST-UnloadDistributedZkTest.test-seed#[2696F42C902DEC34]) [    ] o.e.j.s.Server Started @556431ms
   [junit4]   2> 555352 INFO  (TEST-UnloadDistributedZkTest.test-seed#[2696F42C902DEC34]) [    ] o.a.s.c.s.e.JettySolrRunner Jetty properties: {solr.data.dir=/home/jenkins/workspace/Lucene-Solr-6.x-Linux/solr/build/solr-core/test/J2/temp/solr.cloud.UnloadDistributedZkTest_2696F42C902DEC34-001/tempDir-001/jetty1, solrconfig=solrconfig.xml, hostContext=/, hostPort=39019, coreRootDirectory=/home/jenkins/workspace/Lucene-Solr-6.x-Linux/solr/build/solr-core/test/J2/temp/solr.cloud.UnloadDistributedZkTest_2696F42C902DEC34-001/shard-1-001/cores}
   [junit4]   2> 555352 INFO  (TEST-UnloadDistributedZkTest.test-seed#[2696F42C902DEC34]) [    ] o.a.s.s.SolrDispatchFilter SolrDispatchFilter.init(): sun.misc.Launcher$AppClassLoader@1d16e93
   [junit4]   2> 555352 INFO  (TEST-UnloadDistributedZkTest.test-seed#[2696F42C902DEC34]) [    ] o.a.s.c.SolrResourceLoader new SolrResourceLoader for directory: '/home/jenkins/workspace/Lucene-Solr-6.x-Linux/solr/build/solr-core/test/J2/temp/solr.cloud.UnloadDistributedZkTest_2696F42C902DEC34-001/shard-1-001'
   [junit4]   2> 555353 INFO  (TEST-UnloadDistributedZkTest.test-seed#[2696F42C902DEC34]) [    ] o.a.s.c.SolrResourceLoader JNDI not configured for solr (NoInitialContextEx)
   [junit4]   2> 555353 INFO  (TEST-UnloadDistributedZkTest.test-seed#[2696F42C902DEC34]) [    ] o.a.s.c.SolrResourceLoader solr home defaulted to 'solr/' (could not find system property or JNDI)
   [junit4]   2> 555353 INFO  (TEST-UnloadDistributedZkTest.test-seed#[2696F42C902DEC34]) [    ] o.a.s.c.c.SolrZkClient Using default ZkCredentialsProvider
   [junit4]   2> 555353 INFO  (TEST-UnloadDistributedZkTest.test-seed#[2696F42C902DEC34]) [    ] o.a.s.c.c.ConnectionManager Waiting for client to connect to ZooKeeper
   [junit4]   2> 555354 INFO  (zkCallback-1136-thread-1) [    ] o.a.s.c.c.ConnectionManager Watcher org.apache.solr.common.cloud.ConnectionManager@16d0fa5 name:ZooKeeperConnection Watcher:127.0.0.1:52353/solr got event WatchedEvent state:SyncConnected type:None path:null path:null type:None
   [junit4]   2> 555354 INFO  (TEST-UnloadDistributedZkTest.test-seed#[2696F42C902DEC34]) [    ] o.a.s.c.c.ConnectionManager Client is connected to ZooKeeper
   [junit4]   2> 555355 INFO  (TEST-UnloadDistributedZkTest.test-seed#[2696F42C902DEC34]) [    ] o.a.s.c.c.SolrZkClient Using default ZkACLProvider
   [junit4]   2> 555355 INFO  (TEST-UnloadDistributedZkTest.test-seed#[2696F42C902DEC34]) [    ] o.a.s.s.SolrDispatchFilter Loading solr.xml from SolrHome (not found in ZooKeeper)
   [junit4]   2> 555355 INFO  (TEST-UnloadDistributedZkTest.test-seed#[2696F42C902DEC34]) [    ] o.a.s.c.SolrXmlConfig Loading container configuration from /home/jenkins/workspace/Lucene-Solr-6.x-Linux/solr/build/solr-core/test/J2/temp/solr.cloud.UnloadDistributedZkTest_2696F42C902DEC34-001/shard-1-001/solr.xml
   [junit4]   2> 555361 INFO  (TEST-UnloadDistributedZkTest.test-seed#[2696F42C902DEC34]) [    ] o.a.s.c.CorePropertiesLocator Config-defined core root directory: /home/jenkins/workspace/Lucene-Solr-6.x-Linux/solr/build/solr-core/test/J2/temp/solr.cloud.UnloadDistributedZkTest_2696F42C902DEC34-001/shard-1-001/cores
   [junit4]   2> 555361 INFO  (TEST-UnloadDistributedZkTest.test-seed#[2696F42C902DEC34]) [    ] o.a.s.c.CoreContainer New CoreContainer 2676286
   [junit4]   2> 555361 INFO  (TEST-UnloadDistributedZkTest.test-seed#[2696F42C902DEC34]) [    ] o.a.s.c.CoreContainer Loading cores into CoreContainer [instanceDir=/home/jenkins/workspace/Lucene-Solr-6.x-Linux/solr/build/solr-core/test/J2/temp/solr.cloud.UnloadDistributedZkTest_2696F42C902DEC34-001/shard-1-001]
   [junit4]   2> 555361 WARN  (TEST-UnloadDistributedZkTest.test-seed#[2696F42C902DEC34]) [    ] o.a.s.c.CoreContainer Couldn't add files from /home/jenkins/workspace/Lucene-Solr-6.x-Linux/solr/build/solr-core/test/J2/temp/solr.cloud.UnloadDistributedZkTest_2696F42C902DEC34-001/shard-1-001/lib to classpath: /home/jenkins/workspace/Lucene-Solr-6.x-Linux/solr/build/solr-core/test/J2/temp/solr.cloud.UnloadDistributedZkTest_2696F42C902DEC34-001/shard-1-001/lib
   [junit4]   2> 555361 INFO  (TEST-UnloadDistributedZkTest.test-seed#[2696F42C902DEC34]) [    ] o.a.s.h.c.HttpShardHandlerFactory created with socketTimeout : 90000,urlScheme : ,connTimeout : 15000,maxConnectionsPerHost : 20,maxConnections : 10000,corePoolSize : 0,maximumPoolSize : 2147483647,maxThreadIdleTime : 5,sizeOfQueue : -1,fairnessPolicy : false,useRetries : false,
   [junit4]   2> 555362 INFO  (TEST-UnloadDistributedZkTest.test-seed#[2696F42C902DEC34]) [    ] o.a.s.u.UpdateShardHandler Creating UpdateShardHandler HTTP client with params: socketTimeout=340000&connTimeout=45000&retry=true
   [junit4]   2> 555363 INFO  (TEST-UnloadDistributedZkTest.test-seed#[2696F42C902DEC34]) [    ] o.a.s.l.LogWatcher SLF4J impl is org.slf4j.impl.Log4jLoggerFactory
   [junit4]   2> 555363 INFO  (TEST-UnloadDistributedZkTest.test-seed#[2696F42C902DEC34]) [    ] o.a.s.l.LogWatcher Registering Log Listener [Log4j (org.slf4j.impl.Log4jLoggerFactory)]
   [junit4]   2> 555363 INFO  (TEST-UnloadDistributedZkTest.test-seed#[2696F42C902DEC34]) [    ] o.a.s.c.ZkContainer Zookeeper client=127.0.0.1:52353/solr
   [junit4]   2> 555363 INFO  (TEST-UnloadDistributedZkTest.test-seed#[2696F42C902DEC34]) [    ] o.a.s.c.ZkController zkHost includes chroot
   [junit4]   2> 555363 INFO  (TEST-UnloadDistributedZkTest.test-seed#[2696F42C902DEC34]) [    ] o.a.s.c.c.SolrZkClient Using default ZkCredentialsProvider
   [junit4]   2> 555364 INFO  (TEST-UnloadDistributedZkTest.test-seed#[2696F42C902DEC34]) [    ] o.a.s.c.c.ConnectionManager Waiting for client to connect to ZooKeeper
   [junit4]   2> 555365 INFO  (zkCallback-1139-thread-1) [    ] o.a.s.c.c.ConnectionManager Watcher org.apache.solr.common.cloud.ConnectionManager@11db254 name:ZooKeeperConnection Watcher:127.0.0.1:52353 got event WatchedEvent state:SyncConnected type:None path:null path:null type:None
   [junit4]   2> 555365 INFO  (TEST-UnloadDistributedZkTest.test-seed#[2696F42C902DEC34]) [    ] o.a.s.c.c.ConnectionManager Client is connected to ZooKeeper
   [junit4]   2> 555365 INFO  (TEST-UnloadDistributedZkTest.test-seed#[2696F42C902DEC34]) [    ] o.a.s.c.c.SolrZkClient Using default ZkACLProvider
   [junit4]   2> 555367 INFO  (TEST-UnloadDistributedZkTest.test-seed#[2696F42C902DEC34]) [n:127.0.0.1:39019_    ] o.a.s.c.c.ConnectionManager Waiting for client to connect to ZooKeeper
   [junit4]   2> 555367 INFO  (zkCallback-1140-thread-1-processing-n:127.0.0.1:39019_) [n:127.0.0.1:39019_    ] o.a.s.c.c.ConnectionManager Watcher org.apache.solr.common.cloud.ConnectionManager@6bed69 name:ZooKeeperConnection Watcher:127.0.0.1:52353/solr got event WatchedEvent state:SyncConnected type:None path:null path:null type:None
   [junit4]   2> 555367 INFO  (TEST-UnloadDistributedZkTest.test-seed#[2696F42C902DEC34]) [n:127.0.0.1:39019_    ] o.a.s.c.c.ConnectionManager Client is connected to ZooKeeper
   [junit4]   2> 555371 INFO  (TEST-UnloadDistributedZkTest.test-seed#[2696F42C902DEC34]) [n:127.0.0.1:39019_    ] o.a.s.c.c.ZkStateReader Updating cluster state from ZooKeeper... 
   [junit4]   2> 555372 INFO  (TEST-UnloadDistributedZkTest.test-seed#[2696F42C902DEC34]) [n:127.0.0.1:39019_    ] o.a.s.c.c.ZkStateReader Updated live nodes from ZooKeeper... (0) -> (1)
   [junit4]   2> 555372 INFO  (TEST-UnloadDistributedZkTest.test-seed#[2696F42C902DEC34]) [n:127.0.0.1:39019_    ] o.a.s.c.Overseer Overseer (id=null) closing
   [junit4]   2> 555373 INFO  (TEST-UnloadDistributedZkTest.test-seed#[2696F42C902DEC34]) [n:127.0.0.1:39019_    ] o.a.s.c.LeaderElector Joined leadership election with path: /overseer_elect/election/95518007370842121-127.0.0.1:39019_-n_0000000001
   [junit4]   2> 555373 INFO  (TEST-UnloadDistributedZkTest.test-seed#[2696F42C902DEC34]) [n:127.0.0.1:39019_    ] o.a.s.c.LeaderElector Watching path /overseer_elect/election/95518007370842116-127.0.0.1:60671_-n_0000000000 to know if I could be the leader
   [junit4]   2> 555373 INFO  (TEST-UnloadDistributedZkTest.test-seed#[2696F42C902DEC34]) [n:127.0.0.1:39019_    ] o.a.s.c.ZkController Publish node=127.0.0.1:39019_ as DOWN
   [junit4]   2> 555375 INFO  (OverseerStateUpdate-95518007370842116-127.0.0.1:60671_-n_0000000000) [n:127.0.0.1:60671_    ] o.a.s.c.Overseer processMessage: queueSize: 1, message = {
   [junit4]   2>   "operation":"downnode",
   [junit4]   2>   "node_name":"127.0.0.1:39019_"} current state version: 3
   [junit4]   2> 555375 INFO  (OverseerStateUpdate-95518007370842116-127.0.0.1:60671_-n_0000000000) [n:127.0.0.1:60671_    ] o.a.s.c.o.NodeMutator DownNode state invoked for node: 127.0.0.1:39019_
   [junit4]   2> 555375 INFO  (OverseerStateUpdate-95518007370842116-127.0.0.1:60671_-n_0000000000) [n:127.0.0.1:60671_    ] o.a.s.c.o.ZkStateWriter going to create_collection /collections/collection1/state.json
   [junit4]   2> 555477 INFO  (zkCallback-1132-thread-1-processing-n:127.0.0.1:60671_) [n:127.0.0.1:60671_    ] o.a.s.c.c.ZkStateReader A cluster state change: [WatchedEvent state:SyncConnected type:NodeDataChanged path:/clusterstate.json], has occurred - updating... (live nodes size: [1])
   [junit4]   2> 555477 INFO  (zkCallback-1140-thread-1-processing-n:127.0.0.1:39019_) [n:127.0.0.1:39019_    ] o.a.s.c.c.ZkStateReader A cluster state change: [WatchedEvent state:SyncConnected type:NodeDataChanged path:/clusterstate.json], has occurred - updating... (live nodes size: [1])
   [junit4]   2> 555477 INFO  (zkCallback-1134-thread-1) [    ] o.a.s.c.c.ZkStateReader A cluster state change: [WatchedEvent state:SyncConnected type:NodeDataChanged path:/clusterstate.json], has occurred - updating... (live nodes size: [1])
   [junit4]   2> 556375 INFO  (TEST-UnloadDistributedZkTest.test-seed#[2696F42C902DEC34]) [n:127.0.0.1:39019_    ] o.a.s.c.ZkController Register node as live in ZooKeeper:/live_nodes/127.0.0.1:39019_
   [junit4]   2> 556375 INFO  (TEST-UnloadDistributedZkTest.test-seed#[2696F42C902DEC34]) [n:127.0.0.1:39019_    ] o.a.s.c.c.SolrZkClient makePath: /live_nodes/127.0.0.1:39019_
   [junit4]   2> 556376 INFO  (zkCallback-1134-thread-1) [    ] o.a.s.c.c.ZkStateReader A live node change: [WatchedEvent state:SyncConnected type:NodeChildrenChanged path:/live_nodes], has occurred - updating... (live nodes size: [1])
   [junit4]   2> 556376 INFO  (zkCallback-1132-thread-1-processing-n:127.0.0.1:60671_) [n:127.0.0.1:60671_    ] o.a.s.c.c.ZkStateReader A live node change: [WatchedEvent state:SyncConnected type:NodeChildrenChanged path:/live_nodes], has occurred - updating... (live nodes size: [1])
   [junit4]   2> 556376 INFO  (zkCallback-1140-thread-1-processing-n:127.0.0.1:39019_) [n:127.0.0.1:39019_    ] o.a.s.c.c.ZkStateReader A live node change: [WatchedEvent state:SyncConnected type:NodeChildrenChanged path:/live_nodes], has occurred - updating... (live nodes size: [1])
   [junit4]   2> 556376 INFO  (zkCallback-1132-thread-1-processing-n:127.0.0.1:60671_) [n:127.0.0.1:60671_    ] o.a.s.c.c.ZkStateReader Updated live nodes from ZooKeeper... (1) -> (2)
   [junit4]   2> 556376 INFO  (zkCallback-1140-thread-1-processing-n:127.0.0.1:39019_) [n:127.0.0.1:39019_    ] o.a.s.c.c.ZkStateReader Updated live nodes from ZooKeeper... (1) -> (2)
   [junit4]   2> 556376 INFO  (zkCallback-1134-thread-1) [    ] o.a.s.c.c.ZkStateReader Updated live nodes from ZooKeeper... (1) -> (2)
   [junit4]   2> 556421 INFO  (TEST-UnloadDistributedZkTest.test-seed#[2696F42C902DEC34]) [n:127.0.0.1:39019_    ] o.a.s.c.CoreContainer Security conf doesn't exist. Skipping setup for authorization module.
   [junit4]   2> 556421 INFO  (TEST-UnloadDistributedZkTest.test-seed#[2696F42C902DEC34]) [n:127.0.0.1:39019_    ] o.a.s.c.CoreContainer No authentication plugin used.
   [junit4]   2> 556421 INFO  (TEST-UnloadDistributedZkTest.test-seed#[2696F42C902DEC34]) [n:127.0.0.1:39019_    ] o.a.s.c.CorePropertiesLocator Looking for core definitions underneath /home/jenkins/workspace/Lucene-Solr-6.x-Linux/solr/build/solr-core/test/J2/temp/solr.cloud.UnloadDistributedZkTest_2696F42C902DEC34-001/shard-1-001/cores
   [junit4]   2> 556422 INFO  (TEST-UnloadDistributedZkTest.test-seed#[2696F42C902DEC34]) [n:127.0.0.1:39019_    ] o.a.s.c.CoreDescriptor Created CoreDescriptor: {name=collection1, config=solrconfig.xml, transient=false, schema=schema.xml, loadOnStartup=true, configSetProperties=configsetprops.json, collection=collection1, coreNodeName=, dataDir=data/, shard=}
   [junit4]   2> 556422 INFO  (TEST-UnloadDistributedZkTest.test-seed#[2696F42C902DEC34]) [n:127.0.0.1:39019_    ] o.a.s.c.CorePropertiesLocator Found core collection1 in /home/jenkins/workspace/Lucene-Solr-6.x-Linux/solr/build/solr-core/test/J2/temp/solr.cloud.UnloadDistributedZkTest_2696F42C902DEC34-001/shard-1-001/cores/collection1
   [junit4]   2> 556422 INFO  (TEST-UnloadDistributedZkTest.test-seed#[2696F42C902DEC34]) [n:127.0.0.1:39019_    ] o.a.s.c.CorePropertiesLocator Found 1 core definitions
   [junit4]   2> 556423 INFO  (TEST-UnloadDistributedZkTest.test-seed#[2696F42C902DEC34]) [n:127.0.0.1:39019_    ] o.a.s.s.SolrDispatchFilter user.dir=/home/jenkins/workspace/Lucene-Solr-6.x-Linux/solr/build/solr-core/test/J2
   [junit4]   2> 556423 INFO  (TEST-UnloadDistributedZkTest.test-seed#[2696F42C902DEC34]) [n:127.0.0.1:39019_    ] o.a.s.s.SolrDispatchFilter SolrDispatchFilter.init() done
   [junit4]   2> 556423 INFO  (coreLoadExecutor-2995-thread-1-processing-n:127.0.0.1:39019_) [n:127.0.0.1:39019_ c:collection1   x:collection1] o.a.s.c.ZkController publishing state=down
   [junit4]   2> 556423 INFO  (coreLoadExecutor-2995-thread-1-processing-n:127.0.0.1:39019_) [n:127.0.0.1:39019_ c:collection1   x:collection1] o.a.s.c.ZkController numShards not found on descriptor - reading it from system property
   [junit4]   2> 556424 INFO  (coreLoadExecutor-2995-thread-1-processing-n:127.0.0.1:39019_) [n:127.0.0.1:39019_ c:collection1   x:collection1] o.a.s.c.ZkController Registering watch for collection collection1
   [junit4]   2> 556424 INFO  (coreLoadExecutor-2995-thread-1-processing-n:127.0.0.1:39019_) [n:127.0.0.1:39019_ c:collection1   x:collection1] o.a.s.c.c.ZkStateReader addZkWatch [collection1]
   [junit4]   2> 556425 INFO  (OverseerStateUpdate-95518007370842116-127.0.0.1:60671_-n_0000000000) [n:127.0.0.1:60671_    ] o.a.s.c.Overseer processMessage: queueSize: 1, message = {
   [junit4]   2>   "core":"collection1",
   [junit4]   2>   "roles":null,
   [junit4]   2>   "base_url":"http://127.0.0.1:39019",
   [junit4]   2>   "node_name":"127.0.0.1:39019_",
   [junit4]   2>   "numShards":"2",
   [junit4]   2>   "state":"down",
   [junit4]   2>   "shard":null,
   [junit4]   2>   "collection":"collection1",
   [junit4]   2>   "operation":"state"} current state version: 4
   [junit4]   2> 556425 INFO  (coreLoadExecutor-2995-thread-1-processing-n:127.0.0.1:39019_) [n:127.0.0.1:39019_ c:collection1   x:collection1] o.a.s.c.c.ZkStateReader Add data for [collection1] ver [0]
   [junit4]   2> 556425 INFO  (coreLoadExecutor-2995-thread-1-processing-n:127.0.0.1:39019_) [n:127.0.0.1:39019_ c:collection1   x:collection1] o.a.s.c.ZkController look for our core node name
   [junit4]   2> 556425 INFO  (OverseerStateUpdate-95518007370842116-127.0.0.1:60671_-n_0000000000) [n:127.0.0.1:60671_    ] o.a.s.c.o.ReplicaMutator Update state numShards=2 message={
   [junit4]   2>   "core":"collection1",
   [junit4]   2>   "roles":null,
   [junit4]   2>   "base_url":"http://127.0.0.1:39019",
   [junit4]   2>   "node_name":"127.0.0.1:39019_",
   [junit4]   2>   "numShards":"2",
   [junit4]   2>   "state":"down",
   [junit4]   2>   "shard":null,
   [junit4]   2>   "collection":"collection1",
   [junit4]   2>   "operation":"state"}
   [junit4]   2> 556425 INFO  (OverseerStateUpdate-95518007370842116-127.0.0.1:60671_-n_0000000000) [n:127.0.0.1:60671_    ] o.a.s.c.o.ReplicaMutator Collection already exists with numShards=2
   [junit4]   2> 556425 INFO  (OverseerStateUpdate-95518007370842116-127.0.0.1:60671_-n_0000000000) [n:127.0.0.1:60671_    ] o.a.s.c.o.ReplicaMutator Assigning new node to shard shard=shard2
   [junit4]   2> 556528 INFO  (OverseerStateUpdate-95518007370842116-127.0.0.1:60671_-n_0000000000) [n:127.0.0.1:60671_    ] o.a.s.c.o.ZkStateWriter going to update_collection /collections/collection1/state.json version: 0
   [junit4]   2> 556528 INFO  (zkCallback-1140-thread-1-processing-n:127.0.0.1:39019_) [n:127.0.0.1:39019_    ] o.a.s.c.c.ZkStateReader A cluster state change: [WatchedEvent state:SyncConnected type:NodeDataChanged path:/collections/collection1/state.json] for collection [collection1] has occurred - updating... (live nodes size: [2])
   [junit4]   2> 556528 INFO  (zkCallback-1140-thread-1-processing-n:127.0.0.1:39019_) [n:127.0.0.1:39019_    ] o.a.s.c.c.ZkStateReader Updating data for [collection1] from [0] to [1]
   [junit4]   2> 557425 INFO  (coreLoadExecutor-2995-thread-1-processing-n:127.0.0.1:39019_) [n:127.0.0.1:39019_ c:collection1   x:collection1] o.a.s.c.ZkController waiting to find shard id in clusterstate for collection1
   [junit4]   2> 557425 INFO  (coreLoadExecutor-2995-thread-1-processing-n:127.0.0.1:39019_) [n:127.0.0.1:39019_ c:collection1   x:collection1] o.a.s.c.ZkController Check for collection zkNode:collection1
   [junit4]   2> 557425 INFO  (coreLoadExecutor-2995-thread-1-processing-n:127.0.0.1:39019_) [n:127.0.0.1:39019_ c:collection1   x:collection1] o.a.s.c.ZkController Collection zkNode exists
   [junit4]   2> 557425 INFO  (coreLoadExecutor-2995-thread-1-processing-n:127.0.0.1:39019_) [n:127.0.0.1:39019_ c:collection1   x:collection1] o.a.s.c.c.ZkStateReader Load collection config from: [/collections/collection1]
   [junit4]   2> 557426 INFO  (coreLoadExecutor-2995-thread-1-processing-n:127.0.0.1:39019_) [n:127.0.0.1:39019_ c:collection1   x:collection1] o.a.s.c.c.ZkStateReader path=[/collections/collection1] [configName]=[conf1] specified config exists in ZooKeeper
   [junit4]   2> 557426 INFO  (coreLoadExecutor-2995-thread-1-processing-n:127.0.0.1:39019_) [n:127.0.0.1:39019_ c:collection1   x:collection1] o.a.s.c.SolrResourceLoader new SolrResourceLoader for directory: '/home/jenkins/workspace/Lucene-Solr-6.x-Linux/solr/build/solr-core/test/J2/temp/solr.cloud.UnloadDistributedZkTest_2696F42C902DEC34-001/shard-1-001/cores/collection1'
   [junit4]   2> 557426 INFO  (coreLoadExecutor-2995-thread-1-processing-n:127.0.0.1:39019_) [n:127.0.0.1:39019_ c:collection1   x:collection1] o.a.s.c.SolrResourceLoader JNDI not configured for solr (NoInitialContextEx)
   [junit4]   2> 557426 INFO  (coreLoadExecutor-2995-thread-1-processing-n:127.0.0.1:39019_) [n:127.0.0.1:39019_ c:collection1   x:collection1] o.a.s.c.SolrResourceLoader solr home defaulted to 'solr/' (could not find system property or JNDI)
   [junit4]   2> 557427 INFO  (coreLoadExecutor-2995-thread-1-processing-n:127.0.0.1:39019_) [n:127.0.0.1:39019_ c:collection1   x:collection1] o.a.s.c.Config loaded config solrconfig.xml with version 0 
   [junit4]   2> 557433 INFO  (coreLoadExecutor-2995-thread-1-processing-n:127.0.0.1:39019_) [n:127.0.0.1:39019_ c:collection1   x:collection1] o.a.s.c.SolrConfig current version of requestparams : -1
   [junit4]   2> 557436 WARN  (coreLoadExecutor-2995-thread-1-processing-n:127.0.0.1:39019_) [n:127.0.0.1:39019_ c:collection1   x:collection1] o.a.s.c.Config Beginning with Solr 5.5, <mergePolicy> is deprecated, use <mergePolicyFactory> instead.
   [junit4]   2> 557437 INFO  (coreLoadExecutor-2995-thread-1-processing-n:127.0.0.1:39019_) [n:127.0.0.1:39019_ c:collection1   x:collection1] o.a.s.c.SolrConfig Using Lucene MatchVersion: 6.1.0
   [junit4]   2> 557446 INFO  (coreLoadExecutor-2995-thread-1-processing-n:127.0.0.1:39019_) [n:127.0.0.1:39019_ c:collection1   x:collection1] o.a.s.c.SolrConfig Loaded SolrConfig: solrconfig.xml
   [junit4]   2> 557455 INFO  (coreLoadExecutor-2995-thread-1-processing-n:127.0.0.1:39019_) [n:127.0.0.1:39019_ c:collection1   x:collection1] o.a.s.s.IndexSchema [collection1] Schema name=test
   [junit4]   2> 557571 INFO  (coreLoadExecutor-2995-thread-1-processing-n:127.0.0.1:39019_) [n:127.0.0.1:39019_ c:collection1   x:collection1] o.a.s.s.OpenExchangeRatesOrgProvider Initialized with rates=open-exchange-rates.json, refreshInterval=1440.
   [junit4]   2> 557579 INFO  (coreLoadExecutor-2995-thread-1-processing-n:127.0.0.1:39019_) [n:127.0.0.1:39019_ c:collection1   x:collection1] o.a.s.s.IndexSchema default search field in schema is text
   [junit4]   2> 557580 INFO  (coreLoadExecutor-2995-thread-1-processing-n:127.0.0.1:39019_) [n:127.0.0.1:39019_ c:collection1   x:collection1] o.a.s.s.IndexSchema unique key field: id
   [junit4]   2> 557589 INFO  (coreLoadExecutor-2995-thread-1-processing-n:127.0.0.1:39019_) [n:127.0.0.1:39019_ c:collection1   x:collection1] o.a.s.s.FileExchangeRateProvider Reloading exchange rates from file currency.xml
   [junit4]   2> 557591 INFO  (coreLoadExecutor-2995-thread-1-processing-n:127.0.0.1:39019_) [n:127.0.0.1:39019_ c:collection1   x:collection1] o.a.s.s.FileExchangeRateProvider Reloading exchange rates from file currency.xml
   [junit4]   2> 557593 INFO  (coreLoadExecutor-2995-thread-1-processing-n:127.0.0.1:39019_) [n:127.0.0.1:39019_ c:collection1   x:collection1] o.a.s.s.OpenExchangeRatesOrgProvider Reloading exchange rates from open-exchange-rates.json
   [junit4]   2> 557594 INFO  (coreLoadExecutor-2995-thread-1-processing-n:127.0.0.1:39019_) [n:127.0.0.1:39019_ c:collection1   x:collection1] o.a.s.s.OpenExchangeRatesOrgProvider Reloading exchange rates from open-exchange-rates.json
   [junit4]   2> 557595 INFO  (coreLoadExecutor-2995-thread-1-processing-n:127.0.0.1:39019_) [n:127.0.0.1:39019_ c:collection1   x:collection1] o.a.s.c.ConfigSetProperties Did not find ConfigSet properties, assuming default properties: Can't find resource 'configsetprops.json' in classpath or '/configs/conf1', cwd=/home/jenkins/workspace/Lucene-Solr-6.x-Linux/solr/build/solr-core/test/J2
   [junit4]   2> 557595 INFO  (coreLoadExecutor-2995-thread-1-processing-n:127.0.0.1:39019_) [n:127.0.0.1:39019_ c:collection1   x:collection1] o.a.s.c.CoreContainer Creating SolrCore 'collection1' using configuration from collection collection1
   [junit4]   2> 557595 INFO  (coreLoadExecutor-2995-thread-1-processing-n:127.0.0.1:39019_) [n:127.0.0.1:39019_ c:collection1 s:shard2 r:core_node1 x:collection1] o.a.s.c.SolrCore org.apache.solr.core.MockDirectoryFactory
   [junit4]   2> 557595 INFO  (coreLoadExecutor-2995-thread-1-processing-n:127.0.0.1:39019_) [n:127.0.0.1:39019_ c:collection1 s:shard2 r:core_node1 x:collection1] o.a.s.c.SolrCore [[collection1] ] Opening new SolrCore at [/home/jenkins/workspace/Lucene-Solr-6.x-Linux/solr/build/solr-core/test/J2/temp/solr.cloud.UnloadDistributedZkTest_2696F42C902DEC34-001/shard-1-001/cores/collection1], dataDir=[/home/jenkins/workspace/Lucene-Solr-6.x-Linux/solr/build/solr-core/test/J2/temp/solr.cloud.UnloadDistributedZkTest_2696F42C902DEC34-001/shard-1-001/cores/collection1/data/]
   [junit4]   2> 557596 INFO  (coreLoadExecutor-2995-thread-1-processing-n:127.0.0.1:39019_) [n:127.0.0.1:39019_ c:collection1 s:shard2 r:core_node1 x:collection1] o.a.s.c.JmxMonitoredMap JMX monitoring is enabled. Adding Solr mbeans to JMX Server: com.sun.jmx.mbeanserver.JmxMBeanServer@105694f
   [junit4]   2> 557596 INFO  (coreLoadExecutor-2995-thread-1-processing-n:127.0.0.1:39019_) [n:127.0.0.1:39019_ c:collection1 s:shard2 r:core_node1 x:collection1] o.a.s.c.CachingDirectoryFactory return new directory for /home/jenkins/workspace/Lucene-Solr-6.x-Linux/solr/build/solr-core/test/J2/temp/solr.cloud.UnloadDistributedZkTest_2696F42C902DEC34-001/shard-1-001/cores/collection1/data
   [junit4]   2> 557596 INFO  (coreLoadExecutor-2995-thread-1-processing-n:127.0.0.1:39019_) [n:127.0.0.1:39019_ c:collection1 s:shard2 r:core_node1 x:collection1] o.a.s.c.SolrCore New index directory detected: old=null new=/home/jenkins/workspace/Lucene-Solr-6.x-Linux/solr/build/solr-core/test/J2/temp/solr.cloud.UnloadDistributedZkTest_2696F42C902DEC34-001/shard-1-001/cores/collection1/data/index/
   [junit4]   2> 557596 WARN  (coreLoadExecutor-2995-thread-1-processing-n:127.0.0.1:39019_) [n:127.0.0.1:39019_ c:collection1 s:shard2 r:core_node1 x:collection1] o.a.s.c.SolrCore [collection1] Solr index directory '/home/jenkins/workspace/Lucene-Solr-6.x-Linux/solr/build/solr-core/test/J2/temp/solr.cloud.UnloadDistributedZkTest_2696F42C902DEC34-001/shard-1-001/cores/collection1/data/index' doesn't exist. Creat

[...truncated too long message...]

impl.client.DefaultRequestDirector.execute(DefaultRequestDirector.java:487)
   [junit4]    > 	at org.apache.http.impl.client.AbstractHttpClient.doExecute(AbstractHttpClient.java:882)
   [junit4]    > 	at org.apache.http.impl.client.CloseableHttpClient.execute(CloseableHttpClient.java:82)
   [junit4]    > 	at org.apache.http.impl.client.CloseableHttpClient.execute(CloseableHttpClient.java:107)
   [junit4]    > 	at org.apache.http.impl.client.CloseableHttpClient.execute(CloseableHttpClient.java:55)
   [junit4]    > 	at org.apache.solr.client.solrj.impl.HttpSolrClient.executeMethod(HttpSolrClient.java:482)
   [junit4]    > 	... 8 moreThrowable #6: com.carrotsearch.randomizedtesting.UncaughtExceptionError: Captured an uncaught exception in thread: Thread[id=6055, name=testExecutor-3062-thread-8, state=RUNNABLE, group=TGRP-UnloadDistributedZkTest]
   [junit4]    > Caused by: java.lang.RuntimeException: org.apache.solr.client.solrj.SolrServerException: Timeout occured while waiting response from server at: http://127.0.0.1:58831
   [junit4]    > 	at __randomizedtesting.SeedInfo.seed([2696F42C902DEC34]:0)
   [junit4]    > 	at org.apache.solr.cloud.BasicDistributedZkTest.lambda$createCores$0(BasicDistributedZkTest.java:583)
   [junit4]    > 	at org.apache.solr.common.util.ExecutorUtil$MDCAwareThreadPoolExecutor.lambda$execute$0(ExecutorUtil.java:229)
   [junit4]    > 	at java.util.concurrent.ThreadPoolExecutor.runWorker(ThreadPoolExecutor.java:1142)
   [junit4]    > 	at java.util.concurrent.ThreadPoolExecutor$Worker.run(ThreadPoolExecutor.java:617)
   [junit4]    > 	at java.lang.Thread.run(Thread.java:745)
   [junit4]    > Caused by: org.apache.solr.client.solrj.SolrServerException: Timeout occured while waiting response from server at: http://127.0.0.1:58831
   [junit4]    > 	at org.apache.solr.client.solrj.impl.HttpSolrClient.executeMethod(HttpSolrClient.java:588)
   [junit4]    > 	at org.apache.solr.client.solrj.impl.HttpSolrClient.request(HttpSolrClient.java:241)
   [junit4]    > 	at org.apache.solr.client.solrj.impl.HttpSolrClient.request(HttpSolrClient.java:230)
   [junit4]    > 	at org.apache.solr.client.solrj.SolrClient.request(SolrClient.java:1219)
   [junit4]    > 	at org.apache.solr.cloud.BasicDistributedZkTest.lambda$createCores$0(BasicDistributedZkTest.java:581)
   [junit4]    > 	... 4 more
   [junit4]    > Caused by: java.net.SocketTimeoutException: Read timed out
   [junit4]    > 	at java.net.SocketInputStream.socketRead0(Native Method)
   [junit4]    > 	at java.net.SocketInputStream.socketRead(SocketInputStream.java:116)
   [junit4]    > 	at java.net.SocketInputStream.read(SocketInputStream.java:170)
   [junit4]    > 	at java.net.SocketInputStream.read(SocketInputStream.java:141)
   [junit4]    > 	at org.apache.http.impl.io.AbstractSessionInputBuffer.fillBuffer(AbstractSessionInputBuffer.java:160)
   [junit4]    > 	at org.apache.http.impl.io.SocketInputBuffer.fillBuffer(SocketInputBuffer.java:84)
   [junit4]    > 	at org.apache.http.impl.io.AbstractSessionInputBuffer.readLine(AbstractSessionInputBuffer.java:273)
   [junit4]    > 	at org.apache.http.impl.conn.DefaultHttpResponseParser.parseHead(DefaultHttpResponseParser.java:140)
   [junit4]    > 	at org.apache.http.impl.conn.DefaultHttpResponseParser.parseHead(DefaultHttpResponseParser.java:57)
   [junit4]    > 	at org.apache.http.impl.io.AbstractMessageParser.parse(AbstractMessageParser.java:261)
   [junit4]    > 	at org.apache.http.impl.AbstractHttpClientConnection.receiveResponseHeader(AbstractHttpClientConnection.java:283)
   [junit4]    > 	at org.apache.http.impl.conn.DefaultClientConnection.receiveResponseHeader(DefaultClientConnection.java:251)
   [junit4]    > 	at org.apache.http.impl.conn.ManagedClientConnectionImpl.receiveResponseHeader(ManagedClientConnectionImpl.java:197)
   [junit4]    > 	at org.apache.http.protocol.HttpRequestExecutor.doReceiveResponse(HttpRequestExecutor.java:272)
   [junit4]    > 	at org.apache.http.protocol.HttpRequestExecutor.execute(HttpRequestExecutor.java:124)
   [junit4]    > 	at org.apache.http.impl.client.DefaultRequestDirector.tryExecute(DefaultRequestDirector.java:685)
   [junit4]    > 	at org.apache.http.impl.client.DefaultRequestDirector.execute(DefaultRequestDirector.java:487)
   [junit4]    > 	at org.apache.http.impl.client.AbstractHttpClient.doExecute(AbstractHttpClient.java:882)
   [junit4]    > 	at org.apache.http.impl.client.CloseableHttpClient.execute(CloseableHttpClient.java:82)
   [junit4]    > 	at org.apache.http.impl.client.CloseableHttpClient.execute(CloseableHttpClient.java:107)
   [junit4]    > 	at org.apache.http.impl.client.CloseableHttpClient.execute(CloseableHttpClient.java:55)
   [junit4]    > 	at org.apache.solr.client.solrj.impl.HttpSolrClient.executeMethod(HttpSolrClient.java:482)
   [junit4]    > 	... 8 more
   [junit4]   2> 689166 INFO  (SUITE-UnloadDistributedZkTest-seed#[2696F42C902DEC34]-worker) [    ] o.a.s.SolrTestCaseJ4 ###deleteCore
   [junit4]   2> Mar 09, 2016 2:07:41 AM com.carrotsearch.randomizedtesting.ThreadLeakControl checkThreadLeaks
   [junit4]   2> WARNING: Will linger awaiting termination of 1 leaked thread(s).
   [junit4]   2> NOTE: test params are: codec=Asserting(Lucene60): {other_tl1=TestBloomFilteredLucenePostings(BloomFilteringPostingsFormat(Lucene50(blocksize=128))), range_facet_l_dv=PostingsFormat(name=Memory doPackFST= false), _version_=TestBloomFilteredLucenePostings(BloomFilteringPostingsFormat(Lucene50(blocksize=128))), multiDefault=FST50, a_t=FST50, intDefault=TestBloomFilteredLucenePostings(BloomFilteringPostingsFormat(Lucene50(blocksize=128))), a_i1=FST50, id=PostingsFormat(name=Memory doPackFST= false), range_facet_i_dv=FST50, text=Lucene50(blocksize=128), range_facet_l=FST50, timestamp=FST50}, docValues:{range_facet_l_dv=DocValuesFormat(name=Asserting), range_facet_i_dv=DocValuesFormat(name=Direct), timestamp=DocValuesFormat(name=Direct)}, maxPointsInLeafNode=1200, maxMBSortInHeap=6.408040065161708, sim=RandomSimilarity(queryNorm=false,coord=crazy): {}, locale=mk, timezone=Europe/Dublin
   [junit4]   2> NOTE: Linux 3.19.0-51-generic i386/Oracle Corporation 1.8.0_72 (32-bit)/cpus=12,threads=1,free=130825968,total=306454528
   [junit4]   2> NOTE: All tests run in this JVM: [TestXIncludeConfig, MergeStrategyTest, DocValuesMissingTest, TestDistributedMissingSort, CollectionsAPISolrJTest, TestSortByMinMaxFunction, TestJmxIntegration, TestInfoStreamLogging, CollectionStateFormat2Test, FieldMutatingUpdateProcessorTest, TestPerFieldSimilarityWithDefaultOverride, TestFastWriter, OverseerTaskQueueTest, ZkStateWriterTest, TestAddFieldRealTimeGet, XmlUpdateRequestHandlerTest, CoreAdminRequestStatusTest, TestZkChroot, TestUniqueKeyFieldResource, TestRestManager, BigEndianAscendingWordSerializerTest, HdfsTlogReplayBufferedWhileIndexingTest, TestFilteredDocIdSet, TestComplexPhraseQParserPlugin, AnalyticsMergeStrategyTest, TestReversedWildcardFilterFactory, CdcrRequestHandlerTest, TestCollationField, TestScoreJoinQPNoScore, TestSchemaManager, TestPHPSerializedResponseWriter, NoCacheHeaderTest, RequestHandlersTest, DocExpirationUpdateProcessorFactoryTest, TestPivotHelperCode, ScriptEngineTest, SolrCloudExampleTest, FieldAnalysisRequestHandlerTest, TestConfigSets, StatelessScriptUpdateProcessorFactoryTest, SampleTest, TestJsonFacets, TestSolrCLIRunExample, CleanupOldIndexTest, TestStressUserVersions, StressHdfsTest, BadComponentTest, DirectUpdateHandlerOptimizeTest, TestRequestStatusCollectionAPI, SuggesterTest, ConnectionManagerTest, AddSchemaFieldsUpdateProcessorFactoryTest, DirectUpdateHandlerTest, TestSolrQueryParser, SolrTestCaseJ4Test, TestCopyFieldCollectionResource, CdcrUpdateLogTest, PluginInfoTest, SparseHLLTest, BinaryUpdateRequestHandlerTest, TestWriterPerf, TestExceedMaxTermLength, LeaderInitiatedRecoveryOnCommitTest, OverseerCollectionConfigSetProcessorTest, TestSchemaResource, HdfsRestartWhileUpdatingTest, ExitableDirectoryReaderTest, TestDFISimilarityFactory, TestBulkSchemaConcurrent, TestExtendedDismaxParser, DirectSolrConnectionTest, SuggestComponentTest, BadIndexSchemaTest, TestMacros, BlockDirectoryTest, CircularListTest, QueryParsingTest, ReplicationFactorTest, CurrencyFieldXmlFileTest, TestCloudSchemaless, TestPostingsSolrHighlighter, TestSuggestSpellingConverter, TestFieldTypeCollectionResource, TestSolrConfigHandlerCloud, CoreAdminHandlerTest, HighlighterConfigTest, TestFreeTextSuggestions, ClusterStateTest, TestSolrDynamicMBean, DebugComponentTest, FullHLLTest, TestCSVResponseWriter, DocValuesMultiTest, DistributedQueryComponentCustomSortTest, TestTolerantSearch, ChaosMonkeySafeLeaderTest, BasicDistributedZk2Test, UnloadDistributedZkTest]
   [junit4] Completed [294/579 (1!)] on J2 in 136.13s, 1 test, 1 error <<< FAILURES!

[...truncated 915 lines...]
BUILD FAILED
/home/jenkins/workspace/Lucene-Solr-6.x-Linux/build.xml:740: The following error occurred while executing this line:
/home/jenkins/workspace/Lucene-Solr-6.x-Linux/build.xml:684: The following error occurred while executing this line:
/home/jenkins/workspace/Lucene-Solr-6.x-Linux/build.xml:59: The following error occurred while executing this line:
/home/jenkins/workspace/Lucene-Solr-6.x-Linux/solr/build.xml:233: The following error occurred while executing this line:
/home/jenkins/workspace/Lucene-Solr-6.x-Linux/solr/common-build.xml:524: The following error occurred while executing this line:
/home/jenkins/workspace/Lucene-Solr-6.x-Linux/lucene/common-build.xml:1457: The following error occurred while executing this line:
/home/jenkins/workspace/Lucene-Solr-6.x-Linux/lucene/common-build.xml:1014: There were test failures: 579 suites (10 ignored), 2309 tests, 1 error, 117 ignored (71 assumptions) [seed: 2696F42C902DEC34]

Total time: 54 minutes 56 seconds
Build step 'Invoke Ant' marked build as failure
Archiving artifacts
[WARNINGS] Skipping publisher since build result is FAILURE
Recording test results
Email was triggered for: Failure - Any
Sending email for trigger: Failure - Any



Mime
View raw message