lucene-dev mailing list archives

Site index · List index
Message view « Date » · « Thread »
Top « Date » · « Thread »
From Policeman Jenkins Server <jenk...@thetaphi.de>
Subject [JENKINS] Lucene-Solr-6.x-Linux (32bit/jdk1.8.0_72) - Build # 14 - Still Failing!
Date Fri, 04 Mar 2016 14:19:11 GMT
Build: http://jenkins.thetaphi.de/job/Lucene-Solr-6.x-Linux/14/
Java: 32bit/jdk1.8.0_72 -client -XX:+UseSerialGC

1 tests failed.
FAILED:  org.apache.solr.cloud.CollectionTooManyReplicasTest.testDownedShards

Error Message:
Should have gotten a message about shard not 

Stack Trace:
java.lang.AssertionError: Should have gotten a message about shard not 
	at __randomizedtesting.SeedInfo.seed([EDF3CF085726CE2A:8FDB675DDCDD836E]:0)
	at org.junit.Assert.fail(Assert.java:93)
	at org.junit.Assert.assertTrue(Assert.java:43)
	at org.apache.solr.cloud.CollectionTooManyReplicasTest.testDownedShards(CollectionTooManyReplicasTest.java:256)
	at sun.reflect.NativeMethodAccessorImpl.invoke0(Native Method)
	at sun.reflect.NativeMethodAccessorImpl.invoke(NativeMethodAccessorImpl.java:62)
	at sun.reflect.DelegatingMethodAccessorImpl.invoke(DelegatingMethodAccessorImpl.java:43)
	at java.lang.reflect.Method.invoke(Method.java:498)
	at com.carrotsearch.randomizedtesting.RandomizedRunner.invoke(RandomizedRunner.java:1764)
	at com.carrotsearch.randomizedtesting.RandomizedRunner$8.evaluate(RandomizedRunner.java:871)
	at com.carrotsearch.randomizedtesting.RandomizedRunner$9.evaluate(RandomizedRunner.java:907)
	at com.carrotsearch.randomizedtesting.RandomizedRunner$10.evaluate(RandomizedRunner.java:921)
	at org.apache.solr.BaseDistributedSearchTestCase$ShardsRepeatRule$ShardsFixedStatement.callStatement(BaseDistributedSearchTestCase.java:996)
	at org.apache.solr.BaseDistributedSearchTestCase$ShardsRepeatRule$ShardsStatement.evaluate(BaseDistributedSearchTestCase.java:971)
	at com.carrotsearch.randomizedtesting.rules.SystemPropertiesRestoreRule$1.evaluate(SystemPropertiesRestoreRule.java:57)
	at org.apache.lucene.util.TestRuleSetupTeardownChained$1.evaluate(TestRuleSetupTeardownChained.java:49)
	at org.apache.lucene.util.AbstractBeforeAfterRule$1.evaluate(AbstractBeforeAfterRule.java:45)
	at org.apache.lucene.util.TestRuleThreadAndTestName$1.evaluate(TestRuleThreadAndTestName.java:48)
	at org.apache.lucene.util.TestRuleIgnoreAfterMaxFailures$1.evaluate(TestRuleIgnoreAfterMaxFailures.java:64)
	at org.apache.lucene.util.TestRuleMarkFailure$1.evaluate(TestRuleMarkFailure.java:47)
	at com.carrotsearch.randomizedtesting.rules.StatementAdapter.evaluate(StatementAdapter.java:36)
	at com.carrotsearch.randomizedtesting.ThreadLeakControl$StatementRunner.run(ThreadLeakControl.java:367)
	at com.carrotsearch.randomizedtesting.ThreadLeakControl.forkTimeoutingTask(ThreadLeakControl.java:809)
	at com.carrotsearch.randomizedtesting.ThreadLeakControl$3.evaluate(ThreadLeakControl.java:460)
	at com.carrotsearch.randomizedtesting.RandomizedRunner.runSingleTest(RandomizedRunner.java:880)
	at com.carrotsearch.randomizedtesting.RandomizedRunner$5.evaluate(RandomizedRunner.java:781)
	at com.carrotsearch.randomizedtesting.RandomizedRunner$6.evaluate(RandomizedRunner.java:816)
	at com.carrotsearch.randomizedtesting.RandomizedRunner$7.evaluate(RandomizedRunner.java:827)
	at com.carrotsearch.randomizedtesting.rules.StatementAdapter.evaluate(StatementAdapter.java:36)
	at com.carrotsearch.randomizedtesting.rules.SystemPropertiesRestoreRule$1.evaluate(SystemPropertiesRestoreRule.java:57)
	at org.apache.lucene.util.AbstractBeforeAfterRule$1.evaluate(AbstractBeforeAfterRule.java:45)
	at com.carrotsearch.randomizedtesting.rules.StatementAdapter.evaluate(StatementAdapter.java:36)
	at org.apache.lucene.util.TestRuleStoreClassName$1.evaluate(TestRuleStoreClassName.java:41)
	at com.carrotsearch.randomizedtesting.rules.NoShadowingOrOverridesOnMethodsRule$1.evaluate(NoShadowingOrOverridesOnMethodsRule.java:40)
	at com.carrotsearch.randomizedtesting.rules.NoShadowingOrOverridesOnMethodsRule$1.evaluate(NoShadowingOrOverridesOnMethodsRule.java:40)
	at com.carrotsearch.randomizedtesting.rules.StatementAdapter.evaluate(StatementAdapter.java:36)
	at com.carrotsearch.randomizedtesting.rules.StatementAdapter.evaluate(StatementAdapter.java:36)
	at com.carrotsearch.randomizedtesting.rules.StatementAdapter.evaluate(StatementAdapter.java:36)
	at org.apache.lucene.util.TestRuleAssertionsRequired$1.evaluate(TestRuleAssertionsRequired.java:53)
	at org.apache.lucene.util.TestRuleMarkFailure$1.evaluate(TestRuleMarkFailure.java:47)
	at org.apache.lucene.util.TestRuleIgnoreAfterMaxFailures$1.evaluate(TestRuleIgnoreAfterMaxFailures.java:64)
	at org.apache.lucene.util.TestRuleIgnoreTestSuites$1.evaluate(TestRuleIgnoreTestSuites.java:54)
	at com.carrotsearch.randomizedtesting.rules.StatementAdapter.evaluate(StatementAdapter.java:36)
	at com.carrotsearch.randomizedtesting.ThreadLeakControl$StatementRunner.run(ThreadLeakControl.java:367)
	at java.lang.Thread.run(Thread.java:745)




Build Log:
[...truncated 11084 lines...]
   [junit4] Suite: org.apache.solr.cloud.CollectionTooManyReplicasTest
   [junit4]   2> Creating dataDir: /home/jenkins/workspace/Lucene-Solr-6.x-Linux/solr/build/solr-core/test/J0/temp/solr.cloud.CollectionTooManyReplicasTest_EDF3CF085726CE2A-001/init-core-data-001
   [junit4]   2> 524708 INFO  (SUITE-CollectionTooManyReplicasTest-seed#[EDF3CF085726CE2A]-worker) [    ] o.a.s.SolrTestCaseJ4 Randomized ssl (false) and clientAuth (false)
   [junit4]   2> 524708 INFO  (SUITE-CollectionTooManyReplicasTest-seed#[EDF3CF085726CE2A]-worker) [    ] o.a.s.BaseDistributedSearchTestCase Setting hostContext system property: /
   [junit4]   2> 524709 INFO  (TEST-CollectionTooManyReplicasTest.testAddTooManyReplicas-seed#[EDF3CF085726CE2A]) [    ] o.a.s.c.ZkTestServer STARTING ZK TEST SERVER
   [junit4]   2> 524710 INFO  (Thread-2035) [    ] o.a.s.c.ZkTestServer client port:0.0.0.0/0.0.0.0:0
   [junit4]   2> 524710 INFO  (Thread-2035) [    ] o.a.s.c.ZkTestServer Starting server
   [junit4]   2> 524810 INFO  (TEST-CollectionTooManyReplicasTest.testAddTooManyReplicas-seed#[EDF3CF085726CE2A]) [    ] o.a.s.c.ZkTestServer start zk server on port:52046
   [junit4]   2> 524810 INFO  (TEST-CollectionTooManyReplicasTest.testAddTooManyReplicas-seed#[EDF3CF085726CE2A]) [    ] o.a.s.c.c.SolrZkClient Using default ZkCredentialsProvider
   [junit4]   2> 524811 INFO  (TEST-CollectionTooManyReplicasTest.testAddTooManyReplicas-seed#[EDF3CF085726CE2A]) [    ] o.a.s.c.c.ConnectionManager Waiting for client to connect to ZooKeeper
   [junit4]   2> 524812 INFO  (zkCallback-670-thread-1) [    ] o.a.s.c.c.ConnectionManager Watcher org.apache.solr.common.cloud.ConnectionManager@d45fad name:ZooKeeperConnection Watcher:127.0.0.1:52046 got event WatchedEvent state:SyncConnected type:None path:null path:null type:None
   [junit4]   2> 524812 INFO  (TEST-CollectionTooManyReplicasTest.testAddTooManyReplicas-seed#[EDF3CF085726CE2A]) [    ] o.a.s.c.c.ConnectionManager Client is connected to ZooKeeper
   [junit4]   2> 524813 INFO  (TEST-CollectionTooManyReplicasTest.testAddTooManyReplicas-seed#[EDF3CF085726CE2A]) [    ] o.a.s.c.c.SolrZkClient Using default ZkACLProvider
   [junit4]   2> 524813 INFO  (TEST-CollectionTooManyReplicasTest.testAddTooManyReplicas-seed#[EDF3CF085726CE2A]) [    ] o.a.s.c.c.SolrZkClient makePath: /solr
   [junit4]   2> 524815 INFO  (TEST-CollectionTooManyReplicasTest.testAddTooManyReplicas-seed#[EDF3CF085726CE2A]) [    ] o.a.s.c.c.SolrZkClient Using default ZkCredentialsProvider
   [junit4]   2> 524816 INFO  (TEST-CollectionTooManyReplicasTest.testAddTooManyReplicas-seed#[EDF3CF085726CE2A]) [    ] o.a.s.c.c.ConnectionManager Waiting for client to connect to ZooKeeper
   [junit4]   2> 524817 INFO  (zkCallback-671-thread-1) [    ] o.a.s.c.c.ConnectionManager Watcher org.apache.solr.common.cloud.ConnectionManager@1be0d77 name:ZooKeeperConnection Watcher:127.0.0.1:52046/solr got event WatchedEvent state:SyncConnected type:None path:null path:null type:None
   [junit4]   2> 524817 INFO  (TEST-CollectionTooManyReplicasTest.testAddTooManyReplicas-seed#[EDF3CF085726CE2A]) [    ] o.a.s.c.c.ConnectionManager Client is connected to ZooKeeper
   [junit4]   2> 524817 INFO  (TEST-CollectionTooManyReplicasTest.testAddTooManyReplicas-seed#[EDF3CF085726CE2A]) [    ] o.a.s.c.c.SolrZkClient Using default ZkACLProvider
   [junit4]   2> 524817 INFO  (TEST-CollectionTooManyReplicasTest.testAddTooManyReplicas-seed#[EDF3CF085726CE2A]) [    ] o.a.s.c.c.SolrZkClient makePath: /collections/collection1
   [junit4]   2> 524819 INFO  (TEST-CollectionTooManyReplicasTest.testAddTooManyReplicas-seed#[EDF3CF085726CE2A]) [    ] o.a.s.c.c.SolrZkClient makePath: /collections/collection1/shards
   [junit4]   2> 524821 INFO  (TEST-CollectionTooManyReplicasTest.testAddTooManyReplicas-seed#[EDF3CF085726CE2A]) [    ] o.a.s.c.c.SolrZkClient makePath: /collections/control_collection
   [junit4]   2> 524822 INFO  (TEST-CollectionTooManyReplicasTest.testAddTooManyReplicas-seed#[EDF3CF085726CE2A]) [    ] o.a.s.c.c.SolrZkClient makePath: /collections/control_collection/shards
   [junit4]   2> 524824 INFO  (TEST-CollectionTooManyReplicasTest.testAddTooManyReplicas-seed#[EDF3CF085726CE2A]) [    ] o.a.s.c.AbstractZkTestCase put /home/jenkins/workspace/Lucene-Solr-6.x-Linux/solr/core/src/test-files/solr/collection1/conf/solrconfig-tlog.xml to /configs/conf1/solrconfig.xml
   [junit4]   2> 524824 INFO  (TEST-CollectionTooManyReplicasTest.testAddTooManyReplicas-seed#[EDF3CF085726CE2A]) [    ] o.a.s.c.c.SolrZkClient makePath: /configs/conf1/solrconfig.xml
   [junit4]   2> 524827 INFO  (TEST-CollectionTooManyReplicasTest.testAddTooManyReplicas-seed#[EDF3CF085726CE2A]) [    ] o.a.s.c.AbstractZkTestCase put /home/jenkins/workspace/Lucene-Solr-6.x-Linux/solr/core/src/test-files/solr/collection1/conf/schema.xml to /configs/conf1/schema.xml
   [junit4]   2> 524827 INFO  (TEST-CollectionTooManyReplicasTest.testAddTooManyReplicas-seed#[EDF3CF085726CE2A]) [    ] o.a.s.c.c.SolrZkClient makePath: /configs/conf1/schema.xml
   [junit4]   2> 524829 INFO  (TEST-CollectionTooManyReplicasTest.testAddTooManyReplicas-seed#[EDF3CF085726CE2A]) [    ] o.a.s.c.AbstractZkTestCase put /home/jenkins/workspace/Lucene-Solr-6.x-Linux/solr/core/src/test-files/solr/collection1/conf/solrconfig.snippet.randomindexconfig.xml to /configs/conf1/solrconfig.snippet.randomindexconfig.xml
   [junit4]   2> 524829 INFO  (TEST-CollectionTooManyReplicasTest.testAddTooManyReplicas-seed#[EDF3CF085726CE2A]) [    ] o.a.s.c.c.SolrZkClient makePath: /configs/conf1/solrconfig.snippet.randomindexconfig.xml
   [junit4]   2> 524831 INFO  (TEST-CollectionTooManyReplicasTest.testAddTooManyReplicas-seed#[EDF3CF085726CE2A]) [    ] o.a.s.c.AbstractZkTestCase put /home/jenkins/workspace/Lucene-Solr-6.x-Linux/solr/core/src/test-files/solr/collection1/conf/stopwords.txt to /configs/conf1/stopwords.txt
   [junit4]   2> 524831 INFO  (TEST-CollectionTooManyReplicasTest.testAddTooManyReplicas-seed#[EDF3CF085726CE2A]) [    ] o.a.s.c.c.SolrZkClient makePath: /configs/conf1/stopwords.txt
   [junit4]   2> 524833 INFO  (TEST-CollectionTooManyReplicasTest.testAddTooManyReplicas-seed#[EDF3CF085726CE2A]) [    ] o.a.s.c.AbstractZkTestCase put /home/jenkins/workspace/Lucene-Solr-6.x-Linux/solr/core/src/test-files/solr/collection1/conf/protwords.txt to /configs/conf1/protwords.txt
   [junit4]   2> 524833 INFO  (TEST-CollectionTooManyReplicasTest.testAddTooManyReplicas-seed#[EDF3CF085726CE2A]) [    ] o.a.s.c.c.SolrZkClient makePath: /configs/conf1/protwords.txt
   [junit4]   2> 524835 INFO  (TEST-CollectionTooManyReplicasTest.testAddTooManyReplicas-seed#[EDF3CF085726CE2A]) [    ] o.a.s.c.AbstractZkTestCase put /home/jenkins/workspace/Lucene-Solr-6.x-Linux/solr/core/src/test-files/solr/collection1/conf/currency.xml to /configs/conf1/currency.xml
   [junit4]   2> 524836 INFO  (TEST-CollectionTooManyReplicasTest.testAddTooManyReplicas-seed#[EDF3CF085726CE2A]) [    ] o.a.s.c.c.SolrZkClient makePath: /configs/conf1/currency.xml
   [junit4]   2> 524837 INFO  (TEST-CollectionTooManyReplicasTest.testAddTooManyReplicas-seed#[EDF3CF085726CE2A]) [    ] o.a.s.c.AbstractZkTestCase put /home/jenkins/workspace/Lucene-Solr-6.x-Linux/solr/core/src/test-files/solr/collection1/conf/enumsConfig.xml to /configs/conf1/enumsConfig.xml
   [junit4]   2> 524837 INFO  (TEST-CollectionTooManyReplicasTest.testAddTooManyReplicas-seed#[EDF3CF085726CE2A]) [    ] o.a.s.c.c.SolrZkClient makePath: /configs/conf1/enumsConfig.xml
   [junit4]   2> 524839 INFO  (TEST-CollectionTooManyReplicasTest.testAddTooManyReplicas-seed#[EDF3CF085726CE2A]) [    ] o.a.s.c.AbstractZkTestCase put /home/jenkins/workspace/Lucene-Solr-6.x-Linux/solr/core/src/test-files/solr/collection1/conf/open-exchange-rates.json to /configs/conf1/open-exchange-rates.json
   [junit4]   2> 524839 INFO  (TEST-CollectionTooManyReplicasTest.testAddTooManyReplicas-seed#[EDF3CF085726CE2A]) [    ] o.a.s.c.c.SolrZkClient makePath: /configs/conf1/open-exchange-rates.json
   [junit4]   2> 524841 INFO  (TEST-CollectionTooManyReplicasTest.testAddTooManyReplicas-seed#[EDF3CF085726CE2A]) [    ] o.a.s.c.AbstractZkTestCase put /home/jenkins/workspace/Lucene-Solr-6.x-Linux/solr/core/src/test-files/solr/collection1/conf/mapping-ISOLatin1Accent.txt to /configs/conf1/mapping-ISOLatin1Accent.txt
   [junit4]   2> 524841 INFO  (TEST-CollectionTooManyReplicasTest.testAddTooManyReplicas-seed#[EDF3CF085726CE2A]) [    ] o.a.s.c.c.SolrZkClient makePath: /configs/conf1/mapping-ISOLatin1Accent.txt
   [junit4]   2> 524842 INFO  (TEST-CollectionTooManyReplicasTest.testAddTooManyReplicas-seed#[EDF3CF085726CE2A]) [    ] o.a.s.c.AbstractZkTestCase put /home/jenkins/workspace/Lucene-Solr-6.x-Linux/solr/core/src/test-files/solr/collection1/conf/old_synonyms.txt to /configs/conf1/old_synonyms.txt
   [junit4]   2> 524843 INFO  (TEST-CollectionTooManyReplicasTest.testAddTooManyReplicas-seed#[EDF3CF085726CE2A]) [    ] o.a.s.c.c.SolrZkClient makePath: /configs/conf1/old_synonyms.txt
   [junit4]   2> 524844 INFO  (TEST-CollectionTooManyReplicasTest.testAddTooManyReplicas-seed#[EDF3CF085726CE2A]) [    ] o.a.s.c.AbstractZkTestCase put /home/jenkins/workspace/Lucene-Solr-6.x-Linux/solr/core/src/test-files/solr/collection1/conf/synonyms.txt to /configs/conf1/synonyms.txt
   [junit4]   2> 524845 INFO  (TEST-CollectionTooManyReplicasTest.testAddTooManyReplicas-seed#[EDF3CF085726CE2A]) [    ] o.a.s.c.c.SolrZkClient makePath: /configs/conf1/synonyms.txt
   [junit4]   2> 524951 INFO  (TEST-CollectionTooManyReplicasTest.testAddTooManyReplicas-seed#[EDF3CF085726CE2A]) [    ] o.a.s.SolrTestCaseJ4 Writing core.properties file to /home/jenkins/workspace/Lucene-Solr-6.x-Linux/solr/build/solr-core/test/J0/temp/solr.cloud.CollectionTooManyReplicasTest_EDF3CF085726CE2A-001/control-001/cores/collection1
   [junit4]   2> 524953 INFO  (TEST-CollectionTooManyReplicasTest.testAddTooManyReplicas-seed#[EDF3CF085726CE2A]) [    ] o.e.j.s.Server jetty-9.3.6.v20151106
   [junit4]   2> 524954 INFO  (TEST-CollectionTooManyReplicasTest.testAddTooManyReplicas-seed#[EDF3CF085726CE2A]) [    ] o.e.j.s.h.ContextHandler Started o.e.j.s.ServletContextHandler@1730d20{/,null,AVAILABLE}
   [junit4]   2> 524955 INFO  (TEST-CollectionTooManyReplicasTest.testAddTooManyReplicas-seed#[EDF3CF085726CE2A]) [    ] o.e.j.s.ServerConnector Started ServerConnector@38053e{HTTP/1.1,[http/1.1]}{127.0.0.1:46397}
   [junit4]   2> 524955 INFO  (TEST-CollectionTooManyReplicasTest.testAddTooManyReplicas-seed#[EDF3CF085726CE2A]) [    ] o.e.j.s.Server Started @526177ms
   [junit4]   2> 524956 INFO  (TEST-CollectionTooManyReplicasTest.testAddTooManyReplicas-seed#[EDF3CF085726CE2A]) [    ] o.a.s.c.s.e.JettySolrRunner Jetty properties: {solr.data.dir=/home/jenkins/workspace/Lucene-Solr-6.x-Linux/solr/build/solr-core/test/J0/temp/solr.cloud.CollectionTooManyReplicasTest_EDF3CF085726CE2A-001/tempDir-001/control/data, hostContext=/, hostPort=46397, coreRootDirectory=/home/jenkins/workspace/Lucene-Solr-6.x-Linux/solr/build/solr-core/test/J0/../../../../../../../../../home/jenkins/workspace/Lucene-Solr-6.x-Linux/solr/build/solr-core/test/J0/temp/solr.cloud.CollectionTooManyReplicasTest_EDF3CF085726CE2A-001/control-001/cores}
   [junit4]   2> 524956 INFO  (TEST-CollectionTooManyReplicasTest.testAddTooManyReplicas-seed#[EDF3CF085726CE2A]) [    ] o.a.s.s.SolrDispatchFilter SolrDispatchFilter.init(): sun.misc.Launcher$AppClassLoader@1d16e93
   [junit4]   2> 524956 INFO  (TEST-CollectionTooManyReplicasTest.testAddTooManyReplicas-seed#[EDF3CF085726CE2A]) [    ] o.a.s.c.SolrResourceLoader new SolrResourceLoader for directory: '/home/jenkins/workspace/Lucene-Solr-6.x-Linux/solr/build/solr-core/test/J0/temp/solr.cloud.CollectionTooManyReplicasTest_EDF3CF085726CE2A-001/control-001'
   [junit4]   2> 524956 INFO  (TEST-CollectionTooManyReplicasTest.testAddTooManyReplicas-seed#[EDF3CF085726CE2A]) [    ] o.a.s.c.SolrResourceLoader JNDI not configured for solr (NoInitialContextEx)
   [junit4]   2> 524956 INFO  (TEST-CollectionTooManyReplicasTest.testAddTooManyReplicas-seed#[EDF3CF085726CE2A]) [    ] o.a.s.c.SolrResourceLoader solr home defaulted to 'solr/' (could not find system property or JNDI)
   [junit4]   2> 524957 INFO  (TEST-CollectionTooManyReplicasTest.testAddTooManyReplicas-seed#[EDF3CF085726CE2A]) [    ] o.a.s.c.c.SolrZkClient Using default ZkCredentialsProvider
   [junit4]   2> 524957 INFO  (TEST-CollectionTooManyReplicasTest.testAddTooManyReplicas-seed#[EDF3CF085726CE2A]) [    ] o.a.s.c.c.ConnectionManager Waiting for client to connect to ZooKeeper
   [junit4]   2> 524958 INFO  (zkCallback-672-thread-1) [    ] o.a.s.c.c.ConnectionManager Watcher org.apache.solr.common.cloud.ConnectionManager@13f045b name:ZooKeeperConnection Watcher:127.0.0.1:52046/solr got event WatchedEvent state:SyncConnected type:None path:null path:null type:None
   [junit4]   2> 524958 INFO  (TEST-CollectionTooManyReplicasTest.testAddTooManyReplicas-seed#[EDF3CF085726CE2A]) [    ] o.a.s.c.c.ConnectionManager Client is connected to ZooKeeper
   [junit4]   2> 524959 INFO  (TEST-CollectionTooManyReplicasTest.testAddTooManyReplicas-seed#[EDF3CF085726CE2A]) [    ] o.a.s.c.c.SolrZkClient Using default ZkACLProvider
   [junit4]   2> 524959 INFO  (TEST-CollectionTooManyReplicasTest.testAddTooManyReplicas-seed#[EDF3CF085726CE2A]) [    ] o.a.s.s.SolrDispatchFilter Loading solr.xml from SolrHome (not found in ZooKeeper)
   [junit4]   2> 524960 INFO  (TEST-CollectionTooManyReplicasTest.testAddTooManyReplicas-seed#[EDF3CF085726CE2A]) [    ] o.a.s.c.SolrXmlConfig Loading container configuration from /home/jenkins/workspace/Lucene-Solr-6.x-Linux/solr/build/solr-core/test/J0/temp/solr.cloud.CollectionTooManyReplicasTest_EDF3CF085726CE2A-001/control-001/solr.xml
   [junit4]   2> 524968 INFO  (TEST-CollectionTooManyReplicasTest.testAddTooManyReplicas-seed#[EDF3CF085726CE2A]) [    ] o.a.s.c.CorePropertiesLocator Config-defined core root directory: /home/jenkins/workspace/Lucene-Solr-6.x-Linux/solr/build/solr-core/test/J0/../../../../../../../../../home/jenkins/workspace/Lucene-Solr-6.x-Linux/solr/build/solr-core/test/J0/temp/solr.cloud.CollectionTooManyReplicasTest_EDF3CF085726CE2A-001/control-001/cores
   [junit4]   2> 524968 INFO  (TEST-CollectionTooManyReplicasTest.testAddTooManyReplicas-seed#[EDF3CF085726CE2A]) [    ] o.a.s.c.CoreContainer New CoreContainer 30744468
   [junit4]   2> 524968 INFO  (TEST-CollectionTooManyReplicasTest.testAddTooManyReplicas-seed#[EDF3CF085726CE2A]) [    ] o.a.s.c.CoreContainer Loading cores into CoreContainer [instanceDir=/home/jenkins/workspace/Lucene-Solr-6.x-Linux/solr/build/solr-core/test/J0/temp/solr.cloud.CollectionTooManyReplicasTest_EDF3CF085726CE2A-001/control-001]
   [junit4]   2> 524968 WARN  (TEST-CollectionTooManyReplicasTest.testAddTooManyReplicas-seed#[EDF3CF085726CE2A]) [    ] o.a.s.c.CoreContainer Couldn't add files from /home/jenkins/workspace/Lucene-Solr-6.x-Linux/solr/build/solr-core/test/J0/temp/solr.cloud.CollectionTooManyReplicasTest_EDF3CF085726CE2A-001/control-001/lib to classpath: /home/jenkins/workspace/Lucene-Solr-6.x-Linux/solr/build/solr-core/test/J0/temp/solr.cloud.CollectionTooManyReplicasTest_EDF3CF085726CE2A-001/control-001/lib
   [junit4]   2> 524969 INFO  (TEST-CollectionTooManyReplicasTest.testAddTooManyReplicas-seed#[EDF3CF085726CE2A]) [    ] o.a.s.h.c.HttpShardHandlerFactory created with socketTimeout : 90000,urlScheme : ,connTimeout : 15000,maxConnectionsPerHost : 20,maxConnections : 10000,corePoolSize : 0,maximumPoolSize : 2147483647,maxThreadIdleTime : 5,sizeOfQueue : -1,fairnessPolicy : false,useRetries : false,
   [junit4]   2> 524970 INFO  (TEST-CollectionTooManyReplicasTest.testAddTooManyReplicas-seed#[EDF3CF085726CE2A]) [    ] o.a.s.u.UpdateShardHandler Creating UpdateShardHandler HTTP client with params: socketTimeout=340000&connTimeout=45000&retry=true
   [junit4]   2> 524971 INFO  (TEST-CollectionTooManyReplicasTest.testAddTooManyReplicas-seed#[EDF3CF085726CE2A]) [    ] o.a.s.l.LogWatcher SLF4J impl is org.slf4j.impl.Log4jLoggerFactory
   [junit4]   2> 524971 INFO  (TEST-CollectionTooManyReplicasTest.testAddTooManyReplicas-seed#[EDF3CF085726CE2A]) [    ] o.a.s.l.LogWatcher Registering Log Listener [Log4j (org.slf4j.impl.Log4jLoggerFactory)]
   [junit4]   2> 524971 INFO  (TEST-CollectionTooManyReplicasTest.testAddTooManyReplicas-seed#[EDF3CF085726CE2A]) [    ] o.a.s.c.ZkContainer Zookeeper client=127.0.0.1:52046/solr
   [junit4]   2> 524971 INFO  (TEST-CollectionTooManyReplicasTest.testAddTooManyReplicas-seed#[EDF3CF085726CE2A]) [    ] o.a.s.c.ZkController zkHost includes chroot
   [junit4]   2> 524971 INFO  (TEST-CollectionTooManyReplicasTest.testAddTooManyReplicas-seed#[EDF3CF085726CE2A]) [    ] o.a.s.c.c.SolrZkClient Using default ZkCredentialsProvider
   [junit4]   2> 524972 INFO  (TEST-CollectionTooManyReplicasTest.testAddTooManyReplicas-seed#[EDF3CF085726CE2A]) [    ] o.a.s.c.c.ConnectionManager Waiting for client to connect to ZooKeeper
   [junit4]   2> 524973 INFO  (zkCallback-675-thread-1) [    ] o.a.s.c.c.ConnectionManager Watcher org.apache.solr.common.cloud.ConnectionManager@b30f39 name:ZooKeeperConnection Watcher:127.0.0.1:52046 got event WatchedEvent state:SyncConnected type:None path:null path:null type:None
   [junit4]   2> 524973 INFO  (TEST-CollectionTooManyReplicasTest.testAddTooManyReplicas-seed#[EDF3CF085726CE2A]) [    ] o.a.s.c.c.ConnectionManager Client is connected to ZooKeeper
   [junit4]   2> 524974 INFO  (TEST-CollectionTooManyReplicasTest.testAddTooManyReplicas-seed#[EDF3CF085726CE2A]) [    ] o.a.s.c.c.SolrZkClient Using default ZkACLProvider
   [junit4]   2> 524975 INFO  (TEST-CollectionTooManyReplicasTest.testAddTooManyReplicas-seed#[EDF3CF085726CE2A]) [n:127.0.0.1:46397_    ] o.a.s.c.c.ConnectionManager Waiting for client to connect to ZooKeeper
   [junit4]   2> 524976 INFO  (zkCallback-676-thread-1-processing-n:127.0.0.1:46397_) [n:127.0.0.1:46397_    ] o.a.s.c.c.ConnectionManager Watcher org.apache.solr.common.cloud.ConnectionManager@1388d0b name:ZooKeeperConnection Watcher:127.0.0.1:52046/solr got event WatchedEvent state:SyncConnected type:None path:null path:null type:None
   [junit4]   2> 524976 INFO  (TEST-CollectionTooManyReplicasTest.testAddTooManyReplicas-seed#[EDF3CF085726CE2A]) [n:127.0.0.1:46397_    ] o.a.s.c.c.ConnectionManager Client is connected to ZooKeeper
   [junit4]   2> 524978 INFO  (TEST-CollectionTooManyReplicasTest.testAddTooManyReplicas-seed#[EDF3CF085726CE2A]) [n:127.0.0.1:46397_    ] o.a.s.c.c.SolrZkClient makePath: /overseer/queue
   [junit4]   2> 524980 INFO  (TEST-CollectionTooManyReplicasTest.testAddTooManyReplicas-seed#[EDF3CF085726CE2A]) [n:127.0.0.1:46397_    ] o.a.s.c.c.SolrZkClient makePath: /overseer/collection-queue-work
   [junit4]   2> 524983 INFO  (TEST-CollectionTooManyReplicasTest.testAddTooManyReplicas-seed#[EDF3CF085726CE2A]) [n:127.0.0.1:46397_    ] o.a.s.c.c.SolrZkClient makePath: /overseer/collection-map-running
   [junit4]   2> 524985 INFO  (TEST-CollectionTooManyReplicasTest.testAddTooManyReplicas-seed#[EDF3CF085726CE2A]) [n:127.0.0.1:46397_    ] o.a.s.c.c.SolrZkClient makePath: /overseer/collection-map-completed
   [junit4]   2> 524987 INFO  (TEST-CollectionTooManyReplicasTest.testAddTooManyReplicas-seed#[EDF3CF085726CE2A]) [n:127.0.0.1:46397_    ] o.a.s.c.c.SolrZkClient makePath: /overseer/collection-map-failure
   [junit4]   2> 524989 INFO  (TEST-CollectionTooManyReplicasTest.testAddTooManyReplicas-seed#[EDF3CF085726CE2A]) [n:127.0.0.1:46397_    ] o.a.s.c.c.SolrZkClient makePath: /live_nodes
   [junit4]   2> 524991 INFO  (TEST-CollectionTooManyReplicasTest.testAddTooManyReplicas-seed#[EDF3CF085726CE2A]) [n:127.0.0.1:46397_    ] o.a.s.c.c.SolrZkClient makePath: /aliases.json
   [junit4]   2> 524992 INFO  (TEST-CollectionTooManyReplicasTest.testAddTooManyReplicas-seed#[EDF3CF085726CE2A]) [n:127.0.0.1:46397_    ] o.a.s.c.c.SolrZkClient makePath: /clusterstate.json
   [junit4]   2> 524993 INFO  (TEST-CollectionTooManyReplicasTest.testAddTooManyReplicas-seed#[EDF3CF085726CE2A]) [n:127.0.0.1:46397_    ] o.a.s.c.c.SolrZkClient makePath: /security.json
   [junit4]   2> 524994 INFO  (TEST-CollectionTooManyReplicasTest.testAddTooManyReplicas-seed#[EDF3CF085726CE2A]) [n:127.0.0.1:46397_    ] o.a.s.c.c.ZkStateReader Updating cluster state from ZooKeeper... 
   [junit4]   2> 524995 INFO  (TEST-CollectionTooManyReplicasTest.testAddTooManyReplicas-seed#[EDF3CF085726CE2A]) [n:127.0.0.1:46397_    ] o.a.s.c.c.ZkStateReader Updated live nodes from ZooKeeper... (0) -> (0)
   [junit4]   2> 524997 INFO  (TEST-CollectionTooManyReplicasTest.testAddTooManyReplicas-seed#[EDF3CF085726CE2A]) [n:127.0.0.1:46397_    ] o.a.s.c.c.SolrZkClient makePath: /overseer_elect
   [junit4]   2> 524998 INFO  (TEST-CollectionTooManyReplicasTest.testAddTooManyReplicas-seed#[EDF3CF085726CE2A]) [n:127.0.0.1:46397_    ] o.a.s.c.c.SolrZkClient makePath: /overseer_elect/election
   [junit4]   2> 524999 INFO  (TEST-CollectionTooManyReplicasTest.testAddTooManyReplicas-seed#[EDF3CF085726CE2A]) [n:127.0.0.1:46397_    ] o.a.s.c.Overseer Overseer (id=null) closing
   [junit4]   2> 525000 INFO  (TEST-CollectionTooManyReplicasTest.testAddTooManyReplicas-seed#[EDF3CF085726CE2A]) [n:127.0.0.1:46397_    ] o.a.s.c.LeaderElector Joined leadership election with path: /overseer_elect/election/95492479487967236-127.0.0.1:46397_-n_0000000000
   [junit4]   2> 525000 INFO  (TEST-CollectionTooManyReplicasTest.testAddTooManyReplicas-seed#[EDF3CF085726CE2A]) [n:127.0.0.1:46397_    ] o.a.s.c.OverseerElectionContext I am going to be the leader 127.0.0.1:46397_
   [junit4]   2> 525000 INFO  (TEST-CollectionTooManyReplicasTest.testAddTooManyReplicas-seed#[EDF3CF085726CE2A]) [n:127.0.0.1:46397_    ] o.a.s.c.c.SolrZkClient makePath: /overseer_elect/leader
   [junit4]   2> 525001 INFO  (TEST-CollectionTooManyReplicasTest.testAddTooManyReplicas-seed#[EDF3CF085726CE2A]) [n:127.0.0.1:46397_    ] o.a.s.c.Overseer Overseer (id=95492479487967236-127.0.0.1:46397_-n_0000000000) starting
   [junit4]   2> 525003 INFO  (TEST-CollectionTooManyReplicasTest.testAddTooManyReplicas-seed#[EDF3CF085726CE2A]) [n:127.0.0.1:46397_    ] o.a.s.c.c.SolrZkClient makePath: /overseer/queue-work
   [junit4]   2> 525009 INFO  (TEST-CollectionTooManyReplicasTest.testAddTooManyReplicas-seed#[EDF3CF085726CE2A]) [n:127.0.0.1:46397_    ] o.a.s.c.OverseerAutoReplicaFailoverThread Starting OverseerAutoReplicaFailoverThread autoReplicaFailoverWorkLoopDelay=10000 autoReplicaFailoverWaitAfterExpiration=30000 autoReplicaFailoverBadNodeExpiration=60000
   [junit4]   2> 525009 INFO  (OverseerCollectionConfigSetProcessor-95492479487967236-127.0.0.1:46397_-n_0000000000) [n:127.0.0.1:46397_    ] o.a.s.c.OverseerTaskProcessor Process current queue of overseer operations
   [junit4]   2> 525010 INFO  (OverseerStateUpdate-95492479487967236-127.0.0.1:46397_-n_0000000000) [n:127.0.0.1:46397_    ] o.a.s.c.Overseer Starting to work on the main queue
   [junit4]   2> 525010 INFO  (TEST-CollectionTooManyReplicasTest.testAddTooManyReplicas-seed#[EDF3CF085726CE2A]) [n:127.0.0.1:46397_    ] o.a.s.c.ZkController Register node as live in ZooKeeper:/live_nodes/127.0.0.1:46397_
   [junit4]   2> 525011 INFO  (TEST-CollectionTooManyReplicasTest.testAddTooManyReplicas-seed#[EDF3CF085726CE2A]) [n:127.0.0.1:46397_    ] o.a.s.c.c.SolrZkClient makePath: /live_nodes/127.0.0.1:46397_
   [junit4]   2> 525012 INFO  (OverseerStateUpdate-95492479487967236-127.0.0.1:46397_-n_0000000000) [n:127.0.0.1:46397_    ] o.a.s.c.c.ZkStateReader Updated live nodes from ZooKeeper... (0) -> (0)
   [junit4]   2> 525013 INFO  (zkCallback-676-thread-1-processing-n:127.0.0.1:46397_) [n:127.0.0.1:46397_    ] o.a.s.c.c.ZkStateReader A live node change: [WatchedEvent state:SyncConnected type:NodeChildrenChanged path:/live_nodes], has occurred - updating... (live nodes size: [0])
   [junit4]   2> 525013 INFO  (zkCallback-676-thread-1-processing-n:127.0.0.1:46397_) [n:127.0.0.1:46397_    ] o.a.s.c.c.ZkStateReader Updated live nodes from ZooKeeper... (0) -> (1)
   [junit4]   2> 525077 INFO  (TEST-CollectionTooManyReplicasTest.testAddTooManyReplicas-seed#[EDF3CF085726CE2A]) [n:127.0.0.1:46397_    ] o.a.s.c.CoreContainer Security conf doesn't exist. Skipping setup for authorization module.
   [junit4]   2> 525077 INFO  (TEST-CollectionTooManyReplicasTest.testAddTooManyReplicas-seed#[EDF3CF085726CE2A]) [n:127.0.0.1:46397_    ] o.a.s.c.CoreContainer No authentication plugin used.
   [junit4]   2> 525078 INFO  (TEST-CollectionTooManyReplicasTest.testAddTooManyReplicas-seed#[EDF3CF085726CE2A]) [n:127.0.0.1:46397_    ] o.a.s.c.CorePropertiesLocator Looking for core definitions underneath /home/jenkins/workspace/Lucene-Solr-6.x-Linux/solr/build/solr-core/test/J0/../../../../../../../../../home/jenkins/workspace/Lucene-Solr-6.x-Linux/solr/build/solr-core/test/J0/temp/solr.cloud.CollectionTooManyReplicasTest_EDF3CF085726CE2A-001/control-001/cores
   [junit4]   2> 525079 INFO  (TEST-CollectionTooManyReplicasTest.testAddTooManyReplicas-seed#[EDF3CF085726CE2A]) [n:127.0.0.1:46397_    ] o.a.s.c.CoreDescriptor Created CoreDescriptor: {name=collection1, config=solrconfig.xml, transient=false, schema=schema.xml, loadOnStartup=true, configSetProperties=configsetprops.json, collection=control_collection, coreNodeName=, dataDir=data/, shard=}
   [junit4]   2> 525079 INFO  (TEST-CollectionTooManyReplicasTest.testAddTooManyReplicas-seed#[EDF3CF085726CE2A]) [n:127.0.0.1:46397_    ] o.a.s.c.CorePropertiesLocator Found core collection1 in /home/jenkins/workspace/Lucene-Solr-6.x-Linux/solr/build/solr-core/test/J0/../../../../../../../../../home/jenkins/workspace/Lucene-Solr-6.x-Linux/solr/build/solr-core/test/J0/temp/solr.cloud.CollectionTooManyReplicasTest_EDF3CF085726CE2A-001/control-001/cores/collection1
   [junit4]   2> 525079 INFO  (TEST-CollectionTooManyReplicasTest.testAddTooManyReplicas-seed#[EDF3CF085726CE2A]) [n:127.0.0.1:46397_    ] o.a.s.c.CorePropertiesLocator Found 1 core definitions
   [junit4]   2> 525080 INFO  (TEST-CollectionTooManyReplicasTest.testAddTooManyReplicas-seed#[EDF3CF085726CE2A]) [n:127.0.0.1:46397_    ] o.a.s.s.SolrDispatchFilter user.dir=/home/jenkins/workspace/Lucene-Solr-6.x-Linux/solr/build/solr-core/test/J0
   [junit4]   2> 525080 INFO  (TEST-CollectionTooManyReplicasTest.testAddTooManyReplicas-seed#[EDF3CF085726CE2A]) [n:127.0.0.1:46397_    ] o.a.s.s.SolrDispatchFilter SolrDispatchFilter.init() done
   [junit4]   2> 525080 INFO  (coreLoadExecutor-2471-thread-1-processing-n:127.0.0.1:46397_) [n:127.0.0.1:46397_ c:control_collection   x:collection1] o.a.s.c.ZkController publishing state=down
   [junit4]   2> 525080 INFO  (coreLoadExecutor-2471-thread-1-processing-n:127.0.0.1:46397_) [n:127.0.0.1:46397_ c:control_collection   x:collection1] o.a.s.c.ZkController numShards not found on descriptor - reading it from system property
   [junit4]   2> 525082 INFO  (OverseerStateUpdate-95492479487967236-127.0.0.1:46397_-n_0000000000) [n:127.0.0.1:46397_    ] o.a.s.c.Overseer processMessage: queueSize: 1, message = {
   [junit4]   2>   "core":"collection1",
   [junit4]   2>   "roles":null,
   [junit4]   2>   "base_url":"http://127.0.0.1:46397",
   [junit4]   2>   "node_name":"127.0.0.1:46397_",
   [junit4]   2>   "numShards":"1",
   [junit4]   2>   "state":"down",
   [junit4]   2>   "shard":null,
   [junit4]   2>   "collection":"control_collection",
   [junit4]   2>   "operation":"state"} current state version: 0
   [junit4]   2> 525082 INFO  (coreLoadExecutor-2471-thread-1-processing-n:127.0.0.1:46397_) [n:127.0.0.1:46397_ c:control_collection   x:collection1] o.a.s.c.ZkController look for our core node name
   [junit4]   2> 525082 INFO  (OverseerStateUpdate-95492479487967236-127.0.0.1:46397_-n_0000000000) [n:127.0.0.1:46397_    ] o.a.s.c.o.ReplicaMutator Update state numShards=1 message={
   [junit4]   2>   "core":"collection1",
   [junit4]   2>   "roles":null,
   [junit4]   2>   "base_url":"http://127.0.0.1:46397",
   [junit4]   2>   "node_name":"127.0.0.1:46397_",
   [junit4]   2>   "numShards":"1",
   [junit4]   2>   "state":"down",
   [junit4]   2>   "shard":null,
   [junit4]   2>   "collection":"control_collection",
   [junit4]   2>   "operation":"state"}
   [junit4]   2> 525083 INFO  (OverseerStateUpdate-95492479487967236-127.0.0.1:46397_-n_0000000000) [n:127.0.0.1:46397_    ] o.a.s.c.o.ClusterStateMutator building a new cName: control_collection
   [junit4]   2> 525083 INFO  (OverseerStateUpdate-95492479487967236-127.0.0.1:46397_-n_0000000000) [n:127.0.0.1:46397_    ] o.a.s.c.o.ReplicaMutator Assigning new node to shard shard=shard1
   [junit4]   2> 525084 INFO  (zkCallback-676-thread-1-processing-n:127.0.0.1:46397_) [n:127.0.0.1:46397_    ] o.a.s.c.c.ZkStateReader A cluster state change: [WatchedEvent state:SyncConnected type:NodeDataChanged path:/clusterstate.json], has occurred - updating... (live nodes size: [1])
   [junit4]   2> 526083 INFO  (coreLoadExecutor-2471-thread-1-processing-n:127.0.0.1:46397_) [n:127.0.0.1:46397_ c:control_collection   x:collection1] o.a.s.c.ZkController waiting to find shard id in clusterstate for collection1
   [junit4]   2> 526083 INFO  (coreLoadExecutor-2471-thread-1-processing-n:127.0.0.1:46397_) [n:127.0.0.1:46397_ c:control_collection   x:collection1] o.a.s.c.ZkController Check for collection zkNode:control_collection
   [junit4]   2> 526083 INFO  (coreLoadExecutor-2471-thread-1-processing-n:127.0.0.1:46397_) [n:127.0.0.1:46397_ c:control_collection   x:collection1] o.a.s.c.ZkController Collection zkNode exists
   [junit4]   2> 526083 INFO  (coreLoadExecutor-2471-thread-1-processing-n:127.0.0.1:46397_) [n:127.0.0.1:46397_ c:control_collection   x:collection1] o.a.s.c.c.ZkStateReader Load collection config from: [/collections/control_collection]
   [junit4]   2> 526084 INFO  (coreLoadExecutor-2471-thread-1-processing-n:127.0.0.1:46397_) [n:127.0.0.1:46397_ c:control_collection   x:collection1] o.a.s.c.c.ZkStateReader path=[/collections/control_collection] [configName]=[conf1] specified config exists in ZooKeeper
   [junit4]   2> 526084 INFO  (coreLoadExecutor-2471-thread-1-processing-n:127.0.0.1:46397_) [n:127.0.0.1:46397_ c:control_collection   x:collection1] o.a.s.c.SolrResourceLoader new SolrResourceLoader for directory: '/home/jenkins/workspace/Lucene-Solr-6.x-Linux/solr/build/solr-core/test/J0/temp/solr.cloud.CollectionTooManyReplicasTest_EDF3CF085726CE2A-001/control-001/cores/collection1'
   [junit4]   2> 526084 INFO  (coreLoadExecutor-2471-thread-1-processing-n:127.0.0.1:46397_) [n:127.0.0.1:46397_ c:control_collection   x:collection1] o.a.s.c.SolrResourceLoader JNDI not configured for solr (NoInitialContextEx)
   [junit4]   2> 526084 INFO  (coreLoadExecutor-2471-thread-1-processing-n:127.0.0.1:46397_) [n:127.0.0.1:46397_ c:control_collection   x:collection1] o.a.s.c.SolrResourceLoader solr home defaulted to 'solr/' (could not find system property or JNDI)
   [junit4]   2> 526086 INFO  (coreLoadExecutor-2471-thread-1-processing-n:127.0.0.1:46397_) [n:127.0.0.1:46397_ c:control_collection   x:collection1] o.a.s.c.Config loaded config solrconfig.xml with version 0 
   [junit4]   2> 526091 INFO  (coreLoadExecutor-2471-thread-1-processing-n:127.0.0.1:46397_) [n:127.0.0.1:46397_ c:control_collection   x:collection1] o.a.s.c.SolrConfig current version of requestparams : -1
   [junit4]   2> 526105 INFO  (coreLoadExecutor-2471-thread-1-processing-n:127.0.0.1:46397_) [n:127.0.0.1:46397_ c:control_collection   x:collection1] o.a.s.c.SolrConfig Using Lucene MatchVersion: 6.1.0
   [junit4]   2> 526116 INFO  (coreLoadExecutor-2471-thread-1-processing-n:127.0.0.1:46397_) [n:127.0.0.1:46397_ c:control_collection   x:collection1] o.a.s.c.SolrConfig Loaded SolrConfig: solrconfig.xml
   [junit4]   2> 526126 INFO  (coreLoadExecutor-2471-thread-1-processing-n:127.0.0.1:46397_) [n:127.0.0.1:46397_ c:control_collection   x:collection1] o.a.s.s.IndexSchema [collection1] Schema name=test
   [junit4]   2> 526264 INFO  (coreLoadExecutor-2471-thread-1-processing-n:127.0.0.1:46397_) [n:127.0.0.1:46397_ c:control_collection   x:collection1] o.a.s.s.OpenExchangeRatesOrgProvider Initialized with rates=open-exchange-rates.json, refreshInterval=1440.
   [junit4]   2> 526274 INFO  (coreLoadExecutor-2471-thread-1-processing-n:127.0.0.1:46397_) [n:127.0.0.1:46397_ c:control_collection   x:collection1] o.a.s.s.IndexSchema default search field in schema is text
   [junit4]   2> 526276 INFO  (coreLoadExecutor-2471-thread-1-processing-n:127.0.0.1:46397_) [n:127.0.0.1:46397_ c:control_collection   x:collection1] o.a.s.s.IndexSchema unique key field: id
   [junit4]   2> 526291 INFO  (coreLoadExecutor-2471-thread-1-processing-n:127.0.0.1:46397_) [n:127.0.0.1:46397_ c:control_collection   x:collection1] o.a.s.s.FileExchangeRateProvider Reloading exchange rates from file currency.xml
   [junit4]   2> 526294 INFO  (coreLoadExecutor-2471-thread-1-processing-n:127.0.0.1:46397_) [n:127.0.0.1:46397_ c:control_collection   x:collection1] o.a.s.s.FileExchangeRateProvider Reloading exchange rates from file currency.xml
   [junit4]   2> 526298 INFO  (coreLoadExecutor-2471-thread-1-processing-n:127.0.0.1:46397_) [n:127.0.0.1:46397_ c:control_collection   x:collection1] o.a.s.s.OpenExchangeRatesOrgProvider Reloading exchange rates from open-exchange-rates.json
   [junit4]   2> 526299 INFO  (coreLoadExecutor-2471-thread-1-processing-n:127.0.0.1:46397_) [n:127.0.0.1:46397_ c:control_collection   x:collection1] o.a.s.s.OpenExchangeRatesOrgProvider Reloading exchange rates from open-exchange-rates.json
   [junit4]   2> 526301 INFO  (coreLoadExecutor-2471-thread-1-processing-n:127.0.0.1:46397_) [n:127.0.0.1:46397_ c:control_collection   x:collection1] o.a.s.c.ConfigSetProperties Did not find ConfigSet properties, assuming default properties: Can't find resource 'configsetprops.json' in classpath or '/configs/conf1', cwd=/home/jenkins/workspace/Lucene-Solr-6.x-Linux/solr/build/solr-core/test/J0
   [junit4]   2> 526302 INFO  (coreLoadExecutor-2471-thread-1-processing-n:127.0.0.1:46397_) [n:127.0.0.1:46397_ c:control_collection   x:collection1] o.a.s.c.CoreContainer Creating SolrCore 'collection1' using configuration from collection control_collection
   [junit4]   2> 526302 INFO  (coreLoadExecutor-2471-thread-1-processing-n:127.0.0.1:46397_) [n:127.0.0.1:46397_ c:control_collection s:shard1 r:core_node1 x:collection1] o.a.s.c.SolrCore org.apache.solr.core.MockDirectoryFactory
   [junit4]   2> 526302 INFO  (coreLoadExecutor-2471-thread-1-processing-n:127.0.0.1:46397_) [n:127.0.0.1:46397_ c:control_collection s:shard1 r:core_node1 x:collection1] o.a.s.c.SolrCore [[collection1] ] Opening new SolrCore at [/home/jenkins/workspace/Lucene-Solr-6.x-Linux/solr/build/solr-core/test/J0/temp/solr.cloud.CollectionTooManyReplicasTest_EDF3CF085726CE2A-001/control-001/cores/collection1], dataDir=[/home/jenkins/workspace/Lucene-Solr-6.x-Linux/solr/build/solr-core/test/J0/../../../../../../../../../home/jenkins/workspace/Lucene-Solr-6.x-Linux/solr/build/solr-core/test/J0/temp/solr.cloud.CollectionTooManyReplicasTest_EDF3CF085726CE2A-001/control-001/cores/collection1/data/]
   [junit4]   2> 526302 INFO  (coreLoadExecutor-2471-thread-1-processing-n:127.0.0.1:46397_) [n:127.0.0.1:46397_ c:control_collection s:shard1 r:core_node1 x:collection1] o.a.s.c.JmxMonitoredMap JMX monitoring is enabled. Adding Solr mbeans to JMX Server: com.sun.jmx.mbeanserver.JmxMBeanServer@38e7ae
   [junit4]   2> 526304 INFO  (coreLoadExecutor-2471-thread-1-processing-n:127.0.0.1:46397_) [n:127.0.0.1:46397_ c:control_collection s:shard1 r:core_node1 x:collection1] o.a.s.c.CachingDirectoryFactory return new directory for /home/jenkins/workspace/Lucene-Solr-6.x-Linux/solr/build/solr-core/test/J0/../../../../../../../../../home/jenkins/workspace/Lucene-Solr-6.x-Linux/solr/build/solr-core/test/J0/temp/solr.cloud.CollectionTooManyReplicasTest_EDF3CF085726CE2A-001/control-001/cores/collection1/data
   [junit4]   2> 526304 INFO  (coreLoadExecutor-2471-thread-1-processing-n:127.0.0.1:46397_) [n:127.0.0.1:46397_ c:control_collection s:shard1 r:core_node1 x:collection1] o.a.s.c.SolrCore New index directory detected: old=null new=/home/jenkins/workspace/Lucene-Solr-6.x-Linux/solr/build/solr-core/test/J0/../../../../../../../../../home/jenkins/workspace/Lucene-Solr-6.x-Linux/solr/build/solr-core/test/J0/temp/solr.cloud.CollectionTooManyReplicasTest_EDF3CF085726CE2A-001/control-001/cores/collection1/data/index/
   [junit4]   2> 526304 WARN  (coreLoadExecutor-2471-thread-1-processing-n:127.0.0.1:46397_) [n:127.0.0.1:46397_ c:control_collection s:shard1 r:core_node1 x:collection1] o.a.s.c.SolrCore [collection1] Solr index directory '/home/jenkins/workspace/Lucene-Solr-6.x-Linux/solr/build/solr-core/test/J0/../../../../../../../../../home/jenkins/workspace/Lucene-Solr-6.x-Linux/solr/build/solr-core/test/J0/temp/solr.cloud.CollectionTooManyReplicasTest_EDF3CF085726CE2A-001/control-001/cores/collection1/data/index' doesn't exist. Creating new index...
   [junit4]   2> 526304 INFO  (coreLoadExecutor-2471-thread-1-processing-n:127.0.0.1:46397_) [n:127.0.0.1:46397_ c:control_collection s:shard1 r:core_node1 x:collection1] o.a.s.c.CachingDirectoryFactory return new directory for /home/jenkins/workspace/Lucene-Solr-6.x-Linux/solr/build/solr-core/test/J0/../../../../../../../../../home/jenkins/workspace/Lucene-Solr-6.x-Linux/solr/build/solr-core/test/J0/temp/solr.cloud.CollectionTooManyReplicasTest_EDF3CF085726CE2A-001/control-001/cores/collection1/data/index
   [junit4]   2> 526305 INFO  (coreLoadExecutor-2471-thread-1-processing-n:127.0.0.1:46397_) [n:127.0.0.1:46397_ c:control_collection s:shard1 r:core_node1 x:collection1] o.a.s.u.RandomMergePolicy RandomMergePolicy wrapping class org.apache.lucene.index.TieredMergePolicy: [TieredMergePolicy: maxMergeAtOnce=27, maxMergeAtOnceExplicit=19, maxMergedSegmentMB=99.455078125, floorSegmentMB=0.3408203125, forceMergeDeletesPctAllowed=26.63727002970598, segmentsPerTier=27.0, maxCFSSegmentSizeMB=8.796093022207999E12, noCFSRatio=0.0
   [junit4]   2> 526306 INFO  (coreLoadExecutor-2471-thread-1-processing-n:127.0.0.1:46397_) [n:127.0.0.1:46397_ c:control_collection s:shard1 r:core_node1 x:collection1] o.a.s.c.SolrDeletionPolicy SolrDeletionPolicy.onCommit: commits: num=1
   [junit4]   2> 	commit{dir=MockDirectoryWrapper(RAMDirectory@138d1 lockFactory=org.apache.lucene.store.SingleInstanceLockFactory@8a1a27),segFN=segments_1,generation=1}
   [junit4]   2> 526306 INFO  (coreLoadExecutor-2471-thread-1-processing-n:127.0.0.1:46397_) [n:127.0.0.1:46397_ c:control_collection s:shard1 r:core_node1 x:collection1] o.a.s.c.SolrDeletionPolicy newest commit generation = 1
   [junit4]   2> 526306 INFO  (OldIndexDirectoryCleanupThreadForCore-collection1) [n:127.0.0.1:46397_ c:control_collection s:shard1 r:core_node1 x:collection1] o.a.s.c.SolrCore Looking for old index directories to cleanup for core collection1 in /home/jenkins/workspace/Lucene-Solr-6.x-Linux/solr/build/solr-core/test/J0/../../../../../../../../../home/jenkins/workspace/Lucene-Solr-6.x-Linux/solr/build/solr-core/test/J0/temp/solr.cloud.CollectionTooManyReplicasTest_EDF3CF085726CE2A-001/control-001/cores/collection1/data/
   [junit4]   2> 526306 WARN  (OldIndexDirectoryCleanupThreadForCore-collection1) [n:127.0.0.1:46397_ c:control_collection s:shard1 r:core_node1 x:collection1] o.a.s.c.DirectoryFactory /home/jenkins/workspace/Lucene-Solr-6.x-Linux/solr/build/solr-core/test/J0/../../../../../../../../../home/jenkins/workspace/Lucene-Solr-6.x-Linux/solr/build/solr-core/test/J0/temp/solr.cloud.CollectionTooManyReplicasTest_EDF3CF085726CE2A-001/control-001/cores/collection1/data/ does not point to a valid data directory; skipping clean-up of old index directories.
   [junit4]   2> 526312 INFO  (coreLoadExecutor-2471-thread-1-processing-n:127.0.0.1:46397_) [n:127.0.0.1:46397_ c:control_collection s:shard1 r:core_node1 x:collection1] o.a.s.u.p.UpdateRequestProcessorChain creating updateRequestProcessorChain "nodistrib"
   [junit4]   2> 526312 INFO  (coreLoadExecutor-2471-thread-1-processing-n:127.0.0.1:46397_) [n:127.0.0.1:46397_ c:control_collection s:shard1 r:core_node1 x:collection1] o.a.s.u.p.UpdateRequestProcessorChain creating updateRequestProcessorChain "dedupe"
   [junit4]   2> 526313 INFO  (coreLoadExecutor-2471-thread-1-processing-n:127.0.0.1:46397_) [n:127.0.0.1:46397_ c:control_collection s:shard1 r:core_node1 x:collection1] o.a.s.u.p.UpdateRequestProcessorChain inserting DistributedUpdateProcessorFactory into updateRequestProcessorChain "dedupe"
   [junit4]   2> 526313 INFO  (coreLoadExecutor-2471-thread-1-processing-n:127.0.0.1:46397_) [n:127.0.0.1:46397_ c:control_collection s:shard1 r:core_node1 x:collection1] o.a.s.u.p.UpdateRequestProcessorChain creating updateRequestProcessorChain "stored_sig"
   [junit4]   2> 526313 INFO  (coreLoadExecutor-2471-thread-1-processing-n:127.0.0.1:46397_) [n:127.0.0.1:46397_ c:control_collection s:shard1 r:core_node1 x:collection1] o.a.s.u.p.UpdateRequestProcessorChain inserting DistributedUpdateProcessorFactory into updateRequestProcessorChain "stored_sig"
   [junit4]   2> 526313 INFO  (coreLoadExecutor-2471-thread-1-processing-n:127.0.0.1:46397_) [n:127.0.0.1:46397_ c:control_collection s:shard1 r:core_node1 x:collection1] o.a.s.u.p.UpdateRequestProcessorChain creating updateRequestProcessorChain "distrib-dup-test-chain-explicit"
   [junit4]   2> 526313 INFO  (coreLoadExecutor-2471-thread-1-processing-n:127.0.0.1:46397_) [n:127.0.0.1:46397_ c:control_collection s:shard1 r:core_node1 x:collection1] o.a.s.u.p.UpdateRequestProcessorChain creating updateRequestProcessorChain "distrib-dup-test-chain-implicit"
   [junit4]   2> 526313 INFO  (coreLoadExecutor-2471-thread-1-processing-n:127.0.0.1:46397_) [n:127.0.0.1:46397_ c:control_collection s:shard1 r:core_node1 x:collection1] o.a.s.u.p.UpdateRequestProcessorChain inserting DistributedUpdateProcessorFactory into updateRequestProcessorChain "distrib-dup-test-chain-implicit"
   [junit4]   2> 526314 INFO  (coreLoadExecutor-2471-thread-1-processing-n:127.0.0.1:46397_) [n:127.0.0.1:46397_ c:control_collection s:shard1 r:core_node1 x:collection1] o.a.s.c.SolrCore no updateRequestProcessorChain defined as default, creating implicit default
   [junit4]   2> 526314 WARN  (coreLoadExecutor-2471-thread-1-processing-n:127.0.0.1:46397_) [n:127.0.0.1:46397_ c:control_collection s:shard1 r:core_node1 x:collection1] o.a.s.c.RequestHandlers INVALID paramSet a in requestHandler {type = requestHandler,name = /dump,class = DumpRequestHandler,args = {defaults={a=A,b=B}}}
   [junit4]   2> 526316 INFO  (coreLoadExecutor-2471-thread-1-processing-n:127.0.0.1:46397_) [n:127.0.0.1:46397_ c:control_collection s:shard1 r:core_node1 x:collection1] o.a.s.h.l.XMLLoader xsltCacheLifetimeSeconds=60
   [junit4]   2> 526318 INFO  (coreLoadExecutor-2471-thread-1-processing-n:127.0.0.1:46397_) [n:127.0.0.1:46397_ c:control_collection s:shard1 r:core_node1 x:collection1] o.a.s.h.l.XMLLoader xsltCacheLifetimeSeconds=60
   [junit4]   2> 526320 INFO  (coreLoadExecutor-2471-thread-1-processing-n:127.0.0.1:46397_) [n:127.0.0.1:46397_ c:control_collection s:shard1 r:core_node1 x:collection1] o.a.s.h.l.XMLLoader xsltCacheLifetimeSeconds=60
   [junit4]   2> 526322 INFO  (coreLoadExecutor-2471-thread-1-processing-n:127.0.0.1:46397_) [n:127.0.0.1:46397_ c:control_collection s:shard1 r:core_node1 x:collection1] o.a.s.h.l.XMLLoader xsltCacheLifetimeSeconds=60
   [junit4]   2> 526331 INFO  (coreLoadExecutor-2471-thread-1-processing-n:127.0.0.1:46397_) [n:127.0.0.1:46397_ c:control_collection s:shard1 r:core_node1 x:collection1] o.a.s.c.RequestHandlers Registered paths: /admin/mbeans,standard,/dump,/update/csv,/sql,/update/json/docs,/admin/luke,/export,/admin/segments,/get,/admin/system,/replication,/admin/properties,/config,/stream,/schema,/admin/plugins,/admin/logging,/update/json,/admin/ping,/admin/threads,/update,/admin/file
   [junit4]   2> 526332 INFO  (coreLoadExecutor-2471-thread-1-processing-n:127.0.0.1:46397_) [n:127.0.0.1:46397_ c:control_collection s:shard1 r:core_node1 x:collection1] o.a.s.c.SolrCore Using default statsCache cache: org.apache.solr.search.stats.LocalStatsCache
   [junit4]   2> 526333 INFO  (coreLoadExecutor-2471-thread-1-processing-n:127.0.0.1:46397_) [n:127.0.0.1:46397_ c:control_collection s:shard1 r:core_node1 x:collection1] o.a.s.u.UpdateHandler Using UpdateLog implementation: org.apache.solr.update.UpdateLog
   [junit4]   2> 526333 INFO  (coreLoadExecutor-2471-thread-1-processing-n:127.0.0.1:46397_) [n:127.0.0.1:46397_ c:control_collection s:shard1 r:core_node1 x:collection1] o.a.s.u.UpdateLog Initializing UpdateLog: dataDir= defaultSyncLevel=FLUSH numRecordsToKeep=100 maxNumLogsToKeep=10 numVersionBuckets=65536
   [junit4]   2> 526341 INFO  (coreLoadExecutor-2471-thread-1-processing-n:127.0.0.1:46397_) [n:127.0.0.1:46397_ c:control_collection s:shard1 r:core_node1 x:collection1] o.a.s.u.CommitTracker Hard AutoCommit: disabled
   [junit4]   2> 526341 INFO  (coreLoadExecutor-2471-thread-1-processing-n:127.0.0.1:46397_) [n:127.0.0.1:46397_ c:control_collection s:shard1 r:core_node1 x:collection1] o.a.s.u.CommitTracker Soft AutoCommit: disabled
   [junit4]   2> 526342 INFO  (coreLoadExecutor-2471-thread-1-processing-n:127.0.0.1:46397_) [n:127.0.0.1:46397_ c:control_collection s:shard1 r:core_node1 x:collection1] o.a.s.u.RandomMergePolicy RandomMergePolicy wrapping class org.apache.lucene.index.TieredMergePolicy: [TieredMergePolicy: maxMergeAtOnce=17, maxMergeAtOnceExplicit=35, maxMergedSegmentMB=80.78515625, floorSegmentMB=1.9951171875, forceMergeDeletesPctAllowed=26.300552044842878, segmentsPerTier=33.0, maxCFSSegmentSizeMB=8.796093022207999E12, noCFSRatio=1.0
   [junit4]   2> 526342 INFO  (coreLoadExecutor-2471-thread-1-processing-n:127.0.0.1:46397_) [n:127.0.0.1:46397_ c:control_collection s:shard1 r:core_node1 x:collection1] o.a.s.c.SolrDeletionPolicy SolrDeletionPolicy.onInit: commits: num=1
   [junit4]   2> 	commit{dir=MockDirectoryWrapper(RAMDirectory@138d1 lockFactory=org.apache.lucene.store.SingleInstanceLockFactory@8a1a27),segFN=segments_1,generation=1}
   [junit4]   2> 526342 INFO  (coreLoadExecutor-2471-thread-1-processing-n:127.0.0.1:46397_) [n:127.0.0.1:46397_ c:control_collection s:shard1 r:core_node1 x:collection1] o.a.s.c.SolrDeletionPolicy newest commit generation = 1
   [junit4]   2> 526343 INFO  (coreLoadExecutor-2471-thread-1-processing-n:127.0.0.1:46397_) [n:127.0.0.1:46397_ c:control_collection s:shard1 r:core_node1 x:collection1] o.a.s.s.SolrIndexSearcher Opening [Searcher@a60adb[collection1] main]
   [junit4]   2> 526343 INFO  (coreLoadExecutor-2471-thread-1-processing-n:127.0.0.1:46397_) [n:127.0.0.1:46397_ c:control_collection s:shard1 r:core_node1 x:collection1] o.a.s.c.c.ZkStateReader Load collection config from: [/collections/control_collection]
   [junit4]   2> 526344 INFO  (coreLoadExecutor-2471-thread-1-processing-n:127.0.0.1:46397_) [n:127.0.0.1:46397_ c:control_collection s:shard1 r:core_node1 x:collection1] o.a.s.c.c.ZkStateReader path=[/collections/control_collection] [configName]=[conf1] specified config exists in ZooKeeper
   [junit4]   2> 526344 INFO  (coreLoadExecutor-2471-thread-1-processing-n:127.0.0.1:46397_) [n:127.0.0.1:46397_ c:control_collection s:shard1 r:core_node1 x:collection1] o.a.s.r.ManagedResourceStorage Setting up ZooKeeper-based storage for the RestManager with znodeBase: /configs/conf1
   [junit4]   2> 526345 INFO  (coreLoadExecutor-2471-thread-1-processing-n:127.0.0.1:46397_) [n:127.0.0.1:46397_ c:control_collection s:shard1 r:core_node1 x:collection1] o.a.s.r.ManagedResourceStorage Configured ZooKeeperStorageIO with znodeBase: /configs/conf1
   [junit4]   2> 526345 INFO  (coreLoadExecutor-2471-thread-1-processing-n:127.0.0.1:46397_) [n:127.0.0.1:46397_ c:control_collection s:shard1 r:core_node1 x:collection1] o.a.s.r.RestManager Initializing RestManager with initArgs: {}
   [junit4]   2> 526345 INFO  (coreLoadExecutor-2471-thread-1-processing-n:127.0.0.1:46397_) [n:127.0.0.1:46397_ c:control_collection s:shard1 r:core_node1 x:collection1] o.a.s.r.ManagedResourceStorage Reading _rest_managed.json using ZooKeeperStorageIO:path=/configs/conf1
   [junit4]   2> 526345 INFO  (coreLoadExecutor-2471-thread-1-processing-n:127.0.0.1:46397_) [n:127.0.0.1:46397_ c:control_collection s:shard1 r:core_node1 x:collection1] o.a.s.r.ManagedResourceStorage No data found for znode /configs/conf1/_rest_managed.json
   [junit4]   2> 526346 INFO  (coreLoadExecutor-2471-thread-1-processing-n:127.0.0.1:46397_) [n:127.0.0.1:46397_ c:control_collection s:shard1 r:core_node1 x:collection1] o.a.s.r.ManagedResourceStorage Loaded null at path _rest_managed.json using ZooKeeperStorageIO:path=/configs/conf1
   [junit4]   2> 526346 INFO  (coreLoadExecutor-2471-thread-1-processing-n:127.0.0.1:46397_) [n:127.0.0.1:46397_ c:control_collection s:shard1 r:core_node1 x:collection1] o.a.s.r.RestManager Initializing 0 registered ManagedResources
   [junit4]   2> 526346 INFO  (coreLoadExecutor-2471-thread-1-processing-n:127.0.0.1:46397_) [n:127.0.0.1:46397_ c:control_collection s:shard1 r:core_node1 x:collection1] o.a.s.h.ReplicationHandler Commits will be reserved for  10000
   [junit4]   2> 526348 INFO  (searcherExecutor-2472-thread-1-processing-n:127.0.0.1:46397_ x:collection1 s:shard1 c:control_collection r:core_node1) [n:127.0.0.1:46397_ c:control_collection s:shard1 r:core_node1 x:collection1] o.a.s.c.SolrCore [collection1] Registered new searcher Searcher@a60adb[collection1] main{ExitableDirectoryReader(UninvertingDirectoryReader())}
   [junit4]   2> 526348 INFO  (coreLoadExecutor-2471-thread-1-processing-n:127.0.0.1:46397_) [n:127.0.0.1:46397_ c:control_collection s:shard1 r:core_node1 x:collection1] o.a.s.u.UpdateLog Looking up max value of version field to seed version buckets
   [junit4]   2> 526348 INFO  (coreLoadExecutor-2471-thread-1-processing-n:127.0.0.1:46397_) [n:127.0.0.1:46397_ c:control_collection s:shard1 r:core_node1 x:collection1] o.a.s.u.VersionInfo Refreshing highest value of _version_ for 65536 version buckets from index
   [junit4]   2> 526348 INFO  (coreLoadExecutor-2471-thread-1-processing-n:127.0.0.1:46397_) [n:127.0.0.1:46397_ c:control_collection s:shard1 r:core_node1 x:collection1] o.a.s.u.VersionInfo No terms found for _version_, cannot seed version bucket highest value from index
   [junit4]   2> 526348 INFO  (coreLoadExecutor-2471-thread-1-processing-n:127.0.0.1:46397_) [n:127.0.0.1:46397_ c:control_collection s:shard1 r:core_node1 x:collection1] o.a.s.u.UpdateLog Could not find max version in index or recent updates, using new clock 1527879673523994624
   [junit4]   2> 526350 INFO  (coreLoadExecutor-2471-thread-1-processing-n:127.0.0.1:46397_) [n:127.0.0.1:46397_ c:control_collection s:shard1 r:core_node1 x:collection1] o.a.s.u.UpdateLog Took 2.0ms to seed version buckets with highest version 1527879673523994624
   [junit4]   2> 526350 INFO  (coreLoadExecutor-2471-thread-1-processing-n:127.0.0.1:46397_) [n:127.0.0.1:46397_ c:control_collection s:shard1 r:core_node1 x:collection1] o.a.s.c.ZkController watch zkdir /configs/conf1
   [junit4]   2> 526351 INFO  (coreLoadExecutor-2471-thread-1-processing-n:127.0.0.1:46397_) [n:127.0.0.1:46397_ c:control_collection s:shard1 r:core_node1 x:collection1] o.a.s.c.CoreContainer registering core: collection1
   [junit4]   2> 526352 INFO  (coreZkRegister-2465-thread-1-processing-n:127.0.0.1:46397_ x:collection1 s:shard1 c:control_collection r:core_node1) [n:127.0.0.1:46397_ c:control_collection s:shard1 r:core_node1 x:collection1] o.a.s.c.ZkController Register replica - core:collection1 address:http://127.0.0.1:46397 collection:control_collection shard:shard1
   [junit4]   2> 526352 INFO  (coreZkRegister-2465-thread-1-processing-n:127.0.0.1:46397_ x:collection1 s:shard1 c:control_collection r:core_node1) [n:127.0.0.1:46397_ c:control_collection s:shard1 r:core_node1 x:collection1] o.a.s.c.c.SolrZkClient makePath: /collections/control_collection/leader_elect/shard1/election
   [junit4]   2> 526356 INFO  (coreZkRegister-2465-thread-1-processing-n:127.0.0.1:46397_ x:collection1 s:shard1 c:control_collection r:core_node1) [n:127.0.0.1:46397_ c:control_collection s:shard1 r:core_node1 x:collection1] o.a.s.c.LeaderElector Joined leadership election with path: /collections/control_collection/leader_elect/shard1/election/95492479487967236-core_node1-n_0000000000
   [junit4]   2> 526356 INFO  (coreZkRegister-2465-thread-1-processing-n:127.0.0.1:46397_ x:collection1 s:shard1 c:control_collection r:core_node1) [n:127.0.0.1:46397_ c:control_collection s:shard1 r:core_node1 x:collection1] o.a.s.c.ShardLeaderElectionContext Running the leader process for shard=shard1 and weAreReplacement=false and leaderVoteWait=10000
   [junit4]   2> 526358 INFO  (coreZkRegister-2465-thread-1-processing-n:127.0.0.1:46397_ x:collection1 s:shard1 c:control_collection r:core_node1) [n:127.0.0.1:46397_ c:control_collection s:shard1 r:core_node1 x:collection1] o.a.s.c.ShardLeaderElectionContext Enough replicas found to continue.
   [junit4]   2> 526358 INFO  (coreZkRegister-2465-thread-1-processing-n:127.0.0.1:46397_ x:collection1 s:shard1 c:control_collection r:core_node1) [n:127.0.0.1:46397_ c:control_collection s:shard1 r:core_node1 x:collection1] o.a.s.c.ShardLeaderElectionContext I may be the new leader - try and sync
   [junit4]   2> 526358 INFO  (coreZkRegister-2465-thread-1-processing-n:127.0.0.1:46397_ x:collection1 s:shard1 c:control_collection r:core_node1) [n:127.0.0.1:46397_ c:control_collection s:shard1 r:core_node1 x:collection1] o.a.s.c.SyncStrategy Sync replicas to http://127.0.0.1:46397/collection1/
   [junit4]   2> 526358 INFO  (coreZkRegister-2465-thread-1-processing-n:127.0.0.1:46397_ x:collection1 s:shard1 c:control_collection r:core_node1) [n:127.0.0.1:46397_ c:control_collection s:shard1 r:core_node1 x:collection1] o.a.s.c.SyncStrategy Sync Success - now sync replicas to me
   [junit4]   2> 526358 INFO  (coreZkRegister-2465-thread-1-processing-n:127.0.0.1:46397_ x:collection1 s:shard1 c:control_collection r:core_node1) [n:127.0.0.1:46397_ c:control_collection s:shard1 r:core_node1 x:collection1] o.a.s.c.SyncStrategy http://127.0.0.1:46397/collection1/ has no replicas
   [junit4]   2> 526358 INFO  (OverseerStateUpdate-95492479487967236-127.0.0.1:46397_-n_0000000000) [n:127.0.0.1:46397_    ] o.a.s.c.Overseer processMessage: queueSize: 1, message = {
   [junit4]   2>   "operation":"leader",
   [junit4]   2>   "shard":"shard1",
   [junit4]   2>   "collection":"control_collection"} current state version: 1
   [junit4]   2> 526359 INFO  (coreZkRegister-2465-thread-1-processing-n:127.0.0.1:46397_ x:collection1 s:shard1 c:control_collection r:core_node1) [n:127.0.0.1:46397_ c:control_collection s:shard1 r:core_node1 x:collection1] o.a.s.c.c.SolrZkClient makePath: /collections/control_collection/leaders/shard1
   [junit4]   2> 526362 INFO  (coreZkRegister-2465-thread-1-processing-n:127.0.0.1:46397_ x:collection1 s:shard1 c:control_collection r:core_node1) [n:127.0.0.1:46397_ c:control_collection s:shard1 r:core_node1 x:collection1] o.a.s.c.ShardLeaderElectionContextBase Creating leader registration node /collections/control_collection/leaders/shard1/leader after winning as /collections/control_collection/leader_elect/shard1/election/95492479487967236-core_node1-n_0000000000
   [junit4]   2> 526365 INFO  (coreZkRegister-2465-thread-1-processing-n:127.0.0.1:46397_ x:collection1 s:shard1 c:control_collection r:core_node1) [n:127.0.0.1:46397_ c:control_collection s:shard1 r:core_node1 x:collection1] o.a.s.c.ShardLeaderElectionContext I am the new leader: http://127.0.0.1:46397/collection1/ shard1
   [junit4]   2> 526366 INFO  (OverseerStateUpdate-95492479487967236-127.0.0.1:46397_-n_0000000000) [n:127.0.0.1:46397_    ] o.a.s.c.Overseer processMessage: queueSize: 1, message = {
   [junit4]   2>   "operation":"leader",
   [junit4]   2>   "shard":"shard1",
   [junit4]   2>   "collection":"control_collection",
   [junit4]   2>   "base_url":"http://127.0.0.1:46397",
   [junit4]   2>   "core":"collection1",
   [junit4]   2>   "state":"active"} current state version: 1
   [junit4]   2> 526468 INFO  (zkCallback-676-thread-1-processing-n:127.0.0.1:46397_) [n:127.0.0.1:46397_    ] o.a.s.c.c.ZkStateReader A cluster state change: [WatchedEvent state:SyncConnected type:NodeDataChanged path:/clusterstate.json], has occurred - updating... (live nodes size: [1])
   [junit4]   2> 526516 INFO  (coreZkRegister-2465-thread-1-processing-n:127.0.0.1:46397_ x:collection1 s:shard1 c:control_collection r:core_node1) [n:127.0.0.1:46397_ c:control_collection s:shard1 r:core_node1 x:collection1] o.a.s.c.ZkController We are http://127.0.0.1:46397/collection1/ and leader is http://127.0.0.1:46397/collection1/
   [junit4]   2> 526516 INFO  (coreZkRegister-2465-thread-1-processing-n:127.0.0.1:46397_ x:collection1 s:shard1 c:control_collection r:core_node1) [n:127.0.0.1:46397_ c:control_collection s:shard1 r:core_node1 x:collection1] o.a.s.c.ZkController No LogReplay needed for core=collection1 baseURL=http://127.0.0.1:46397
   [junit4]   2> 526516 INFO  (coreZkRegister-2465-thread-1-processing-n:127.0.0.1:46397_ x:collection1 s:shard1 c:control_collection r:core_node1) [n:127.0.0.1:46397_ c:control_collection s:shard1 r:core_node1 x:collection1] o.a.s.c.ZkController I am the leader, no recovery necessary
   [junit4]   2> 526516 INFO  (coreZkRegister-2465-thread-1-processing-n:127.0.0.1:46397_ x:collection1 s:shard1 c:control_collection r:core_node1) [n:127.0.0.1:46397_ c:control_collection s:shard1 r:core_node1 x:collection1] o.a.s.c.ZkController publishing state=active
   [junit4]   2> 526516 INFO  (coreZkRegister-2465-thread-1-processing-n:127.0.0.1:46397_ x:collection1 s:shard1 c:control_collection r:core_node1) [n:127.0.0.1:46397_ c:control_collection s:shard1 r:core_node1 x:collection1] o.a.s.c.ZkController numShards not found on descriptor - reading it from system property
   [junit4]   2> 526518 INFO  (OverseerStateUpdate-95492479487967236-127.0.0.1:46397_-n_0000000000) [n:127.0.0.1:46397_    ] o.a.s.c.Overseer processMessage: queueSize: 1, message = {
   [junit4]   2>   "core":"collection1",
   [junit4]   2>   "core_node_name":"core_node1",
   [junit4]   2>   "roles":null,
   [junit4]   2>   "base_url":"http://127.0.0.1:46397",
   [junit4]   2>   "node_name":"127.0.0.1:46397_",
   [junit4]   2>   "numShards":"1",
   [junit4]   2>   "state":"active",
   [junit4]   2>   "shard":"shard1",
   [junit4]   2>   "collection":"control_collection",
   [junit4]   2>   "operation":"state"} current state version: 2
   [junit4]   2> 526519 INFO  (coreZkRegister-2465-thread-1-processing-n:127.0.0.1:46397_ x:collection1 s:shard1 c:control_collection r:core_node1) [n:127.0.0.1:46397_ c:control_collection s:shard1 r:core_node1 x:collection1] o.a.s.c.c.ZkStateReader Updated live nodes from ZooKeeper... (1) -> (1)
   [junit4]   2> 526519 INFO  (OverseerStateUpdate-95492479487967236-127.0.0.1:46397_-n_0000000000) [n:127.0.0.1:46397_    ] o.a.s.c.o.ReplicaMutator Update state numShards=1 message={
   [junit4]   2>   "core":"collection1",
   [junit4]   2>   "core_node_name":"core_node1",
   [junit4]   2>   "roles":null,
   [junit4]   2>   "base_url":"http://127.0.0.1:46397",
   [junit4]   2>   "node_name":"127.0.0.1:46397_",
   [junit4]   2>   "numShards":"1",
   [junit4]   2>   "state":"active",
   [junit4]   2>   "shard":"shard1",
   [junit4]   2>   "collection":"control_collection",
   [junit4]   2>   "operation":"state"}
   [junit4]   2> 526581 INFO  (TEST-CollectionTooManyReplicasTest.testAddTooManyReplicas-seed#[EDF3CF085726CE2A]) [    ] o.a.s.c.c.SolrZkClient Using default ZkCredentialsProvider
   [junit4]   2> 526582 INFO  (TEST-CollectionTooManyReplicasTest.testAddTooManyReplicas-seed#[EDF3CF085726CE2A]) [    ] o.a.s.c.c.ConnectionManager Waiting for client to connect to ZooKeeper
   [junit4]   2> 526584 INFO  (zkCallback-678-thread-1) [    ] o.a.s.c.c.ConnectionManager Watcher org.apache.solr.common.cloud.ConnectionManager@6c17c name:ZooKeeperConnection Watcher:127.0.0.1:52046/solr got event WatchedEvent state:SyncConnected type:None path:null path:null type:None
   [junit4]   2> 526584 INFO  (TEST-CollectionTooManyReplicasTest.testAddTooManyReplicas-seed#[EDF3CF085726CE2A]) [    ] o.a.s.c.c.ConnectionManager Client is connected to ZooKeeper
   [junit4]   2> 526584 INFO  (TEST-CollectionTooManyReplicasTest.testAddTooManyReplicas-seed#[EDF3CF085726CE2A]) [    ] o.a.s.c.c.SolrZkClient Using default ZkACLProvider
   [junit4]   2> 526584 INFO  (TEST-CollectionTooManyReplicasTest.testAddTooManyReplicas-seed#[EDF3CF085726CE2A]) [    ] o.a.s.c.c.ZkStateReader Updating cluster state from ZooKeeper... 
   [junit4]   2> 526585 INFO  (TEST-CollectionTooManyReplicasTest.testAddTooManyReplicas-seed#[EDF3CF085726CE2A]) [    ] o.a.s.c.c.ZkStateReader Updated live nodes from ZooKeeper... (0) -> (1)
   [junit4]   2> 526586 INFO  (TEST-CollectionTooManyReplicasTest.testAddTooManyReplicas-seed#[EDF3CF085726CE2A]) [    ] o.a.s.c.ChaosMonkey monkey: init - expire sessions:false cause connection loss:false
   [junit4]   2> 526622 INFO  (zkCallback-676-thread-1-processing-n:127.0.0.1:46397_) [n:127.0.0.1:46397_    ] o.a.s.c.c.ZkStateReader A cluster state change: [WatchedEvent state:SyncConnected type:NodeDataChanged path:/clusterstate.json], has occurred - updating... (live nodes size: [1])
   [junit4]   2> 526622 INFO  (zkCallback-678-thread-1) [    ] o.a.s.c.c.ZkStateReader A cluster state change: [WatchedEvent state:SyncConnected type:NodeDataChanged path:/clusterstate.json], has occurred - updating... (live nodes size: [1])
   [junit4]   2> 526660 INFO  (TEST-CollectionTooManyReplicasTest.testAddTooManyReplicas-seed#[EDF3CF085726CE2A]) [    ] o.a.s.SolrTestCaseJ4 Writing core.properties file to /home/jenkins/workspace/Lucene-Solr-6.x-Linux/solr/build/solr-core/test/J0/temp/solr.cloud.CollectionTooManyReplicasTest_EDF3CF085726CE2A-001/shard-1-001/cores/collection1
   [junit4]   2> 526660 INFO  (TEST-CollectionTooManyReplicasTest.testAddTooManyReplicas-seed#[EDF3CF085726CE2A]) [    ] o.a.s.c.AbstractFullDistribZkTestBase create jetty 1 in directory /home/jenkins/workspace/Lucene-Solr-6.x-Linux/solr/build/solr-core/test/J0/temp/solr.cloud.CollectionTooManyReplicasTest_EDF3CF085726CE2A-001/shard-1-001
   [junit4]   2> 526661 INFO  (TEST-CollectionTooManyReplicasTest.testAddTooManyReplicas-seed#[EDF3CF085726CE2A]) [    ] o.e.j.s.Server jetty-9.3.6.v20151106
   [junit4]   2> 526662 INFO  (TEST-CollectionTooManyReplicasTest.testAddTooManyReplicas-seed#[EDF3CF085726CE2A]) [    ] o.e.j.s.h.ContextHandler Started o.e.j.s.ServletContextHandler@a8b0f6{/,null,AVAILABLE}
   [junit4]   2> 526663 INFO  (TEST-CollectionTooManyReplicasTest.testAddTooManyReplicas-seed#[EDF3CF085726CE2A]) [    ] o.e.j.s.ServerConnector Started ServerConnector@188a595{HTTP/1.1,[http/1.1]}{127.0.0.1:45533}
   [junit4]   2> 526663 INFO  (TEST-CollectionTooManyReplicasTest.testAddTooManyReplicas-seed#[EDF3CF085726CE2A]) [    ] o.e.j.s.Server Started @527885ms
   [junit4]   2> 526663 INFO  (TEST-CollectionTooManyReplicasTest.testAddTooManyReplicas-seed#[EDF3CF085726CE2A]) [    ] o.a.s.c.s.e.JettySolrRunner Jetty properties: {solr.data.dir=/home/jenkins/workspace/Lucene-Solr-6.x-Linux/solr/build/solr-core/test/J0/temp/solr.cloud.CollectionTooManyReplicasTest_EDF3CF085726CE2A-001/tempDir-001/jetty1, solrconfig=solrconfig.xml, hostContext=/, hostPort=45533, coreRootDirectory=/home/jenkins/workspace/Lucene-Solr-6.x-Linux/solr/build/solr-core/test/J0/../../../../../../../../../home/jenkins/workspace/Lucene-Solr-6.x-Linux/solr/build/solr-core/test/J0/temp/solr.cloud.CollectionTooManyReplicasTest_EDF3CF085726CE2A-001/shard-1-001/cores}
   [junit4]   2> 526664 INFO  (TEST-CollectionTooManyReplicasTest.testAddTooManyReplicas-seed#[EDF3CF085726CE2A]) [    ] o.a.s.s.SolrDispatchFilter SolrDispatchFilter.init(): sun.misc.Launcher$AppClassLoader@1d16e93
   [junit4]   2> 526664 INFO  (TEST-CollectionTooManyReplicasTest.testAddTooManyReplicas-seed#[EDF3CF085726CE2A]) [    ] o.a.s.c.SolrResourceLoader new SolrResourceLoader for directory: '/home/jenkins/workspace/Lucene-Solr-6.x-Linux/solr/build/solr-core/test/J0/temp/solr.cloud.CollectionTooManyReplicasTest_EDF3CF085726CE2A-001/shard-1-001'
   [junit4]   2> 526664 INFO  (TEST-CollectionTooManyReplicasTest.testAddTooManyReplicas-seed#[EDF3CF085726CE2A]) [    ] o.a.s.c.SolrResourceLoader JNDI not configured for solr (NoInitialContextEx)
   [junit4]   2> 526664 INFO  (TEST-CollectionTooManyReplicasTest.testAddTooManyReplicas-seed#[EDF3CF085726CE2A]) [    ] o.a.s.c.SolrResourceLoader solr home defaulted to 'solr/' (could not find system property or JNDI)
   [junit4]   2> 526664 INFO  (TEST-CollectionTooManyReplicasTest.testAddTooManyReplicas-seed#[EDF3CF085726CE2A]) [    ] o.a.s.c.c.SolrZkClient Using default ZkCredentialsProvider
   [junit4]   2> 526665 INFO  (TEST-CollectionTooManyReplicasTest.testAddTooManyReplicas-seed#[EDF3CF085726CE2A]) [    ] o.a.s.c.c.ConnectionManager Waiting for client to connect to ZooKeeper
   [junit4]   2> 526666 INFO  (zkCallback-679-thread-1) [    ] o.a.s.c.c.ConnectionManager Watcher org.apache.solr.common.cloud.ConnectionManager@1e2f893 name:ZooKeeperConnection Watcher:127.0.0.1:52046/solr got event WatchedEvent state:SyncConnected type:None path:null path:null type:None
   [junit4]   2> 526666 INFO  (TEST-CollectionTooManyReplicasTest.testAddTooManyReplicas-seed#[EDF3CF085726CE2A]) [    ] o.a.s.c.c.ConnectionManager Client is connected to ZooKeeper
   [junit4]   2> 526668 INFO  (TEST-CollectionTooManyReplicasTest.testAddTooManyReplicas-seed#[EDF3CF085726CE2A]) [    ] o.a.s.c.c.SolrZkClient Using default ZkACLProvider
   [junit4]   2> 526669 INFO  (TEST-CollectionTooManyReplicasTest.testAddTooManyReplicas-seed#[EDF3CF085726CE2A]) [    ] o.a.s.s.SolrDispatchFilter Loading solr.xml from SolrHome (not found in ZooKeeper)
   [junit4]   2> 526669 INFO  (TEST-CollectionTooManyReplicasTest.testAddTooManyReplicas-seed#[EDF3CF085726CE2A]) [    ] o.a.s.c.SolrXmlConfig Loading container configuration from /home/jenkins/workspace/Lucene-Solr-6.x-Linux/solr/build/solr-core/test/J0/temp/solr.cloud.CollectionTooManyReplicasTest_EDF3CF085726CE2A-001/shard-1-001/solr.xml
   [junit4]   2> 526675 INFO  (TEST-CollectionTooManyReplicasTest.testAddTooManyReplicas-seed#[EDF3CF085726CE2A]) [    ] o.a.s.c.CorePropertiesLocator Config-defined core root directory: /home/jenkins/workspace/Lucene-Solr-6.x-Linux/solr/build/solr-core/test/J0/../../../../../../../../../home/jenkins/workspace/Lucene-Solr-6.x-Linux/solr/build/solr-core/test/J0/temp/solr.cloud.CollectionTooManyReplicasTest_EDF3CF085726CE2A-001/shard-1-001/cores
   [junit4]   2> 526675 INFO  (TEST-CollectionTooManyReplicasTest.testAddTooManyReplicas-seed#[EDF3CF085726CE2A]) [    ] o.a.s.c.CoreContainer New CoreContainer 28270137
   [junit4]   2> 526675 INFO  (TEST-CollectionTooManyReplicasTest.testAddTooManyReplicas-seed#[EDF3CF085726CE2A]) [    ] o.a.s.c.CoreContainer Loading cores into CoreContainer [instanceDir=/home/jenkins/workspace/Lucene-Solr-6.x-Linux/solr/build/solr-core/test/J0/temp/solr.cloud.CollectionTooManyReplicasTest_EDF3CF085726CE2A-001/shard-1-001]
   [junit4]   2> 526675 WARN  (TEST-CollectionTooManyReplicasTest.testAddTooManyReplicas-seed#[EDF3CF085726CE2A]) [    ] o.a.s.c.CoreContainer Couldn't add files from /home/jenkins/workspace/Lucene-Solr-6.x-Linux/solr/build/solr-core/test/J0/temp/solr.cloud.CollectionTooManyReplicasTest_EDF3CF085726CE2A-001/shard-1-001/lib to classpath: /home/jenkins/workspace/Lucene-Solr-6.x-Linux/solr/build/solr-core/test/J0/temp/solr.cloud.CollectionTooManyReplicasTest_EDF3CF085726CE2A-001/shard-1-001/lib
   [junit4]   2> 526675 INFO  (TEST-CollectionTooManyReplicasTest.testAddTooManyReplicas-seed#[EDF3CF085726CE2A]) [    ] o.a.s.h.c.HttpShardHandlerFactory created with socketTimeout : 90000,urlScheme : ,connTimeout : 15000,maxConnectionsPerHost : 20,maxConnections : 10000,corePoolSize : 0,maximumPoolSize : 2147483647,maxThreadIdleTime : 5,sizeOfQueue : -1,fairnessPolicy : false,useRetries : false,
   [junit4]   2> 526676 INFO  (TEST-CollectionTooManyReplicasTest.testAddTooManyReplicas-seed#[EDF3CF085726CE2A]) [    ] o.a.s.u.UpdateShardHandler Creating UpdateShardHandler HTTP client with params: socketTimeout=340000&connTimeout=45000&retry=true
   [junit4]   2> 526677 INFO  (TEST-CollectionTooManyReplicasTest.testAddTooManyReplicas-seed#[EDF3CF085726CE2A]) [    ] o.a.s.l.LogWatcher SLF4J impl is org.slf4j.impl.Log4jLoggerFactory
   [junit4]   2> 526677 INFO  (TEST-CollectionTooManyReplicasTest.testAddTooManyReplicas-seed#[EDF3CF085726CE2A]) [    ] o.a.s.l.LogWatcher Registering Log Listener [Log4j (org.slf4j.impl.Log4jLoggerFactory)]
   [junit4]   2> 526677 INFO  (TEST-CollectionTooManyReplicasTest.testAddTooManyReplicas-seed#[EDF3CF085726CE2A]) [    ] o.a.s.c.ZkContainer Zookeeper client=127.0.0.1:52046/solr
   [junit4]   2> 526677 INFO  (TEST-CollectionTooManyReplicasTest.testAddTooManyReplicas-seed#[EDF3CF085726CE2A]) [    ] o.a.s.c.ZkController zkHost includes chroot
   [junit4]   2> 526677 INFO  (TEST-CollectionTooManyReplicasTest.testAddTooManyReplicas-seed#[EDF3CF085726CE2A]) [    ] o.a.s.c.c.SolrZkClient Using default ZkCredentialsProvider
   [junit4]   2> 526678 INFO  (TEST-CollectionTooManyReplicasTest.testAddTooManyReplicas-seed#[EDF3CF085726CE2A]) [    ] o.a.s.c.c.ConnectionManager Waiting for client to connect to ZooKeeper
   [junit4]   2> 526679 INFO  (zkCallback-682-thread-1) [    ] o.a.s.c.c.ConnectionManager Watcher org.apache.solr.common.cloud.ConnectionManager@1ff4e3a name:ZooKeeperConnection Watcher:127.0.0.1:52046 got event WatchedEvent state:SyncConnected type:None path:null path:null type:None
   [junit4]   2> 526679 INFO  (TEST-CollectionTooManyReplicasTest.testAddTooManyReplicas-seed#[EDF3CF085726CE2A]) [    ] o.a.s.c.c.ConnectionManager Client is connected to ZooKeeper
   [junit4]   2> 526680 INFO  (TEST-CollectionTooManyReplicasTest.testAddTooManyReplicas-seed#[EDF3CF085726CE2A]) [    ] o.a.s.c.c.SolrZkClient Using default ZkACLProvider
   [junit4]   2> 526681 INFO  (TEST-CollectionTooManyReplicasTest.testAddTooManyReplicas-seed#[EDF3CF085726CE2A]) [n:127.0.0.1:45533_    ] o.a.s.c.c.ConnectionManager Waiting for client to connect to ZooKeeper
   [junit4]   2> 526682 INFO  (zkCallback-683-thread-1-processing-n:127.0.0.1:45533_) [n:127.0.0.1:45533_    ] o.a.s.c.c.ConnectionManager Watcher org.apache.solr.common.cloud.ConnectionManager@b13217 name:ZooKeeperConnection Watcher:127.0.0.1:52046/solr got event WatchedEvent state:SyncConnected type:None path:null path:null type:None
   [junit4]   2> 526682 INFO  (TEST-CollectionTooManyReplicasTest.testAddTooManyReplicas-seed#[EDF3CF085726CE2A]) [n:127.0.0.1:45533_    ] o.a.s.c.c.ConnectionManager Client is connected to ZooKeeper
   [junit4]   2> 526686 INFO  (TEST-CollectionTooManyReplicasTest.testAddTooManyReplicas-seed#[EDF3CF085726CE2A]) [n:127.0.0.1:45533_    ] o.a.s.c.c.ZkStateReader Updating cluster state from ZooKeeper... 
   [junit4]   2> 526687 INFO  (TEST-CollectionTooManyReplicasTest.testAddTooManyReplicas-seed#[EDF3CF085726CE2A]) [n:127.0.0.1:45533_    ] o.a.s.c.c.ZkStateReader Updated live nodes from ZooKeeper... (0) -> (1)
   [junit4]   2> 526689 INFO  (TEST-CollectionTooManyReplicasTest.testAddTooManyReplicas-seed#[EDF3CF085726CE2A]) [n:127.0.0.1:45533_    ] o.a.s.c.Overseer Overseer (id=null) closing
   [junit4]   2> 526689 INFO  (TEST-CollectionTooManyReplicasTest.testAddTooManyReplicas-seed#[EDF3CF085726CE2A]) [n:127.0.0.1:45533_    ] o.a.s.c.LeaderElector Joined leadership election with path: /overseer_elect/election/95492479487967240-127.0.0.1:45533_-n_0000000001
   [junit4]   2> 526690 INFO  (TEST-CollectionTooManyReplicasTest.testAddTooManyReplicas-seed#[EDF3CF085726CE2A]) [n:127.0.0.1:45533_    ] o.a.s.c.LeaderElector Watching path /overseer_elect/election/95492479487967236-127.0.0.1:46397_-n_0000000000 to know if I could be the leader
   [junit4]   2> 526690 INFO  (TEST-CollectionTooManyReplicasTest.testAddTooManyReplicas-seed#[EDF3CF085726CE2A]) [n:127.0.0.1:45533_    ] o.a.s.c.ZkController Publish node=127.0.0.1:45533_ as DOWN
   [junit4]   2> 526692 INFO  (OverseerStateUpdate-95492479487967236-127.0.0.1:46397_-n_0000000000) [n:127.0.0.1:46397_    ] o.a.s.c.Overseer processMessage: queueSize: 1, message = {
   [junit4]   2>   "operation":"downnode",
   [junit4]   2>   "node_name":"127.0.0.1:45533_"} current state version: 3
   [junit4]   2> 526692 INFO  (OverseerStateUpdate-95492479487967236-127.0.0.1:46397_-n_0000000000) [n:127.0.0.1:46397_    ] o.a.s.c.o.NodeMutator DownNode state invoked for node: 127.0.0.1:45533_
   [junit4]   2> 526795 INFO  (zkCallback-683-thread-1-processing-n:127.0.0.1:45533_) [n:127.0.0.1:45533_    ] o.a.s.c.c.ZkStateReader A cluster state change: [WatchedEvent state:SyncConnected type:NodeDataChanged path:/clusterstate.json], has occurred - updating... (live nodes size: [1])
   [junit4]   2> 526795 INFO  (zkCallback-678-thread-1) [    ] o.a.s.c.c.ZkStateReader A cluster state change: [WatchedEvent state:SyncConnected type:NodeDataChanged path:/clusterstate.json], has occurred - updating... (live nodes size: [1])
   [junit4]   2> 526795 INFO  (zkCallback-676-thread-1-processing-n:127.0.0.1:46397_) [n:127.0.0.1:46397_    ] o.a.s.c.c.ZkStateReader A cluster state change: [WatchedEvent state:SyncConnected type:NodeDataChanged path:/clusterstate.json], has occurred - updating... (live nodes size: [1])
   [junit4]   2> 527692 INFO  (TEST-CollectionTooManyReplicasTest.testAddTooManyReplicas-seed#[EDF3CF085726CE2A]) [n:127.0.0.1:45533_    ] o.a.s.c.ZkController Register node as live in ZooKeeper:/live_nodes/127.0.0.1:45533_
   [junit4]   2> 527693 INFO  (TEST-CollectionTooManyReplicasTest.testAddTooManyReplicas-seed#[EDF3CF085726CE2A]) [n:127.0.0.1:45533_    ] o.a.s.c.c.SolrZkClient makePath: /live_nodes/127.0.0.1:45533_
   [junit4]   2> 527694 INFO  (zkCallback-683-thread-1-processing-n:127.0.0.1:45533_) [n:127.0.0.1:45533_    ] o.a.s.c.c.ZkStateReader A live node change: [WatchedEvent state:SyncConnected type:NodeChildrenChanged path:/live_nodes], has occurred - updating... (live nodes size: [1])
   [junit4]   2> 527694 INFO  (zkCallback-676-thread-1-processing-n:127.0.0.1:46397_) [n:127.0.0.1:46397_    ] o.a.s.c.c.ZkStateReader A live node change: [WatchedEvent state:SyncConnected type:NodeChildrenChanged path:/live_nodes], has occurred - updating... (live nodes size: [1])
   [junit4]   2> 527694 INFO  (zkCallback-678-thread-1) [    ] o.a.s.c.c.ZkStateReader A live node change: [WatchedEvent state:SyncConnected type:NodeChildrenChanged path:/live_nodes], has occurred - updating... (live nodes size: [1])
   [junit4]   2> 527694 INFO  (zkCallback-676-thread-1-processing-n:127.0.0.1:46397_) [n:127.0.0.1:46397_    ] o.a.s.c.c.ZkStateReader Updated live nodes from ZooKeeper... (1) -> (2)
   [junit4]   2> 527694 INFO  (zkCallback-678-thread-1) [    ] o.a.s.c.c.ZkStateReader Updated live nodes from ZooKeeper... (1) -> (2)
   [junit4]   2> 527695 INFO  (zkCallback-683-thread-1-processing-n:127.0.0.1:45533_) [n:127.0.0.1:45533_    ] o.a.s.c.c.ZkStateReader Updated live nodes from ZooKeeper... (1) -> (2)
   [junit4]   2> 527729 INFO  (TEST-CollectionTooManyReplicasTest.testAddTooManyReplicas-seed#[EDF3CF085726CE2A]) [n:127.0.0.1:45533_    ] o.a.s.c.CoreContainer Security conf doesn't exist. Skipping setup for authorization module.
   [junit4]   2> 527730 INFO  (TEST-CollectionTooManyReplicasTest.testAddTooManyReplicas-seed#[EDF3CF085726CE2A]) [n:127.0.0.1:45533_    ] o.a.s.c.CoreContainer No authentication plugin used.
   [junit4]   2> 527730 INFO  (TEST-CollectionTooManyReplicasTest.testAddTooManyReplicas-seed#[EDF3CF085726CE2A]) [n:127.0.0.1:45533_    ] o.a.s.c.CorePropertiesLocator Looking for core definitions underneath /home/jenkins/workspace/Lucene-Solr-6.x-Linux/solr/build/solr-core/test/J0/../../../../../../../../../home/jenkins/workspace/Lucene-Solr-6.x-Linux/solr/build/solr-core/test/J0/temp/solr.cloud.CollectionTooManyReplicasTest_EDF3CF085726CE2A-001/shard-1-001/cores
   [junit4]   2> 527731 INFO  (TEST-CollectionTooManyReplicasTest.testAddTooManyReplicas-seed#[EDF3CF085726CE2A]) [n:127.0.0.1:45533_    ] o.a.s.c.CoreDescriptor Created CoreDescriptor: {name=collection1, config=solrconfig.xml, transient=false, schema=schema.xml, loadOnStartup=true, configSetProperties=configsetprops.json, collection=collection1, coreNodeName=, dataDir=data/, shard=}
   [junit4]   2> 527731 INFO  (TEST-CollectionTooManyReplicasTest.testAddTooManyReplicas-seed#[EDF3CF085726CE2A]) [n:127.0.0.1:45533_    ] o.a.s.c.CorePropertiesLocator Found core collection1 in /home/jenkins/workspace/Lucene-Solr-6.x-Linux/solr/build/solr-core/test/J0/../../../../../../../../../home/jenkins/workspace/Lucene-Solr-6.x-Linux/solr/build/solr-core/test/J0/temp/solr.cloud.CollectionTooManyReplicasTest_EDF3CF085726CE2A-001/shard-1-001/cores/collection1
   [junit4]   2> 527731 INFO  (TEST-CollectionTooManyReplicasTest.testAddTooManyReplicas-seed#[EDF3CF085726CE2A]) [n:127.0.0.1:45533_    ] o.a.s.c.CorePropertiesLocator Found 1 core definitions
   [junit4]   2> 527732 INFO  (TEST-CollectionTooManyReplicasTest.testAddTooManyReplicas-seed#[EDF3CF085726CE2A]) [n:127.0.0.1:45533_    ] o.a.s.s.SolrDispatchFilter user.dir=/home/jenkins/workspace/Lucene-Solr-6.x-Linux/solr/build/solr-core/test/J0
   [junit4]   2> 527732 INFO  (TEST-CollectionTooManyReplicasTest.testAddTooManyReplicas-seed#[EDF3CF085726CE2A]) [n:127.0.0.1:45533_    ] o.a.s.s.SolrDispatchFilter SolrDispatchFilter.init() done
   [junit4]   2> 527732 INFO  (coreLoadExecutor-2482-thread-1-processing-n:127.0.0.1:45533_) [n:127.0.0.1:45533_ c:collection1   x:collection1] o.a.s.c.ZkController publishing state=down
   [junit4]   2> 527732 INFO  (coreLoadExecutor-2482-thread-1-processing-n:127.0.0.1:45533_) [n:127.0.0.1:45533_ c:collection1   x:collection1] o.a.s.c.ZkController numShards not found on descriptor - reading it from system property
   [junit4]   2> 527734 INFO  (coreLoadExecutor-2482-thread-1-processing-n:127.0.0.1:45533_) [n:127.0.0.1:45533_ c:collection1   x:collection1] o.a.s.c.ZkController look for our core node name
   [junit4]   2> 527734 INFO  (OverseerStateUpdate-95492479487967236-127.0.0.1:46397_-n_0000000000) [n:127.0.0.1:46397_    ] o.a.s.c.Overseer processMessage: queueSize: 1, message = {
   [junit4]   2>   "core":"collection1",
   [junit4]   2>   "roles":null,
   [junit4]   2>   "base_url":"http://127.0.0.1:45533",
   [junit4]   2>   "node_name":"127.0.0.1:45533_",
   [junit4]   2>   "numShards":"1",
   [junit4]   2>   "state":"down",
   [junit4]   2>   "shard":null,
   [junit4]   2>   "collection":"collection1",
   [junit4]   2>   "operation":"state"} current state version: 4
   [junit4]   2> 527734 INFO  (OverseerStateUpdate-95492479487967236-127.0.0.1:46397_-n_0000000000) [n:127.0.0.1:46397_    ] o.a.s.c.o.ReplicaMutator Update state numShards=1 message={
   [junit4]   2>   "core":"collection1",
   [junit4]   2>   "roles":null,
   [junit4]   2>   "base_url":"http://127.0.0.1:45533",
   [junit4]   2>   "node_name":"127.0.0.1:45533_",
   [junit4]   2>   "numShards":"1",
   [junit4]   2>   "state":"down",
   [junit4]   2>   "shard":null,
   [junit4]   2>   "collection":"collection1",
   [junit4]   2>   "operation":"state"}
   [junit4]   2> 527734 INFO  (OverseerStateUpdate-95492479487967236-127.0.0.1:46397_-n_0000000000) [n:127.0.0.1:46397_    ] o.a.s.c.o.ClusterStateMutator building a new cName: collection1
   [junit4]   2> 527735 INFO  (OverseerStateUpdate-95492479487967236-127.0.0.1:46397_-n_0000000000) [n:127.0.0.1:46397_    ] o.a.s.c.o.ReplicaMutator Assigning new node to shard shard=shard1
   [junit4]   2> 527837 INFO  (zkCallback-683-thread-1-processing-n:127.0.0.1:45533_) [n:127.0.0.1:45533_    ] o.a.s.c.c.ZkStateReader A cluster state change: [WatchedEvent state:SyncConnected type:NodeDataChanged path:/clusterstate.json], has occurred - updating... (live nodes size: [2])
   [junit4]   2> 527837 INFO  (zkCallback-676-thread-1-processing-n:127.0.0.1:46397_) [n:127.0.0.1:46397_    ] o.a.s.c.c.ZkStateReader A cluster state change: [WatchedEvent state:SyncConnected type:NodeDataChanged path:/clusterstate.json], has occurred - updating... (live nodes size: [2])
   [junit4]   2> 527837 INFO  (zkCallback-678-thread-1) [    ] o.a.s.c.c.ZkStateReader A cluster state change: [WatchedEvent state:SyncConnected type:NodeDataChanged path:/clusterstate.json], has occurred - updating... (live nodes size: [2])
   [junit4]   2> 528734 INFO  (coreLoadExecutor-2482-thread-1-processing-n:127.0.0.1:45533_) [n:127.0.0.1:45533_ c:collection1   x:collection1] o.a.s.c.ZkController waiting to find shard id in clusterstate for collection1
   [junit4]   2> 528734 INFO  (coreLoadExecutor-2482-thread-1-processing-n:127.0.0.1:45533_) [n:127.0.0.1:45533_ c:collection1   x:collection1] o.a.s.c.ZkController Check for collection zkNode:collection1
   [junit4]   2> 528735 INFO  (coreLoadExecutor-2482-thread-1-processing-n:127.0.0.1:45533_) [n:127.0.0.1:45533_ c:collection1   x:collection1] o.a.s.c.ZkController Collection zkNode exists
   [junit4]   2> 528735 INFO  (coreLoadExecutor-2482-thread-1-processing-n:127.0.0.1:45533_) [n:127.0.0.1:45533_ c:collection1   x:collection1] o.a.s.c.c.ZkStateReader Load collection config from: [/collections/collection1]
   [junit4]   2> 528736 INFO  (coreLoadExecutor-2482-thread-1-processing-n:127.0.0.1:45533_) [n:127.0.0.1:45533_ c:collection1   x:collection1] o.a.s.c.c.ZkStateReader path=[/collections/collection1] [configName]=[conf1] specified config exists in ZooKeeper
   [junit4]   2> 528736 INFO  (coreLoadExecutor-2482-thread-1-processing-n:127.0.0.1:45533_) [n:127.0.0.1:45533_ c:collection1   x:collection1] o.a.s.c.SolrResourceLoader new SolrResourceLoader for directory: '/home/jenkins/workspace/Lucene-Solr-6.x-Linux/solr/build/solr-core/test/J0/temp/solr.cloud.CollectionTooManyReplicasTest_EDF3CF085726CE2A-001/shard-1-001/cores/collection1'
   [junit4]   2> 528736 INFO  (coreLoadExecutor-2482-thread-1-processing-n:127.0.0.1:45533_) [n:127.0.0.1:45533_ c:collection1   x:collection1] o.a.s.c.SolrResourceLoader JNDI not configured for solr (NoInitialContextEx)
   [junit4]   2> 528736 INFO  (coreLoadExecutor-2482-thread-1-processing-n:127.0.0.1:45533_) [n:127.0.0.1:45533_ c:collection1   x:collection1] o.a.s.c.SolrResourceLoader solr home defaulted to 'solr/' (could not find system property or JNDI)
   [junit4]   2> 528737 INFO  (coreLoadExecutor-2482-thread-1-processing-n:127.0.0.1:45533_) [n:127.0.0.1:45533_ c:collection1   x:collection1] o.a.s.c.Config loaded config solrconfig.xml with version 0 
   [junit4]   2> 528742 INFO  (coreLoadExecutor-2482-thread-1-processing-n:127.0.0.1:45533_) [n:127.0.0.1:45533_ c:collection1   x:collection1] o.a.s.c.SolrConfig current version of requestparams : -1
   [junit4]   2> 528748 INFO  (coreLoadExecutor-2482-thread-1-processing-n:127.0.0.1:45533_) [n:127.0.0.1:45533_ c:collection1   x:collection1] o.a.s.c.SolrConfig Using Lucene MatchVersion: 6.1.0
   [junit4]   2> 528761 INFO  (coreLoadExecutor-2482-thread-1-processing-n:127.0.0.1:45533_) [n:127.0.0.1:45533_ c:collection1   x:collection1] o.a.s.c.SolrConfig Loaded SolrConfig: solrconfig.xml
   [junit4]   2> 528771 INFO  (coreLoadExecutor-2482-thread-1-processing-n:127.0.0.1:45533_) [n:127.0.0.1:45533_ c:collection1   x:collection1] o.a.s.s.IndexSchema [collection1] Schema name=test
   [junit4]   2> 528919 INFO  (coreLoadExecutor-2482-thread-1-processing-n:127.0.0.1:45533_) [n:127.0.0.1:45533_ c:collection1   x:collection1] o.a.s.s.OpenExchangeRatesOrgProvider Initialized with rates=open-exchange-rates.json, refreshInterval=1440.
   [junit4]   2> 528927 INFO  (coreLoadExecutor-2482-thread-1-processing-n:127.0.0.1:45533_) [n:127.0.0.1:45533_ c:collection1   x:collection1] o.a.s.s.IndexSchema default search field in schema is text
   [junit4]   2> 528928 INFO  (coreLoadExecutor-2482-thread-1-processing-n:127.0.0.1:45533_) [n:127.0.0.1:45533_ c:collection1   x:collection1] o.a.s.s.IndexSchema unique key field: id
   [junit4]   2> 528938 INFO  (coreLoadExecutor-2482-thread-1-processing-n:127.0.0.1:45533_) [n:127.0.0.1:45533_ c:collection1   x:collection1] o.a.s.s.FileExchangeRateProvider Reloading exchange rates from file currency.xml
   [junit4]   2> 528941 INFO  (coreLoadExecutor-2482-thread-1-processing-n:127.0.0.1:45533_) [n:127.0.0.1:45533_ c:collection1   x:collection1] o.a.s.s.FileExchangeRateProvider Reloading exchange rates from file currency.xml
   [junit4]   2> 528943 INFO  (coreLoadExecutor-2482-thread-1-processing-n:127.0.0.1:45533_) [n:127.0.0.1:45533_ c:collection1   x:collection1] o.a.s.s.OpenExchangeRatesOrgProvider Reloading exchange rates from open-exchange-rates.json
   [junit4]   2> 528944 INFO  (coreLoadExecutor-2482-thread-1-processing-n:127.0.0.1:45533_) [n:127.0.0.1:45533_ c:collection1   x:collection1] o.a.s.s.OpenExchangeRatesOrgProvider Reloading exchange rates from open-exchange-rates.json
   [junit4]   2> 528945 INFO  (coreLoadExe

[...truncated too long message...]

ionTooManyReplicasTest_EDF3CF085726CE2A-001/shard-2-002/cores/collection1/data/index;done=false>>]
   [junit4]   2> 596412 INFO  (zkCallback-729-thread-1-processing-n:127.0.0.1:50137_) [n:127.0.0.1:50137_ c:collection1 s:shard1 r:core_node2 x:collection1] o.a.s.c.CachingDirectoryFactory Closing directory: /home/jenkins/workspace/Lucene-Solr-6.x-Linux/solr/build/solr-core/test/J0/../../../../../../../../../home/jenkins/workspace/Lucene-Solr-6.x-Linux/solr/build/solr-core/test/J0/temp/solr.cloud.CollectionTooManyReplicasTest_EDF3CF085726CE2A-001/shard-2-002/cores/collection1/data/index
   [junit4]   2> 596412 INFO  (zkCallback-729-thread-1-processing-n:127.0.0.1:50137_) [n:127.0.0.1:50137_ c:collection1 s:shard1 r:core_node2 x:collection1] o.a.s.c.CachingDirectoryFactory looking to close /home/jenkins/workspace/Lucene-Solr-6.x-Linux/solr/build/solr-core/test/J0/../../../../../../../../../home/jenkins/workspace/Lucene-Solr-6.x-Linux/solr/build/solr-core/test/J0/temp/solr.cloud.CollectionTooManyReplicasTest_EDF3CF085726CE2A-001/shard-2-002/cores/collection1/data [CachedDir<<refCount=0;path=/home/jenkins/workspace/Lucene-Solr-6.x-Linux/solr/build/solr-core/test/J0/../../../../../../../../../home/jenkins/workspace/Lucene-Solr-6.x-Linux/solr/build/solr-core/test/J0/temp/solr.cloud.CollectionTooManyReplicasTest_EDF3CF085726CE2A-001/shard-2-002/cores/collection1/data;done=false>>]
   [junit4]   2> 596412 INFO  (zkCallback-729-thread-1-processing-n:127.0.0.1:50137_) [n:127.0.0.1:50137_ c:collection1 s:shard1 r:core_node2 x:collection1] o.a.s.c.CachingDirectoryFactory Closing directory: /home/jenkins/workspace/Lucene-Solr-6.x-Linux/solr/build/solr-core/test/J0/../../../../../../../../../home/jenkins/workspace/Lucene-Solr-6.x-Linux/solr/build/solr-core/test/J0/temp/solr.cloud.CollectionTooManyReplicasTest_EDF3CF085726CE2A-001/shard-2-002/cores/collection1/data
   [junit4]   2> 596412 INFO  (zkCallback-729-thread-1-processing-n:127.0.0.1:50137_) [n:127.0.0.1:50137_ c:collection1 s:shard1 r:core_node2 x:collection1] o.a.s.c.ElectionContext Canceling election /collections/collection1/leader_elect/shard1/election/95492481948581899-core_node2-n_0000000001
   [junit4]   2> 596413 WARN  (zkCallback-729-thread-1-processing-n:127.0.0.1:50137_) [n:127.0.0.1:50137_ c:collection1 s:shard1 r:core_node2 x:collection1] o.a.s.c.LeaderElector 
   [junit4]   2> org.apache.zookeeper.KeeperException$SessionExpiredException: KeeperErrorCode = Session expired for /collections/collection1/leader_elect/shard1/election/95492481948581899-core_node2-n_0000000001
   [junit4]   2> 	at org.apache.zookeeper.KeeperException.create(KeeperException.java:127)
   [junit4]   2> 	at org.apache.zookeeper.KeeperException.create(KeeperException.java:51)
   [junit4]   2> 	at org.apache.zookeeper.ZooKeeper.delete(ZooKeeper.java:873)
   [junit4]   2> 	at org.apache.solr.common.cloud.SolrZkClient$2.execute(SolrZkClient.java:244)
   [junit4]   2> 	at org.apache.solr.common.cloud.SolrZkClient$2.execute(SolrZkClient.java:241)
   [junit4]   2> 	at org.apache.solr.common.cloud.ZkCmdExecutor.retryOperation(ZkCmdExecutor.java:60)
   [junit4]   2> 	at org.apache.solr.common.cloud.SolrZkClient.delete(SolrZkClient.java:241)
   [junit4]   2> 	at org.apache.solr.cloud.ElectionContext.cancelElection(ElectionContext.java:86)
   [junit4]   2> 	at org.apache.solr.cloud.ShardLeaderElectionContextBase.cancelElection(ElectionContext.java:143)
   [junit4]   2> 	at org.apache.solr.cloud.ShardLeaderElectionContext.cancelElection(ElectionContext.java:279)
   [junit4]   2> 	at org.apache.solr.cloud.ShardLeaderElectionContext.runLeaderProcess(ElectionContext.java:455)
   [junit4]   2> 	at org.apache.solr.cloud.LeaderElector.runIamLeaderProcess(LeaderElector.java:173)
   [junit4]   2> 	at org.apache.solr.cloud.LeaderElector.checkIfIamLeader(LeaderElector.java:138)
   [junit4]   2> 	at org.apache.solr.cloud.LeaderElector.access$200(LeaderElector.java:59)
   [junit4]   2> 	at org.apache.solr.cloud.LeaderElector$ElectionWatcher.process(LeaderElector.java:351)
   [junit4]   2> 	at org.apache.solr.common.cloud.SolrZkClient$3$1.run(SolrZkClient.java:269)
   [junit4]   2> 	at java.util.concurrent.Executors$RunnableAdapter.call(Executors.java:511)
   [junit4]   2> 	at java.util.concurrent.FutureTask.run(FutureTask.java:266)
   [junit4]   2> 	at org.apache.solr.common.util.ExecutorUtil$MDCAwareThreadPoolExecutor$1.run(ExecutorUtil.java:231)
   [junit4]   2> 	at java.util.concurrent.ThreadPoolExecutor.runWorker(ThreadPoolExecutor.java:1142)
   [junit4]   2> 	at java.util.concurrent.ThreadPoolExecutor$Worker.run(ThreadPoolExecutor.java:617)
   [junit4]   2> 	at java.lang.Thread.run(Thread.java:745)
   [junit4]   2> 596414 INFO  (TEST-CollectionTooManyReplicasTest.testAddShard-seed#[EDF3CF085726CE2A]) [    ] o.e.j.s.ServerConnector Stopped ServerConnector@91680f{HTTP/1.1,[http/1.1]}{127.0.0.1:0}
   [junit4]   2> 596415 INFO  (TEST-CollectionTooManyReplicasTest.testAddShard-seed#[EDF3CF085726CE2A]) [    ] o.e.j.s.h.ContextHandler Stopped o.e.j.s.ServletContextHandler@1dc6fac{/,null,UNAVAILABLE}
   [junit4]   2> 596416 INFO  (TEST-CollectionTooManyReplicasTest.testAddShard-seed#[EDF3CF085726CE2A]) [    ] o.a.s.c.ChaosMonkey monkey: stop shard! 54355
   [junit4]   2> 596416 INFO  (TEST-CollectionTooManyReplicasTest.testAddShard-seed#[EDF3CF085726CE2A]) [    ] o.a.s.c.ZkTestServer connecting to 127.0.0.1:60440 60440
   [junit4]   2> 601458 INFO  (Thread-2131) [    ] o.a.s.c.ZkTestServer connecting to 127.0.0.1:60440 60440
   [junit4]   2> 601459 WARN  (Thread-2131) [    ] o.a.s.c.ZkTestServer Watch limit violations: 
   [junit4]   2> Maximum concurrent create/delete watches above limit:
   [junit4]   2> 
   [junit4]   2> 	5	/solr/aliases.json
   [junit4]   2> 	3	/solr/security.json
   [junit4]   2> 	3	/solr/configs/conf1
   [junit4]   2> 
   [junit4]   2> Maximum concurrent data watches above limit:
   [junit4]   2> 
   [junit4]   2> 	5	/solr/clusterstate.json
   [junit4]   2> 	3	/solr/collections/TooManyReplicasWhenAddingShards/state.json
   [junit4]   2> 
   [junit4]   2> Maximum concurrent children watches above limit:
   [junit4]   2> 
   [junit4]   2> 	5	/solr/live_nodes
   [junit4]   2> 	5	/solr/collections
   [junit4]   2> 	3	/solr/overseer/queue
   [junit4]   2> 	3	/solr/overseer/collection-queue-work
   [junit4]   2> 	2	/solr/overseer/queue-work
   [junit4]   2> 
   [junit4]   2> 601460 INFO  (SUITE-CollectionTooManyReplicasTest-seed#[EDF3CF085726CE2A]-worker) [    ] o.a.s.SolrTestCaseJ4 ###deleteCore
   [junit4]   2> NOTE: leaving temporary files on disk at: /home/jenkins/workspace/Lucene-Solr-6.x-Linux/solr/build/solr-core/test/J0/temp/solr.cloud.CollectionTooManyReplicasTest_EDF3CF085726CE2A-001
   [junit4]   2> NOTE: test params are: codec=Asserting(Lucene60): {}, docValues:{}, maxPointsInLeafNode=1711, maxMBSortInHeap=6.89760161911928, sim=RandomSimilarity(queryNorm=true,coord=yes): {}, locale=mk, timezone=Europe/Paris
   [junit4]   2> NOTE: Linux 3.19.0-51-generic i386/Oracle Corporation 1.8.0_72 (32-bit)/cpus=12,threads=1,free=77674136,total=226852864
   [junit4]   2> NOTE: All tests run in this JVM: [FileBasedSpellCheckerTest, DistributedSuggestComponentTest, TestSolr4Spatial, TestCustomSort, DistributedDebugComponentTest, TestDynamicFieldCollectionResource, DistribDocExpirationUpdateProcessorTest, TestFieldResource, EchoParamsTest, AsyncCallRequestStatusResponseTest, BasicZkTest, TestFoldingMultitermQuery, TestRealTimeGet, RollingRestartTest, TestNamedUpdateProcessors, PrimUtilsTest, AnalyticsQueryTest, DistributedSpellCheckComponentTest, TestReplicationHandler, TestAtomicUpdateErrorCases, DefaultValueUpdateProcessorTest, TestExactSharedStatsCache, ZkNodePropsTest, DistributedFacetPivotLongTailTest, TestConfig, DeleteInactiveReplicaTest, TestRemoveLastDynamicCopyField, CdcrReplicationDistributedZkTest, TestConfigSetsAPIExclusivity, TestSchemaSimilarityResource, TestPseudoReturnFields, CursorPagingTest, StandardRequestHandlerTest, ReturnFieldsTest, LeaderElectionIntegrationTest, DirectoryFactoryTest, LeaderFailoverAfterPartitionTest, RequiredFieldsTest, TestTrieFacet, OverriddenZkACLAndCredentialsProvidersTest, CoreAdminCreateDiscoverTest, QueryElevationComponentTest, ZkStateReaderTest, TestManagedResourceStorage, TestTestInjection, TestPhraseSuggestions, BlockJoinFacetSimpleTest, TestObjectReleaseTracker, TestHighFrequencyDictionaryFactory, AnalysisAfterCoreReloadTest, JavabinLoaderTest, CloudExitableDirectoryReaderTest, TestBinaryField, TestSolrConfigHandler, DataDrivenBlockJoinTest, SolrRequestParserTest, TestSolrQueryParserDefaultOperatorResource, CollectionTooManyReplicasTest]
   [junit4] Completed [176/582 (1!)] on J0 in 76.78s, 3 tests, 1 failure <<< FAILURES!

[...truncated 1291 lines...]
BUILD FAILED
/home/jenkins/workspace/Lucene-Solr-6.x-Linux/build.xml:740: The following error occurred while executing this line:
/home/jenkins/workspace/Lucene-Solr-6.x-Linux/build.xml:684: The following error occurred while executing this line:
/home/jenkins/workspace/Lucene-Solr-6.x-Linux/build.xml:59: The following error occurred while executing this line:
/home/jenkins/workspace/Lucene-Solr-6.x-Linux/solr/build.xml:233: The following error occurred while executing this line:
/home/jenkins/workspace/Lucene-Solr-6.x-Linux/solr/common-build.xml:524: The following error occurred while executing this line:
/home/jenkins/workspace/Lucene-Solr-6.x-Linux/lucene/common-build.xml:1457: The following error occurred while executing this line:
/home/jenkins/workspace/Lucene-Solr-6.x-Linux/lucene/common-build.xml:1014: There were test failures: 582 suites (8 ignored), 2351 tests, 1 failure, 116 ignored (71 assumptions) [seed: EDF3CF085726CE2A]

Total time: 61 minutes 46 seconds
Build step 'Invoke Ant' marked build as failure
Archiving artifacts
[WARNINGS] Skipping publisher since build result is FAILURE
Recording test results
Email was triggered for: Failure - Any
Sending email for trigger: Failure - Any



Mime
View raw message