lucene-dev mailing list archives

Site index · List index
Message view « Date » · « Thread »
Top « Date » · « Thread »
From Policeman Jenkins Server <jenk...@thetaphi.de>
Subject [JENKINS] Lucene-Solr-6.x-Linux (32bit/jdk1.8.0_72) - Build # 94 - Still Failing!
Date Fri, 11 Mar 2016 12:04:43 GMT
Build: http://jenkins.thetaphi.de/job/Lucene-Solr-6.x-Linux/94/
Java: 32bit/jdk1.8.0_72 -client -XX:+UseG1GC

1 tests failed.
FAILED:  org.apache.solr.cloud.UnloadDistributedZkTest.test

Error Message:
Captured an uncaught exception in thread: Thread[id=8162, name=testExecutor-3704-thread-12, state=RUNNABLE, group=TGRP-UnloadDistributedZkTest]

Stack Trace:
com.carrotsearch.randomizedtesting.UncaughtExceptionError: Captured an uncaught exception in thread: Thread[id=8162, name=testExecutor-3704-thread-12, state=RUNNABLE, group=TGRP-UnloadDistributedZkTest]
Caused by: java.lang.RuntimeException: org.apache.solr.client.solrj.SolrServerException: Timeout occured while waiting response from server at: http://127.0.0.1:50600/od_ez/m
	at __randomizedtesting.SeedInfo.seed([816441844EAEA890]:0)
	at org.apache.solr.cloud.BasicDistributedZkTest.lambda$createCores$0(BasicDistributedZkTest.java:583)
	at org.apache.solr.common.util.ExecutorUtil$MDCAwareThreadPoolExecutor.lambda$execute$0(ExecutorUtil.java:229)
	at java.util.concurrent.ThreadPoolExecutor.runWorker(ThreadPoolExecutor.java:1142)
	at java.util.concurrent.ThreadPoolExecutor$Worker.run(ThreadPoolExecutor.java:617)
	at java.lang.Thread.run(Thread.java:745)
Caused by: org.apache.solr.client.solrj.SolrServerException: Timeout occured while waiting response from server at: http://127.0.0.1:50600/od_ez/m
	at org.apache.solr.client.solrj.impl.HttpSolrClient.executeMethod(HttpSolrClient.java:588)
	at org.apache.solr.client.solrj.impl.HttpSolrClient.request(HttpSolrClient.java:241)
	at org.apache.solr.client.solrj.impl.HttpSolrClient.request(HttpSolrClient.java:230)
	at org.apache.solr.client.solrj.SolrClient.request(SolrClient.java:1219)
	at org.apache.solr.cloud.BasicDistributedZkTest.lambda$createCores$0(BasicDistributedZkTest.java:581)
	... 4 more
Caused by: java.net.SocketTimeoutException: Read timed out
	at java.net.SocketInputStream.socketRead0(Native Method)
	at java.net.SocketInputStream.socketRead(SocketInputStream.java:116)
	at java.net.SocketInputStream.read(SocketInputStream.java:170)
	at java.net.SocketInputStream.read(SocketInputStream.java:141)
	at org.apache.http.impl.io.AbstractSessionInputBuffer.fillBuffer(AbstractSessionInputBuffer.java:160)
	at org.apache.http.impl.io.SocketInputBuffer.fillBuffer(SocketInputBuffer.java:84)
	at org.apache.http.impl.io.AbstractSessionInputBuffer.readLine(AbstractSessionInputBuffer.java:273)
	at org.apache.http.impl.conn.DefaultHttpResponseParser.parseHead(DefaultHttpResponseParser.java:140)
	at org.apache.http.impl.conn.DefaultHttpResponseParser.parseHead(DefaultHttpResponseParser.java:57)
	at org.apache.http.impl.io.AbstractMessageParser.parse(AbstractMessageParser.java:261)
	at org.apache.http.impl.AbstractHttpClientConnection.receiveResponseHeader(AbstractHttpClientConnection.java:283)
	at org.apache.http.impl.conn.DefaultClientConnection.receiveResponseHeader(DefaultClientConnection.java:251)
	at org.apache.http.impl.conn.ManagedClientConnectionImpl.receiveResponseHeader(ManagedClientConnectionImpl.java:197)
	at org.apache.http.protocol.HttpRequestExecutor.doReceiveResponse(HttpRequestExecutor.java:272)
	at org.apache.http.protocol.HttpRequestExecutor.execute(HttpRequestExecutor.java:124)
	at org.apache.http.impl.client.DefaultRequestDirector.tryExecute(DefaultRequestDirector.java:685)
	at org.apache.http.impl.client.DefaultRequestDirector.execute(DefaultRequestDirector.java:487)
	at org.apache.http.impl.client.AbstractHttpClient.doExecute(AbstractHttpClient.java:882)
	at org.apache.http.impl.client.CloseableHttpClient.execute(CloseableHttpClient.java:82)
	at org.apache.http.impl.client.CloseableHttpClient.execute(CloseableHttpClient.java:107)
	at org.apache.http.impl.client.CloseableHttpClient.execute(CloseableHttpClient.java:55)
	at org.apache.solr.client.solrj.impl.HttpSolrClient.executeMethod(HttpSolrClient.java:482)
	... 8 more




Build Log:
[...truncated 11422 lines...]
   [junit4] Suite: org.apache.solr.cloud.UnloadDistributedZkTest
   [junit4]   2> Creating dataDir: /home/jenkins/workspace/Lucene-Solr-6.x-Linux/solr/build/solr-core/test/J2/temp/solr.cloud.UnloadDistributedZkTest_816441844EAEA890-001/init-core-data-001
   [junit4]   2> 1057311 INFO  (SUITE-UnloadDistributedZkTest-seed#[816441844EAEA890]-worker) [    ] o.a.s.BaseDistributedSearchTestCase Setting hostContext system property: /od_ez/m
   [junit4]   2> 1057314 INFO  (TEST-UnloadDistributedZkTest.test-seed#[816441844EAEA890]) [    ] o.a.s.c.ZkTestServer STARTING ZK TEST SERVER
   [junit4]   2> 1057314 INFO  (Thread-2608) [    ] o.a.s.c.ZkTestServer client port:0.0.0.0/0.0.0.0:0
   [junit4]   2> 1057314 INFO  (Thread-2608) [    ] o.a.s.c.ZkTestServer Starting server
   [junit4]   2> 1057414 INFO  (TEST-UnloadDistributedZkTest.test-seed#[816441844EAEA890]) [    ] o.a.s.c.ZkTestServer start zk server on port:41736
   [junit4]   2> 1057415 INFO  (TEST-UnloadDistributedZkTest.test-seed#[816441844EAEA890]) [    ] o.a.s.c.c.SolrZkClient Using default ZkCredentialsProvider
   [junit4]   2> 1057415 INFO  (TEST-UnloadDistributedZkTest.test-seed#[816441844EAEA890]) [    ] o.a.s.c.c.ConnectionManager Waiting for client to connect to ZooKeeper
   [junit4]   2> 1057417 INFO  (zkCallback-1166-thread-1) [    ] o.a.s.c.c.ConnectionManager Watcher org.apache.solr.common.cloud.ConnectionManager@1662a59 name:ZooKeeperConnection Watcher:127.0.0.1:41736 got event WatchedEvent state:SyncConnected type:None path:null path:null type:None
   [junit4]   2> 1057417 INFO  (TEST-UnloadDistributedZkTest.test-seed#[816441844EAEA890]) [    ] o.a.s.c.c.ConnectionManager Client is connected to ZooKeeper
   [junit4]   2> 1057418 INFO  (TEST-UnloadDistributedZkTest.test-seed#[816441844EAEA890]) [    ] o.a.s.c.c.SolrZkClient Using default ZkACLProvider
   [junit4]   2> 1057418 INFO  (TEST-UnloadDistributedZkTest.test-seed#[816441844EAEA890]) [    ] o.a.s.c.c.SolrZkClient makePath: /solr
   [junit4]   2> 1057420 INFO  (TEST-UnloadDistributedZkTest.test-seed#[816441844EAEA890]) [    ] o.a.s.c.c.SolrZkClient Using default ZkCredentialsProvider
   [junit4]   2> 1057421 INFO  (TEST-UnloadDistributedZkTest.test-seed#[816441844EAEA890]) [    ] o.a.s.c.c.ConnectionManager Waiting for client to connect to ZooKeeper
   [junit4]   2> 1057422 INFO  (zkCallback-1167-thread-1) [    ] o.a.s.c.c.ConnectionManager Watcher org.apache.solr.common.cloud.ConnectionManager@1bb838e name:ZooKeeperConnection Watcher:127.0.0.1:41736/solr got event WatchedEvent state:SyncConnected type:None path:null path:null type:None
   [junit4]   2> 1057422 INFO  (TEST-UnloadDistributedZkTest.test-seed#[816441844EAEA890]) [    ] o.a.s.c.c.ConnectionManager Client is connected to ZooKeeper
   [junit4]   2> 1057422 INFO  (TEST-UnloadDistributedZkTest.test-seed#[816441844EAEA890]) [    ] o.a.s.c.c.SolrZkClient Using default ZkACLProvider
   [junit4]   2> 1057422 INFO  (TEST-UnloadDistributedZkTest.test-seed#[816441844EAEA890]) [    ] o.a.s.c.c.SolrZkClient makePath: /collections/collection1
   [junit4]   2> 1057424 INFO  (TEST-UnloadDistributedZkTest.test-seed#[816441844EAEA890]) [    ] o.a.s.c.c.SolrZkClient makePath: /collections/collection1/shards
   [junit4]   2> 1057425 INFO  (TEST-UnloadDistributedZkTest.test-seed#[816441844EAEA890]) [    ] o.a.s.c.c.SolrZkClient makePath: /collections/control_collection
   [junit4]   2> 1057426 INFO  (TEST-UnloadDistributedZkTest.test-seed#[816441844EAEA890]) [    ] o.a.s.c.c.SolrZkClient makePath: /collections/control_collection/shards
   [junit4]   2> 1057428 INFO  (TEST-UnloadDistributedZkTest.test-seed#[816441844EAEA890]) [    ] o.a.s.c.AbstractZkTestCase put /home/jenkins/workspace/Lucene-Solr-6.x-Linux/solr/core/src/test-files/solr/collection1/conf/solrconfig-tlog.xml to /configs/conf1/solrconfig.xml
   [junit4]   2> 1057428 INFO  (TEST-UnloadDistributedZkTest.test-seed#[816441844EAEA890]) [    ] o.a.s.c.c.SolrZkClient makePath: /configs/conf1/solrconfig.xml
   [junit4]   2> 1057430 INFO  (TEST-UnloadDistributedZkTest.test-seed#[816441844EAEA890]) [    ] o.a.s.c.AbstractZkTestCase put /home/jenkins/workspace/Lucene-Solr-6.x-Linux/solr/core/src/test-files/solr/collection1/conf/schema.xml to /configs/conf1/schema.xml
   [junit4]   2> 1057430 INFO  (TEST-UnloadDistributedZkTest.test-seed#[816441844EAEA890]) [    ] o.a.s.c.c.SolrZkClient makePath: /configs/conf1/schema.xml
   [junit4]   2> 1057431 INFO  (TEST-UnloadDistributedZkTest.test-seed#[816441844EAEA890]) [    ] o.a.s.c.AbstractZkTestCase put /home/jenkins/workspace/Lucene-Solr-6.x-Linux/solr/core/src/test-files/solr/collection1/conf/solrconfig.snippet.randomindexconfig.xml to /configs/conf1/solrconfig.snippet.randomindexconfig.xml
   [junit4]   2> 1057431 INFO  (TEST-UnloadDistributedZkTest.test-seed#[816441844EAEA890]) [    ] o.a.s.c.c.SolrZkClient makePath: /configs/conf1/solrconfig.snippet.randomindexconfig.xml
   [junit4]   2> 1057432 INFO  (TEST-UnloadDistributedZkTest.test-seed#[816441844EAEA890]) [    ] o.a.s.c.AbstractZkTestCase put /home/jenkins/workspace/Lucene-Solr-6.x-Linux/solr/core/src/test-files/solr/collection1/conf/stopwords.txt to /configs/conf1/stopwords.txt
   [junit4]   2> 1057433 INFO  (TEST-UnloadDistributedZkTest.test-seed#[816441844EAEA890]) [    ] o.a.s.c.c.SolrZkClient makePath: /configs/conf1/stopwords.txt
   [junit4]   2> 1057434 INFO  (TEST-UnloadDistributedZkTest.test-seed#[816441844EAEA890]) [    ] o.a.s.c.AbstractZkTestCase put /home/jenkins/workspace/Lucene-Solr-6.x-Linux/solr/core/src/test-files/solr/collection1/conf/protwords.txt to /configs/conf1/protwords.txt
   [junit4]   2> 1057434 INFO  (TEST-UnloadDistributedZkTest.test-seed#[816441844EAEA890]) [    ] o.a.s.c.c.SolrZkClient makePath: /configs/conf1/protwords.txt
   [junit4]   2> 1057435 INFO  (TEST-UnloadDistributedZkTest.test-seed#[816441844EAEA890]) [    ] o.a.s.c.AbstractZkTestCase put /home/jenkins/workspace/Lucene-Solr-6.x-Linux/solr/core/src/test-files/solr/collection1/conf/currency.xml to /configs/conf1/currency.xml
   [junit4]   2> 1057435 INFO  (TEST-UnloadDistributedZkTest.test-seed#[816441844EAEA890]) [    ] o.a.s.c.c.SolrZkClient makePath: /configs/conf1/currency.xml
   [junit4]   2> 1057436 INFO  (TEST-UnloadDistributedZkTest.test-seed#[816441844EAEA890]) [    ] o.a.s.c.AbstractZkTestCase put /home/jenkins/workspace/Lucene-Solr-6.x-Linux/solr/core/src/test-files/solr/collection1/conf/enumsConfig.xml to /configs/conf1/enumsConfig.xml
   [junit4]   2> 1057436 INFO  (TEST-UnloadDistributedZkTest.test-seed#[816441844EAEA890]) [    ] o.a.s.c.c.SolrZkClient makePath: /configs/conf1/enumsConfig.xml
   [junit4]   2> 1057438 INFO  (TEST-UnloadDistributedZkTest.test-seed#[816441844EAEA890]) [    ] o.a.s.c.AbstractZkTestCase put /home/jenkins/workspace/Lucene-Solr-6.x-Linux/solr/core/src/test-files/solr/collection1/conf/open-exchange-rates.json to /configs/conf1/open-exchange-rates.json
   [junit4]   2> 1057438 INFO  (TEST-UnloadDistributedZkTest.test-seed#[816441844EAEA890]) [    ] o.a.s.c.c.SolrZkClient makePath: /configs/conf1/open-exchange-rates.json
   [junit4]   2> 1057439 INFO  (TEST-UnloadDistributedZkTest.test-seed#[816441844EAEA890]) [    ] o.a.s.c.AbstractZkTestCase put /home/jenkins/workspace/Lucene-Solr-6.x-Linux/solr/core/src/test-files/solr/collection1/conf/mapping-ISOLatin1Accent.txt to /configs/conf1/mapping-ISOLatin1Accent.txt
   [junit4]   2> 1057439 INFO  (TEST-UnloadDistributedZkTest.test-seed#[816441844EAEA890]) [    ] o.a.s.c.c.SolrZkClient makePath: /configs/conf1/mapping-ISOLatin1Accent.txt
   [junit4]   2> 1057440 INFO  (TEST-UnloadDistributedZkTest.test-seed#[816441844EAEA890]) [    ] o.a.s.c.AbstractZkTestCase put /home/jenkins/workspace/Lucene-Solr-6.x-Linux/solr/core/src/test-files/solr/collection1/conf/old_synonyms.txt to /configs/conf1/old_synonyms.txt
   [junit4]   2> 1057440 INFO  (TEST-UnloadDistributedZkTest.test-seed#[816441844EAEA890]) [    ] o.a.s.c.c.SolrZkClient makePath: /configs/conf1/old_synonyms.txt
   [junit4]   2> 1057442 INFO  (TEST-UnloadDistributedZkTest.test-seed#[816441844EAEA890]) [    ] o.a.s.c.AbstractZkTestCase put /home/jenkins/workspace/Lucene-Solr-6.x-Linux/solr/core/src/test-files/solr/collection1/conf/synonyms.txt to /configs/conf1/synonyms.txt
   [junit4]   2> 1057442 INFO  (TEST-UnloadDistributedZkTest.test-seed#[816441844EAEA890]) [    ] o.a.s.c.c.SolrZkClient makePath: /configs/conf1/synonyms.txt
   [junit4]   2> 1057518 INFO  (TEST-UnloadDistributedZkTest.test-seed#[816441844EAEA890]) [    ] o.a.s.SolrTestCaseJ4 Writing core.properties file to /home/jenkins/workspace/Lucene-Solr-6.x-Linux/solr/build/solr-core/test/J2/temp/solr.cloud.UnloadDistributedZkTest_816441844EAEA890-001/control-001/cores/collection1
   [junit4]   2> 1057519 INFO  (TEST-UnloadDistributedZkTest.test-seed#[816441844EAEA890]) [    ] o.e.j.s.Server jetty-9.3.6.v20151106
   [junit4]   2> 1057520 INFO  (TEST-UnloadDistributedZkTest.test-seed#[816441844EAEA890]) [    ] o.e.j.s.h.ContextHandler Started o.e.j.s.ServletContextHandler@1f47893{/od_ez/m,null,AVAILABLE}
   [junit4]   2> 1057526 INFO  (TEST-UnloadDistributedZkTest.test-seed#[816441844EAEA890]) [    ] o.e.j.s.ServerConnector Started ServerConnector@6d2609{HTTP/1.1,[http/1.1]}{127.0.0.1:46476}
   [junit4]   2> 1057526 INFO  (TEST-UnloadDistributedZkTest.test-seed#[816441844EAEA890]) [    ] o.e.j.s.Server Started @1059023ms
   [junit4]   2> 1057526 INFO  (TEST-UnloadDistributedZkTest.test-seed#[816441844EAEA890]) [    ] o.a.s.c.s.e.JettySolrRunner Jetty properties: {solr.data.dir=/home/jenkins/workspace/Lucene-Solr-6.x-Linux/solr/build/solr-core/test/J2/temp/solr.cloud.UnloadDistributedZkTest_816441844EAEA890-001/tempDir-001/control/data, hostContext=/od_ez/m, hostPort=46476, coreRootDirectory=/home/jenkins/workspace/Lucene-Solr-6.x-Linux/solr/build/solr-core/test/J2/../../../../../../../../../home/jenkins/workspace/Lucene-Solr-6.x-Linux/solr/build/solr-core/test/J2/temp/solr.cloud.UnloadDistributedZkTest_816441844EAEA890-001/control-001/cores}
   [junit4]   2> 1057527 INFO  (TEST-UnloadDistributedZkTest.test-seed#[816441844EAEA890]) [    ] o.a.s.s.SolrDispatchFilter SolrDispatchFilter.init(): sun.misc.Launcher$AppClassLoader@1d16e93
   [junit4]   2> 1057527 INFO  (TEST-UnloadDistributedZkTest.test-seed#[816441844EAEA890]) [    ] o.a.s.c.SolrResourceLoader new SolrResourceLoader for directory: '/home/jenkins/workspace/Lucene-Solr-6.x-Linux/solr/build/solr-core/test/J2/temp/solr.cloud.UnloadDistributedZkTest_816441844EAEA890-001/control-001'
   [junit4]   2> 1057527 INFO  (TEST-UnloadDistributedZkTest.test-seed#[816441844EAEA890]) [    ] o.a.s.c.SolrResourceLoader JNDI not configured for solr (NoInitialContextEx)
   [junit4]   2> 1057527 INFO  (TEST-UnloadDistributedZkTest.test-seed#[816441844EAEA890]) [    ] o.a.s.c.SolrResourceLoader solr home defaulted to 'solr/' (could not find system property or JNDI)
   [junit4]   2> 1057527 INFO  (TEST-UnloadDistributedZkTest.test-seed#[816441844EAEA890]) [    ] o.a.s.c.c.SolrZkClient Using default ZkCredentialsProvider
   [junit4]   2> 1057528 INFO  (TEST-UnloadDistributedZkTest.test-seed#[816441844EAEA890]) [    ] o.a.s.c.c.ConnectionManager Waiting for client to connect to ZooKeeper
   [junit4]   2> 1057529 INFO  (zkCallback-1168-thread-1) [    ] o.a.s.c.c.ConnectionManager Watcher org.apache.solr.common.cloud.ConnectionManager@fa2da4 name:ZooKeeperConnection Watcher:127.0.0.1:41736/solr got event WatchedEvent state:SyncConnected type:None path:null path:null type:None
   [junit4]   2> 1057529 INFO  (TEST-UnloadDistributedZkTest.test-seed#[816441844EAEA890]) [    ] o.a.s.c.c.ConnectionManager Client is connected to ZooKeeper
   [junit4]   2> 1057530 INFO  (TEST-UnloadDistributedZkTest.test-seed#[816441844EAEA890]) [    ] o.a.s.c.c.SolrZkClient Using default ZkACLProvider
   [junit4]   2> 1057530 INFO  (TEST-UnloadDistributedZkTest.test-seed#[816441844EAEA890]) [    ] o.a.s.s.SolrDispatchFilter Loading solr.xml from SolrHome (not found in ZooKeeper)
   [junit4]   2> 1057530 INFO  (TEST-UnloadDistributedZkTest.test-seed#[816441844EAEA890]) [    ] o.a.s.c.SolrXmlConfig Loading container configuration from /home/jenkins/workspace/Lucene-Solr-6.x-Linux/solr/build/solr-core/test/J2/temp/solr.cloud.UnloadDistributedZkTest_816441844EAEA890-001/control-001/solr.xml
   [junit4]   2> 1057539 INFO  (TEST-UnloadDistributedZkTest.test-seed#[816441844EAEA890]) [    ] o.a.s.c.CorePropertiesLocator Config-defined core root directory: /home/jenkins/workspace/Lucene-Solr-6.x-Linux/solr/build/solr-core/test/J2/../../../../../../../../../home/jenkins/workspace/Lucene-Solr-6.x-Linux/solr/build/solr-core/test/J2/temp/solr.cloud.UnloadDistributedZkTest_816441844EAEA890-001/control-001/cores
   [junit4]   2> 1057539 INFO  (TEST-UnloadDistributedZkTest.test-seed#[816441844EAEA890]) [    ] o.a.s.c.CoreContainer New CoreContainer 23713815
   [junit4]   2> 1057539 INFO  (TEST-UnloadDistributedZkTest.test-seed#[816441844EAEA890]) [    ] o.a.s.c.CoreContainer Loading cores into CoreContainer [instanceDir=/home/jenkins/workspace/Lucene-Solr-6.x-Linux/solr/build/solr-core/test/J2/temp/solr.cloud.UnloadDistributedZkTest_816441844EAEA890-001/control-001]
   [junit4]   2> 1057539 WARN  (TEST-UnloadDistributedZkTest.test-seed#[816441844EAEA890]) [    ] o.a.s.c.CoreContainer Couldn't add files from /home/jenkins/workspace/Lucene-Solr-6.x-Linux/solr/build/solr-core/test/J2/temp/solr.cloud.UnloadDistributedZkTest_816441844EAEA890-001/control-001/lib to classpath: /home/jenkins/workspace/Lucene-Solr-6.x-Linux/solr/build/solr-core/test/J2/temp/solr.cloud.UnloadDistributedZkTest_816441844EAEA890-001/control-001/lib
   [junit4]   2> 1057539 INFO  (TEST-UnloadDistributedZkTest.test-seed#[816441844EAEA890]) [    ] o.a.s.h.c.HttpShardHandlerFactory created with socketTimeout : 90000,urlScheme : ,connTimeout : 15000,maxConnectionsPerHost : 20,maxConnections : 10000,corePoolSize : 0,maximumPoolSize : 2147483647,maxThreadIdleTime : 5,sizeOfQueue : -1,fairnessPolicy : false,useRetries : false,
   [junit4]   2> 1057541 INFO  (TEST-UnloadDistributedZkTest.test-seed#[816441844EAEA890]) [    ] o.a.s.u.UpdateShardHandler Creating UpdateShardHandler HTTP client with params: socketTimeout=340000&connTimeout=45000&retry=true
   [junit4]   2> 1057542 INFO  (TEST-UnloadDistributedZkTest.test-seed#[816441844EAEA890]) [    ] o.a.s.l.LogWatcher SLF4J impl is org.slf4j.impl.Log4jLoggerFactory
   [junit4]   2> 1057542 INFO  (TEST-UnloadDistributedZkTest.test-seed#[816441844EAEA890]) [    ] o.a.s.l.LogWatcher Registering Log Listener [Log4j (org.slf4j.impl.Log4jLoggerFactory)]
   [junit4]   2> 1057542 INFO  (TEST-UnloadDistributedZkTest.test-seed#[816441844EAEA890]) [    ] o.a.s.c.ZkContainer Zookeeper client=127.0.0.1:41736/solr
   [junit4]   2> 1057542 INFO  (TEST-UnloadDistributedZkTest.test-seed#[816441844EAEA890]) [    ] o.a.s.c.ZkController zkHost includes chroot
   [junit4]   2> 1057542 INFO  (TEST-UnloadDistributedZkTest.test-seed#[816441844EAEA890]) [    ] o.a.s.c.c.SolrZkClient Using default ZkCredentialsProvider
   [junit4]   2> 1057543 INFO  (TEST-UnloadDistributedZkTest.test-seed#[816441844EAEA890]) [    ] o.a.s.c.c.ConnectionManager Waiting for client to connect to ZooKeeper
   [junit4]   2> 1057544 INFO  (zkCallback-1171-thread-1) [    ] o.a.s.c.c.ConnectionManager Watcher org.apache.solr.common.cloud.ConnectionManager@15a7b78 name:ZooKeeperConnection Watcher:127.0.0.1:41736 got event WatchedEvent state:SyncConnected type:None path:null path:null type:None
   [junit4]   2> 1057544 INFO  (TEST-UnloadDistributedZkTest.test-seed#[816441844EAEA890]) [    ] o.a.s.c.c.ConnectionManager Client is connected to ZooKeeper
   [junit4]   2> 1057545 INFO  (TEST-UnloadDistributedZkTest.test-seed#[816441844EAEA890]) [    ] o.a.s.c.c.SolrZkClient Using default ZkACLProvider
   [junit4]   2> 1057546 INFO  (TEST-UnloadDistributedZkTest.test-seed#[816441844EAEA890]) [n:127.0.0.1:46476_od_ez%2Fm    ] o.a.s.c.c.ConnectionManager Waiting for client to connect to ZooKeeper
   [junit4]   2> 1057547 INFO  (zkCallback-1172-thread-1-processing-n:127.0.0.1:46476_od_ez%2Fm) [n:127.0.0.1:46476_od_ez%2Fm    ] o.a.s.c.c.ConnectionManager Watcher org.apache.solr.common.cloud.ConnectionManager@1ab3ae9 name:ZooKeeperConnection Watcher:127.0.0.1:41736/solr got event WatchedEvent state:SyncConnected type:None path:null path:null type:None
   [junit4]   2> 1057547 INFO  (TEST-UnloadDistributedZkTest.test-seed#[816441844EAEA890]) [n:127.0.0.1:46476_od_ez%2Fm    ] o.a.s.c.c.ConnectionManager Client is connected to ZooKeeper
   [junit4]   2> 1057548 INFO  (TEST-UnloadDistributedZkTest.test-seed#[816441844EAEA890]) [n:127.0.0.1:46476_od_ez%2Fm    ] o.a.s.c.c.SolrZkClient makePath: /overseer/queue
   [junit4]   2> 1057549 INFO  (TEST-UnloadDistributedZkTest.test-seed#[816441844EAEA890]) [n:127.0.0.1:46476_od_ez%2Fm    ] o.a.s.c.c.SolrZkClient makePath: /overseer/collection-queue-work
   [junit4]   2> 1057552 INFO  (TEST-UnloadDistributedZkTest.test-seed#[816441844EAEA890]) [n:127.0.0.1:46476_od_ez%2Fm    ] o.a.s.c.c.SolrZkClient makePath: /overseer/collection-map-running
   [junit4]   2> 1057553 INFO  (TEST-UnloadDistributedZkTest.test-seed#[816441844EAEA890]) [n:127.0.0.1:46476_od_ez%2Fm    ] o.a.s.c.c.SolrZkClient makePath: /overseer/collection-map-completed
   [junit4]   2> 1057554 INFO  (TEST-UnloadDistributedZkTest.test-seed#[816441844EAEA890]) [n:127.0.0.1:46476_od_ez%2Fm    ] o.a.s.c.c.SolrZkClient makePath: /overseer/collection-map-failure
   [junit4]   2> 1057555 INFO  (TEST-UnloadDistributedZkTest.test-seed#[816441844EAEA890]) [n:127.0.0.1:46476_od_ez%2Fm    ] o.a.s.c.c.SolrZkClient makePath: /live_nodes
   [junit4]   2> 1057556 INFO  (TEST-UnloadDistributedZkTest.test-seed#[816441844EAEA890]) [n:127.0.0.1:46476_od_ez%2Fm    ] o.a.s.c.c.SolrZkClient makePath: /aliases.json
   [junit4]   2> 1057557 INFO  (TEST-UnloadDistributedZkTest.test-seed#[816441844EAEA890]) [n:127.0.0.1:46476_od_ez%2Fm    ] o.a.s.c.c.SolrZkClient makePath: /clusterstate.json
   [junit4]   2> 1057558 INFO  (TEST-UnloadDistributedZkTest.test-seed#[816441844EAEA890]) [n:127.0.0.1:46476_od_ez%2Fm    ] o.a.s.c.c.SolrZkClient makePath: /security.json
   [junit4]   2> 1057558 INFO  (TEST-UnloadDistributedZkTest.test-seed#[816441844EAEA890]) [n:127.0.0.1:46476_od_ez%2Fm    ] o.a.s.c.c.ZkStateReader Updating cluster state from ZooKeeper... 
   [junit4]   2> 1057559 INFO  (TEST-UnloadDistributedZkTest.test-seed#[816441844EAEA890]) [n:127.0.0.1:46476_od_ez%2Fm    ] o.a.s.c.c.ZkStateReader Updated live nodes from ZooKeeper... (0) -> (0)
   [junit4]   2> 1057560 INFO  (TEST-UnloadDistributedZkTest.test-seed#[816441844EAEA890]) [n:127.0.0.1:46476_od_ez%2Fm    ] o.a.s.c.c.SolrZkClient makePath: /overseer_elect
   [junit4]   2> 1057561 INFO  (TEST-UnloadDistributedZkTest.test-seed#[816441844EAEA890]) [n:127.0.0.1:46476_od_ez%2Fm    ] o.a.s.c.c.SolrZkClient makePath: /overseer_elect/election
   [junit4]   2> 1057562 INFO  (TEST-UnloadDistributedZkTest.test-seed#[816441844EAEA890]) [n:127.0.0.1:46476_od_ez%2Fm    ] o.a.s.c.Overseer Overseer (id=null) closing
   [junit4]   2> 1057562 INFO  (TEST-UnloadDistributedZkTest.test-seed#[816441844EAEA890]) [n:127.0.0.1:46476_od_ez%2Fm    ] o.a.s.c.LeaderElector Joined leadership election with path: /overseer_elect/election/95531632236953604-127.0.0.1:46476_od_ez%2Fm-n_0000000000
   [junit4]   2> 1057563 INFO  (TEST-UnloadDistributedZkTest.test-seed#[816441844EAEA890]) [n:127.0.0.1:46476_od_ez%2Fm    ] o.a.s.c.OverseerElectionContext I am going to be the leader 127.0.0.1:46476_od_ez%2Fm
   [junit4]   2> 1057563 INFO  (TEST-UnloadDistributedZkTest.test-seed#[816441844EAEA890]) [n:127.0.0.1:46476_od_ez%2Fm    ] o.a.s.c.c.SolrZkClient makePath: /overseer_elect/leader
   [junit4]   2> 1057563 INFO  (TEST-UnloadDistributedZkTest.test-seed#[816441844EAEA890]) [n:127.0.0.1:46476_od_ez%2Fm    ] o.a.s.c.Overseer Overseer (id=95531632236953604-127.0.0.1:46476_od_ez%2Fm-n_0000000000) starting
   [junit4]   2> 1057564 INFO  (TEST-UnloadDistributedZkTest.test-seed#[816441844EAEA890]) [n:127.0.0.1:46476_od_ez%2Fm    ] o.a.s.c.c.SolrZkClient makePath: /overseer/queue-work
   [junit4]   2> 1057568 INFO  (TEST-UnloadDistributedZkTest.test-seed#[816441844EAEA890]) [n:127.0.0.1:46476_od_ez%2Fm    ] o.a.s.c.OverseerAutoReplicaFailoverThread Starting OverseerAutoReplicaFailoverThread autoReplicaFailoverWorkLoopDelay=10000 autoReplicaFailoverWaitAfterExpiration=10000 autoReplicaFailoverBadNodeExpiration=60000
   [junit4]   2> 1057568 INFO  (OverseerCollectionConfigSetProcessor-95531632236953604-127.0.0.1:46476_od_ez%2Fm-n_0000000000) [n:127.0.0.1:46476_od_ez%2Fm    ] o.a.s.c.OverseerTaskProcessor Process current queue of overseer operations
   [junit4]   2> 1057569 INFO  (TEST-UnloadDistributedZkTest.test-seed#[816441844EAEA890]) [n:127.0.0.1:46476_od_ez%2Fm    ] o.a.s.c.ZkController Register node as live in ZooKeeper:/live_nodes/127.0.0.1:46476_od_ez%2Fm
   [junit4]   2> 1057569 INFO  (OverseerStateUpdate-95531632236953604-127.0.0.1:46476_od_ez%2Fm-n_0000000000) [n:127.0.0.1:46476_od_ez%2Fm    ] o.a.s.c.Overseer Starting to work on the main queue
   [junit4]   2> 1057569 INFO  (TEST-UnloadDistributedZkTest.test-seed#[816441844EAEA890]) [n:127.0.0.1:46476_od_ez%2Fm    ] o.a.s.c.c.SolrZkClient makePath: /live_nodes/127.0.0.1:46476_od_ez%2Fm
   [junit4]   2> 1057570 INFO  (OverseerStateUpdate-95531632236953604-127.0.0.1:46476_od_ez%2Fm-n_0000000000) [n:127.0.0.1:46476_od_ez%2Fm    ] o.a.s.c.c.ZkStateReader Updated live nodes from ZooKeeper... (0) -> (0)
   [junit4]   2> 1057570 INFO  (zkCallback-1172-thread-1-processing-n:127.0.0.1:46476_od_ez%2Fm) [n:127.0.0.1:46476_od_ez%2Fm    ] o.a.s.c.c.ZkStateReader A live node change: [WatchedEvent state:SyncConnected type:NodeChildrenChanged path:/live_nodes], has occurred - updating... (live nodes size: [0])
   [junit4]   2> 1057570 INFO  (zkCallback-1172-thread-1-processing-n:127.0.0.1:46476_od_ez%2Fm) [n:127.0.0.1:46476_od_ez%2Fm    ] o.a.s.c.c.ZkStateReader Updated live nodes from ZooKeeper... (0) -> (1)
   [junit4]   2> 1057622 INFO  (TEST-UnloadDistributedZkTest.test-seed#[816441844EAEA890]) [n:127.0.0.1:46476_od_ez%2Fm    ] o.a.s.c.CoreContainer Security conf doesn't exist. Skipping setup for authorization module.
   [junit4]   2> 1057623 INFO  (TEST-UnloadDistributedZkTest.test-seed#[816441844EAEA890]) [n:127.0.0.1:46476_od_ez%2Fm    ] o.a.s.c.CoreContainer No authentication plugin used.
   [junit4]   2> 1057623 INFO  (TEST-UnloadDistributedZkTest.test-seed#[816441844EAEA890]) [n:127.0.0.1:46476_od_ez%2Fm    ] o.a.s.c.CorePropertiesLocator Looking for core definitions underneath /home/jenkins/workspace/Lucene-Solr-6.x-Linux/solr/build/solr-core/test/J2/../../../../../../../../../home/jenkins/workspace/Lucene-Solr-6.x-Linux/solr/build/solr-core/test/J2/temp/solr.cloud.UnloadDistributedZkTest_816441844EAEA890-001/control-001/cores
   [junit4]   2> 1057624 INFO  (TEST-UnloadDistributedZkTest.test-seed#[816441844EAEA890]) [n:127.0.0.1:46476_od_ez%2Fm    ] o.a.s.c.CoreDescriptor Created CoreDescriptor: {name=collection1, config=solrconfig.xml, transient=false, schema=schema.xml, loadOnStartup=true, configSetProperties=configsetprops.json, collection=control_collection, coreNodeName=, dataDir=data/, shard=}
   [junit4]   2> 1057624 INFO  (TEST-UnloadDistributedZkTest.test-seed#[816441844EAEA890]) [n:127.0.0.1:46476_od_ez%2Fm    ] o.a.s.c.CorePropertiesLocator Found core collection1 in /home/jenkins/workspace/Lucene-Solr-6.x-Linux/solr/build/solr-core/test/J2/../../../../../../../../../home/jenkins/workspace/Lucene-Solr-6.x-Linux/solr/build/solr-core/test/J2/temp/solr.cloud.UnloadDistributedZkTest_816441844EAEA890-001/control-001/cores/collection1
   [junit4]   2> 1057624 INFO  (TEST-UnloadDistributedZkTest.test-seed#[816441844EAEA890]) [n:127.0.0.1:46476_od_ez%2Fm    ] o.a.s.c.CorePropertiesLocator Found 1 core definitions
   [junit4]   2> 1057625 INFO  (TEST-UnloadDistributedZkTest.test-seed#[816441844EAEA890]) [n:127.0.0.1:46476_od_ez%2Fm    ] o.a.s.s.SolrDispatchFilter user.dir=/home/jenkins/workspace/Lucene-Solr-6.x-Linux/solr/build/solr-core/test/J2
   [junit4]   2> 1057625 INFO  (TEST-UnloadDistributedZkTest.test-seed#[816441844EAEA890]) [n:127.0.0.1:46476_od_ez%2Fm    ] o.a.s.s.SolrDispatchFilter SolrDispatchFilter.init() done
   [junit4]   2> 1057625 INFO  (coreLoadExecutor-3626-thread-1-processing-n:127.0.0.1:46476_od_ez%2Fm) [n:127.0.0.1:46476_od_ez%2Fm c:control_collection   x:collection1] o.a.s.c.ZkController publishing state=down
   [junit4]   2> 1057625 INFO  (coreLoadExecutor-3626-thread-1-processing-n:127.0.0.1:46476_od_ez%2Fm) [n:127.0.0.1:46476_od_ez%2Fm c:control_collection   x:collection1] o.a.s.c.ZkController numShards not found on descriptor - reading it from system property
   [junit4]   2> 1057627 INFO  (coreLoadExecutor-3626-thread-1-processing-n:127.0.0.1:46476_od_ez%2Fm) [n:127.0.0.1:46476_od_ez%2Fm c:control_collection   x:collection1] o.a.s.c.ZkController look for our core node name
   [junit4]   2> 1057627 INFO  (OverseerStateUpdate-95531632236953604-127.0.0.1:46476_od_ez%2Fm-n_0000000000) [n:127.0.0.1:46476_od_ez%2Fm    ] o.a.s.c.Overseer processMessage: queueSize: 1, message = {
   [junit4]   2>   "core":"collection1",
   [junit4]   2>   "roles":null,
   [junit4]   2>   "base_url":"http://127.0.0.1:46476/od_ez/m",
   [junit4]   2>   "node_name":"127.0.0.1:46476_od_ez%2Fm",
   [junit4]   2>   "numShards":"1",
   [junit4]   2>   "state":"down",
   [junit4]   2>   "shard":null,
   [junit4]   2>   "collection":"control_collection",
   [junit4]   2>   "operation":"state"} current state version: 0
   [junit4]   2> 1057627 INFO  (OverseerStateUpdate-95531632236953604-127.0.0.1:46476_od_ez%2Fm-n_0000000000) [n:127.0.0.1:46476_od_ez%2Fm    ] o.a.s.c.o.ReplicaMutator Update state numShards=1 message={
   [junit4]   2>   "core":"collection1",
   [junit4]   2>   "roles":null,
   [junit4]   2>   "base_url":"http://127.0.0.1:46476/od_ez/m",
   [junit4]   2>   "node_name":"127.0.0.1:46476_od_ez%2Fm",
   [junit4]   2>   "numShards":"1",
   [junit4]   2>   "state":"down",
   [junit4]   2>   "shard":null,
   [junit4]   2>   "collection":"control_collection",
   [junit4]   2>   "operation":"state"}
   [junit4]   2> 1057628 INFO  (OverseerStateUpdate-95531632236953604-127.0.0.1:46476_od_ez%2Fm-n_0000000000) [n:127.0.0.1:46476_od_ez%2Fm    ] o.a.s.c.o.ClusterStateMutator building a new cName: control_collection
   [junit4]   2> 1057628 INFO  (OverseerStateUpdate-95531632236953604-127.0.0.1:46476_od_ez%2Fm-n_0000000000) [n:127.0.0.1:46476_od_ez%2Fm    ] o.a.s.c.o.ReplicaMutator Assigning new node to shard shard=shard1
   [junit4]   2> 1057630 INFO  (zkCallback-1172-thread-1-processing-n:127.0.0.1:46476_od_ez%2Fm) [n:127.0.0.1:46476_od_ez%2Fm    ] o.a.s.c.c.ZkStateReader A cluster state change: [WatchedEvent state:SyncConnected type:NodeDataChanged path:/clusterstate.json], has occurred - updating... (live nodes size: [1])
   [junit4]   2> 1058627 INFO  (coreLoadExecutor-3626-thread-1-processing-n:127.0.0.1:46476_od_ez%2Fm) [n:127.0.0.1:46476_od_ez%2Fm c:control_collection   x:collection1] o.a.s.c.ZkController waiting to find shard id in clusterstate for collection1
   [junit4]   2> 1058627 INFO  (coreLoadExecutor-3626-thread-1-processing-n:127.0.0.1:46476_od_ez%2Fm) [n:127.0.0.1:46476_od_ez%2Fm c:control_collection   x:collection1] o.a.s.c.ZkController Check for collection zkNode:control_collection
   [junit4]   2> 1058628 INFO  (coreLoadExecutor-3626-thread-1-processing-n:127.0.0.1:46476_od_ez%2Fm) [n:127.0.0.1:46476_od_ez%2Fm c:control_collection   x:collection1] o.a.s.c.ZkController Collection zkNode exists
   [junit4]   2> 1058628 INFO  (coreLoadExecutor-3626-thread-1-processing-n:127.0.0.1:46476_od_ez%2Fm) [n:127.0.0.1:46476_od_ez%2Fm c:control_collection   x:collection1] o.a.s.c.c.ZkStateReader Load collection config from: [/collections/control_collection]
   [junit4]   2> 1058628 INFO  (coreLoadExecutor-3626-thread-1-processing-n:127.0.0.1:46476_od_ez%2Fm) [n:127.0.0.1:46476_od_ez%2Fm c:control_collection   x:collection1] o.a.s.c.c.ZkStateReader path=[/collections/control_collection] [configName]=[conf1] specified config exists in ZooKeeper
   [junit4]   2> 1058628 INFO  (coreLoadExecutor-3626-thread-1-processing-n:127.0.0.1:46476_od_ez%2Fm) [n:127.0.0.1:46476_od_ez%2Fm c:control_collection   x:collection1] o.a.s.c.SolrResourceLoader new SolrResourceLoader for directory: '/home/jenkins/workspace/Lucene-Solr-6.x-Linux/solr/build/solr-core/test/J2/temp/solr.cloud.UnloadDistributedZkTest_816441844EAEA890-001/control-001/cores/collection1'
   [junit4]   2> 1058628 INFO  (coreLoadExecutor-3626-thread-1-processing-n:127.0.0.1:46476_od_ez%2Fm) [n:127.0.0.1:46476_od_ez%2Fm c:control_collection   x:collection1] o.a.s.c.SolrResourceLoader JNDI not configured for solr (NoInitialContextEx)
   [junit4]   2> 1058629 INFO  (coreLoadExecutor-3626-thread-1-processing-n:127.0.0.1:46476_od_ez%2Fm) [n:127.0.0.1:46476_od_ez%2Fm c:control_collection   x:collection1] o.a.s.c.SolrResourceLoader solr home defaulted to 'solr/' (could not find system property or JNDI)
   [junit4]   2> 1058630 INFO  (coreLoadExecutor-3626-thread-1-processing-n:127.0.0.1:46476_od_ez%2Fm) [n:127.0.0.1:46476_od_ez%2Fm c:control_collection   x:collection1] o.a.s.c.Config loaded config solrconfig.xml with version 0 
   [junit4]   2> 1058635 INFO  (coreLoadExecutor-3626-thread-1-processing-n:127.0.0.1:46476_od_ez%2Fm) [n:127.0.0.1:46476_od_ez%2Fm c:control_collection   x:collection1] o.a.s.c.SolrConfig current version of requestparams : -1
   [junit4]   2> 1058638 WARN  (coreLoadExecutor-3626-thread-1-processing-n:127.0.0.1:46476_od_ez%2Fm) [n:127.0.0.1:46476_od_ez%2Fm c:control_collection   x:collection1] o.a.s.c.Config Beginning with Solr 5.5, <mergePolicy> is deprecated, use <mergePolicyFactory> instead.
   [junit4]   2> 1058639 INFO  (coreLoadExecutor-3626-thread-1-processing-n:127.0.0.1:46476_od_ez%2Fm) [n:127.0.0.1:46476_od_ez%2Fm c:control_collection   x:collection1] o.a.s.c.SolrConfig Using Lucene MatchVersion: 6.1.0
   [junit4]   2> 1058647 INFO  (coreLoadExecutor-3626-thread-1-processing-n:127.0.0.1:46476_od_ez%2Fm) [n:127.0.0.1:46476_od_ez%2Fm c:control_collection   x:collection1] o.a.s.c.SolrConfig Loaded SolrConfig: solrconfig.xml
   [junit4]   2> 1058655 INFO  (coreLoadExecutor-3626-thread-1-processing-n:127.0.0.1:46476_od_ez%2Fm) [n:127.0.0.1:46476_od_ez%2Fm c:control_collection   x:collection1] o.a.s.s.IndexSchema [collection1] Schema name=test
   [junit4]   2> 1058737 INFO  (coreLoadExecutor-3626-thread-1-processing-n:127.0.0.1:46476_od_ez%2Fm) [n:127.0.0.1:46476_od_ez%2Fm c:control_collection   x:collection1] o.a.s.s.OpenExchangeRatesOrgProvider Initialized with rates=open-exchange-rates.json, refreshInterval=1440.
   [junit4]   2> 1058743 INFO  (coreLoadExecutor-3626-thread-1-processing-n:127.0.0.1:46476_od_ez%2Fm) [n:127.0.0.1:46476_od_ez%2Fm c:control_collection   x:collection1] o.a.s.s.IndexSchema default search field in schema is text
   [junit4]   2> 1058744 INFO  (coreLoadExecutor-3626-thread-1-processing-n:127.0.0.1:46476_od_ez%2Fm) [n:127.0.0.1:46476_od_ez%2Fm c:control_collection   x:collection1] o.a.s.s.IndexSchema unique key field: id
   [junit4]   2> 1058750 INFO  (coreLoadExecutor-3626-thread-1-processing-n:127.0.0.1:46476_od_ez%2Fm) [n:127.0.0.1:46476_od_ez%2Fm c:control_collection   x:collection1] o.a.s.s.FileExchangeRateProvider Reloading exchange rates from file currency.xml
   [junit4]   2> 1058752 INFO  (coreLoadExecutor-3626-thread-1-processing-n:127.0.0.1:46476_od_ez%2Fm) [n:127.0.0.1:46476_od_ez%2Fm c:control_collection   x:collection1] o.a.s.s.FileExchangeRateProvider Reloading exchange rates from file currency.xml
   [junit4]   2> 1058754 INFO  (coreLoadExecutor-3626-thread-1-processing-n:127.0.0.1:46476_od_ez%2Fm) [n:127.0.0.1:46476_od_ez%2Fm c:control_collection   x:collection1] o.a.s.s.OpenExchangeRatesOrgProvider Reloading exchange rates from open-exchange-rates.json
   [junit4]   2> 1058754 INFO  (coreLoadExecutor-3626-thread-1-processing-n:127.0.0.1:46476_od_ez%2Fm) [n:127.0.0.1:46476_od_ez%2Fm c:control_collection   x:collection1] o.a.s.s.OpenExchangeRatesOrgProvider Reloading exchange rates from open-exchange-rates.json
   [junit4]   2> 1058755 INFO  (coreLoadExecutor-3626-thread-1-processing-n:127.0.0.1:46476_od_ez%2Fm) [n:127.0.0.1:46476_od_ez%2Fm c:control_collection   x:collection1] o.a.s.c.ConfigSetProperties Did not find ConfigSet properties, assuming default properties: Can't find resource 'configsetprops.json' in classpath or '/configs/conf1', cwd=/home/jenkins/workspace/Lucene-Solr-6.x-Linux/solr/build/solr-core/test/J2
   [junit4]   2> 1058755 INFO  (coreLoadExecutor-3626-thread-1-processing-n:127.0.0.1:46476_od_ez%2Fm) [n:127.0.0.1:46476_od_ez%2Fm c:control_collection   x:collection1] o.a.s.c.CoreContainer Creating SolrCore 'collection1' using configuration from collection control_collection
   [junit4]   2> 1058756 INFO  (coreLoadExecutor-3626-thread-1-processing-n:127.0.0.1:46476_od_ez%2Fm) [n:127.0.0.1:46476_od_ez%2Fm c:control_collection s:shard1 r:core_node1 x:collection1] o.a.s.c.SolrCore org.apache.solr.core.MockDirectoryFactory
   [junit4]   2> 1058756 INFO  (coreLoadExecutor-3626-thread-1-processing-n:127.0.0.1:46476_od_ez%2Fm) [n:127.0.0.1:46476_od_ez%2Fm c:control_collection s:shard1 r:core_node1 x:collection1] o.a.s.c.SolrCore [[collection1] ] Opening new SolrCore at [/home/jenkins/workspace/Lucene-Solr-6.x-Linux/solr/build/solr-core/test/J2/temp/solr.cloud.UnloadDistributedZkTest_816441844EAEA890-001/control-001/cores/collection1], dataDir=[/home/jenkins/workspace/Lucene-Solr-6.x-Linux/solr/build/solr-core/test/J2/../../../../../../../../../home/jenkins/workspace/Lucene-Solr-6.x-Linux/solr/build/solr-core/test/J2/temp/solr.cloud.UnloadDistributedZkTest_816441844EAEA890-001/control-001/cores/collection1/data/]
   [junit4]   2> 1058756 INFO  (coreLoadExecutor-3626-thread-1-processing-n:127.0.0.1:46476_od_ez%2Fm) [n:127.0.0.1:46476_od_ez%2Fm c:control_collection s:shard1 r:core_node1 x:collection1] o.a.s.c.JmxMonitoredMap JMX monitoring is enabled. Adding Solr mbeans to JMX Server: com.sun.jmx.mbeanserver.JmxMBeanServer@880f1
   [junit4]   2> 1058757 INFO  (coreLoadExecutor-3626-thread-1-processing-n:127.0.0.1:46476_od_ez%2Fm) [n:127.0.0.1:46476_od_ez%2Fm c:control_collection s:shard1 r:core_node1 x:collection1] o.a.s.c.CachingDirectoryFactory return new directory for /home/jenkins/workspace/Lucene-Solr-6.x-Linux/solr/build/solr-core/test/J2/../../../../../../../../../home/jenkins/workspace/Lucene-Solr-6.x-Linux/solr/build/solr-core/test/J2/temp/solr.cloud.UnloadDistributedZkTest_816441844EAEA890-001/control-001/cores/collection1/data
   [junit4]   2> 1058757 INFO  (coreLoadExecutor-3626-thread-1-processing-n:127.0.0.1:46476_od_ez%2Fm) [n:127.0.0.1:46476_od_ez%2Fm c:control_collection s:shard1 r:core_node1 x:collection1] o.a.s.c.SolrCore New index directory detected: old=null new=/home/jenkins/workspace/Lucene-Solr-6.x-Linux/solr/build/solr-core/test/J2/../../../../../../../../../home/jenkins/workspace/Lucene-Solr-6.x-Linux/solr/build/solr-core/test/J2/temp/solr.cloud.UnloadDistributedZkTest_816441844EAEA890-001/control-001/cores/collection1/data/index/
   [junit4]   2> 1058757 WARN  (coreLoadExecutor-3626-thread-1-processing-n:127.0.0.1:46476_od_ez%2Fm) [n:127.0.0.1:46476_od_ez%2Fm c:control_collection s:shard1 r:core_node1 x:collection1] o.a.s.c.SolrCore [collection1] Solr index directory '/home/jenkins/workspace/Lucene-Solr-6.x-Linux/solr/build/solr-core/test/J2/../../../../../../../../../home/jenkins/workspace/Lucene-Solr-6.x-Linux/solr/build/solr-core/test/J2/temp/solr.cloud.UnloadDistributedZkTest_816441844EAEA890-001/control-001/cores/collection1/data/index' doesn't exist. Creating new index...
   [junit4]   2> 1058757 INFO  (coreLoadExecutor-3626-thread-1-processing-n:127.0.0.1:46476_od_ez%2Fm) [n:127.0.0.1:46476_od_ez%2Fm c:control_collection s:shard1 r:core_node1 x:collection1] o.a.s.c.CachingDirectoryFactory return new directory for /home/jenkins/workspace/Lucene-Solr-6.x-Linux/solr/build/solr-core/test/J2/../../../../../../../../../home/jenkins/workspace/Lucene-Solr-6.x-Linux/solr/build/solr-core/test/J2/temp/solr.cloud.UnloadDistributedZkTest_816441844EAEA890-001/control-001/cores/collection1/data/index
   [junit4]   2> 1058758 INFO  (coreLoadExecutor-3626-thread-1-processing-n:127.0.0.1:46476_od_ez%2Fm) [n:127.0.0.1:46476_od_ez%2Fm c:control_collection s:shard1 r:core_node1 x:collection1] o.a.s.u.RandomMergePolicy RandomMergePolicy wrapping class org.apache.lucene.index.LogDocMergePolicy: [LogDocMergePolicy: minMergeSize=1000, mergeFactor=38, maxMergeSize=9223372036854775807, maxMergeSizeForForcedMerge=9223372036854775807, calibrateSizeByDeletes=false, maxMergeDocs=2147483647, maxCFSSegmentSizeMB=8.796093022207999E12, noCFSRatio=0.45107290715009174]
   [junit4]   2> 1058758 INFO  (coreLoadExecutor-3626-thread-1-processing-n:127.0.0.1:46476_od_ez%2Fm) [n:127.0.0.1:46476_od_ez%2Fm c:control_collection s:shard1 r:core_node1 x:collection1] o.a.s.c.SolrDeletionPolicy SolrDeletionPolicy.onCommit: commits: num=1
   [junit4]   2> 	commit{dir=MockDirectoryWrapper(RAMDirectory@1983bc9 lockFactory=org.apache.lucene.store.SingleInstanceLockFactory@bc5895),segFN=segments_1,generation=1}
   [junit4]   2> 1058758 INFO  (coreLoadExecutor-3626-thread-1-processing-n:127.0.0.1:46476_od_ez%2Fm) [n:127.0.0.1:46476_od_ez%2Fm c:control_collection s:shard1 r:core_node1 x:collection1] o.a.s.c.SolrDeletionPolicy newest commit generation = 1
   [junit4]   2> 1058759 INFO  (OldIndexDirectoryCleanupThreadForCore-collection1) [n:127.0.0.1:46476_od_ez%2Fm c:control_collection s:shard1 r:core_node1 x:collection1] o.a.s.c.SolrCore Looking for old index directories to cleanup for core collection1 in /home/jenkins/workspace/Lucene-Solr-6.x-Linux/solr/build/solr-core/test/J2/../../../../../../../../../home/jenkins/workspace/Lucene-Solr-6.x-Linux/solr/build/solr-core/test/J2/temp/solr.cloud.UnloadDistributedZkTest_816441844EAEA890-001/control-001/cores/collection1/data/
   [junit4]   2> 1058759 WARN  (OldIndexDirectoryCleanupThreadForCore-collection1) [n:127.0.0.1:46476_od_ez%2Fm c:control_collection s:shard1 r:core_node1 x:collection1] o.a.s.c.DirectoryFactory /home/jenkins/workspace/Lucene-Solr-6.x-Linux/solr/build/solr-core/test/J2/../../../../../../../../../home/jenkins/workspace/Lucene-Solr-6.x-Linux/solr/build/solr-core/test/J2/temp/solr.cloud.UnloadDistributedZkTest_816441844EAEA890-001/control-001/cores/collection1/data/ does not point to a valid data directory; skipping clean-up of old index directories.
   [junit4]   2> 1058762 INFO  (coreLoadExecutor-3626-thread-1-processing-n:127.0.0.1:46476_od_ez%2Fm) [n:127.0.0.1:46476_od_ez%2Fm c:control_collection s:shard1 r:core_node1 x:collection1] o.a.s.u.p.UpdateRequestProcessorChain creating updateRequestProcessorChain "nodistrib"
   [junit4]   2> 1058762 INFO  (coreLoadExecutor-3626-thread-1-processing-n:127.0.0.1:46476_od_ez%2Fm) [n:127.0.0.1:46476_od_ez%2Fm c:control_collection s:shard1 r:core_node1 x:collection1] o.a.s.u.p.UpdateRequestProcessorChain creating updateRequestProcessorChain "dedupe"
   [junit4]   2> 1058763 INFO  (coreLoadExecutor-3626-thread-1-processing-n:127.0.0.1:46476_od_ez%2Fm) [n:127.0.0.1:46476_od_ez%2Fm c:control_collection s:shard1 r:core_node1 x:collection1] o.a.s.u.p.UpdateRequestProcessorChain inserting DistributedUpdateProcessorFactory into updateRequestProcessorChain "dedupe"
   [junit4]   2> 1058763 INFO  (coreLoadExecutor-3626-thread-1-processing-n:127.0.0.1:46476_od_ez%2Fm) [n:127.0.0.1:46476_od_ez%2Fm c:control_collection s:shard1 r:core_node1 x:collection1] o.a.s.u.p.UpdateRequestProcessorChain creating updateRequestProcessorChain "stored_sig"
   [junit4]   2> 1058763 INFO  (coreLoadExecutor-3626-thread-1-processing-n:127.0.0.1:46476_od_ez%2Fm) [n:127.0.0.1:46476_od_ez%2Fm c:control_collection s:shard1 r:core_node1 x:collection1] o.a.s.u.p.UpdateRequestProcessorChain inserting DistributedUpdateProcessorFactory into updateRequestProcessorChain "stored_sig"
   [junit4]   2> 1058763 INFO  (coreLoadExecutor-3626-thread-1-processing-n:127.0.0.1:46476_od_ez%2Fm) [n:127.0.0.1:46476_od_ez%2Fm c:control_collection s:shard1 r:core_node1 x:collection1] o.a.s.u.p.UpdateRequestProcessorChain creating updateRequestProcessorChain "distrib-dup-test-chain-explicit"
   [junit4]   2> 1058763 INFO  (coreLoadExecutor-3626-thread-1-processing-n:127.0.0.1:46476_od_ez%2Fm) [n:127.0.0.1:46476_od_ez%2Fm c:control_collection s:shard1 r:core_node1 x:collection1] o.a.s.u.p.UpdateRequestProcessorChain creating updateRequestProcessorChain "distrib-dup-test-chain-implicit"
   [junit4]   2> 1058763 INFO  (coreLoadExecutor-3626-thread-1-processing-n:127.0.0.1:46476_od_ez%2Fm) [n:127.0.0.1:46476_od_ez%2Fm c:control_collection s:shard1 r:core_node1 x:collection1] o.a.s.u.p.UpdateRequestProcessorChain inserting DistributedUpdateProcessorFactory into updateRequestProcessorChain "distrib-dup-test-chain-implicit"
   [junit4]   2> 1058763 INFO  (coreLoadExecutor-3626-thread-1-processing-n:127.0.0.1:46476_od_ez%2Fm) [n:127.0.0.1:46476_od_ez%2Fm c:control_collection s:shard1 r:core_node1 x:collection1] o.a.s.c.SolrCore no updateRequestProcessorChain defined as default, creating implicit default
   [junit4]   2> 1058763 WARN  (coreLoadExecutor-3626-thread-1-processing-n:127.0.0.1:46476_od_ez%2Fm) [n:127.0.0.1:46476_od_ez%2Fm c:control_collection s:shard1 r:core_node1 x:collection1] o.a.s.c.RequestHandlers INVALID paramSet a in requestHandler {type = requestHandler,name = /dump,class = DumpRequestHandler,args = {defaults={a=A,b=B}}}
   [junit4]   2> 1058765 INFO  (coreLoadExecutor-3626-thread-1-processing-n:127.0.0.1:46476_od_ez%2Fm) [n:127.0.0.1:46476_od_ez%2Fm c:control_collection s:shard1 r:core_node1 x:collection1] o.a.s.h.l.XMLLoader xsltCacheLifetimeSeconds=60
   [junit4]   2> 1058766 INFO  (coreLoadExecutor-3626-thread-1-processing-n:127.0.0.1:46476_od_ez%2Fm) [n:127.0.0.1:46476_od_ez%2Fm c:control_collection s:shard1 r:core_node1 x:collection1] o.a.s.h.l.XMLLoader xsltCacheLifetimeSeconds=60
   [junit4]   2> 1058767 INFO  (coreLoadExecutor-3626-thread-1-processing-n:127.0.0.1:46476_od_ez%2Fm) [n:127.0.0.1:46476_od_ez%2Fm c:control_collection s:shard1 r:core_node1 x:collection1] o.a.s.h.l.XMLLoader xsltCacheLifetimeSeconds=60
   [junit4]   2> 1058768 INFO  (coreLoadExecutor-3626-thread-1-processing-n:127.0.0.1:46476_od_ez%2Fm) [n:127.0.0.1:46476_od_ez%2Fm c:control_collection s:shard1 r:core_node1 x:collection1] o.a.s.h.l.XMLLoader xsltCacheLifetimeSeconds=60
   [junit4]   2> 1058774 INFO  (coreLoadExecutor-3626-thread-1-processing-n:127.0.0.1:46476_od_ez%2Fm) [n:127.0.0.1:46476_od_ez%2Fm c:control_collection s:shard1 r:core_node1 x:collection1] o.a.s.c.RequestHandlers Registered paths: /admin/mbeans,standard,/dump,/update/csv,/sql,/update/json/docs,/admin/luke,/export,/admin/segments,/get,/admin/system,/replication,/admin/properties,/config,/stream,/schema,/admin/plugins,/admin/logging,/update/json,/admin/ping,/admin/threads,/update,/admin/file
   [junit4]   2> 1058774 INFO  (coreLoadExecutor-3626-thread-1-processing-n:127.0.0.1:46476_od_ez%2Fm) [n:127.0.0.1:46476_od_ez%2Fm c:control_collection s:shard1 r:core_node1 x:collection1] o.a.s.c.SolrCore Using default statsCache cache: org.apache.solr.search.stats.LocalStatsCache
   [junit4]   2> 1058774 INFO  (coreLoadExecutor-3626-thread-1-processing-n:127.0.0.1:46476_od_ez%2Fm) [n:127.0.0.1:46476_od_ez%2Fm c:control_collection s:shard1 r:core_node1 x:collection1] o.a.s.u.UpdateHandler Using UpdateLog implementation: org.apache.solr.update.UpdateLog
   [junit4]   2> 1058774 INFO  (coreLoadExecutor-3626-thread-1-processing-n:127.0.0.1:46476_od_ez%2Fm) [n:127.0.0.1:46476_od_ez%2Fm c:control_collection s:shard1 r:core_node1 x:collection1] o.a.s.u.UpdateLog Initializing UpdateLog: dataDir= defaultSyncLevel=FLUSH numRecordsToKeep=100 maxNumLogsToKeep=10 numVersionBuckets=65536
   [junit4]   2> 1058775 INFO  (coreLoadExecutor-3626-thread-1-processing-n:127.0.0.1:46476_od_ez%2Fm) [n:127.0.0.1:46476_od_ez%2Fm c:control_collection s:shard1 r:core_node1 x:collection1] o.a.s.u.CommitTracker Hard AutoCommit: disabled
   [junit4]   2> 1058775 INFO  (coreLoadExecutor-3626-thread-1-processing-n:127.0.0.1:46476_od_ez%2Fm) [n:127.0.0.1:46476_od_ez%2Fm c:control_collection s:shard1 r:core_node1 x:collection1] o.a.s.u.CommitTracker Soft AutoCommit: disabled
   [junit4]   2> 1058775 INFO  (coreLoadExecutor-3626-thread-1-processing-n:127.0.0.1:46476_od_ez%2Fm) [n:127.0.0.1:46476_od_ez%2Fm c:control_collection s:shard1 r:core_node1 x:collection1] o.a.s.u.RandomMergePolicy RandomMergePolicy wrapping class org.apache.lucene.index.LogByteSizeMergePolicy: [LogByteSizeMergePolicy: minMergeSize=1677721, mergeFactor=10, maxMergeSize=2147483648, maxMergeSizeForForcedMerge=9223372036854775807, calibrateSizeByDeletes=true, maxMergeDocs=2147483647, maxCFSSegmentSizeMB=8.796093022207999E12, noCFSRatio=0.7913370626641765]
   [junit4]   2> 1058776 INFO  (coreLoadExecutor-3626-thread-1-processing-n:127.0.0.1:46476_od_ez%2Fm) [n:127.0.0.1:46476_od_ez%2Fm c:control_collection s:shard1 r:core_node1 x:collection1] o.a.s.c.SolrDeletionPolicy SolrDeletionPolicy.onInit: commits: num=1
   [junit4]   2> 	commit{dir=MockDirectoryWrapper(RAMDirectory@1983bc9 lockFactory=org.apache.lucene.store.SingleInstanceLockFactory@bc5895),segFN=segments_1,generation=1}
   [junit4]   2> 1058776 INFO  (coreLoadExecutor-3626-thread-1-processing-n:127.0.0.1:46476_od_ez%2Fm) [n:127.0.0.1:46476_od_ez%2Fm c:control_collection s:shard1 r:core_node1 x:collection1] o.a.s.c.SolrDeletionPolicy newest commit generation = 1
   [junit4]   2> 1058776 INFO  (coreLoadExecutor-3626-thread-1-processing-n:127.0.0.1:46476_od_ez%2Fm) [n:127.0.0.1:46476_od_ez%2Fm c:control_collection s:shard1 r:core_node1 x:collection1] o.a.s.s.SolrIndexSearcher Opening [Searcher@16af26d[collection1] main]
   [junit4]   2> 1058776 INFO  (coreLoadExecutor-3626-thread-1-processing-n:127.0.0.1:46476_od_ez%2Fm) [n:127.0.0.1:46476_od_ez%2Fm c:control_collection s:shard1 r:core_node1 x:collection1] o.a.s.c.c.ZkStateReader Load collection config from: [/collections/control_collection]
   [junit4]   2> 1058777 INFO  (coreLoadExecutor-3626-thread-1-processing-n:127.0.0.1:46476_od_ez%2Fm) [n:127.0.0.1:46476_od_ez%2Fm c:control_collection s:shard1 r:core_node1 x:collection1] o.a.s.c.c.ZkStateReader path=[/collections/control_collection] [configName]=[conf1] specified config exists in ZooKeeper
   [junit4]   2> 1058777 INFO  (coreLoadExecutor-3626-thread-1-processing-n:127.0.0.1:46476_od_ez%2Fm) [n:127.0.0.1:46476_od_ez%2Fm c:control_collection s:shard1 r:core_node1 x:collection1] o.a.s.r.ManagedResourceStorage Setting up ZooKeeper-based storage for the RestManager with znodeBase: /configs/conf1
   [junit4]   2> 1058777 INFO  (coreLoadExecutor-3626-thread-1-processing-n:127.0.0.1:46476_od_ez%2Fm) [n:127.0.0.1:46476_od_ez%2Fm c:control_collection s:shard1 r:core_node1 x:collection1] o.a.s.r.ManagedResourceStorage Configured ZooKeeperStorageIO with znodeBase: /configs/conf1
   [junit4]   2> 1058777 INFO  (coreLoadExecutor-3626-thread-1-processing-n:127.0.0.1:46476_od_ez%2Fm) [n:127.0.0.1:46476_od_ez%2Fm c:control_collection s:shard1 r:core_node1 x:collection1] o.a.s.r.RestManager Initializing RestManager with initArgs: {}
   [junit4]   2> 1058777 INFO  (coreLoadExecutor-3626-thread-1-processing-n:127.0.0.1:46476_od_ez%2Fm) [n:127.0.0.1:46476_od_ez%2Fm c:control_collection s:shard1 r:core_node1 x:collection1] o.a.s.r.ManagedResourceStorage Reading _rest_managed.json using ZooKeeperStorageIO:path=/configs/conf1
   [junit4]   2> 1058778 INFO  (coreLoadExecutor-3626-thread-1-processing-n:127.0.0.1:46476_od_ez%2Fm) [n:127.0.0.1:46476_od_ez%2Fm c:control_collection s:shard1 r:core_node1 x:collection1] o.a.s.r.ManagedResourceStorage No data found for znode /configs/conf1/_rest_managed.json
   [junit4]   2> 1058778 INFO  (coreLoadExecutor-3626-thread-1-processing-n:127.0.0.1:46476_od_ez%2Fm) [n:127.0.0.1:46476_od_ez%2Fm c:control_collection s:shard1 r:core_node1 x:collection1] o.a.s.r.ManagedResourceStorage Loaded null at path _rest_managed.json using ZooKeeperStorageIO:path=/configs/conf1
   [junit4]   2> 1058778 INFO  (coreLoadExecutor-3626-thread-1-processing-n:127.0.0.1:46476_od_ez%2Fm) [n:127.0.0.1:46476_od_ez%2Fm c:control_collection s:shard1 r:core_node1 x:collection1] o.a.s.r.RestManager Initializing 0 registered ManagedResources
   [junit4]   2> 1058778 INFO  (coreLoadExecutor-3626-thread-1-processing-n:127.0.0.1:46476_od_ez%2Fm) [n:127.0.0.1:46476_od_ez%2Fm c:control_collection s:shard1 r:core_node1 x:collection1] o.a.s.h.ReplicationHandler Commits will be reserved for  10000
   [junit4]   2> 1058779 INFO  (searcherExecutor-3627-thread-1-processing-n:127.0.0.1:46476_od_ez%2Fm x:collection1 s:shard1 c:control_collection r:core_node1) [n:127.0.0.1:46476_od_ez%2Fm c:control_collection s:shard1 r:core_node1 x:collection1] o.a.s.c.SolrCore [collection1] Registered new searcher Searcher@16af26d[collection1] main{ExitableDirectoryReader(UninvertingDirectoryReader())}
   [junit4]   2> 1058780 INFO  (coreLoadExecutor-3626-thread-1-processing-n:127.0.0.1:46476_od_ez%2Fm) [n:127.0.0.1:46476_od_ez%2Fm c:control_collection s:shard1 r:core_node1 x:collection1] o.a.s.u.UpdateLog Looking up max value of version field to seed version buckets
   [junit4]   2> 1058780 INFO  (coreLoadExecutor-3626-thread-1-processing-n:127.0.0.1:46476_od_ez%2Fm) [n:127.0.0.1:46476_od_ez%2Fm c:control_collection s:shard1 r:core_node1 x:collection1] o.a.s.u.VersionInfo Refreshing highest value of _version_ for 65536 version buckets from index
   [junit4]   2> 1058780 INFO  (coreLoadExecutor-3626-thread-1-processing-n:127.0.0.1:46476_od_ez%2Fm) [n:127.0.0.1:46476_od_ez%2Fm c:control_collection s:shard1 r:core_node1 x:collection1] o.a.s.u.VersionInfo No terms found for _version_, cannot seed version bucket highest value from index
   [junit4]   2> 1058780 INFO  (coreLoadExecutor-3626-thread-1-processing-n:127.0.0.1:46476_od_ez%2Fm) [n:127.0.0.1:46476_od_ez%2Fm c:control_collection s:shard1 r:core_node1 x:collection1] o.a.s.u.UpdateLog Could not find max version in index or recent updates, using new clock 1528506117327421440
   [junit4]   2> 1058782 INFO  (coreLoadExecutor-3626-thread-1-processing-n:127.0.0.1:46476_od_ez%2Fm) [n:127.0.0.1:46476_od_ez%2Fm c:control_collection s:shard1 r:core_node1 x:collection1] o.a.s.u.UpdateLog Took 2.0ms to seed version buckets with highest version 1528506117327421440
   [junit4]   2> 1058782 INFO  (coreLoadExecutor-3626-thread-1-processing-n:127.0.0.1:46476_od_ez%2Fm) [n:127.0.0.1:46476_od_ez%2Fm c:control_collection s:shard1 r:core_node1 x:collection1] o.a.s.c.ZkController watch zkdir /configs/conf1
   [junit4]   2> 1058782 INFO  (coreLoadExecutor-3626-thread-1-processing-n:127.0.0.1:46476_od_ez%2Fm) [n:127.0.0.1:46476_od_ez%2Fm c:control_collection s:shard1 r:core_node1 x:collection1] o.a.s.c.CoreContainer registering core: collection1
   [junit4]   2> 1058782 INFO  (coreZkRegister-3620-thread-1-processing-n:127.0.0.1:46476_od_ez%2Fm x:collection1 s:shard1 c:control_collection r:core_node1) [n:127.0.0.1:46476_od_ez%2Fm c:control_collection s:shard1 r:core_node1 x:collection1] o.a.s.c.ZkController Register replica - core:collection1 address:http://127.0.0.1:46476/od_ez/m collection:control_collection shard:shard1
   [junit4]   2> 1058783 INFO  (coreZkRegister-3620-thread-1-processing-n:127.0.0.1:46476_od_ez%2Fm x:collection1 s:shard1 c:control_collection r:core_node1) [n:127.0.0.1:46476_od_ez%2Fm c:control_collection s:shard1 r:core_node1 x:collection1] o.a.s.c.c.SolrZkClient makePath: /collections/control_collection/leader_elect/shard1/election
   [junit4]   2> 1058785 INFO  (coreZkRegister-3620-thread-1-processing-n:127.0.0.1:46476_od_ez%2Fm x:collection1 s:shard1 c:control_collection r:core_node1) [n:127.0.0.1:46476_od_ez%2Fm c:control_collection s:shard1 r:core_node1 x:collection1] o.a.s.c.LeaderElector Joined leadership election with path: /collections/control_collection/leader_elect/shard1/election/95531632236953604-core_node1-n_0000000000
   [junit4]   2> 1058786 INFO  (coreZkRegister-3620-thread-1-processing-n:127.0.0.1:46476_od_ez%2Fm x:collection1 s:shard1 c:control_collection r:core_node1) [n:127.0.0.1:46476_od_ez%2Fm c:control_collection s:shard1 r:core_node1 x:collection1] o.a.s.c.ShardLeaderElectionContext Running the leader process for shard=shard1 and weAreReplacement=false and leaderVoteWait=180000
   [junit4]   2> 1058787 INFO  (coreZkRegister-3620-thread-1-processing-n:127.0.0.1:46476_od_ez%2Fm x:collection1 s:shard1 c:control_collection r:core_node1) [n:127.0.0.1:46476_od_ez%2Fm c:control_collection s:shard1 r:core_node1 x:collection1] o.a.s.c.ShardLeaderElectionContext Enough replicas found to continue.
   [junit4]   2> 1058787 INFO  (coreZkRegister-3620-thread-1-processing-n:127.0.0.1:46476_od_ez%2Fm x:collection1 s:shard1 c:control_collection r:core_node1) [n:127.0.0.1:46476_od_ez%2Fm c:control_collection s:shard1 r:core_node1 x:collection1] o.a.s.c.ShardLeaderElectionContext I may be the new leader - try and sync
   [junit4]   2> 1058787 INFO  (coreZkRegister-3620-thread-1-processing-n:127.0.0.1:46476_od_ez%2Fm x:collection1 s:shard1 c:control_collection r:core_node1) [n:127.0.0.1:46476_od_ez%2Fm c:control_collection s:shard1 r:core_node1 x:collection1] o.a.s.c.SyncStrategy Sync replicas to http://127.0.0.1:46476/od_ez/m/collection1/
   [junit4]   2> 1058787 INFO  (coreZkRegister-3620-thread-1-processing-n:127.0.0.1:46476_od_ez%2Fm x:collection1 s:shard1 c:control_collection r:core_node1) [n:127.0.0.1:46476_od_ez%2Fm c:control_collection s:shard1 r:core_node1 x:collection1] o.a.s.c.SyncStrategy Sync Success - now sync replicas to me
   [junit4]   2> 1058787 INFO  (coreZkRegister-3620-thread-1-processing-n:127.0.0.1:46476_od_ez%2Fm x:collection1 s:shard1 c:control_collection r:core_node1) [n:127.0.0.1:46476_od_ez%2Fm c:control_collection s:shard1 r:core_node1 x:collection1] o.a.s.c.SyncStrategy http://127.0.0.1:46476/od_ez/m/collection1/ has no replicas
   [junit4]   2> 1058787 INFO  (OverseerStateUpdate-95531632236953604-127.0.0.1:46476_od_ez%2Fm-n_0000000000) [n:127.0.0.1:46476_od_ez%2Fm    ] o.a.s.c.Overseer processMessage: queueSize: 1, message = {
   [junit4]   2>   "operation":"leader",
   [junit4]   2>   "shard":"shard1",
   [junit4]   2>   "collection":"control_collection"} current state version: 1
   [junit4]   2> 1058787 INFO  (coreZkRegister-3620-thread-1-processing-n:127.0.0.1:46476_od_ez%2Fm x:collection1 s:shard1 c:control_collection r:core_node1) [n:127.0.0.1:46476_od_ez%2Fm c:control_collection s:shard1 r:core_node1 x:collection1] o.a.s.c.c.SolrZkClient makePath: /collections/control_collection/leaders/shard1
   [junit4]   2> 1058789 INFO  (coreZkRegister-3620-thread-1-processing-n:127.0.0.1:46476_od_ez%2Fm x:collection1 s:shard1 c:control_collection r:core_node1) [n:127.0.0.1:46476_od_ez%2Fm c:control_collection s:shard1 r:core_node1 x:collection1] o.a.s.c.ShardLeaderElectionContextBase Creating leader registration node /collections/control_collection/leaders/shard1/leader after winning as /collections/control_collection/leader_elect/shard1/election/95531632236953604-core_node1-n_0000000000
   [junit4]   2> 1058790 INFO  (coreZkRegister-3620-thread-1-processing-n:127.0.0.1:46476_od_ez%2Fm x:collection1 s:shard1 c:control_collection r:core_node1) [n:127.0.0.1:46476_od_ez%2Fm c:control_collection s:shard1 r:core_node1 x:collection1] o.a.s.c.ShardLeaderElectionContext I am the new leader: http://127.0.0.1:46476/od_ez/m/collection1/ shard1
   [junit4]   2> 1058791 INFO  (OverseerStateUpdate-95531632236953604-127.0.0.1:46476_od_ez%2Fm-n_0000000000) [n:127.0.0.1:46476_od_ez%2Fm    ] o.a.s.c.Overseer processMessage: queueSize: 1, message = {
   [junit4]   2>   "operation":"leader",
   [junit4]   2>   "shard":"shard1",
   [junit4]   2>   "collection":"control_collection",
   [junit4]   2>   "base_url":"http://127.0.0.1:46476/od_ez/m",
   [junit4]   2>   "core":"collection1",
   [junit4]   2>   "state":"active"} current state version: 1
   [junit4]   2> 1058893 INFO  (zkCallback-1172-thread-1-processing-n:127.0.0.1:46476_od_ez%2Fm) [n:127.0.0.1:46476_od_ez%2Fm    ] o.a.s.c.c.ZkStateReader A cluster state change: [WatchedEvent state:SyncConnected type:NodeDataChanged path:/clusterstate.json], has occurred - updating... (live nodes size: [1])
   [junit4]   2> 1058941 INFO  (coreZkRegister-3620-thread-1-processing-n:127.0.0.1:46476_od_ez%2Fm x:collection1 s:shard1 c:control_collection r:core_node1) [n:127.0.0.1:46476_od_ez%2Fm c:control_collection s:shard1 r:core_node1 x:collection1] o.a.s.c.ZkController We are http://127.0.0.1:46476/od_ez/m/collection1/ and leader is http://127.0.0.1:46476/od_ez/m/collection1/
   [junit4]   2> 1058941 INFO  (coreZkRegister-3620-thread-1-processing-n:127.0.0.1:46476_od_ez%2Fm x:collection1 s:shard1 c:control_collection r:core_node1) [n:127.0.0.1:46476_od_ez%2Fm c:control_collection s:shard1 r:core_node1 x:collection1] o.a.s.c.ZkController No LogReplay needed for core=collection1 baseURL=http://127.0.0.1:46476/od_ez/m
   [junit4]   2> 1058941 INFO  (coreZkRegister-3620-thread-1-processing-n:127.0.0.1:46476_od_ez%2Fm x:collection1 s:shard1 c:control_collection r:core_node1) [n:127.0.0.1:46476_od_ez%2Fm c:control_collection s:shard1 r:core_node1 x:collection1] o.a.s.c.ZkController I am the leader, no recovery necessary
   [junit4]   2> 1058941 INFO  (coreZkRegister-3620-thread-1-processing-n:127.0.0.1:46476_od_ez%2Fm x:collection1 s:shard1 c:control_collection r:core_node1) [n:127.0.0.1:46476_od_ez%2Fm c:control_collection s:shard1 r:core_node1 x:collection1] o.a.s.c.ZkController publishing state=active
   [junit4]   2> 1058941 INFO  (coreZkRegister-3620-thread-1-processing-n:127.0.0.1:46476_od_ez%2Fm x:collection1 s:shard1 c:control_collection r:core_node1) [n:127.0.0.1:46476_od_ez%2Fm c:control_collection s:shard1 r:core_node1 x:collection1] o.a.s.c.ZkController numShards not found on descriptor - reading it from system property
   [junit4]   2> 1058943 INFO  (OverseerStateUpdate-95531632236953604-127.0.0.1:46476_od_ez%2Fm-n_0000000000) [n:127.0.0.1:46476_od_ez%2Fm    ] o.a.s.c.Overseer processMessage: queueSize: 1, message = {
   [junit4]   2>   "core":"collection1",
   [junit4]   2>   "core_node_name":"core_node1",
   [junit4]   2>   "roles":null,
   [junit4]   2>   "base_url":"http://127.0.0.1:46476/od_ez/m",
   [junit4]   2>   "node_name":"127.0.0.1:46476_od_ez%2Fm",
   [junit4]   2>   "numShards":"1",
   [junit4]   2>   "state":"active",
   [junit4]   2>   "shard":"shard1",
   [junit4]   2>   "collection":"control_collection",
   [junit4]   2>   "operation":"state"} current state version: 2
   [junit4]   2> 1058943 INFO  (OverseerStateUpdate-95531632236953604-127.0.0.1:46476_od_ez%2Fm-n_0000000000) [n:127.0.0.1:46476_od_ez%2Fm    ] o.a.s.c.o.ReplicaMutator Update state numShards=1 message={
   [junit4]   2>   "core":"collection1",
   [junit4]   2>   "core_node_name":"core_node1",
   [junit4]   2>   "roles":null,
   [junit4]   2>   "base_url":"http://127.0.0.1:46476/od_ez/m",
   [junit4]   2>   "node_name":"127.0.0.1:46476_od_ez%2Fm",
   [junit4]   2>   "numShards":"1",
   [junit4]   2>   "state":"active",
   [junit4]   2>   "shard":"shard1",
   [junit4]   2>   "collection":"control_collection",
   [junit4]   2>   "operation":"state"}
   [junit4]   2> 1059045 INFO  (zkCallback-1172-thread-1-processing-n:127.0.0.1:46476_od_ez%2Fm) [n:127.0.0.1:46476_od_ez%2Fm    ] o.a.s.c.c.ZkStateReader A cluster state change: [WatchedEvent state:SyncConnected type:NodeDataChanged path:/clusterstate.json], has occurred - updating... (live nodes size: [1])
   [junit4]   2> 1059127 INFO  (TEST-UnloadDistributedZkTest.test-seed#[816441844EAEA890]) [    ] o.a.s.c.c.SolrZkClient Using default ZkCredentialsProvider
   [junit4]   2> 1059127 INFO  (TEST-UnloadDistributedZkTest.test-seed#[816441844EAEA890]) [    ] o.a.s.c.c.ConnectionManager Waiting for client to connect to ZooKeeper
   [junit4]   2> 1059128 INFO  (zkCallback-1174-thread-1) [    ] o.a.s.c.c.ConnectionManager Watcher org.apache.solr.common.cloud.ConnectionManager@1f89d80 name:ZooKeeperConnection Watcher:127.0.0.1:41736/solr got event WatchedEvent state:SyncConnected type:None path:null path:null type:None
   [junit4]   2> 1059128 INFO  (TEST-UnloadDistributedZkTest.test-seed#[816441844EAEA890]) [    ] o.a.s.c.c.ConnectionManager Client is connected to ZooKeeper
   [junit4]   2> 1059129 INFO  (TEST-UnloadDistributedZkTest.test-seed#[816441844EAEA890]) [    ] o.a.s.c.c.SolrZkClient Using default ZkACLProvider
   [junit4]   2> 1059129 INFO  (TEST-UnloadDistributedZkTest.test-seed#[816441844EAEA890]) [    ] o.a.s.c.c.ZkStateReader Updating cluster state from ZooKeeper... 
   [junit4]   2> 1059130 INFO  (TEST-UnloadDistributedZkTest.test-seed#[816441844EAEA890]) [    ] o.a.s.c.c.ZkStateReader Updated live nodes from ZooKeeper... (0) -> (1)
   [junit4]   2> 1059130 INFO  (TEST-UnloadDistributedZkTest.test-seed#[816441844EAEA890]) [    ] o.a.s.c.ChaosMonkey monkey: init - expire sessions:false cause connection loss:false
   [junit4]   2> 1059206 INFO  (TEST-UnloadDistributedZkTest.test-seed#[816441844EAEA890]) [    ] o.a.s.SolrTestCaseJ4 Writing core.properties file to /home/jenkins/workspace/Lucene-Solr-6.x-Linux/solr/build/solr-core/test/J2/temp/solr.cloud.UnloadDistributedZkTest_816441844EAEA890-001/shard-1-001/cores/collection1
   [junit4]   2> 1059207 INFO  (TEST-UnloadDistributedZkTest.test-seed#[816441844EAEA890]) [    ] o.a.s.c.AbstractFullDistribZkTestBase create jetty 1 in directory /home/jenkins/workspace/Lucene-Solr-6.x-Linux/solr/build/solr-core/test/J2/temp/solr.cloud.UnloadDistributedZkTest_816441844EAEA890-001/shard-1-001
   [junit4]   2> 1059207 INFO  (TEST-UnloadDistributedZkTest.test-seed#[816441844EAEA890]) [    ] o.e.j.s.Server jetty-9.3.6.v20151106
   [junit4]   2> 1059208 INFO  (TEST-UnloadDistributedZkTest.test-seed#[816441844EAEA890]) [    ] o.e.j.s.h.ContextHandler Started o.e.j.s.ServletContextHandler@3b8b68{/od_ez/m,null,AVAILABLE}
   [junit4]   2> 1059210 INFO  (TEST-UnloadDistributedZkTest.test-seed#[816441844EAEA890]) [    ] o.e.j.s.ServerConnector Started ServerConnector@1ea08e{HTTP/1.1,[http/1.1]}{127.0.0.1:42861}
   [junit4]   2> 1059210 INFO  (TEST-UnloadDistributedZkTest.test-seed#[816441844EAEA890]) [    ] o.e.j.s.Server Started @1060706ms
   [junit4]   2> 1059210 INFO  (TEST-UnloadDistributedZkTest.test-seed#[816441844EAEA890]) [    ] o.a.s.c.s.e.JettySolrRunner Jetty properties: {solr.data.dir=/home/jenkins/workspace/Lucene-Solr-6.x-Linux/solr/build/solr-core/test/J2/temp/solr.cloud.UnloadDistributedZkTest_816441844EAEA890-001/tempDir-001/jetty1, solrconfig=solrconfig.xml, hostContext=/od_ez/m, hostPort=42861, coreRootDirectory=/home/jenkins/workspace/Lucene-Solr-6.x-Linux/solr/build/solr-core/test/J2/temp/solr.cloud.UnloadDistributedZkTest_816441844EAEA890-001/shard-1-001/cores}
   [junit4]   2> 1059210 INFO  (TEST-UnloadDistributedZkTest.test-seed#[816441844EAEA890]) [    ] o.a.s.s.SolrDispatchFilter SolrDispatchFilter.init(): sun.misc.Launcher$AppClassLoader@1d16e93
   [junit4]   2> 1059210 INFO  (TEST-UnloadDistributedZkTest.test-seed#[816441844EAEA890]) [    ] o.a.s.c.SolrResourceLoader new SolrResourceLoader for directory: '/home/jenkins/workspace/Lucene-Solr-6.x-Linux/solr/build/solr-core/test/J2/temp/solr.cloud.UnloadDistributedZkTest_816441844EAEA890-001/shard-1-001'
   [junit4]   2> 1059210 INFO  (TEST-UnloadDistributedZkTest.test-seed#[816441844EAEA890]) [    ] o.a.s.c.SolrResourceLoader JNDI not configured for solr (NoInitialContextEx)
   [junit4]   2> 1059210 INFO  (TEST-UnloadDistributedZkTest.test-seed#[816441844EAEA890]) [    ] o.a.s.c.SolrResourceLoader solr home defaulted to 'solr/' (could not find system property or JNDI)
   [junit4]   2> 1059210 INFO  (TEST-UnloadDistributedZkTest.test-seed#[816441844EAEA890]) [    ] o.a.s.c.c.SolrZkClient Using default ZkCredentialsProvider
   [junit4]   2> 1059211 INFO  (TEST-UnloadDistributedZkTest.test-seed#[816441844EAEA890]) [    ] o.a.s.c.c.ConnectionManager Waiting for client to connect to ZooKeeper
   [junit4]   2> 1059212 INFO  (zkCallback-1175-thread-1) [    ] o.a.s.c.c.ConnectionManager Watcher org.apache.solr.common.cloud.ConnectionManager@75ce7e name:ZooKeeperConnection Watcher:127.0.0.1:41736/solr got event WatchedEvent state:SyncConnected type:None path:null path:null type:None
   [junit4]   2> 1059212 INFO  (TEST-UnloadDistributedZkTest.test-seed#[816441844EAEA890]) [    ] o.a.s.c.c.ConnectionManager Client is connected to ZooKeeper
   [junit4]   2> 1059212 INFO  (TEST-UnloadDistributedZkTest.test-seed#[816441844EAEA890]) [    ] o.a.s.c.c.SolrZkClient Using default ZkACLProvider
   [junit4]   2> 1059213 INFO  (TEST-UnloadDistributedZkTest.test-seed#[816441844EAEA890]) [    ] o.a.s.s.SolrDispatchFilter Loading solr.xml from SolrHome (not found in ZooKeeper)
   [junit4]   2> 1059213 INFO  (TEST-UnloadDistributedZkTest.test-seed#[816441844EAEA890]) [    ] o.a.s.c.SolrXmlConfig Loading container configuration from /home/jenkins/workspace/Lucene-Solr-6.x-Linux/solr/build/solr-core/test/J2/temp/solr.cloud.UnloadDistributedZkTest_816441844EAEA890-001/shard-1-001/solr.xml
   [junit4]   2> 1059224 INFO  (TEST-UnloadDistributedZkTest.test-seed#[816441844EAEA890]) [    ] o.a.s.c.CorePropertiesLocator Config-defined core root directory: /home/jenkins/workspace/Lucene-Solr-6.x-Linux/solr/build/solr-core/test/J2/temp/solr.cloud.UnloadDistributedZkTest_816441844EAEA890-001/shard-1-001/cores
   [junit4]   2> 1059224 INFO  (TEST-UnloadDistributedZkTest.test-seed#[816441844EAEA890]) [    ] o.a.s.c.CoreContainer New CoreContainer 17126443
   [junit4]   2> 1059224 INFO  (TEST-UnloadDistributedZkTest.test-seed#[816441844EAEA890]) [    ] o.a.s.c.CoreContainer Loading cores into CoreContainer [instanceDir=/home/jenkins/workspace/Lucene-Solr-6.x-Linux/solr/build/solr-core/test/J2/temp/solr.cloud.UnloadDistributedZkTest_816441844EAEA890-001/shard-1-001]
   [junit4]   2> 1059224 WARN  (TEST-UnloadDistributedZkTest.test-seed#[816441844EAEA890]) [    ] o.a.s.c.CoreContainer Couldn't add files from /home/jenkins/workspace/Lucene-Solr-6.x-Linux/solr/build/solr-core/test/J2/temp/solr.cloud.UnloadDistributedZkTest_816441844EAEA890-001/shard-1-001/lib to classpath: /home/jenkins/workspace/Lucene-Solr-6.x-Linux/solr/build/solr-core/test/J2/temp/solr.cloud.UnloadDistributedZkTest_816441844EAEA890-001/shard-1-001/lib
   [junit4]   2> 1059224 INFO  (TEST-UnloadDistributedZkTest.test-seed#[816441844EAEA890]) [    ] o.a.s.h.c.HttpShardHandlerFactory created with socketTimeout : 90000,urlScheme : ,connTimeout : 15000,maxConnectionsPerHost : 20,maxConnections : 10000,corePoolSize : 0,maximumPoolSize : 2147483647,maxThreadIdleTime : 5,sizeOfQueue : -1,fairnessPolicy : false,useRetries : false,
   [junit4]   2> 1059226 INFO  (TEST-UnloadDistributedZkTest.test-seed#[816441844EAEA890]) [    ] o.a.s.u.UpdateShardHandler Creating UpdateShardHandler HTTP client with params: socketTimeout=340000&connTimeout=45000&retry=true
   [junit4]   2> 1059226 INFO  (TEST-UnloadDistributedZkTest.test-seed#[816441844EAEA890]) [    ] o.a.s.l.LogWatcher SLF4J impl is org.slf4j.impl.Log4jLoggerFactory
   [junit4]   2> 1059226 INFO  (TEST-UnloadDistributedZkTest.test-seed#[816441844EAEA890]) [    ] o.a.s.l.LogWatcher Registering Log Listener [Log4j (org.slf4j.impl.Log4jLoggerFactory)]
   [junit4]   2> 1059226 INFO  (TEST-UnloadDistributedZkTest.test-seed#[816441844EAEA890]) [    ] o.a.s.c.ZkContainer Zookeeper client=127.0.0.1:41736/solr
   [junit4]   2> 1059226 INFO  (TEST-UnloadDistributedZkTest.test-seed#[816441844EAEA890]) [    ] o.a.s.c.ZkController zkHost includes chroot
   [junit4]   2> 1059226 INFO  (TEST-UnloadDistributedZkTest.test-seed#[816441844EAEA890]) [    ] o.a.s.c.c.SolrZkClient Using default ZkCredentialsProvider
   [junit4]   2> 1059227 INFO  (TEST-UnloadDistributedZkTest.test-seed#[816441844EAEA890]) [    ] o.a.s.c.c.ConnectionManager Waiting for client to connect to ZooKeeper
   [junit4]   2> 1059228 INFO  (zkCallback-1178-thread-1) [    ] o.a.s.c.c.ConnectionManager Watcher org.apache.solr.common.cloud.ConnectionManager@1bf6196 name:ZooKeeperConnection Watcher:127.0.0.1:41736 got event WatchedEvent state:SyncConnected type:None path:null path:null type:None
   [junit4]   2> 1059229 INFO  (TEST-UnloadDistributedZkTest.test-seed#[816441844EAEA890]) [    ] o.a.s.c.c.ConnectionManager Client is connected to ZooKeeper
   [junit4]   2> 1059230 INFO  (TEST-UnloadDistributedZkTest.test-seed#[816441844EAEA890]) [    ] o.a.s.c.c.SolrZkClient Using default ZkACLProvider
   [junit4]   2> 1059231 INFO  (TEST-UnloadDistributedZkTest.test-seed#[816441844EAEA890]) [n:127.0.0.1:42861_od_ez%2Fm    ] o.a.s.c.c.ConnectionManager Waiting for client to connect to ZooKeeper
   [junit4]   2> 1059232 INFO  (zkCallback-1179-thread-1-processing-n:127.0.0.1:42861_od_ez%2Fm) [n:127.0.0.1:42861_od_ez%2Fm    ] o.a.s.c.c.ConnectionManager Watcher org.apache.solr.common.cloud.ConnectionManager@18c2363 name:ZooKeeperConnection Watcher:127.0.0.1:41736/solr got event WatchedEvent state:SyncConnected type:None path:null path:null type:None
   [junit4]   2> 1059232 INFO  (TEST-UnloadDistributedZkTest.test-seed#[816441844EAEA890]) [n:127.0.0.1:42861_od_ez%2Fm    ] o.a.s.c.c.ConnectionManager Client is connected to ZooKeeper
   [junit4]   2> 1059236 INFO  (TEST-UnloadDistributedZkTest.test-seed#[816441844EAEA890]) [n:127.0.0.1:42861_od_ez%2Fm    ] o.a.s.c.c.ZkStateReader Updating cluster state from ZooKeeper... 
   [junit4]   2> 1059237 INFO  (TEST-UnloadDistributedZkTest.test-seed#[816441844EAEA890]) [n:127.0.0.1:42861_od_ez%2Fm    ] o.a.s.c.c.ZkStateReader Updated live nodes from ZooKeeper... (0) -> (1)
   [junit4]   2> 1059239 INFO  (TEST-UnloadDistributedZkTest.test-seed#[816441844EAEA890]) [n:127.0.0.1:42861_od_ez%2Fm    ] o.a.s.c.Overseer Overseer (id=null) closing
   [junit4]   2> 1059239 INFO  (TEST-UnloadDistributedZkTest.test-seed#[816441844EAEA890]) [n:127.0.0.1:42861_od_ez%2Fm    ] o.a.s.c.LeaderElector Joined leadership election with path: /overseer_elect/election/95531632236953608-127.0.0.1:42861_od_ez%2Fm-n_0000000001
   [junit4]   2> 1059240 INFO  (TEST-UnloadDistributedZkTest.test-seed#[816441844EAEA890]) [n:127.0.0.1:42861_od_ez%2Fm    ] o.a.s.c.LeaderElector Watching path /overseer_elect/election/95531632236953604-127.0.0.1:46476_od_ez%2Fm-n_0000000000 to know if I could be the leader
   [junit4]   2> 1059240 INFO  (TEST-UnloadDistributedZkTest.test-seed#[816441844EAEA890]) [n:127.0.0.1:42861_od_ez%2Fm    ] o.a.s.c.ZkController Publish node=127.0.0.1:42861_od_ez%2Fm as DOWN
   [junit4]   2> 1059242 INFO  (OverseerStateUpdate-95531632236953604-127.0.0.1:46476_od_ez%2Fm-n_0000000000) [n:127.0.0.1:46476_od_ez%2Fm    ] o.a.s.c.Overseer processMessage: queueSize: 1, message = {
   [junit4]   2>   "operation":"downnode",
   [junit4]   2>   "node_name":"127.0.0.1:42861_od_ez%2Fm"} current state version: 3
   [junit4]   2> 1059242 INFO  (OverseerStateUpdate-95531632236953604-127.0.0.1:46476_od_ez%2Fm-n_0000000000) [n:127.0.0.1:46476_od_ez%2Fm    ] o.a.s.c.o.NodeMutator DownNode state invoked for node: 127.0.0.1:42861_od_ez%2Fm
   [junit4]   2> 1059344 INFO  (zkCallback-1174-thread-1) [    ] o.a.s.c.c.ZkStateReader A cluster state change: [WatchedEvent state:SyncConnected type:NodeDataChanged path:/clusterstate.json], has occurred - updating... (live nodes size: [1])
   [junit4]   2> 1059344 INFO  (zkCallback-1179-thread-1-processing-n:127.0.0.1:42861_od_ez%2Fm) [n:127.0.0.1:42861_od_ez%2Fm    ] o.a.s.c.c.ZkStateReader A cluster state change: [WatchedEvent state:SyncConnected type:NodeDataChanged path:/clusterstate.json], has occurred - updating... (live nodes size: [1])
   [junit4]   2> 1059344 INFO  (zkCallback-1172-thread-1-processing-n:127.0.0.1:46476_od_ez%2Fm) [n:127.0.0.1:46476_od_ez%2Fm    ] o.a.s.c.c.ZkStateReader A cluster state change: [WatchedEvent state:SyncConnected type:NodeDataChanged path:/clusterstate.json], has occurred - updating... (live nodes size: [1])
   [junit4]   2> 1060242 INFO  (TEST-UnloadDistributedZkTest.test-seed#[816441844EAEA890]) [n:127.0.0.1:42861_od_ez%2Fm    ] o.a.s.c.ZkController Register node as live in ZooKeeper:/live_nodes/127.0.0.1:42861_od_ez%2Fm
   [junit4]   2> 1060242 INFO  (TEST-UnloadDistributedZkTest.test-seed#[816441844EAEA890]) [n:127.0.0.1:42861_od_ez%2Fm    ] o.a.s.c.c.SolrZkClient makePath: /live_nodes/127.0.0.1:42861_od_ez%2Fm
   [junit4]   2> 1060243 INFO  (zkCallback-1172-thread-1-processing-n:127.0.0.1:46476_od_ez%2Fm) [n:127.0.0.1:46476_od_ez%2Fm    ] o.a.s.c.c.ZkStateReader A live node change: [WatchedEvent state:SyncConnected type:NodeChildrenChanged path:/live_nodes], has occurred - updating... (live nodes size: [1])
   [junit4]   2> 1060243 INFO  (zkCallback-1174-thread-1) [    ] o.a.s.c.c.ZkStateReader A live node change: [WatchedEvent state:SyncConnected type:NodeChildrenChanged path:/live_nodes], has occurred - updating... (live nodes size: [1])
   [junit4]   2> 1060243 INFO  (zkCallback-1179-thread-1-processing-n:127.0.0.1:42861_od_ez%2Fm) [n:127.0.0.1:42861_od_ez%2Fm    ] o.a.s.c.c.ZkStateReader A live node change: [WatchedEvent state:SyncConnected type:NodeChildrenChanged path:/live_nodes], has occurred - updating... (live nodes size: [1])
   [junit4]   2> 1060244 INFO  (zkCallback-1172-thread-1-processing-n:127.0.0.1:46476_od_ez%2Fm) [n:127.0.0.1:46476_od_ez%2Fm    ] o.a.s.c.c.ZkStateReader Updated live nodes from ZooKeeper... (1) -> (2)
   [junit4]   2> 1060244 INFO  (zkCallback-1174-thread-1) [    ] o.a.s.c.c.ZkStateReader Updated live nodes from ZooKeeper... (1) -> (2)
   [junit4]   2> 1060244 INFO  (zkCallback-1179-thread-1-processing-n:127.0.0.1:42861_od_ez%2Fm) [n:127.0.0.1:42861_od_ez%2Fm    ] o.a.s.c.c.ZkStateReader Updated live nodes from ZooKeeper... (1) -> (2)
   [junit4]   2> 1060264 INFO  (TEST-UnloadDistributedZkTest.test-seed#[816441844EAEA890]) [n:127.0.0.1:42861_od_ez%2Fm    ] o.a.s.c.CoreContainer Security conf doesn't exist. Skipping setup for authorization module.
   [junit4]   2> 1060264 INFO  (TEST-UnloadDistributedZkTest.test-seed#[816441844EAEA890]) [n:127.0.0.1:42861_od_ez%2Fm    ] o.a.s.c.CoreContainer No authentication plugin used.
   [junit4]   2> 1060265 INFO  (TEST-UnloadDistributedZkTest.test-seed#[816441844EAEA890]) [n:127.0.0.1:42861_od_ez%2Fm    ] o.a.s.c.CorePropertiesLocator Looking for core definitions underneath /home/jenkins/workspace/Lucene-Solr-6.x-Linux/solr/build/solr-core/test/J2/temp/solr.cloud.UnloadDistributedZkTest_816441844EAEA890-001/shard-1-001/cores
   [junit4]   2> 1060266 INFO  (TEST-UnloadDistributedZkTest.test-seed#[816441844EAEA890]) [n:127.0.0.1:42861_od_ez%2Fm    ] o.a.s.c.CoreDescriptor Created CoreDescriptor: {name=collection1, config=solrconfig.xml, transient=false, schema=schema.xml, loadOnStartup=true, configSetProperties=configsetprops.json, collection=collection1, coreNodeName=, dataDir=data/, shard=}
   [junit4]   2> 1060266 INFO  (TEST-UnloadDistributedZkTest.test-seed#[816441844EAEA890]) [n:127.0.0.1:42861_od_ez%2Fm    ] o.a.s.c.CorePropertiesLocator Found core collection1 in /home/jenkins/workspace/Lucene-Solr-6.x-Linux/solr/build/solr-core/test/J2/temp/solr.cloud.UnloadDistributedZkTest_816441844EAEA890-001/shard-1-001/cores/collection1
   [junit4]   2> 1060266 INFO  (TEST-UnloadDistributedZkTest.test-seed#[816441844EAEA890]) [n:127.0.0.1:42861_od_ez%2Fm    ] o.a.s.c.CorePropertiesLocator Found 1 core definitions
   [junit4]   2> 1060267 INFO  (TEST-UnloadDistributedZkTest.test-seed#[816441844EAEA890]) [n:127.0.0.1:42861_od_ez%2Fm    ] o.a.s.s.SolrDispatchFilter user.dir=/home/jenkins/workspace/Lucene-Solr-6.x-Linux/solr/build/solr-core/test/J2
   [junit4]   2> 1060267 INFO  (TEST-UnloadDistributedZkTest.test-seed#[816441844EAEA890]) [n:127.0.0.1:42861_od_ez%2Fm    ] o.a.s.s.SolrDispatchFilter SolrDispatchFilter.init() done
   [junit4]   2> 1060267 INFO  (coreLoadExecutor-3637-thread-1-processing-n:127.0.0.1:42861_od_ez%2Fm) [n:127.0.0.1:42861_od_ez%2Fm c:collection1   x:collection1] o.a.s.c.ZkController publishing state=down
   [junit4]   2> 1060267 INFO  (coreLoadExecutor-3637-thread-1-processing-n:127.0.0.1:42861_od_ez%2Fm) [n:127.0.0.1:42861_od_ez%2Fm c:collection1   x:collection1] o.a.s.c.ZkController numShards not found on descriptor - reading it from system property
   [junit4]   2> 1060268 INFO  (coreLoadExecutor-3637-thread-1-processing-n:127.0.0.1:42861_od_ez%2Fm) [n:127.0.0.1:42861_od_ez%2Fm c:collection1   x:collection1] o.a.s.c.ZkController look for our core node name
   [junit4]   2> 1060268 INFO  (OverseerStateUpdate-95531632236953604-127.0.0.1:46476_od_ez%2Fm-n_0000000000) [n:127.0.0.1:46476_od_ez%2Fm    ] o.a.s.c.Overseer processMessage: queueSize: 1, message = {
   [junit4]   2>   "core":"collection1",
   [junit4]   2>   "roles":null,
   [junit4]   2>   "base_url":"http://127.0.0.1:42861/od_ez/m",
   [junit4]   2>   "node_name":"127.0.0.1:42861_od_ez%2Fm",
   [junit4]   2>   "numShards":"2",
   [junit4]   2>   "state":"down",
   [junit4]   2>   "shard":null,
   [junit4]   2>   "collection":"collection1",
   [junit4]   2>   "operation":"state"} current state version: 4
   [junit4]   2> 1060269 INFO  (OverseerStateUpdate-95531632236953604-127.0.0.1:46476_od_ez%2Fm-n_0000000000) [n:127.0.0.1:46476_od_ez%2Fm    ] o.a.s.c.o.ReplicaMutator Update state numShards=2 message={
   [junit4]   2>   "core":"collection1",
   [junit4]   2>   "roles":null,
   [junit4]   2>   "base_url":"http://127.0.0.1:42861/od_ez/m",
   [junit4]   2>   "node_name":"127.0.0.1:42861_od_ez%2Fm",
   [junit4]   2>   "numShards":"2",
   [junit4]   2>   "state":"down",
   [junit4]   2>   "shard":null,
   [junit4]   2>   "collection":"collection1",
   [junit4]   2>   "operation":"state"}
   [junit4]   2> 1060269 INFO  (OverseerStateUpdate-95531632236953604-127.0.0.1:46476_od_ez%2Fm-n_0000000000) [n:127.0.0.1:46476_od_ez%2Fm    ] o.a.s.c.o.ClusterStateMutator building a new cName: collection1
   [junit4]   2> 1060269 INFO  (OverseerStateUpdate-95531632236953604-127.0.0.1:46476_od_ez%2Fm-n_0000000000) [n:127.0.0.1:46476_od_ez%2Fm    ] o.a.s.c.o.ReplicaMutator Assigning new node to shard shard=shard2
   [junit4]   2> 1060371 INFO  (zkCallback-1174-thread-1) [    ] o.a.s.c.c.ZkStateReader A cluster state change: [WatchedEvent state:SyncConnected type:NodeDataChanged path:/clusterstate.json], has occurred - updating... (live nodes size: [2])
   [junit4]   2> 1060371 INFO  (zkCallback-1179-thread-1-processing-n:127.0.0.1:42861_od_ez%2Fm) [n:127.0.0.1:42861_od_ez%2Fm    ] o.a.s.c.c.ZkStateReader A cluster state change: [WatchedEvent state:SyncConnected type:NodeDataChanged path:/clusterstate.json], has occurred - updating... (live nodes size: [2])
   [junit4]   2> 1060371 INFO  (zkCallback-1172-thread-1-processing-n:127.0.0.1:46476_od_ez%2Fm) [n:127.0.0.1:46476_od_ez%2Fm    ] o.a.s.c.c.ZkStateReader A cluster state change: [WatchedEvent state:SyncConnected type:NodeDataChanged path:/clusterstate.json], has occurred - updating... (live nodes size: [2])
   [junit4]   2> 1061268 INFO  (coreLoadExecutor-3637-thread-1-processing-n:127.0.0.1:42861_od_ez%2Fm) [n:127.0.0.1:42861_od_ez%2Fm c:collection1   x:collection1] o.a.s.c.ZkController waiting to find shard id in clusterstate for collection1
   [junit4]   2> 1061268 INFO  (coreLoadExecutor-3637-thread-1-processing-n:127.0.0.1:42861_od_ez%2Fm) [n:127.0.0.1:42861_od_ez%2Fm c:collection1   x:collection1] o.a.s.c.ZkController Check for collection zkNode:collection1
   [junit4]   2> 1061269 INFO  (coreLoadExecutor-3637-thread-1-processing-n:127.0.0.1:42861_od_ez%2Fm) [n:127.0.0.1:42861_od_ez%2Fm c:collection1   x:collection1] o.a.s.c.ZkController Collection zkNode exists
   [junit4]   2> 1061269 INFO  (coreLoadExecutor-3637-thread-1-processing-n:127.0.0.1:42861_od_ez%2Fm) [n:127.0.0.1:42861_od_ez%2Fm c:collection1   x:collection1] o.a.s.c.c.ZkStateReader Load collection config from: [/collections/collection1]
   [junit4]   2> 1061270 INFO  (coreLoadExecutor-3637-thread-1-processing-n:127.0.0.1:42861_od_ez%2Fm) [n:127.0.0.1:42861_od_ez%2Fm c:collection1   x:collection1] o.a.s.c.c.ZkStateReader path=[/collections/collection1] [configName]=[conf1] specified config exists in ZooKeeper
   [junit4]   2> 1061270 INFO  (coreLoadExecutor-3637-thread-1-processing-n:127.0.0.1:42861_od_ez%2Fm) [n:127.0.0.1:42861_od_ez%2Fm c:collection1   x:collection1] o.a.s.c.SolrResourceLoader new SolrResourceLoader for directory: '/home/jenkins/workspace/Lucene-Solr-6.x-Linux/solr/build/solr-core/test/J2/temp/solr.cloud.UnloadDistributedZkTest_816441844EAEA890-001/shard-1-001/cores/collection1'
   [junit4]   2> 1061270 INFO  (coreLoadExecutor-3637-thread-1-processing-n:127.0.0.1:42861_od_ez%2Fm) [n:127.0.0.1:42861_od_ez%2Fm c:collection1   x:collection1] o.a.s.c.SolrResourceLoader JNDI not configured for solr (NoInitialContextEx)
   [junit4]   2> 1061270 INFO  (coreLoadExecutor-3637-thread-1-processing-n:127.0.0.1:42861_od_ez%2Fm) [n:127.0.0.1:42861_od_ez%2Fm c:collection1   x:collection1] o.a.s.c.SolrResourceLoader solr home defaulted to 'solr/' (could not find system property or JNDI)
   [junit4]   2> 1061271 INFO  (coreLoadExecutor-3637-thread-1-processing-n:127.0.0.1:42861_od_ez%2Fm) [n:127.0.0.1:42861_od_ez%2Fm c:collection1   x:collection1] o.a.s.c.Config loaded config solrconfig.xml with version 0 
   [junit4]   2> 1061280 INFO  (coreLoadExecutor-3637-thread-1-processing-n:127.0.0.1:42861_od_ez%2Fm) [n:127.0.0.1:42861_od_ez%2Fm c:collection1   x:collection1] o.a.s.c.SolrConfig current version of requestparams : -1
   [junit4]   2> 1061288 WARN  (coreLoadExecutor-3637-thread-1-processing-n:127.0.0.1:42861_od_ez%2Fm) [n:127.0.0.1:42861_od_ez%2Fm c:collection1   x:collection1] o.a.s.c.Config Beginning with Solr 5.5, <mergePolicy> is deprecated, use <mergePolicyFactory> instead.
   [junit4]   2> 1061290 INFO  (coreLoadExecutor-3637-thread-1-processing-n:127.0.0.1:42861_od_ez%2Fm) [n:127.0.0.1:42861_od_ez%2Fm c:collection1   x:collection1] o.a.s.c.SolrConfig Using Lucene MatchVersion: 6.1.0
   [junit4]   2> 1061301 INFO  (coreLoadExecutor-3637-thread-1-processing-n:127.0.0.1:42861_od_ez%2Fm) [n:127.0.0.1:42861_od_ez%2Fm c:collection1   x:collection1] o.a.s.c.SolrConfig Loaded SolrConfig: solrconfig.xml
   [junit4]   2> 1061326 INFO  (coreLoadExecutor-3637-thread-1-processing-n:127.0.0.1:42861_od_ez%2Fm) [n:127.0.0.1:42861_od_ez%2Fm c:collection1   x:collection1] o.a.s.s.IndexSchema [collection1] Schema name=test
   [junit4]   2> 1061414 INFO  (coreLoadExecutor-3637-thread-1-processing-n:127.0.0.1:42861_od_ez%2Fm) [n:127.0.0.1:42861_od_ez%2Fm c:collection1   x:collection1] o.a.s.s.OpenExchangeRatesOrgProvider Initialized with rates=open-exchange-rates.json, refreshInterval=1440.
   [junit4]   2> 1061420 INFO  (coreLoadExecutor-3637-thread-1-processing-n:127.0.0.1:42861_od_ez%2Fm) [n:127.0.0.1:42861_od_ez%2Fm c:collection1   x:collection1] o.a.s.s.IndexSchema default search field in schema is text
   [junit4]   2> 1061421 INFO  (coreLoadExecutor-3637-thread-1-processing-n:127.0.0.1:42861_od_ez%2Fm) [n:127.0.0.1:42861_od_ez%2Fm c:collection1   x:collection1] o.a.s.s.IndexSchema unique key field: id
   [junit4]   2> 1061430 INFO  (coreLoadExecutor-3637-thread-1-processing-n:127.0.0.1:42861_od_ez%2Fm) [n:127.0.0.1:42861_od_ez%2Fm c:collection1   x:collection1] o.a.s.s.FileExchangeRateProvider Reloading exchange rates from file currency.xml
   [junit4]   2> 1061432 INFO  (coreLoadExecutor-3637-thread-1-processing-n:127.0.0.1:42861_od_ez%2Fm) [n:127.0.0.1:42861_od_ez%2Fm c:collection1   x:collection1] o.a.s.s.FileExchangeRateProvider Reloading exchange rates from file currency.xml
   [junit4]   2> 1061434 INFO  (coreLoadExecutor-3637-thread-1-processing-n:127.0.0.1:42861_od_ez%2Fm) [n:127.0.0.1:42861_od_ez%2Fm c:collection1   x:collection1] o.a.s.s.OpenExchangeRatesOrgProvider Reloading exchange rates from open-exchange-rates.json
   [junit4]   2> 1061434 INFO  (coreLoadExecutor-3637-thread-1-processing-n:127.0.0.1:42861_od_ez%2Fm) [n:127.0.0.1:42861_od_ez%2Fm c:collection1   x:collection1] o.a.s.s.OpenExchangeRatesOrgProvider Reloading exchange rates from open-exchange-rates.json
   [junit4]   2> 1061435 INFO  (coreLoadExecutor-3637-thread-1-processing-n:127.0.0.1:42861_od_ez%2Fm) [n:127.0.0.1:42861_od_ez%2Fm c:collection1   x:collection1] o.a.s.c.ConfigSetProperties Did not find ConfigSet properties, assuming default properties: Can't find resource 'configsetprops.json' in classpath or '/configs/conf1', cwd=/home/jenkins/workspace/Lucene-Solr-6.x-Linux/solr/build/solr-core/test/J2
   [junit4]   2> 1061435 INFO  (coreLoadExecutor-3637-thread-1-processing-n:127.0.0.1:42861_od_ez%2Fm) [n:127.0.0.1:42861_od_ez%2Fm c:collection1   x:collection1] o.a.s.c.CoreContainer Creating SolrCore 'collection1' using configuration from collection collection1
   [junit4]   2> 1061436 INFO  (coreLoadExecutor-3637-thread-1-processing-n:127.0.0.1:42861_od_ez%2Fm) [n:127.0.0.1:42861_od_ez%2Fm c:collection1 s:shard2 r:core_node1 x:collection1] o.a.s.c.SolrCore org.apache.solr.core.MockDirectoryFactory
   [junit4]   2> 1061436 INFO  (coreLoadExecutor-3637-thread-1-processing-n:127.0.0.1:42861_od_ez%2Fm) [n:127.0.0.1:42861_od_ez%2Fm c:collection1 s:shard2 r:core_node1 x:collection1] o.a.s.c.SolrCore [[collection1] ] Opening new SolrCore at [/home/jenkins/workspace/Lucene-Solr-6.x-Linux/solr/build/solr-core/test/J2/temp/solr.cloud.UnloadDistributedZkTest_816441844EAEA890-001/shard-1-001/cores/collection1], dataDir=[/home/jenkins/workspace/Lucene-Solr-6.x-Linux/solr/build/solr-core/test/J2/temp/solr.cloud.UnloadDistributedZkTest_816441844EAEA890-001/shard-1-001/cores/

[...truncated too long message...]

eParser.java:57)
   [junit4]    > 	at org.apache.http.impl.io.AbstractMessageParser.parse(AbstractMessageParser.java:261)
   [junit4]    > 	at org.apache.http.impl.AbstractHttpClientConnection.receiveResponseHeader(AbstractHttpClientConnection.java:283)
   [junit4]    > 	at org.apache.http.impl.conn.DefaultClientConnection.receiveResponseHeader(DefaultClientConnection.java:251)
   [junit4]    > 	at org.apache.http.impl.conn.ManagedClientConnectionImpl.receiveResponseHeader(ManagedClientConnectionImpl.java:197)
   [junit4]    > 	at org.apache.http.protocol.HttpRequestExecutor.doReceiveResponse(HttpRequestExecutor.java:272)
   [junit4]    > 	at org.apache.http.protocol.HttpRequestExecutor.execute(HttpRequestExecutor.java:124)
   [junit4]    > 	at org.apache.http.impl.client.DefaultRequestDirector.tryExecute(DefaultRequestDirector.java:685)
   [junit4]    > 	at org.apache.http.impl.client.DefaultRequestDirector.execute(DefaultRequestDirector.java:487)
   [junit4]    > 	at org.apache.http.impl.client.AbstractHttpClient.doExecute(AbstractHttpClient.java:882)
   [junit4]    > 	at org.apache.http.impl.client.CloseableHttpClient.execute(CloseableHttpClient.java:82)
   [junit4]    > 	at org.apache.http.impl.client.CloseableHttpClient.execute(CloseableHttpClient.java:107)
   [junit4]    > 	at org.apache.http.impl.client.CloseableHttpClient.execute(CloseableHttpClient.java:55)
   [junit4]    > 	at org.apache.solr.client.solrj.impl.HttpSolrClient.executeMethod(HttpSolrClient.java:482)
   [junit4]    > 	... 8 moreThrowable #7: com.carrotsearch.randomizedtesting.UncaughtExceptionError: Captured an uncaught exception in thread: Thread[id=8167, name=testExecutor-3704-thread-13, state=RUNNABLE, group=TGRP-UnloadDistributedZkTest]
   [junit4]    > Caused by: java.lang.RuntimeException: org.apache.solr.client.solrj.SolrServerException: Timeout occured while waiting response from server at: http://127.0.0.1:50600/od_ez/m
   [junit4]    > 	at __randomizedtesting.SeedInfo.seed([816441844EAEA890]:0)
   [junit4]    > 	at org.apache.solr.cloud.BasicDistributedZkTest.lambda$createCores$0(BasicDistributedZkTest.java:583)
   [junit4]    > 	at org.apache.solr.common.util.ExecutorUtil$MDCAwareThreadPoolExecutor.lambda$execute$0(ExecutorUtil.java:229)
   [junit4]    > 	at java.util.concurrent.ThreadPoolExecutor.runWorker(ThreadPoolExecutor.java:1142)
   [junit4]    > 	at java.util.concurrent.ThreadPoolExecutor$Worker.run(ThreadPoolExecutor.java:617)
   [junit4]    > 	at java.lang.Thread.run(Thread.java:745)
   [junit4]    > Caused by: org.apache.solr.client.solrj.SolrServerException: Timeout occured while waiting response from server at: http://127.0.0.1:50600/od_ez/m
   [junit4]    > 	at org.apache.solr.client.solrj.impl.HttpSolrClient.executeMethod(HttpSolrClient.java:588)
   [junit4]    > 	at org.apache.solr.client.solrj.impl.HttpSolrClient.request(HttpSolrClient.java:241)
   [junit4]    > 	at org.apache.solr.client.solrj.impl.HttpSolrClient.request(HttpSolrClient.java:230)
   [junit4]    > 	at org.apache.solr.client.solrj.SolrClient.request(SolrClient.java:1219)
   [junit4]    > 	at org.apache.solr.cloud.BasicDistributedZkTest.lambda$createCores$0(BasicDistributedZkTest.java:581)
   [junit4]    > 	... 4 more
   [junit4]    > Caused by: java.net.SocketTimeoutException: Read timed out
   [junit4]    > 	at java.net.SocketInputStream.socketRead0(Native Method)
   [junit4]    > 	at java.net.SocketInputStream.socketRead(SocketInputStream.java:116)
   [junit4]    > 	at java.net.SocketInputStream.read(SocketInputStream.java:170)
   [junit4]    > 	at java.net.SocketInputStream.read(SocketInputStream.java:141)
   [junit4]    > 	at org.apache.http.impl.io.AbstractSessionInputBuffer.fillBuffer(AbstractSessionInputBuffer.java:160)
   [junit4]    > 	at org.apache.http.impl.io.SocketInputBuffer.fillBuffer(SocketInputBuffer.java:84)
   [junit4]    > 	at org.apache.http.impl.io.AbstractSessionInputBuffer.readLine(AbstractSessionInputBuffer.java:273)
   [junit4]    > 	at org.apache.http.impl.conn.DefaultHttpResponseParser.parseHead(DefaultHttpResponseParser.java:140)
   [junit4]    > 	at org.apache.http.impl.conn.DefaultHttpResponseParser.parseHead(DefaultHttpResponseParser.java:57)
   [junit4]    > 	at org.apache.http.impl.io.AbstractMessageParser.parse(AbstractMessageParser.java:261)
   [junit4]    > 	at org.apache.http.impl.AbstractHttpClientConnection.receiveResponseHeader(AbstractHttpClientConnection.java:283)
   [junit4]    > 	at org.apache.http.impl.conn.DefaultClientConnection.receiveResponseHeader(DefaultClientConnection.java:251)
   [junit4]    > 	at org.apache.http.impl.conn.ManagedClientConnectionImpl.receiveResponseHeader(ManagedClientConnectionImpl.java:197)
   [junit4]    > 	at org.apache.http.protocol.HttpRequestExecutor.doReceiveResponse(HttpRequestExecutor.java:272)
   [junit4]    > 	at org.apache.http.protocol.HttpRequestExecutor.execute(HttpRequestExecutor.java:124)
   [junit4]    > 	at org.apache.http.impl.client.DefaultRequestDirector.tryExecute(DefaultRequestDirector.java:685)
   [junit4]    > 	at org.apache.http.impl.client.DefaultRequestDirector.execute(DefaultRequestDirector.java:487)
   [junit4]    > 	at org.apache.http.impl.client.AbstractHttpClient.doExecute(AbstractHttpClient.java:882)
   [junit4]    > 	at org.apache.http.impl.client.CloseableHttpClient.execute(CloseableHttpClient.java:82)
   [junit4]    > 	at org.apache.http.impl.client.CloseableHttpClient.execute(CloseableHttpClient.java:107)
   [junit4]    > 	at org.apache.http.impl.client.CloseableHttpClient.execute(CloseableHttpClient.java:55)
   [junit4]    > 	at org.apache.solr.client.solrj.impl.HttpSolrClient.executeMethod(HttpSolrClient.java:482)
   [junit4]    > 	... 8 more
   [junit4]   2> 1192698 INFO  (SUITE-UnloadDistributedZkTest-seed#[816441844EAEA890]-worker) [    ] o.a.s.SolrTestCaseJ4 ###deleteCore
   [junit4]   2> Mar 11, 2016 11:52:40 AM com.carrotsearch.randomizedtesting.ThreadLeakControl checkThreadLeaks
   [junit4]   2> WARNING: Will linger awaiting termination of 1 leaked thread(s).
   [junit4]   2> NOTE: test params are: codec=Asserting(Lucene60), sim=RandomSimilarity(queryNorm=false,coord=no): {}, locale=nn-NO, timezone=America/Rainy_River
   [junit4]   2> NOTE: Linux 3.19.0-51-generic i386/Oracle Corporation 1.8.0_72 (32-bit)/cpus=12,threads=1,free=288608176,total=536870912
   [junit4]   2> NOTE: All tests run in this JVM: [TestLeaderInitiatedRecoveryThread, TestCloudSchemaless, SuggesterTSTTest, CurrencyFieldXmlFileTest, BlockDirectoryTest, DistanceUnitsTest, CleanupOldIndexTest, SecurityConfHandlerTest, PreAnalyzedUpdateProcessorTest, FullHLLTest, TestZkChroot, PrimitiveFieldTypeTest, SliceStateTest, TestSha256AuthenticationProvider, TestUniqueKeyFieldResource, CdcrRequestHandlerTest, TestRawResponseWriter, TestStressRecovery, MultiThreadedOCPTest, TestIndexingPerformance, TestPerFieldSimilarityWithDefaultOverride, ForceLeaderTest, TestJmxIntegration, TestOverriddenPrefixQueryForCustomFieldType, SparseHLLTest, TestJettySolrRunner, RegexBoostProcessorTest, TestAnalyzeInfixSuggestions, TestConfigOverlay, TestXIncludeConfig, TestPerFieldSimilarity, TestSweetSpotSimilarityFactory, OverseerCollectionConfigSetProcessorTest, ClusterStateTest, ConnectionManagerTest, TestFilteredDocIdSet, TestSolrDeletionPolicy1, StressHdfsTest, TestCollationField, BadComponentTest, RecoveryZkTest, FullSolrCloudDistribCmdsTest, AnalyticsMergeStrategyTest, TestIndexSearcher, TestComplexPhraseQParserPlugin, CircularListTest, TestReloadAndDeleteDocs, TestFreeTextSuggestions, HighlighterConfigTest, BaseCdcrDistributedZkTest, DebugComponentTest, OverseerTest, BasicDistributedZk2Test, TestBulkSchemaConcurrent, TestReload, TestCharFilters, DistributedExpandComponentTest, BadIndexSchemaTest, BigEndianAscendingWordSerializerTest, TestTolerantSearch, TestJmxMonitoredMap, TestConfigSets, TestPostingsSolrHighlighter, SearchHandlerTest, HdfsChaosMonkeyNothingIsSafeTest, StatsComponentTest, BinaryUpdateRequestHandlerTest, TestSort, CollectionsAPISolrJTest, TestCopyFieldCollectionResource, SuggesterWFSTTest, TestSuggestSpellingConverter, LeaderInitiatedRecoveryOnCommitTest, TestCollectionAPI, DeleteStatusTest, DirectUpdateHandlerTest, SimpleFacetsTest, LeaderElectionTest, TestPivotHelperCode, RulesTest, TestReversedWildcardFilterFactory, SolrTestCaseJ4Test, TestAddFieldRealTimeGet, TestCoreDiscovery, LukeRequestHandlerTest, AddSchemaFieldsUpdateProcessorFactoryTest, TestDownShardTolerantSearch, TestSolrCloudWithKerberosAlt, DocValuesMultiTest, SampleTest, TestExtendedDismaxParser, TestPHPSerializedResponseWriter, TestSolrDynamicMBean, SuggestComponentTest, UnloadDistributedZkTest]
   [junit4] Completed [288/579 (1!)] on J2 in 136.05s, 1 test, 1 error <<< FAILURES!

[...truncated 951 lines...]
BUILD FAILED
/home/jenkins/workspace/Lucene-Solr-6.x-Linux/build.xml:740: The following error occurred while executing this line:
/home/jenkins/workspace/Lucene-Solr-6.x-Linux/build.xml:684: The following error occurred while executing this line:
/home/jenkins/workspace/Lucene-Solr-6.x-Linux/build.xml:59: The following error occurred while executing this line:
/home/jenkins/workspace/Lucene-Solr-6.x-Linux/solr/build.xml:233: The following error occurred while executing this line:
/home/jenkins/workspace/Lucene-Solr-6.x-Linux/solr/common-build.xml:524: The following error occurred while executing this line:
/home/jenkins/workspace/Lucene-Solr-6.x-Linux/lucene/common-build.xml:1457: The following error occurred while executing this line:
/home/jenkins/workspace/Lucene-Solr-6.x-Linux/lucene/common-build.xml:1014: There were test failures: 579 suites (10 ignored), 2314 tests, 1 error, 115 ignored (70 assumptions) [seed: 816441844EAEA890]

Total time: 56 minutes 37 seconds
Build step 'Invoke Ant' marked build as failure
Archiving artifacts
[WARNINGS] Skipping publisher since build result is FAILURE
Recording test results
Email was triggered for: Failure - Any
Sending email for trigger: Failure - Any



Mime
View raw message