lucene-dev mailing list archives

Site index · List index
Message view « Date » · « Thread »
Top « Date » · « Thread »
From Policeman Jenkins Server <jenk...@thetaphi.de>
Subject [JENKINS] Lucene-Solr-master-Linux (64bit/jdk1.8.0_72) - Build # 16301 - Still Failing!
Date Wed, 23 Mar 2016 03:43:06 GMT
Build: http://jenkins.thetaphi.de/job/Lucene-Solr-master-Linux/16301/
Java: 64bit/jdk1.8.0_72 -XX:-UseCompressedOops -XX:+UseParallelGC

1 tests failed.
FAILED:  org.apache.solr.cloud.TestCloudPivotFacet.test

Error Message:
Captured an uncaught exception in thread: Thread[id=2934, name=SessionTracker, state=RUNNABLE, group=TGRP-TestCloudPivotFacet]

Stack Trace:
com.carrotsearch.randomizedtesting.UncaughtExceptionError: Captured an uncaught exception in thread: Thread[id=2934, name=SessionTracker, state=RUNNABLE, group=TGRP-TestCloudPivotFacet]
Caused by: java.lang.OutOfMemoryError: GC overhead limit exceeded




Build Log:
[...truncated 11373 lines...]
   [junit4] Suite: org.apache.solr.cloud.TestCloudPivotFacet
   [junit4]   2> Creating dataDir: /home/jenkins/workspace/Lucene-Solr-master-Linux/solr/build/solr-core/test/J1/temp/solr.cloud.TestCloudPivotFacet_39D34BE0B4D5CCCC-001/init-core-data-001
   [junit4]   2> 521843 INFO  (SUITE-TestCloudPivotFacet-seed#[39D34BE0B4D5CCCC]-worker) [    ] o.a.s.BaseDistributedSearchTestCase Setting hostContext system property: /
   [junit4]   2> 521844 INFO  (SUITE-TestCloudPivotFacet-seed#[39D34BE0B4D5CCCC]-worker) [    ] o.a.s.c.TestCloudPivotFacet init'ing useFieldRandomizedFactor = 10
   [junit4]   2> 521846 INFO  (TEST-TestCloudPivotFacet.test-seed#[39D34BE0B4D5CCCC]) [    ] o.a.s.c.ZkTestServer STARTING ZK TEST SERVER
   [junit4]   2> 521846 INFO  (Thread-1062) [    ] o.a.s.c.ZkTestServer client port:0.0.0.0/0.0.0.0:0
   [junit4]   2> 521847 INFO  (Thread-1062) [    ] o.a.s.c.ZkTestServer Starting server
   [junit4]   2> 521946 INFO  (TEST-TestCloudPivotFacet.test-seed#[39D34BE0B4D5CCCC]) [    ] o.a.s.c.ZkTestServer start zk server on port:33288
   [junit4]   2> 521946 INFO  (TEST-TestCloudPivotFacet.test-seed#[39D34BE0B4D5CCCC]) [    ] o.a.s.c.c.SolrZkClient Using default ZkCredentialsProvider
   [junit4]   2> 521947 INFO  (TEST-TestCloudPivotFacet.test-seed#[39D34BE0B4D5CCCC]) [    ] o.a.s.c.c.ConnectionManager Waiting for client to connect to ZooKeeper
   [junit4]   2> 521949 INFO  (zkCallback-426-thread-1) [    ] o.a.s.c.c.ConnectionManager Watcher org.apache.solr.common.cloud.ConnectionManager@b5cdf26 name:ZooKeeperConnection Watcher:127.0.0.1:33288 got event WatchedEvent state:SyncConnected type:None path:null path:null type:None
   [junit4]   2> 521949 INFO  (TEST-TestCloudPivotFacet.test-seed#[39D34BE0B4D5CCCC]) [    ] o.a.s.c.c.ConnectionManager Client is connected to ZooKeeper
   [junit4]   2> 521949 INFO  (TEST-TestCloudPivotFacet.test-seed#[39D34BE0B4D5CCCC]) [    ] o.a.s.c.c.SolrZkClient Using default ZkACLProvider
   [junit4]   2> 521949 INFO  (TEST-TestCloudPivotFacet.test-seed#[39D34BE0B4D5CCCC]) [    ] o.a.s.c.c.SolrZkClient makePath: /solr
   [junit4]   2> 521950 INFO  (TEST-TestCloudPivotFacet.test-seed#[39D34BE0B4D5CCCC]) [    ] o.a.s.c.c.SolrZkClient Using default ZkCredentialsProvider
   [junit4]   2> 521950 INFO  (TEST-TestCloudPivotFacet.test-seed#[39D34BE0B4D5CCCC]) [    ] o.a.s.c.c.ConnectionManager Waiting for client to connect to ZooKeeper
   [junit4]   2> 521951 INFO  (zkCallback-427-thread-1) [    ] o.a.s.c.c.ConnectionManager Watcher org.apache.solr.common.cloud.ConnectionManager@3674acae name:ZooKeeperConnection Watcher:127.0.0.1:33288/solr got event WatchedEvent state:SyncConnected type:None path:null path:null type:None
   [junit4]   2> 521951 INFO  (TEST-TestCloudPivotFacet.test-seed#[39D34BE0B4D5CCCC]) [    ] o.a.s.c.c.ConnectionManager Client is connected to ZooKeeper
   [junit4]   2> 521951 INFO  (TEST-TestCloudPivotFacet.test-seed#[39D34BE0B4D5CCCC]) [    ] o.a.s.c.c.SolrZkClient Using default ZkACLProvider
   [junit4]   2> 521951 INFO  (TEST-TestCloudPivotFacet.test-seed#[39D34BE0B4D5CCCC]) [    ] o.a.s.c.c.SolrZkClient makePath: /collections/collection1
   [junit4]   2> 521952 INFO  (TEST-TestCloudPivotFacet.test-seed#[39D34BE0B4D5CCCC]) [    ] o.a.s.c.c.SolrZkClient makePath: /collections/collection1/shards
   [junit4]   2> 521952 INFO  (TEST-TestCloudPivotFacet.test-seed#[39D34BE0B4D5CCCC]) [    ] o.a.s.c.c.SolrZkClient makePath: /collections/control_collection
   [junit4]   2> 521953 INFO  (TEST-TestCloudPivotFacet.test-seed#[39D34BE0B4D5CCCC]) [    ] o.a.s.c.c.SolrZkClient makePath: /collections/control_collection/shards
   [junit4]   2> 521953 INFO  (TEST-TestCloudPivotFacet.test-seed#[39D34BE0B4D5CCCC]) [    ] o.a.s.c.AbstractZkTestCase put /home/jenkins/workspace/Lucene-Solr-master-Linux/solr/core/src/test-files/solr/collection1/conf/solrconfig-tlog.xml to /configs/conf1/solrconfig.xml
   [junit4]   2> 521953 INFO  (TEST-TestCloudPivotFacet.test-seed#[39D34BE0B4D5CCCC]) [    ] o.a.s.c.c.SolrZkClient makePath: /configs/conf1/solrconfig.xml
   [junit4]   2> 521954 INFO  (TEST-TestCloudPivotFacet.test-seed#[39D34BE0B4D5CCCC]) [    ] o.a.s.c.AbstractZkTestCase put /home/jenkins/workspace/Lucene-Solr-master-Linux/solr/core/src/test-files/solr/collection1/conf/schema.xml to /configs/conf1/schema.xml
   [junit4]   2> 521954 INFO  (TEST-TestCloudPivotFacet.test-seed#[39D34BE0B4D5CCCC]) [    ] o.a.s.c.c.SolrZkClient makePath: /configs/conf1/schema.xml
   [junit4]   2> 521955 INFO  (TEST-TestCloudPivotFacet.test-seed#[39D34BE0B4D5CCCC]) [    ] o.a.s.c.AbstractZkTestCase put /home/jenkins/workspace/Lucene-Solr-master-Linux/solr/core/src/test-files/solr/collection1/conf/solrconfig.snippet.randomindexconfig.xml to /configs/conf1/solrconfig.snippet.randomindexconfig.xml
   [junit4]   2> 521955 INFO  (TEST-TestCloudPivotFacet.test-seed#[39D34BE0B4D5CCCC]) [    ] o.a.s.c.c.SolrZkClient makePath: /configs/conf1/solrconfig.snippet.randomindexconfig.xml
   [junit4]   2> 521955 INFO  (TEST-TestCloudPivotFacet.test-seed#[39D34BE0B4D5CCCC]) [    ] o.a.s.c.AbstractZkTestCase put /home/jenkins/workspace/Lucene-Solr-master-Linux/solr/core/src/test-files/solr/collection1/conf/stopwords.txt to /configs/conf1/stopwords.txt
   [junit4]   2> 521955 INFO  (TEST-TestCloudPivotFacet.test-seed#[39D34BE0B4D5CCCC]) [    ] o.a.s.c.c.SolrZkClient makePath: /configs/conf1/stopwords.txt
   [junit4]   2> 521956 INFO  (TEST-TestCloudPivotFacet.test-seed#[39D34BE0B4D5CCCC]) [    ] o.a.s.c.AbstractZkTestCase put /home/jenkins/workspace/Lucene-Solr-master-Linux/solr/core/src/test-files/solr/collection1/conf/protwords.txt to /configs/conf1/protwords.txt
   [junit4]   2> 521956 INFO  (TEST-TestCloudPivotFacet.test-seed#[39D34BE0B4D5CCCC]) [    ] o.a.s.c.c.SolrZkClient makePath: /configs/conf1/protwords.txt
   [junit4]   2> 521956 INFO  (TEST-TestCloudPivotFacet.test-seed#[39D34BE0B4D5CCCC]) [    ] o.a.s.c.AbstractZkTestCase put /home/jenkins/workspace/Lucene-Solr-master-Linux/solr/core/src/test-files/solr/collection1/conf/currency.xml to /configs/conf1/currency.xml
   [junit4]   2> 521956 INFO  (TEST-TestCloudPivotFacet.test-seed#[39D34BE0B4D5CCCC]) [    ] o.a.s.c.c.SolrZkClient makePath: /configs/conf1/currency.xml
   [junit4]   2> 521957 INFO  (TEST-TestCloudPivotFacet.test-seed#[39D34BE0B4D5CCCC]) [    ] o.a.s.c.AbstractZkTestCase put /home/jenkins/workspace/Lucene-Solr-master-Linux/solr/core/src/test-files/solr/collection1/conf/enumsConfig.xml to /configs/conf1/enumsConfig.xml
   [junit4]   2> 521957 INFO  (TEST-TestCloudPivotFacet.test-seed#[39D34BE0B4D5CCCC]) [    ] o.a.s.c.c.SolrZkClient makePath: /configs/conf1/enumsConfig.xml
   [junit4]   2> 521957 INFO  (TEST-TestCloudPivotFacet.test-seed#[39D34BE0B4D5CCCC]) [    ] o.a.s.c.AbstractZkTestCase put /home/jenkins/workspace/Lucene-Solr-master-Linux/solr/core/src/test-files/solr/collection1/conf/open-exchange-rates.json to /configs/conf1/open-exchange-rates.json
   [junit4]   2> 521957 INFO  (TEST-TestCloudPivotFacet.test-seed#[39D34BE0B4D5CCCC]) [    ] o.a.s.c.c.SolrZkClient makePath: /configs/conf1/open-exchange-rates.json
   [junit4]   2> 521958 INFO  (TEST-TestCloudPivotFacet.test-seed#[39D34BE0B4D5CCCC]) [    ] o.a.s.c.AbstractZkTestCase put /home/jenkins/workspace/Lucene-Solr-master-Linux/solr/core/src/test-files/solr/collection1/conf/mapping-ISOLatin1Accent.txt to /configs/conf1/mapping-ISOLatin1Accent.txt
   [junit4]   2> 521958 INFO  (TEST-TestCloudPivotFacet.test-seed#[39D34BE0B4D5CCCC]) [    ] o.a.s.c.c.SolrZkClient makePath: /configs/conf1/mapping-ISOLatin1Accent.txt
   [junit4]   2> 521958 INFO  (TEST-TestCloudPivotFacet.test-seed#[39D34BE0B4D5CCCC]) [    ] o.a.s.c.AbstractZkTestCase put /home/jenkins/workspace/Lucene-Solr-master-Linux/solr/core/src/test-files/solr/collection1/conf/old_synonyms.txt to /configs/conf1/old_synonyms.txt
   [junit4]   2> 521958 INFO  (TEST-TestCloudPivotFacet.test-seed#[39D34BE0B4D5CCCC]) [    ] o.a.s.c.c.SolrZkClient makePath: /configs/conf1/old_synonyms.txt
   [junit4]   2> 521959 INFO  (TEST-TestCloudPivotFacet.test-seed#[39D34BE0B4D5CCCC]) [    ] o.a.s.c.AbstractZkTestCase put /home/jenkins/workspace/Lucene-Solr-master-Linux/solr/core/src/test-files/solr/collection1/conf/synonyms.txt to /configs/conf1/synonyms.txt
   [junit4]   2> 521959 INFO  (TEST-TestCloudPivotFacet.test-seed#[39D34BE0B4D5CCCC]) [    ] o.a.s.c.c.SolrZkClient makePath: /configs/conf1/synonyms.txt
   [junit4]   2> 522003 INFO  (TEST-TestCloudPivotFacet.test-seed#[39D34BE0B4D5CCCC]) [    ] o.a.s.SolrTestCaseJ4 Writing core.properties file to /home/jenkins/workspace/Lucene-Solr-master-Linux/solr/build/solr-core/test/J1/temp/solr.cloud.TestCloudPivotFacet_39D34BE0B4D5CCCC-001/control-001/cores/collection1
   [junit4]   2> 522004 INFO  (TEST-TestCloudPivotFacet.test-seed#[39D34BE0B4D5CCCC]) [    ] o.e.j.s.Server jetty-9.3.8.v20160314
   [junit4]   2> 522005 INFO  (TEST-TestCloudPivotFacet.test-seed#[39D34BE0B4D5CCCC]) [    ] o.e.j.s.h.ContextHandler Started o.e.j.s.ServletContextHandler@2eba0b63{/,null,AVAILABLE}
   [junit4]   2> 522007 INFO  (TEST-TestCloudPivotFacet.test-seed#[39D34BE0B4D5CCCC]) [    ] o.e.j.s.ServerConnector Started ServerConnector@27c3b453{HTTP/1.1,[http/1.1]}{127.0.0.1:42127}
   [junit4]   2> 522007 INFO  (TEST-TestCloudPivotFacet.test-seed#[39D34BE0B4D5CCCC]) [    ] o.e.j.s.Server Started @523623ms
   [junit4]   2> 522007 INFO  (TEST-TestCloudPivotFacet.test-seed#[39D34BE0B4D5CCCC]) [    ] o.a.s.c.s.e.JettySolrRunner Jetty properties: {solr.data.dir=/home/jenkins/workspace/Lucene-Solr-master-Linux/solr/build/solr-core/test/J1/temp/solr.cloud.TestCloudPivotFacet_39D34BE0B4D5CCCC-001/tempDir-001/control/data, hostContext=/, hostPort=42127, coreRootDirectory=/home/jenkins/workspace/Lucene-Solr-master-Linux/solr/build/solr-core/test/J1/temp/solr.cloud.TestCloudPivotFacet_39D34BE0B4D5CCCC-001/control-001/cores}
   [junit4]   2> 522007 INFO  (TEST-TestCloudPivotFacet.test-seed#[39D34BE0B4D5CCCC]) [    ] o.a.s.s.SolrDispatchFilter SolrDispatchFilter.init(): sun.misc.Launcher$AppClassLoader@73d16e93
   [junit4]   2> 522007 INFO  (TEST-TestCloudPivotFacet.test-seed#[39D34BE0B4D5CCCC]) [    ] o.a.s.c.SolrResourceLoader new SolrResourceLoader for directory: '/home/jenkins/workspace/Lucene-Solr-master-Linux/solr/build/solr-core/test/J1/temp/solr.cloud.TestCloudPivotFacet_39D34BE0B4D5CCCC-001/control-001'
   [junit4]   2> 522007 INFO  (TEST-TestCloudPivotFacet.test-seed#[39D34BE0B4D5CCCC]) [    ] o.a.s.c.SolrResourceLoader JNDI not configured for solr (NoInitialContextEx)
   [junit4]   2> 522007 INFO  (TEST-TestCloudPivotFacet.test-seed#[39D34BE0B4D5CCCC]) [    ] o.a.s.c.SolrResourceLoader solr home defaulted to 'solr/' (could not find system property or JNDI)
   [junit4]   2> 522008 INFO  (TEST-TestCloudPivotFacet.test-seed#[39D34BE0B4D5CCCC]) [    ] o.a.s.c.c.SolrZkClient Using default ZkCredentialsProvider
   [junit4]   2> 522008 INFO  (TEST-TestCloudPivotFacet.test-seed#[39D34BE0B4D5CCCC]) [    ] o.a.s.c.c.ConnectionManager Waiting for client to connect to ZooKeeper
   [junit4]   2> 522009 INFO  (zkCallback-428-thread-1) [    ] o.a.s.c.c.ConnectionManager Watcher org.apache.solr.common.cloud.ConnectionManager@160eee26 name:ZooKeeperConnection Watcher:127.0.0.1:33288/solr got event WatchedEvent state:SyncConnected type:None path:null path:null type:None
   [junit4]   2> 522009 INFO  (TEST-TestCloudPivotFacet.test-seed#[39D34BE0B4D5CCCC]) [    ] o.a.s.c.c.ConnectionManager Client is connected to ZooKeeper
   [junit4]   2> 522009 INFO  (TEST-TestCloudPivotFacet.test-seed#[39D34BE0B4D5CCCC]) [    ] o.a.s.c.c.SolrZkClient Using default ZkACLProvider
   [junit4]   2> 522009 INFO  (TEST-TestCloudPivotFacet.test-seed#[39D34BE0B4D5CCCC]) [    ] o.a.s.s.SolrDispatchFilter Loading solr.xml from SolrHome (not found in ZooKeeper)
   [junit4]   2> 522009 INFO  (TEST-TestCloudPivotFacet.test-seed#[39D34BE0B4D5CCCC]) [    ] o.a.s.c.SolrXmlConfig Loading container configuration from /home/jenkins/workspace/Lucene-Solr-master-Linux/solr/build/solr-core/test/J1/temp/solr.cloud.TestCloudPivotFacet_39D34BE0B4D5CCCC-001/control-001/solr.xml
   [junit4]   2> 522012 INFO  (TEST-TestCloudPivotFacet.test-seed#[39D34BE0B4D5CCCC]) [    ] o.a.s.c.CorePropertiesLocator Config-defined core root directory: /home/jenkins/workspace/Lucene-Solr-master-Linux/solr/build/solr-core/test/J1/temp/solr.cloud.TestCloudPivotFacet_39D34BE0B4D5CCCC-001/control-001/cores
   [junit4]   2> 522013 INFO  (TEST-TestCloudPivotFacet.test-seed#[39D34BE0B4D5CCCC]) [    ] o.a.s.c.CoreContainer New CoreContainer 1160330195
   [junit4]   2> 522013 INFO  (TEST-TestCloudPivotFacet.test-seed#[39D34BE0B4D5CCCC]) [    ] o.a.s.c.CoreContainer Loading cores into CoreContainer [instanceDir=/home/jenkins/workspace/Lucene-Solr-master-Linux/solr/build/solr-core/test/J1/temp/solr.cloud.TestCloudPivotFacet_39D34BE0B4D5CCCC-001/control-001]
   [junit4]   2> 522013 WARN  (TEST-TestCloudPivotFacet.test-seed#[39D34BE0B4D5CCCC]) [    ] o.a.s.c.CoreContainer Couldn't add files from /home/jenkins/workspace/Lucene-Solr-master-Linux/solr/build/solr-core/test/J1/temp/solr.cloud.TestCloudPivotFacet_39D34BE0B4D5CCCC-001/control-001/lib to classpath: /home/jenkins/workspace/Lucene-Solr-master-Linux/solr/build/solr-core/test/J1/temp/solr.cloud.TestCloudPivotFacet_39D34BE0B4D5CCCC-001/control-001/lib
   [junit4]   2> 522013 INFO  (TEST-TestCloudPivotFacet.test-seed#[39D34BE0B4D5CCCC]) [    ] o.a.s.h.c.HttpShardHandlerFactory created with socketTimeout : 90000,urlScheme : ,connTimeout : 15000,maxConnectionsPerHost : 20,maxConnections : 10000,corePoolSize : 0,maximumPoolSize : 2147483647,maxThreadIdleTime : 5,sizeOfQueue : -1,fairnessPolicy : false,useRetries : false,
   [junit4]   2> 522014 INFO  (TEST-TestCloudPivotFacet.test-seed#[39D34BE0B4D5CCCC]) [    ] o.a.s.u.UpdateShardHandler Creating UpdateShardHandler HTTP client with params: socketTimeout=340000&connTimeout=45000&retry=true
   [junit4]   2> 522014 INFO  (TEST-TestCloudPivotFacet.test-seed#[39D34BE0B4D5CCCC]) [    ] o.a.s.l.LogWatcher SLF4J impl is org.slf4j.impl.Log4jLoggerFactory
   [junit4]   2> 522014 INFO  (TEST-TestCloudPivotFacet.test-seed#[39D34BE0B4D5CCCC]) [    ] o.a.s.l.LogWatcher Registering Log Listener [Log4j (org.slf4j.impl.Log4jLoggerFactory)]
   [junit4]   2> 522014 INFO  (TEST-TestCloudPivotFacet.test-seed#[39D34BE0B4D5CCCC]) [    ] o.a.s.c.ZkContainer Zookeeper client=127.0.0.1:33288/solr
   [junit4]   2> 522014 INFO  (TEST-TestCloudPivotFacet.test-seed#[39D34BE0B4D5CCCC]) [    ] o.a.s.c.ZkController zkHost includes chroot
   [junit4]   2> 522014 INFO  (TEST-TestCloudPivotFacet.test-seed#[39D34BE0B4D5CCCC]) [    ] o.a.s.c.c.SolrZkClient Using default ZkCredentialsProvider
   [junit4]   2> 522014 INFO  (TEST-TestCloudPivotFacet.test-seed#[39D34BE0B4D5CCCC]) [    ] o.a.s.c.c.ConnectionManager Waiting for client to connect to ZooKeeper
   [junit4]   2> 522015 INFO  (zkCallback-431-thread-1) [    ] o.a.s.c.c.ConnectionManager Watcher org.apache.solr.common.cloud.ConnectionManager@723a1fb3 name:ZooKeeperConnection Watcher:127.0.0.1:33288 got event WatchedEvent state:SyncConnected type:None path:null path:null type:None
   [junit4]   2> 522016 INFO  (TEST-TestCloudPivotFacet.test-seed#[39D34BE0B4D5CCCC]) [    ] o.a.s.c.c.ConnectionManager Client is connected to ZooKeeper
   [junit4]   2> 522016 INFO  (TEST-TestCloudPivotFacet.test-seed#[39D34BE0B4D5CCCC]) [    ] o.a.s.c.c.SolrZkClient Using default ZkACLProvider
   [junit4]   2> 522016 INFO  (TEST-TestCloudPivotFacet.test-seed#[39D34BE0B4D5CCCC]) [n:127.0.0.1:42127_    ] o.a.s.c.c.ConnectionManager Waiting for client to connect to ZooKeeper
   [junit4]   2> 522017 INFO  (zkCallback-432-thread-1-processing-n:127.0.0.1:42127_) [n:127.0.0.1:42127_    ] o.a.s.c.c.ConnectionManager Watcher org.apache.solr.common.cloud.ConnectionManager@7f854879 name:ZooKeeperConnection Watcher:127.0.0.1:33288/solr got event WatchedEvent state:SyncConnected type:None path:null path:null type:None
   [junit4]   2> 522017 INFO  (TEST-TestCloudPivotFacet.test-seed#[39D34BE0B4D5CCCC]) [n:127.0.0.1:42127_    ] o.a.s.c.c.ConnectionManager Client is connected to ZooKeeper
   [junit4]   2> 522017 INFO  (TEST-TestCloudPivotFacet.test-seed#[39D34BE0B4D5CCCC]) [n:127.0.0.1:42127_    ] o.a.s.c.c.SolrZkClient makePath: /overseer/queue
   [junit4]   2> 522018 INFO  (TEST-TestCloudPivotFacet.test-seed#[39D34BE0B4D5CCCC]) [n:127.0.0.1:42127_    ] o.a.s.c.c.SolrZkClient makePath: /overseer/collection-queue-work
   [junit4]   2> 522019 INFO  (TEST-TestCloudPivotFacet.test-seed#[39D34BE0B4D5CCCC]) [n:127.0.0.1:42127_    ] o.a.s.c.c.SolrZkClient makePath: /overseer/collection-map-running
   [junit4]   2> 522019 INFO  (TEST-TestCloudPivotFacet.test-seed#[39D34BE0B4D5CCCC]) [n:127.0.0.1:42127_    ] o.a.s.c.c.SolrZkClient makePath: /overseer/collection-map-completed
   [junit4]   2> 522020 INFO  (TEST-TestCloudPivotFacet.test-seed#[39D34BE0B4D5CCCC]) [n:127.0.0.1:42127_    ] o.a.s.c.c.SolrZkClient makePath: /overseer/collection-map-failure
   [junit4]   2> 522020 INFO  (TEST-TestCloudPivotFacet.test-seed#[39D34BE0B4D5CCCC]) [n:127.0.0.1:42127_    ] o.a.s.c.c.SolrZkClient makePath: /live_nodes
   [junit4]   2> 522020 INFO  (TEST-TestCloudPivotFacet.test-seed#[39D34BE0B4D5CCCC]) [n:127.0.0.1:42127_    ] o.a.s.c.c.SolrZkClient makePath: /aliases.json
   [junit4]   2> 522021 INFO  (TEST-TestCloudPivotFacet.test-seed#[39D34BE0B4D5CCCC]) [n:127.0.0.1:42127_    ] o.a.s.c.c.SolrZkClient makePath: /clusterstate.json
   [junit4]   2> 522021 INFO  (TEST-TestCloudPivotFacet.test-seed#[39D34BE0B4D5CCCC]) [n:127.0.0.1:42127_    ] o.a.s.c.c.SolrZkClient makePath: /security.json
   [junit4]   2> 522021 INFO  (TEST-TestCloudPivotFacet.test-seed#[39D34BE0B4D5CCCC]) [n:127.0.0.1:42127_    ] o.a.s.c.c.ZkStateReader Updating cluster state from ZooKeeper... 
   [junit4]   2> 522021 INFO  (TEST-TestCloudPivotFacet.test-seed#[39D34BE0B4D5CCCC]) [n:127.0.0.1:42127_    ] o.a.s.c.c.ZkStateReader Updated live nodes from ZooKeeper... (0) -> (0)
   [junit4]   2> 522022 INFO  (TEST-TestCloudPivotFacet.test-seed#[39D34BE0B4D5CCCC]) [n:127.0.0.1:42127_    ] o.a.s.c.c.SolrZkClient makePath: /overseer_elect
   [junit4]   2> 522022 INFO  (TEST-TestCloudPivotFacet.test-seed#[39D34BE0B4D5CCCC]) [n:127.0.0.1:42127_    ] o.a.s.c.c.SolrZkClient makePath: /overseer_elect/election
   [junit4]   2> 522023 INFO  (TEST-TestCloudPivotFacet.test-seed#[39D34BE0B4D5CCCC]) [n:127.0.0.1:42127_    ] o.a.s.c.Overseer Overseer (id=null) closing
   [junit4]   2> 522023 INFO  (TEST-TestCloudPivotFacet.test-seed#[39D34BE0B4D5CCCC]) [n:127.0.0.1:42127_    ] o.a.s.c.LeaderElector Joined leadership election with path: /overseer_elect/election/95597570045116420-127.0.0.1:42127_-n_0000000000
   [junit4]   2> 522023 INFO  (TEST-TestCloudPivotFacet.test-seed#[39D34BE0B4D5CCCC]) [n:127.0.0.1:42127_    ] o.a.s.c.OverseerElectionContext I am going to be the leader 127.0.0.1:42127_
   [junit4]   2> 522023 INFO  (TEST-TestCloudPivotFacet.test-seed#[39D34BE0B4D5CCCC]) [n:127.0.0.1:42127_    ] o.a.s.c.c.SolrZkClient makePath: /overseer_elect/leader
   [junit4]   2> 522023 INFO  (TEST-TestCloudPivotFacet.test-seed#[39D34BE0B4D5CCCC]) [n:127.0.0.1:42127_    ] o.a.s.c.Overseer Overseer (id=95597570045116420-127.0.0.1:42127_-n_0000000000) starting
   [junit4]   2> 522024 INFO  (TEST-TestCloudPivotFacet.test-seed#[39D34BE0B4D5CCCC]) [n:127.0.0.1:42127_    ] o.a.s.c.c.SolrZkClient makePath: /overseer/queue-work
   [junit4]   2> 522025 INFO  (TEST-TestCloudPivotFacet.test-seed#[39D34BE0B4D5CCCC]) [n:127.0.0.1:42127_    ] o.a.s.c.OverseerAutoReplicaFailoverThread Starting OverseerAutoReplicaFailoverThread autoReplicaFailoverWorkLoopDelay=10000 autoReplicaFailoverWaitAfterExpiration=30000 autoReplicaFailoverBadNodeExpiration=60000
   [junit4]   2> 522025 INFO  (OverseerCollectionConfigSetProcessor-95597570045116420-127.0.0.1:42127_-n_0000000000) [n:127.0.0.1:42127_    ] o.a.s.c.OverseerTaskProcessor Process current queue of overseer operations
   [junit4]   2> 522025 INFO  (TEST-TestCloudPivotFacet.test-seed#[39D34BE0B4D5CCCC]) [n:127.0.0.1:42127_    ] o.a.s.c.ZkController Register node as live in ZooKeeper:/live_nodes/127.0.0.1:42127_
   [junit4]   2> 522025 INFO  (OverseerStateUpdate-95597570045116420-127.0.0.1:42127_-n_0000000000) [n:127.0.0.1:42127_    ] o.a.s.c.Overseer Starting to work on the main queue
   [junit4]   2> 522025 INFO  (TEST-TestCloudPivotFacet.test-seed#[39D34BE0B4D5CCCC]) [n:127.0.0.1:42127_    ] o.a.s.c.c.SolrZkClient makePath: /live_nodes/127.0.0.1:42127_
   [junit4]   2> 522027 INFO  (zkCallback-432-thread-1-processing-n:127.0.0.1:42127_) [n:127.0.0.1:42127_    ] o.a.s.c.c.ZkStateReader A live node change: [WatchedEvent state:SyncConnected type:NodeChildrenChanged path:/live_nodes], has occurred - updating... (live nodes size: [0])
   [junit4]   2> 522027 INFO  (OverseerStateUpdate-95597570045116420-127.0.0.1:42127_-n_0000000000) [n:127.0.0.1:42127_    ] o.a.s.c.c.ZkStateReader Updated live nodes from ZooKeeper... (0) -> (1)
   [junit4]   2> 522027 INFO  (zkCallback-432-thread-1-processing-n:127.0.0.1:42127_) [n:127.0.0.1:42127_    ] o.a.s.c.c.ZkStateReader Updated live nodes from ZooKeeper... (1) -> (1)
   [junit4]   2> 522037 INFO  (TEST-TestCloudPivotFacet.test-seed#[39D34BE0B4D5CCCC]) [n:127.0.0.1:42127_    ] o.a.s.c.CoreContainer Security conf doesn't exist. Skipping setup for authorization module.
   [junit4]   2> 522037 INFO  (TEST-TestCloudPivotFacet.test-seed#[39D34BE0B4D5CCCC]) [n:127.0.0.1:42127_    ] o.a.s.c.CoreContainer No authentication plugin used.
   [junit4]   2> 522038 INFO  (TEST-TestCloudPivotFacet.test-seed#[39D34BE0B4D5CCCC]) [n:127.0.0.1:42127_    ] o.a.s.c.CorePropertiesLocator Looking for core definitions underneath /home/jenkins/workspace/Lucene-Solr-master-Linux/solr/build/solr-core/test/J1/temp/solr.cloud.TestCloudPivotFacet_39D34BE0B4D5CCCC-001/control-001/cores
   [junit4]   2> 522039 INFO  (TEST-TestCloudPivotFacet.test-seed#[39D34BE0B4D5CCCC]) [n:127.0.0.1:42127_    ] o.a.s.c.CoreDescriptor Created CoreDescriptor: {name=collection1, config=solrconfig.xml, transient=false, schema=schema.xml, loadOnStartup=true, configSetProperties=configsetprops.json, collection=control_collection, coreNodeName=, dataDir=data/, shard=}
   [junit4]   2> 522039 INFO  (TEST-TestCloudPivotFacet.test-seed#[39D34BE0B4D5CCCC]) [n:127.0.0.1:42127_    ] o.a.s.c.CorePropertiesLocator Found core collection1 in /home/jenkins/workspace/Lucene-Solr-master-Linux/solr/build/solr-core/test/J1/temp/solr.cloud.TestCloudPivotFacet_39D34BE0B4D5CCCC-001/control-001/cores/collection1
   [junit4]   2> 522039 INFO  (TEST-TestCloudPivotFacet.test-seed#[39D34BE0B4D5CCCC]) [n:127.0.0.1:42127_    ] o.a.s.c.CorePropertiesLocator Found 1 core definitions
   [junit4]   2> 522039 INFO  (TEST-TestCloudPivotFacet.test-seed#[39D34BE0B4D5CCCC]) [n:127.0.0.1:42127_    ] o.a.s.s.SolrDispatchFilter user.dir=/home/jenkins/workspace/Lucene-Solr-master-Linux/solr/build/solr-core/test/J1
   [junit4]   2> 522039 INFO  (TEST-TestCloudPivotFacet.test-seed#[39D34BE0B4D5CCCC]) [n:127.0.0.1:42127_    ] o.a.s.s.SolrDispatchFilter SolrDispatchFilter.init() done
   [junit4]   2> 522039 INFO  (coreLoadExecutor-1465-thread-1-processing-n:127.0.0.1:42127_) [n:127.0.0.1:42127_ c:control_collection   x:collection1] o.a.s.c.ZkController publishing state=down
   [junit4]   2> 522039 INFO  (coreLoadExecutor-1465-thread-1-processing-n:127.0.0.1:42127_) [n:127.0.0.1:42127_ c:control_collection   x:collection1] o.a.s.c.ZkController numShards not found on descriptor - reading it from system property
   [junit4]   2> 522040 INFO  (coreLoadExecutor-1465-thread-1-processing-n:127.0.0.1:42127_) [n:127.0.0.1:42127_ c:control_collection   x:collection1] o.a.s.c.ZkController look for our core node name
   [junit4]   2> 522040 INFO  (OverseerStateUpdate-95597570045116420-127.0.0.1:42127_-n_0000000000) [n:127.0.0.1:42127_    ] o.a.s.c.Overseer processMessage: queueSize: 1, message = {
   [junit4]   2>   "core":"collection1",
   [junit4]   2>   "roles":null,
   [junit4]   2>   "base_url":"http://127.0.0.1:42127",
   [junit4]   2>   "node_name":"127.0.0.1:42127_",
   [junit4]   2>   "numShards":"1",
   [junit4]   2>   "state":"down",
   [junit4]   2>   "shard":null,
   [junit4]   2>   "collection":"control_collection",
   [junit4]   2>   "operation":"state"} current state version: 0
   [junit4]   2> 522040 INFO  (OverseerStateUpdate-95597570045116420-127.0.0.1:42127_-n_0000000000) [n:127.0.0.1:42127_    ] o.a.s.c.o.ReplicaMutator Update state numShards=1 message={
   [junit4]   2>   "core":"collection1",
   [junit4]   2>   "roles":null,
   [junit4]   2>   "base_url":"http://127.0.0.1:42127",
   [junit4]   2>   "node_name":"127.0.0.1:42127_",
   [junit4]   2>   "numShards":"1",
   [junit4]   2>   "state":"down",
   [junit4]   2>   "shard":null,
   [junit4]   2>   "collection":"control_collection",
   [junit4]   2>   "operation":"state"}
   [junit4]   2> 522040 INFO  (OverseerStateUpdate-95597570045116420-127.0.0.1:42127_-n_0000000000) [n:127.0.0.1:42127_    ] o.a.s.c.o.ClusterStateMutator building a new cName: control_collection
   [junit4]   2> 522040 INFO  (OverseerStateUpdate-95597570045116420-127.0.0.1:42127_-n_0000000000) [n:127.0.0.1:42127_    ] o.a.s.c.o.ReplicaMutator Assigning new node to shard shard=shard1
   [junit4]   2> 522041 INFO  (zkCallback-432-thread-1-processing-n:127.0.0.1:42127_) [n:127.0.0.1:42127_    ] o.a.s.c.c.ZkStateReader A cluster state change: [WatchedEvent state:SyncConnected type:NodeDataChanged path:/clusterstate.json], has occurred - updating... (live nodes size: [1])
   [junit4]   2> 523040 INFO  (coreLoadExecutor-1465-thread-1-processing-n:127.0.0.1:42127_) [n:127.0.0.1:42127_ c:control_collection   x:collection1] o.a.s.c.ZkController waiting to find shard id in clusterstate for collection1
   [junit4]   2> 523040 INFO  (coreLoadExecutor-1465-thread-1-processing-n:127.0.0.1:42127_) [n:127.0.0.1:42127_ c:control_collection   x:collection1] o.a.s.c.ZkController Check for collection zkNode:control_collection
   [junit4]   2> 523040 INFO  (coreLoadExecutor-1465-thread-1-processing-n:127.0.0.1:42127_) [n:127.0.0.1:42127_ c:control_collection   x:collection1] o.a.s.c.ZkController Collection zkNode exists
   [junit4]   2> 523040 INFO  (coreLoadExecutor-1465-thread-1-processing-n:127.0.0.1:42127_) [n:127.0.0.1:42127_ c:control_collection   x:collection1] o.a.s.c.c.ZkStateReader Load collection config from: [/collections/control_collection]
   [junit4]   2> 523040 INFO  (coreLoadExecutor-1465-thread-1-processing-n:127.0.0.1:42127_) [n:127.0.0.1:42127_ c:control_collection   x:collection1] o.a.s.c.c.ZkStateReader path=[/collections/control_collection] [configName]=[conf1] specified config exists in ZooKeeper
   [junit4]   2> 523041 INFO  (coreLoadExecutor-1465-thread-1-processing-n:127.0.0.1:42127_) [n:127.0.0.1:42127_ c:control_collection   x:collection1] o.a.s.c.SolrResourceLoader new SolrResourceLoader for directory: '/home/jenkins/workspace/Lucene-Solr-master-Linux/solr/build/solr-core/test/J1/temp/solr.cloud.TestCloudPivotFacet_39D34BE0B4D5CCCC-001/control-001/cores/collection1'
   [junit4]   2> 523041 INFO  (coreLoadExecutor-1465-thread-1-processing-n:127.0.0.1:42127_) [n:127.0.0.1:42127_ c:control_collection   x:collection1] o.a.s.c.SolrResourceLoader JNDI not configured for solr (NoInitialContextEx)
   [junit4]   2> 523041 INFO  (coreLoadExecutor-1465-thread-1-processing-n:127.0.0.1:42127_) [n:127.0.0.1:42127_ c:control_collection   x:collection1] o.a.s.c.SolrResourceLoader solr home defaulted to 'solr/' (could not find system property or JNDI)
   [junit4]   2> 523042 INFO  (coreLoadExecutor-1465-thread-1-processing-n:127.0.0.1:42127_) [n:127.0.0.1:42127_ c:control_collection   x:collection1] o.a.s.c.Config loaded config solrconfig.xml with version 0 
   [junit4]   2> 523045 INFO  (coreLoadExecutor-1465-thread-1-processing-n:127.0.0.1:42127_) [n:127.0.0.1:42127_ c:control_collection   x:collection1] o.a.s.c.SolrConfig current version of requestparams : -1
   [junit4]   2> 523048 WARN  (coreLoadExecutor-1465-thread-1-processing-n:127.0.0.1:42127_) [n:127.0.0.1:42127_ c:control_collection   x:collection1] o.a.s.c.Config Beginning with Solr 5.5, <mergePolicy> is deprecated, use <mergePolicyFactory> instead.
   [junit4]   2> 523049 INFO  (coreLoadExecutor-1465-thread-1-processing-n:127.0.0.1:42127_) [n:127.0.0.1:42127_ c:control_collection   x:collection1] o.a.s.c.SolrConfig Using Lucene MatchVersion: 7.0.0
   [junit4]   2> 523057 INFO  (coreLoadExecutor-1465-thread-1-processing-n:127.0.0.1:42127_) [n:127.0.0.1:42127_ c:control_collection   x:collection1] o.a.s.c.SolrConfig Loaded SolrConfig: solrconfig.xml
   [junit4]   2> 523061 INFO  (coreLoadExecutor-1465-thread-1-processing-n:127.0.0.1:42127_) [n:127.0.0.1:42127_ c:control_collection   x:collection1] o.a.s.s.IndexSchema [collection1] Schema name=test
   [junit4]   2> 523131 INFO  (coreLoadExecutor-1465-thread-1-processing-n:127.0.0.1:42127_) [n:127.0.0.1:42127_ c:control_collection   x:collection1] o.a.s.s.OpenExchangeRatesOrgProvider Initialized with rates=open-exchange-rates.json, refreshInterval=1440.
   [junit4]   2> 523135 INFO  (coreLoadExecutor-1465-thread-1-processing-n:127.0.0.1:42127_) [n:127.0.0.1:42127_ c:control_collection   x:collection1] o.a.s.s.IndexSchema default search field in schema is text
   [junit4]   2> 523135 INFO  (coreLoadExecutor-1465-thread-1-processing-n:127.0.0.1:42127_) [n:127.0.0.1:42127_ c:control_collection   x:collection1] o.a.s.s.IndexSchema unique key field: id
   [junit4]   2> 523139 INFO  (coreLoadExecutor-1465-thread-1-processing-n:127.0.0.1:42127_) [n:127.0.0.1:42127_ c:control_collection   x:collection1] o.a.s.s.FileExchangeRateProvider Reloading exchange rates from file currency.xml
   [junit4]   2> 523140 INFO  (coreLoadExecutor-1465-thread-1-processing-n:127.0.0.1:42127_) [n:127.0.0.1:42127_ c:control_collection   x:collection1] o.a.s.s.FileExchangeRateProvider Reloading exchange rates from file currency.xml
   [junit4]   2> 523141 INFO  (coreLoadExecutor-1465-thread-1-processing-n:127.0.0.1:42127_) [n:127.0.0.1:42127_ c:control_collection   x:collection1] o.a.s.s.OpenExchangeRatesOrgProvider Reloading exchange rates from open-exchange-rates.json
   [junit4]   2> 523142 INFO  (coreLoadExecutor-1465-thread-1-processing-n:127.0.0.1:42127_) [n:127.0.0.1:42127_ c:control_collection   x:collection1] o.a.s.s.OpenExchangeRatesOrgProvider Reloading exchange rates from open-exchange-rates.json
   [junit4]   2> 523143 INFO  (coreLoadExecutor-1465-thread-1-processing-n:127.0.0.1:42127_) [n:127.0.0.1:42127_ c:control_collection   x:collection1] o.a.s.c.ConfigSetProperties Did not find ConfigSet properties, assuming default properties: Can't find resource 'configsetprops.json' in classpath or '/configs/conf1', cwd=/home/jenkins/workspace/Lucene-Solr-master-Linux/solr/build/solr-core/test/J1
   [junit4]   2> 523143 INFO  (coreLoadExecutor-1465-thread-1-processing-n:127.0.0.1:42127_) [n:127.0.0.1:42127_ c:control_collection   x:collection1] o.a.s.c.CoreContainer Creating SolrCore 'collection1' using configuration from collection control_collection
   [junit4]   2> 523143 INFO  (coreLoadExecutor-1465-thread-1-processing-n:127.0.0.1:42127_) [n:127.0.0.1:42127_ c:control_collection s:shard1 r:core_node1 x:collection1] o.a.s.c.SolrCore org.apache.solr.core.MockDirectoryFactory
   [junit4]   2> 523143 INFO  (coreLoadExecutor-1465-thread-1-processing-n:127.0.0.1:42127_) [n:127.0.0.1:42127_ c:control_collection s:shard1 r:core_node1 x:collection1] o.a.s.c.SolrCore [[collection1] ] Opening new SolrCore at [/home/jenkins/workspace/Lucene-Solr-master-Linux/solr/build/solr-core/test/J1/temp/solr.cloud.TestCloudPivotFacet_39D34BE0B4D5CCCC-001/control-001/cores/collection1], dataDir=[/home/jenkins/workspace/Lucene-Solr-master-Linux/solr/build/solr-core/test/J1/temp/solr.cloud.TestCloudPivotFacet_39D34BE0B4D5CCCC-001/control-001/cores/collection1/data/]
   [junit4]   2> 523143 INFO  (coreLoadExecutor-1465-thread-1-processing-n:127.0.0.1:42127_) [n:127.0.0.1:42127_ c:control_collection s:shard1 r:core_node1 x:collection1] o.a.s.c.JmxMonitoredMap JMX monitoring is enabled. Adding Solr mbeans to JMX Server: com.sun.jmx.mbeanserver.JmxMBeanServer@4a65de4
   [junit4]   2> 523144 INFO  (coreLoadExecutor-1465-thread-1-processing-n:127.0.0.1:42127_) [n:127.0.0.1:42127_ c:control_collection s:shard1 r:core_node1 x:collection1] o.a.s.c.CachingDirectoryFactory return new directory for /home/jenkins/workspace/Lucene-Solr-master-Linux/solr/build/solr-core/test/J1/temp/solr.cloud.TestCloudPivotFacet_39D34BE0B4D5CCCC-001/control-001/cores/collection1/data
   [junit4]   2> 523144 INFO  (coreLoadExecutor-1465-thread-1-processing-n:127.0.0.1:42127_) [n:127.0.0.1:42127_ c:control_collection s:shard1 r:core_node1 x:collection1] o.a.s.c.SolrCore New index directory detected: old=null new=/home/jenkins/workspace/Lucene-Solr-master-Linux/solr/build/solr-core/test/J1/temp/solr.cloud.TestCloudPivotFacet_39D34BE0B4D5CCCC-001/control-001/cores/collection1/data/index/
   [junit4]   2> 523144 WARN  (coreLoadExecutor-1465-thread-1-processing-n:127.0.0.1:42127_) [n:127.0.0.1:42127_ c:control_collection s:shard1 r:core_node1 x:collection1] o.a.s.c.SolrCore [collection1] Solr index directory '/home/jenkins/workspace/Lucene-Solr-master-Linux/solr/build/solr-core/test/J1/temp/solr.cloud.TestCloudPivotFacet_39D34BE0B4D5CCCC-001/control-001/cores/collection1/data/index' doesn't exist. Creating new index...
   [junit4]   2> 523144 INFO  (coreLoadExecutor-1465-thread-1-processing-n:127.0.0.1:42127_) [n:127.0.0.1:42127_ c:control_collection s:shard1 r:core_node1 x:collection1] o.a.s.c.CachingDirectoryFactory return new directory for /home/jenkins/workspace/Lucene-Solr-master-Linux/solr/build/solr-core/test/J1/temp/solr.cloud.TestCloudPivotFacet_39D34BE0B4D5CCCC-001/control-001/cores/collection1/data/index
   [junit4]   2> 523144 INFO  (coreLoadExecutor-1465-thread-1-processing-n:127.0.0.1:42127_) [n:127.0.0.1:42127_ c:control_collection s:shard1 r:core_node1 x:collection1] o.a.s.u.RandomMergePolicy RandomMergePolicy wrapping class org.apache.lucene.index.LogByteSizeMergePolicy: [LogByteSizeMergePolicy: minMergeSize=1677721, mergeFactor=33, maxMergeSize=2147483648, maxMergeSizeForForcedMerge=9223372036854775807, calibrateSizeByDeletes=true, maxMergeDocs=2147483647, maxCFSSegmentSizeMB=8.796093022207999E12, noCFSRatio=0.4294119871040005]
   [junit4]   2> 523144 INFO  (coreLoadExecutor-1465-thread-1-processing-n:127.0.0.1:42127_) [n:127.0.0.1:42127_ c:control_collection s:shard1 r:core_node1 x:collection1] o.a.s.c.SolrDeletionPolicy SolrDeletionPolicy.onCommit: commits: num=1
   [junit4]   2> 	commit{dir=MockDirectoryWrapper(RAMDirectory@6f0f570e lockFactory=org.apache.lucene.store.SingleInstanceLockFactory@57958333),segFN=segments_1,generation=1}
   [junit4]   2> 523144 INFO  (coreLoadExecutor-1465-thread-1-processing-n:127.0.0.1:42127_) [n:127.0.0.1:42127_ c:control_collection s:shard1 r:core_node1 x:collection1] o.a.s.c.SolrDeletionPolicy newest commit generation = 1
   [junit4]   2> 523145 INFO  (OldIndexDirectoryCleanupThreadForCore-collection1) [n:127.0.0.1:42127_ c:control_collection s:shard1 r:core_node1 x:collection1] o.a.s.c.SolrCore Looking for old index directories to cleanup for core collection1 in /home/jenkins/workspace/Lucene-Solr-master-Linux/solr/build/solr-core/test/J1/temp/solr.cloud.TestCloudPivotFacet_39D34BE0B4D5CCCC-001/control-001/cores/collection1/data/
   [junit4]   2> 523145 WARN  (OldIndexDirectoryCleanupThreadForCore-collection1) [n:127.0.0.1:42127_ c:control_collection s:shard1 r:core_node1 x:collection1] o.a.s.c.DirectoryFactory /home/jenkins/workspace/Lucene-Solr-master-Linux/solr/build/solr-core/test/J1/temp/solr.cloud.TestCloudPivotFacet_39D34BE0B4D5CCCC-001/control-001/cores/collection1/data/ does not point to a valid data directory; skipping clean-up of old index directories.
   [junit4]   2> 523147 INFO  (coreLoadExecutor-1465-thread-1-processing-n:127.0.0.1:42127_) [n:127.0.0.1:42127_ c:control_collection s:shard1 r:core_node1 x:collection1] o.a.s.u.p.UpdateRequestProcessorChain creating updateRequestProcessorChain "nodistrib"
   [junit4]   2> 523147 INFO  (coreLoadExecutor-1465-thread-1-processing-n:127.0.0.1:42127_) [n:127.0.0.1:42127_ c:control_collection s:shard1 r:core_node1 x:collection1] o.a.s.u.p.UpdateRequestProcessorChain creating updateRequestProcessorChain "dedupe"
   [junit4]   2> 523147 INFO  (coreLoadExecutor-1465-thread-1-processing-n:127.0.0.1:42127_) [n:127.0.0.1:42127_ c:control_collection s:shard1 r:core_node1 x:collection1] o.a.s.u.p.UpdateRequestProcessorChain inserting DistributedUpdateProcessorFactory into updateRequestProcessorChain "dedupe"
   [junit4]   2> 523147 INFO  (coreLoadExecutor-1465-thread-1-processing-n:127.0.0.1:42127_) [n:127.0.0.1:42127_ c:control_collection s:shard1 r:core_node1 x:collection1] o.a.s.u.p.UpdateRequestProcessorChain creating updateRequestProcessorChain "stored_sig"
   [junit4]   2> 523147 INFO  (coreLoadExecutor-1465-thread-1-processing-n:127.0.0.1:42127_) [n:127.0.0.1:42127_ c:control_collection s:shard1 r:core_node1 x:collection1] o.a.s.u.p.UpdateRequestProcessorChain inserting DistributedUpdateProcessorFactory into updateRequestProcessorChain "stored_sig"
   [junit4]   2> 523147 INFO  (coreLoadExecutor-1465-thread-1-processing-n:127.0.0.1:42127_) [n:127.0.0.1:42127_ c:control_collection s:shard1 r:core_node1 x:collection1] o.a.s.u.p.UpdateRequestProcessorChain creating updateRequestProcessorChain "distrib-dup-test-chain-explicit"
   [junit4]   2> 523147 INFO  (coreLoadExecutor-1465-thread-1-processing-n:127.0.0.1:42127_) [n:127.0.0.1:42127_ c:control_collection s:shard1 r:core_node1 x:collection1] o.a.s.u.p.UpdateRequestProcessorChain creating updateRequestProcessorChain "distrib-dup-test-chain-implicit"
   [junit4]   2> 523147 INFO  (coreLoadExecutor-1465-thread-1-processing-n:127.0.0.1:42127_) [n:127.0.0.1:42127_ c:control_collection s:shard1 r:core_node1 x:collection1] o.a.s.u.p.UpdateRequestProcessorChain inserting DistributedUpdateProcessorFactory into updateRequestProcessorChain "distrib-dup-test-chain-implicit"
   [junit4]   2> 523148 INFO  (coreLoadExecutor-1465-thread-1-processing-n:127.0.0.1:42127_) [n:127.0.0.1:42127_ c:control_collection s:shard1 r:core_node1 x:collection1] o.a.s.c.SolrCore no updateRequestProcessorChain defined as default, creating implicit default
   [junit4]   2> 523148 WARN  (coreLoadExecutor-1465-thread-1-processing-n:127.0.0.1:42127_) [n:127.0.0.1:42127_ c:control_collection s:shard1 r:core_node1 x:collection1] o.a.s.c.RequestHandlers INVALID paramSet a in requestHandler {type = requestHandler,name = /dump,class = DumpRequestHandler,args = {defaults={a=A,b=B}}}
   [junit4]   2> 523149 INFO  (coreLoadExecutor-1465-thread-1-processing-n:127.0.0.1:42127_) [n:127.0.0.1:42127_ c:control_collection s:shard1 r:core_node1 x:collection1] o.a.s.h.l.XMLLoader xsltCacheLifetimeSeconds=60
   [junit4]   2> 523149 INFO  (coreLoadExecutor-1465-thread-1-processing-n:127.0.0.1:42127_) [n:127.0.0.1:42127_ c:control_collection s:shard1 r:core_node1 x:collection1] o.a.s.h.l.XMLLoader xsltCacheLifetimeSeconds=60
   [junit4]   2> 523150 INFO  (coreLoadExecutor-1465-thread-1-processing-n:127.0.0.1:42127_) [n:127.0.0.1:42127_ c:control_collection s:shard1 r:core_node1 x:collection1] o.a.s.h.l.XMLLoader xsltCacheLifetimeSeconds=60
   [junit4]   2> 523150 INFO  (coreLoadExecutor-1465-thread-1-processing-n:127.0.0.1:42127_) [n:127.0.0.1:42127_ c:control_collection s:shard1 r:core_node1 x:collection1] o.a.s.h.l.XMLLoader xsltCacheLifetimeSeconds=60
   [junit4]   2> 523152 INFO  (coreLoadExecutor-1465-thread-1-processing-n:127.0.0.1:42127_) [n:127.0.0.1:42127_ c:control_collection s:shard1 r:core_node1 x:collection1] o.a.s.c.RequestHandlers Registered paths: /admin/mbeans,standard,/dump,/update/csv,/sql,/update/json/docs,/admin/luke,/export,/admin/segments,/get,/admin/system,/replication,/admin/properties,/config,/stream,/schema,/admin/plugins,/admin/logging,/update/json,/admin/ping,/admin/threads,/update,/admin/file
   [junit4]   2> 523152 INFO  (coreLoadExecutor-1465-thread-1-processing-n:127.0.0.1:42127_) [n:127.0.0.1:42127_ c:control_collection s:shard1 r:core_node1 x:collection1] o.a.s.c.SolrCore Using default statsCache cache: org.apache.solr.search.stats.LocalStatsCache
   [junit4]   2> 523152 INFO  (coreLoadExecutor-1465-thread-1-processing-n:127.0.0.1:42127_) [n:127.0.0.1:42127_ c:control_collection s:shard1 r:core_node1 x:collection1] o.a.s.u.UpdateHandler Using UpdateLog implementation: org.apache.solr.update.UpdateLog
   [junit4]   2> 523153 INFO  (coreLoadExecutor-1465-thread-1-processing-n:127.0.0.1:42127_) [n:127.0.0.1:42127_ c:control_collection s:shard1 r:core_node1 x:collection1] o.a.s.u.UpdateLog Initializing UpdateLog: dataDir= defaultSyncLevel=FLUSH numRecordsToKeep=100 maxNumLogsToKeep=10 numVersionBuckets=65536
   [junit4]   2> 523153 INFO  (coreLoadExecutor-1465-thread-1-processing-n:127.0.0.1:42127_) [n:127.0.0.1:42127_ c:control_collection s:shard1 r:core_node1 x:collection1] o.a.s.u.CommitTracker Hard AutoCommit: disabled
   [junit4]   2> 523153 INFO  (coreLoadExecutor-1465-thread-1-processing-n:127.0.0.1:42127_) [n:127.0.0.1:42127_ c:control_collection s:shard1 r:core_node1 x:collection1] o.a.s.u.CommitTracker Soft AutoCommit: disabled
   [junit4]   2> 523153 INFO  (coreLoadExecutor-1465-thread-1-processing-n:127.0.0.1:42127_) [n:127.0.0.1:42127_ c:control_collection s:shard1 r:core_node1 x:collection1] o.a.s.u.RandomMergePolicy RandomMergePolicy wrapping class org.apache.lucene.index.LogDocMergePolicy: [LogDocMergePolicy: minMergeSize=1000, mergeFactor=17, maxMergeSize=9223372036854775807, maxMergeSizeForForcedMerge=9223372036854775807, calibrateSizeByDeletes=true, maxMergeDocs=2147483647, maxCFSSegmentSizeMB=8.796093022207999E12, noCFSRatio=0.48723095929158944]
   [junit4]   2> 523153 INFO  (coreLoadExecutor-1465-thread-1-processing-n:127.0.0.1:42127_) [n:127.0.0.1:42127_ c:control_collection s:shard1 r:core_node1 x:collection1] o.a.s.c.SolrDeletionPolicy SolrDeletionPolicy.onInit: commits: num=1
   [junit4]   2> 	commit{dir=MockDirectoryWrapper(RAMDirectory@6f0f570e lockFactory=org.apache.lucene.store.SingleInstanceLockFactory@57958333),segFN=segments_1,generation=1}
   [junit4]   2> 523154 INFO  (coreLoadExecutor-1465-thread-1-processing-n:127.0.0.1:42127_) [n:127.0.0.1:42127_ c:control_collection s:shard1 r:core_node1 x:collection1] o.a.s.c.SolrDeletionPolicy newest commit generation = 1
   [junit4]   2> 523154 INFO  (coreLoadExecutor-1465-thread-1-processing-n:127.0.0.1:42127_) [n:127.0.0.1:42127_ c:control_collection s:shard1 r:core_node1 x:collection1] o.a.s.s.SolrIndexSearcher Opening [Searcher@5e66d5de[collection1] main]
   [junit4]   2> 523154 INFO  (coreLoadExecutor-1465-thread-1-processing-n:127.0.0.1:42127_) [n:127.0.0.1:42127_ c:control_collection s:shard1 r:core_node1 x:collection1] o.a.s.c.c.ZkStateReader Load collection config from: [/collections/control_collection]
   [junit4]   2> 523154 INFO  (coreLoadExecutor-1465-thread-1-processing-n:127.0.0.1:42127_) [n:127.0.0.1:42127_ c:control_collection s:shard1 r:core_node1 x:collection1] o.a.s.c.c.ZkStateReader path=[/collections/control_collection] [configName]=[conf1] specified config exists in ZooKeeper
   [junit4]   2> 523155 INFO  (coreLoadExecutor-1465-thread-1-processing-n:127.0.0.1:42127_) [n:127.0.0.1:42127_ c:control_collection s:shard1 r:core_node1 x:collection1] o.a.s.r.ManagedResourceStorage Setting up ZooKeeper-based storage for the RestManager with znodeBase: /configs/conf1
   [junit4]   2> 523155 INFO  (coreLoadExecutor-1465-thread-1-processing-n:127.0.0.1:42127_) [n:127.0.0.1:42127_ c:control_collection s:shard1 r:core_node1 x:collection1] o.a.s.r.ManagedResourceStorage Configured ZooKeeperStorageIO with znodeBase: /configs/conf1
   [junit4]   2> 523155 INFO  (coreLoadExecutor-1465-thread-1-processing-n:127.0.0.1:42127_) [n:127.0.0.1:42127_ c:control_collection s:shard1 r:core_node1 x:collection1] o.a.s.r.RestManager Initializing RestManager with initArgs: {}
   [junit4]   2> 523155 INFO  (coreLoadExecutor-1465-thread-1-processing-n:127.0.0.1:42127_) [n:127.0.0.1:42127_ c:control_collection s:shard1 r:core_node1 x:collection1] o.a.s.r.ManagedResourceStorage Reading _rest_managed.json using ZooKeeperStorageIO:path=/configs/conf1
   [junit4]   2> 523155 INFO  (coreLoadExecutor-1465-thread-1-processing-n:127.0.0.1:42127_) [n:127.0.0.1:42127_ c:control_collection s:shard1 r:core_node1 x:collection1] o.a.s.r.ManagedResourceStorage No data found for znode /configs/conf1/_rest_managed.json
   [junit4]   2> 523155 INFO  (coreLoadExecutor-1465-thread-1-processing-n:127.0.0.1:42127_) [n:127.0.0.1:42127_ c:control_collection s:shard1 r:core_node1 x:collection1] o.a.s.r.ManagedResourceStorage Loaded null at path _rest_managed.json using ZooKeeperStorageIO:path=/configs/conf1
   [junit4]   2> 523155 INFO  (coreLoadExecutor-1465-thread-1-processing-n:127.0.0.1:42127_) [n:127.0.0.1:42127_ c:control_collection s:shard1 r:core_node1 x:collection1] o.a.s.r.RestManager Initializing 0 registered ManagedResources
   [junit4]   2> 523155 INFO  (coreLoadExecutor-1465-thread-1-processing-n:127.0.0.1:42127_) [n:127.0.0.1:42127_ c:control_collection s:shard1 r:core_node1 x:collection1] o.a.s.h.ReplicationHandler Commits will be reserved for  10000
   [junit4]   2> 523156 INFO  (searcherExecutor-1466-thread-1-processing-n:127.0.0.1:42127_ x:collection1 s:shard1 c:control_collection r:core_node1) [n:127.0.0.1:42127_ c:control_collection s:shard1 r:core_node1 x:collection1] o.a.s.c.SolrCore [collection1] Registered new searcher Searcher@5e66d5de[collection1] main{ExitableDirectoryReader(UninvertingDirectoryReader())}
   [junit4]   2> 523156 INFO  (coreLoadExecutor-1465-thread-1-processing-n:127.0.0.1:42127_) [n:127.0.0.1:42127_ c:control_collection s:shard1 r:core_node1 x:collection1] o.a.s.u.UpdateLog Looking up max value of version field to seed version buckets
   [junit4]   2> 523156 INFO  (coreLoadExecutor-1465-thread-1-processing-n:127.0.0.1:42127_) [n:127.0.0.1:42127_ c:control_collection s:shard1 r:core_node1 x:collection1] o.a.s.u.VersionInfo Refreshing highest value of _version_ for 65536 version buckets from index
   [junit4]   2> 523156 INFO  (coreLoadExecutor-1465-thread-1-processing-n:127.0.0.1:42127_) [n:127.0.0.1:42127_ c:control_collection s:shard1 r:core_node1 x:collection1] o.a.s.u.VersionInfo No terms found for _version_, cannot seed version bucket highest value from index
   [junit4]   2> 523156 INFO  (coreLoadExecutor-1465-thread-1-processing-n:127.0.0.1:42127_) [n:127.0.0.1:42127_ c:control_collection s:shard1 r:core_node1 x:collection1] o.a.s.u.UpdateLog Could not find max version in index or recent updates, using new clock 1529561122093400064
   [junit4]   2> 523158 INFO  (coreLoadExecutor-1465-thread-1-processing-n:127.0.0.1:42127_) [n:127.0.0.1:42127_ c:control_collection s:shard1 r:core_node1 x:collection1] o.a.s.u.UpdateLog Took 1.0ms to seed version buckets with highest version 1529561122093400064
   [junit4]   2> 523158 INFO  (coreLoadExecutor-1465-thread-1-processing-n:127.0.0.1:42127_) [n:127.0.0.1:42127_ c:control_collection s:shard1 r:core_node1 x:collection1] o.a.s.c.ZkController watch zkdir /configs/conf1
   [junit4]   2> 523158 INFO  (coreLoadExecutor-1465-thread-1-processing-n:127.0.0.1:42127_) [n:127.0.0.1:42127_ c:control_collection s:shard1 r:core_node1 x:collection1] o.a.s.c.CoreContainer registering core: collection1
   [junit4]   2> 523159 INFO  (coreZkRegister-1459-thread-1-processing-n:127.0.0.1:42127_ x:collection1 s:shard1 c:control_collection r:core_node1) [n:127.0.0.1:42127_ c:control_collection s:shard1 r:core_node1 x:collection1] o.a.s.c.ZkController Register replica - core:collection1 address:http://127.0.0.1:42127 collection:control_collection shard:shard1
   [junit4]   2> 523159 INFO  (coreZkRegister-1459-thread-1-processing-n:127.0.0.1:42127_ x:collection1 s:shard1 c:control_collection r:core_node1) [n:127.0.0.1:42127_ c:control_collection s:shard1 r:core_node1 x:collection1] o.a.s.c.c.SolrZkClient makePath: /collections/control_collection/leader_elect/shard1/election
   [junit4]   2> 523160 INFO  (coreZkRegister-1459-thread-1-processing-n:127.0.0.1:42127_ x:collection1 s:shard1 c:control_collection r:core_node1) [n:127.0.0.1:42127_ c:control_collection s:shard1 r:core_node1 x:collection1] o.a.s.c.LeaderElector Joined leadership election with path: /collections/control_collection/leader_elect/shard1/election/95597570045116420-core_node1-n_0000000000
   [junit4]   2> 523160 INFO  (coreZkRegister-1459-thread-1-processing-n:127.0.0.1:42127_ x:collection1 s:shard1 c:control_collection r:core_node1) [n:127.0.0.1:42127_ c:control_collection s:shard1 r:core_node1 x:collection1] o.a.s.c.ShardLeaderElectionContext Running the leader process for shard=shard1 and weAreReplacement=false and leaderVoteWait=10000
   [junit4]   2> 523161 INFO  (coreZkRegister-1459-thread-1-processing-n:127.0.0.1:42127_ x:collection1 s:shard1 c:control_collection r:core_node1) [n:127.0.0.1:42127_ c:control_collection s:shard1 r:core_node1 x:collection1] o.a.s.c.ShardLeaderElectionContext Enough replicas found to continue.
   [junit4]   2> 523161 INFO  (coreZkRegister-1459-thread-1-processing-n:127.0.0.1:42127_ x:collection1 s:shard1 c:control_collection r:core_node1) [n:127.0.0.1:42127_ c:control_collection s:shard1 r:core_node1 x:collection1] o.a.s.c.ShardLeaderElectionContext I may be the new leader - try and sync
   [junit4]   2> 523161 INFO  (coreZkRegister-1459-thread-1-processing-n:127.0.0.1:42127_ x:collection1 s:shard1 c:control_collection r:core_node1) [n:127.0.0.1:42127_ c:control_collection s:shard1 r:core_node1 x:collection1] o.a.s.c.SyncStrategy Sync replicas to http://127.0.0.1:42127/collection1/
   [junit4]   2> 523161 INFO  (coreZkRegister-1459-thread-1-processing-n:127.0.0.1:42127_ x:collection1 s:shard1 c:control_collection r:core_node1) [n:127.0.0.1:42127_ c:control_collection s:shard1 r:core_node1 x:collection1] o.a.s.c.SyncStrategy Sync Success - now sync replicas to me
   [junit4]   2> 523161 INFO  (OverseerStateUpdate-95597570045116420-127.0.0.1:42127_-n_0000000000) [n:127.0.0.1:42127_    ] o.a.s.c.Overseer processMessage: queueSize: 1, message = {
   [junit4]   2>   "operation":"leader",
   [junit4]   2>   "shard":"shard1",
   [junit4]   2>   "collection":"control_collection"} current state version: 1
   [junit4]   2> 523161 INFO  (coreZkRegister-1459-thread-1-processing-n:127.0.0.1:42127_ x:collection1 s:shard1 c:control_collection r:core_node1) [n:127.0.0.1:42127_ c:control_collection s:shard1 r:core_node1 x:collection1] o.a.s.c.SyncStrategy http://127.0.0.1:42127/collection1/ has no replicas
   [junit4]   2> 523161 INFO  (coreZkRegister-1459-thread-1-processing-n:127.0.0.1:42127_ x:collection1 s:shard1 c:control_collection r:core_node1) [n:127.0.0.1:42127_ c:control_collection s:shard1 r:core_node1 x:collection1] o.a.s.c.c.SolrZkClient makePath: /collections/control_collection/leaders/shard1
   [junit4]   2> 523163 INFO  (coreZkRegister-1459-thread-1-processing-n:127.0.0.1:42127_ x:collection1 s:shard1 c:control_collection r:core_node1) [n:127.0.0.1:42127_ c:control_collection s:shard1 r:core_node1 x:collection1] o.a.s.c.ShardLeaderElectionContextBase Creating leader registration node /collections/control_collection/leaders/shard1/leader after winning as /collections/control_collection/leader_elect/shard1/election/95597570045116420-core_node1-n_0000000000
   [junit4]   2> 523164 INFO  (coreZkRegister-1459-thread-1-processing-n:127.0.0.1:42127_ x:collection1 s:shard1 c:control_collection r:core_node1) [n:127.0.0.1:42127_ c:control_collection s:shard1 r:core_node1 x:collection1] o.a.s.c.ShardLeaderElectionContext I am the new leader: http://127.0.0.1:42127/collection1/ shard1
   [junit4]   2> 523164 INFO  (OverseerStateUpdate-95597570045116420-127.0.0.1:42127_-n_0000000000) [n:127.0.0.1:42127_    ] o.a.s.c.Overseer processMessage: queueSize: 1, message = {
   [junit4]   2>   "operation":"leader",
   [junit4]   2>   "shard":"shard1",
   [junit4]   2>   "collection":"control_collection",
   [junit4]   2>   "base_url":"http://127.0.0.1:42127",
   [junit4]   2>   "core":"collection1",
   [junit4]   2>   "state":"active"} current state version: 1
   [junit4]   2> 523265 INFO  (zkCallback-432-thread-1-processing-n:127.0.0.1:42127_) [n:127.0.0.1:42127_    ] o.a.s.c.c.ZkStateReader A cluster state change: [WatchedEvent state:SyncConnected type:NodeDataChanged path:/clusterstate.json], has occurred - updating... (live nodes size: [1])
   [junit4]   2> 523315 INFO  (coreZkRegister-1459-thread-1-processing-n:127.0.0.1:42127_ x:collection1 s:shard1 c:control_collection r:core_node1) [n:127.0.0.1:42127_ c:control_collection s:shard1 r:core_node1 x:collection1] o.a.s.c.ZkController We are http://127.0.0.1:42127/collection1/ and leader is http://127.0.0.1:42127/collection1/
   [junit4]   2> 523315 INFO  (coreZkRegister-1459-thread-1-processing-n:127.0.0.1:42127_ x:collection1 s:shard1 c:control_collection r:core_node1) [n:127.0.0.1:42127_ c:control_collection s:shard1 r:core_node1 x:collection1] o.a.s.c.ZkController No LogReplay needed for core=collection1 baseURL=http://127.0.0.1:42127
   [junit4]   2> 523315 INFO  (coreZkRegister-1459-thread-1-processing-n:127.0.0.1:42127_ x:collection1 s:shard1 c:control_collection r:core_node1) [n:127.0.0.1:42127_ c:control_collection s:shard1 r:core_node1 x:collection1] o.a.s.c.ZkController I am the leader, no recovery necessary
   [junit4]   2> 523315 INFO  (coreZkRegister-1459-thread-1-processing-n:127.0.0.1:42127_ x:collection1 s:shard1 c:control_collection r:core_node1) [n:127.0.0.1:42127_ c:control_collection s:shard1 r:core_node1 x:collection1] o.a.s.c.ZkController publishing state=active
   [junit4]   2> 523315 INFO  (coreZkRegister-1459-thread-1-processing-n:127.0.0.1:42127_ x:collection1 s:shard1 c:control_collection r:core_node1) [n:127.0.0.1:42127_ c:control_collection s:shard1 r:core_node1 x:collection1] o.a.s.c.ZkController numShards not found on descriptor - reading it from system property
   [junit4]   2> 523317 INFO  (OverseerStateUpdate-95597570045116420-127.0.0.1:42127_-n_0000000000) [n:127.0.0.1:42127_    ] o.a.s.c.Overseer processMessage: queueSize: 1, message = {
   [junit4]   2>   "core":"collection1",
   [junit4]   2>   "core_node_name":"core_node1",
   [junit4]   2>   "roles":null,
   [junit4]   2>   "base_url":"http://127.0.0.1:42127",
   [junit4]   2>   "node_name":"127.0.0.1:42127_",
   [junit4]   2>   "numShards":"1",
   [junit4]   2>   "state":"active",
   [junit4]   2>   "shard":"shard1",
   [junit4]   2>   "collection":"control_collection",
   [junit4]   2>   "operation":"state"} current state version: 2
   [junit4]   2> 523317 INFO  (OverseerStateUpdate-95597570045116420-127.0.0.1:42127_-n_0000000000) [n:127.0.0.1:42127_    ] o.a.s.c.o.ReplicaMutator Update state numShards=1 message={
   [junit4]   2>   "core":"collection1",
   [junit4]   2>   "core_node_name":"core_node1",
   [junit4]   2>   "roles":null,
   [junit4]   2>   "base_url":"http://127.0.0.1:42127",
   [junit4]   2>   "node_name":"127.0.0.1:42127_",
   [junit4]   2>   "numShards":"1",
   [junit4]   2>   "state":"active",
   [junit4]   2>   "shard":"shard1",
   [junit4]   2>   "collection":"control_collection",
   [junit4]   2>   "operation":"state"}
   [junit4]   2> 523422 INFO  (zkCallback-432-thread-1-processing-n:127.0.0.1:42127_) [n:127.0.0.1:42127_    ] o.a.s.c.c.ZkStateReader A cluster state change: [WatchedEvent state:SyncConnected type:NodeDataChanged path:/clusterstate.json], has occurred - updating... (live nodes size: [1])
   [junit4]   2> 523540 INFO  (TEST-TestCloudPivotFacet.test-seed#[39D34BE0B4D5CCCC]) [    ] o.a.s.c.c.SolrZkClient Using default ZkCredentialsProvider
   [junit4]   2> 523541 INFO  (TEST-TestCloudPivotFacet.test-seed#[39D34BE0B4D5CCCC]) [    ] o.a.s.c.c.ConnectionManager Waiting for client to connect to ZooKeeper
   [junit4]   2> 523542 INFO  (zkCallback-434-thread-1) [    ] o.a.s.c.c.ConnectionManager Watcher org.apache.solr.common.cloud.ConnectionManager@17b2fa74 name:ZooKeeperConnection Watcher:127.0.0.1:33288/solr got event WatchedEvent state:SyncConnected type:None path:null path:null type:None
   [junit4]   2> 523542 INFO  (TEST-TestCloudPivotFacet.test-seed#[39D34BE0B4D5CCCC]) [    ] o.a.s.c.c.ConnectionManager Client is connected to ZooKeeper
   [junit4]   2> 523542 INFO  (TEST-TestCloudPivotFacet.test-seed#[39D34BE0B4D5CCCC]) [    ] o.a.s.c.c.SolrZkClient Using default ZkACLProvider
   [junit4]   2> 523542 INFO  (TEST-TestCloudPivotFacet.test-seed#[39D34BE0B4D5CCCC]) [    ] o.a.s.c.c.ZkStateReader Updating cluster state from ZooKeeper... 
   [junit4]   2> 523542 INFO  (TEST-TestCloudPivotFacet.test-seed#[39D34BE0B4D5CCCC]) [    ] o.a.s.c.c.ZkStateReader Updated live nodes from ZooKeeper... (0) -> (1)
   [junit4]   2> 523543 INFO  (TEST-TestCloudPivotFacet.test-seed#[39D34BE0B4D5CCCC]) [    ] o.a.s.c.ChaosMonkey monkey: init - expire sessions:false cause connection loss:false
   [junit4]   2> 523543 INFO  (TEST-TestCloudPivotFacet.test-seed#[39D34BE0B4D5CCCC]) [    ] o.a.s.c.AbstractFullDistribZkTestBase Creating collection1 with stateFormat=2
   [junit4]   2> 523543 INFO  (TEST-TestCloudPivotFacet.test-seed#[39D34BE0B4D5CCCC]) [    ] o.a.s.c.c.SolrZkClient Using default ZkCredentialsProvider
   [junit4]   2> 523543 INFO  (TEST-TestCloudPivotFacet.test-seed#[39D34BE0B4D5CCCC]) [    ] o.a.s.c.c.ConnectionManager Waiting for client to connect to ZooKeeper
   [junit4]   2> 523543 INFO  (zkCallback-435-thread-1) [    ] o.a.s.c.c.ConnectionManager Watcher org.apache.solr.common.cloud.ConnectionManager@36f80a3d name:ZooKeeperConnection Watcher:127.0.0.1:33288/solr got event WatchedEvent state:SyncConnected type:None path:null path:null type:None
   [junit4]   2> 523543 INFO  (TEST-TestCloudPivotFacet.test-seed#[39D34BE0B4D5CCCC]) [    ] o.a.s.c.c.ConnectionManager Client is connected to ZooKeeper
   [junit4]   2> 523544 INFO  (TEST-TestCloudPivotFacet.test-seed#[39D34BE0B4D5CCCC]) [    ] o.a.s.c.c.SolrZkClient Using default ZkACLProvider
   [junit4]   2> 523544 INFO  (OverseerStateUpdate-95597570045116420-127.0.0.1:42127_-n_0000000000) [n:127.0.0.1:42127_    ] o.a.s.c.Overseer processMessage: queueSize: 1, message = {
   [junit4]   2>   "operation":"create",
   [junit4]   2>   "name":"collection1",
   [junit4]   2>   "numShards":"2",
   [junit4]   2>   "stateFormat":"2"} current state version: 3
   [junit4]   2> 523545 INFO  (OverseerStateUpdate-95597570045116420-127.0.0.1:42127_-n_0000000000) [n:127.0.0.1:42127_    ] o.a.s.c.o.ClusterStateMutator building a new cName: collection1
   [junit4]   2> 523599 INFO  (TEST-TestCloudPivotFacet.test-seed#[39D34BE0B4D5CCCC]) [    ] o.a.s.SolrTestCaseJ4 Writing core.properties file to /home/jenkins/workspace/Lucene-Solr-master-Linux/solr/build/solr-core/test/J1/temp/solr.cloud.TestCloudPivotFacet_39D34BE0B4D5CCCC-001/shard-1-001/cores/collection1
   [junit4]   2> 523600 INFO  (TEST-TestCloudPivotFacet.test-seed#[39D34BE0B4D5CCCC]) [    ] o.a.s.c.AbstractFullDistribZkTestBase create jetty 1 in directory /home/jenkins/workspace/Lucene-Solr-master-Linux/solr/build/solr-core/test/J1/temp/solr.cloud.TestCloudPivotFacet_39D34BE0B4D5CCCC-001/shard-1-001
   [junit4]   2> 523600 INFO  (TEST-TestCloudPivotFacet.test-seed#[39D34BE0B4D5CCCC]) [    ] o.e.j.s.Server jetty-9.3.8.v20160314
   [junit4]   2> 523601 INFO  (TEST-TestCloudPivotFacet.test-seed#[39D34BE0B4D5CCCC]) [    ] o.e.j.s.h.ContextHandler Started o.e.j.s.ServletContextHandler@59dd5abb{/,null,AVAILABLE}
   [junit4]   2> 523601 INFO  (TEST-TestCloudPivotFacet.test-seed#[39D34BE0B4D5CCCC]) [    ] o.e.j.s.ServerConnector Started ServerConnector@5feff4c3{HTTP/1.1,[http/1.1]}{127.0.0.1:36206}
   [junit4]   2> 523602 INFO  (TEST-TestCloudPivotFacet.test-seed#[39D34BE0B4D5CCCC]) [    ] o.e.j.s.Server Started @525218ms
   [junit4]   2> 523602 INFO  (TEST-TestCloudPivotFacet.test-seed#[39D34BE0B4D5CCCC]) [    ] o.a.s.c.s.e.JettySolrRunner Jetty properties: {solr.data.dir=/home/jenkins/workspace/Lucene-Solr-master-Linux/solr/build/solr-core/test/J1/temp/solr.cloud.TestCloudPivotFacet_39D34BE0B4D5CCCC-001/tempDir-001/jetty1, solrconfig=solrconfig.xml, hostContext=/, hostPort=36206, coreRootDirectory=/home/jenkins/workspace/Lucene-Solr-master-Linux/solr/build/solr-core/test/J1/../../../../../../../../../home/jenkins/workspace/Lucene-Solr-master-Linux/solr/build/solr-core/test/J1/temp/solr.cloud.TestCloudPivotFacet_39D34BE0B4D5CCCC-001/shard-1-001/cores}
   [junit4]   2> 523602 INFO  (TEST-TestCloudPivotFacet.test-seed#[39D34BE0B4D5CCCC]) [    ] o.a.s.s.SolrDispatchFilter SolrDispatchFilter.init(): sun.misc.Launcher$AppClassLoader@73d16e93
   [junit4]   2> 523602 INFO  (TEST-TestCloudPivotFacet.test-seed#[39D34BE0B4D5CCCC]) [    ] o.a.s.c.SolrResourceLoader new SolrResourceLoader for directory: '/home/jenkins/workspace/Lucene-Solr-master-Linux/solr/build/solr-core/test/J1/temp/solr.cloud.TestCloudPivotFacet_39D34BE0B4D5CCCC-001/shard-1-001'
   [junit4]   2> 523603 INFO  (TEST-TestCloudPivotFacet.test-seed#[39D34BE0B4D5CCCC]) [    ] o.a.s.c.SolrResourceLoader JNDI not configured for solr (NoInitialContextEx)
   [junit4]   2> 523603 INFO  (TEST-TestCloudPivotFacet.test-seed#[39D34BE0B4D5CCCC]) [    ] o.a.s.c.SolrResourceLoader solr home defaulted to 'solr/' (could not find system property or JNDI)
   [junit4]   2> 523603 INFO  (TEST-TestCloudPivotFacet.test-seed#[39D34BE0B4D5CCCC]) [    ] o.a.s.c.c.SolrZkClient Using default ZkCredentialsProvider
   [junit4]   2> 523603 INFO  (TEST-TestCloudPivotFacet.test-seed#[39D34BE0B4D5CCCC]) [    ] o.a.s.c.c.ConnectionManager Waiting for client to connect to ZooKeeper
   [junit4]   2> 523604 INFO  (zkCallback-436-thread-1) [    ] o.a.s.c.c.ConnectionManager Watcher org.apache.solr.common.cloud.ConnectionManager@464a4c1d name:ZooKeeperConnection Watcher:127.0.0.1:33288/solr got event WatchedEvent state:SyncConnected type:None path:null path:null type:None
   [junit4]   2> 523604 INFO  (TEST-TestCloudPivotFacet.test-seed#[39D34BE0B4D5CCCC]) [    ] o.a.s.c.c.ConnectionManager Client is connected to ZooKeeper
   [junit4]   2> 523604 INFO  (TEST-TestCloudPivotFacet.test-seed#[39D34BE0B4D5CCCC]) [    ] o.a.s.c.c.SolrZkClient Using default ZkACLProvider
   [junit4]   2> 523604 INFO  (TEST-TestCloudPivotFacet.test-seed#[39D34BE0B4D5CCCC]) [    ] o.a.s.s.SolrDispatchFilter Loading solr.xml from SolrHome (not found in ZooKeeper)
   [junit4]   2> 523604 INFO  (TEST-TestCloudPivotFacet.test-seed#[39D34BE0B4D5CCCC]) [    ] o.a.s.c.SolrXmlConfig Loading container configuration from /home/jenkins/workspace/Lucene-Solr-master-Linux/solr/build/solr-core/test/J1/temp/solr.cloud.TestCloudPivotFacet_39D34BE0B4D5CCCC-001/shard-1-001/solr.xml
   [junit4]   2> 523608 INFO  (TEST-TestCloudPivotFacet.test-seed#[39D34BE0B4D5CCCC]) [    ] o.a.s.c.CorePropertiesLocator Config-defined core root directory: /home/jenkins/workspace/Lucene-Solr-master-Linux/solr/build/solr-core/test/J1/../../../../../../../../../home/jenkins/workspace/Lucene-Solr-master-Linux/solr/build/solr-core/test/J1/temp/solr.cloud.TestCloudPivotFacet_39D34BE0B4D5CCCC-001/shard-1-001/cores
   [junit4]   2> 523608 INFO  (TEST-TestCloudPivotFacet.test-seed#[39D34BE0B4D5CCCC]) [    ] o.a.s.c.CoreContainer New CoreContainer 1046620604
   [junit4]   2> 523608 INFO  (TEST-TestCloudPivotFacet.test-seed#[39D34BE0B4D5CCCC]) [    ] o.a.s.c.CoreContainer Loading cores into CoreContainer [instanceDir=/home/jenkins/workspace/Lucene-Solr-master-Linux/solr/build/solr-core/test/J1/temp/solr.cloud.TestCloudPivotFacet_39D34BE0B4D5CCCC-001/shard-1-001]
   [junit4]   2> 523608 WARN  (TEST-TestCloudPivotFacet.test-seed#[39D34BE0B4D5CCCC]) [    ] o.a.s.c.CoreContainer Couldn't add files from /home/jenkins/workspace/Lucene-Solr-master-Linux/solr/build/solr-core/test/J1/temp/solr.cloud.TestCloudPivotFacet_39D34BE0B4D5CCCC-001/shard-1-001/lib to classpath: /home/jenkins/workspace/Lucene-Solr-master-Linux/solr/build/solr-core/test/J1/temp/solr.cloud.TestCloudPivotFacet_39D34BE0B4D5CCCC-001/shard-1-001/lib
   [junit4]   2> 523608 INFO  (TEST-TestCloudPivotFacet.test-seed#[39D34BE0B4D5CCCC]) [    ] o.a.s.h.c.HttpShardHandlerFactory created with socketTimeout : 90000,urlScheme : ,connTimeout : 15000,maxConnectionsPerHost : 20,maxConnections : 10000,corePoolSize : 0,maximumPoolSize : 2147483647,maxThreadIdleTime : 5,sizeOfQueue : -1,fairnessPolicy : false,useRetries : false,
   [junit4]   2> 523609 INFO  (TEST-TestCloudPivotFacet.test-seed#[39D34BE0B4D5CCCC]) [    ] o.a.s.u.UpdateShardHandler Creating UpdateShardHandler HTTP client with params: socketTimeout=340000&connTimeout=45000&retry=true
   [junit4]   2> 523609 INFO  (TEST-TestCloudPivotFacet.test-seed#[39D34BE0B4D5CCCC]) [    ] o.a.s.l.LogWatcher SLF4J impl is org.slf4j.impl.Log4jLoggerFactory
   [junit4]   2> 523609 INFO  (TEST-TestCloudPivotFacet.test-seed#[39D34BE0B4D5CCCC]) [    ] o.a.s.l.LogWatcher Registering Log Listener [Log4j (org.slf4j.impl.Log4jLoggerFactory)]
   [junit4]   2> 523609 INFO  (TEST-TestCloudPivotFacet.test-seed#[39D34BE0B4D5CCCC]) [    ] o.a.s.c.ZkContainer Zookeeper client=127.0.0.1:33288/solr
   [junit4]   2> 523609 INFO  (TEST-TestCloudPivotFacet.test-seed#[39D34BE0B4D5CCCC]) [    ] o.a.s.c.ZkController zkHost includes chroot
   [junit4]   2> 523609 INFO  (TEST-TestCloudPivotFacet.test-seed#[39D34BE0B4D5CCCC]) [    ] o.a.s.c.c.SolrZkClient Using default ZkCredentialsProvider
   [junit4]   2> 523610 INFO  (TEST-TestCloudPivotFacet.test-seed#[39D34BE0B4D5CCCC]) [    ] o.a.s.c.c.ConnectionManager Waiting for client to connect to ZooKeeper
   [junit4]   2> 523612 INFO  (zkCallback-439-thread-1) [    ] o.a.s.c.c.ConnectionManager Watcher org.apache.solr.common.cloud.ConnectionManager@7aae520 name:ZooKeeperConnection Watcher:127.0.0.1:33288 got event WatchedEvent state:SyncConnected type:None path:null path:null type:None
   [junit4]   2> 523613 INFO  (TEST-TestCloudPivotFacet.test-seed#[39D34BE0B4D5CCCC]) [    ] o.a.s.c.c.ConnectionManager Client is connected to ZooKeeper
   [junit4]   2> 523613 INFO  (TEST-TestCloudPivotFacet.test-seed#[39D34BE0B4D5CCCC]) [    ] o.a.s.c.c.SolrZkClient Using default ZkACLProvider
   [junit4]   2> 523616 INFO  (TEST-TestCloudPivotFacet.test-seed#[39D34BE0B4D5CCCC]) [n:127.0.0.1:36206_    ] o.a.s.c.c.ConnectionManager Waiting for client to connect to ZooKeeper
   [junit4]   2> 523617 INFO  (zkCallback-440-thread-1-processing-n:127.0.0.1:36206_) [n:127.0.0.1:36206_    ] o.a.s.c.c.ConnectionManager Watcher org.apache.solr.common.cloud.ConnectionManager@610d3024 name:ZooKeeperConnection Watcher:127.0.0.1:33288/solr got event WatchedEvent state:SyncConnected type:None path:null path:null type:None
   [junit4]   2> 523617 INFO  (TEST-TestCloudPivotFacet.test-seed#[39D34BE0B4D5CCCC]) [n:127.0.0.1:36206_    ] o.a.s.c.c.ConnectionManager Client is connected to ZooKeeper
   [junit4]   2> 523620 INFO  (TEST-TestCloudPivotFacet.test-seed#[39D34BE0B4D5CCCC]) [n:127.0.0.1:36206_    ] o.a.s.c.c.ZkStateReader Updating cluster state from ZooKeeper... 
   [junit4]   2> 523620 INFO  (TEST-TestCloudPivotFacet.test-seed#[39D34BE0B4D5CCCC]) [n:127.0.0.1:36206_    ] o.a.s.c.c.ZkStateReader Updated live nodes from ZooKeeper... (0) -> (1)
   [junit4]   2> 523621 INFO  (TEST-TestCloudPivotFacet.test-seed#[39D34BE0B4D5CCCC]) [n:127.0.0.1:36206_    ] o.a.s.c.Overseer Overseer (id=null) closing
   [junit4]   2> 523621 INFO  (TEST-TestCloudPivotFacet.test-seed#[39D34BE0B4D5CCCC]) [n:127.0.0.1:36206_    ] o.a.s.c.LeaderElector Joined leadership election with path: /overseer_elect/election/95597570045116425-127.0.0.1:36206_-n_0000000001
   [junit4]   2> 523621 INFO  (TEST-TestCloudPivotFacet.test-seed#[39D34BE0B4D5CCCC]) [n:127.0.0.1:36206_    ] o.a.s.c.LeaderElector Watching path /overseer_elect/election/95597570045116420-127.0.0.1:42127_-n_0000000000 to know if I could be the leader
   [junit4]   2> 523622 INFO  (TEST-TestCloudPivotFacet.test-seed#[39D34BE0B4D5CCCC]) [n:127.0.0.1:36206_    ] o.a.s.c.ZkController Publish node=127.0.0.1:36206_ as DOWN
   [junit4]   2> 523623 INFO  (OverseerStateUpdate-95597570045116420-127.0.0.1:42127_-n_0000000000) [n:127.0.0.1:42127_    ] o.a.s.c.Overseer processMessage: queueSize: 1, message = {
   [junit4]   2>   "operation":"downnode",
   [junit4]   2>   "node_name":"127.0.0.1:36206_"} current state version: 3
   [junit4]   2> 523623 INFO  (OverseerStateUpdate-95597570045116420-127.0.0.1:42127_-n_0000000000) [n:127.0.0.1:42127_    ] o.a.s.c.o.NodeMutator DownNode state invoked for node: 127.0.0.1:36206_
   [junit4]   2> 523624 INFO  (OverseerStateUpdate-95597570045116420-127.0.0.1:42127_-n_0000000000) [n:127.0.0.1:42127_    ] o.a.s.c.o.ZkStateWriter going to create_collection /collections/collection1/state.json
   [junit4]   2> 523726 INFO  (zkCallback-434-thread-1) [    ] o.a.s.c.c.ZkStateReader A cluster state change: [WatchedEvent state:SyncConnected type:NodeDataChanged path:/clusterstate.json], has occurred - updating... (live nodes size: [1])
   [junit4]   2> 523726 INFO  (zkCallback-440-thread-1-processing-n:127.0.0.1:36206_) [n:127.0.0.1:36206_    ] o.a.s.c.c.ZkStateReader A cluster state change: [WatchedEvent state:SyncConnected type:NodeDataChanged path:/clusterstate.json], has occurred - updating... (live nodes size: [1])
   [junit4]   2> 523726 INFO  (zkCallback-432-thread-1-processing-n:127.0.0.1:42127_) [n:127.0.0.1:42127_    ] o.a.s.c.c.ZkStateReader A cluster state change: [WatchedEvent state:SyncConnected type:NodeDataChanged path:/clusterstate.json], has occurred - updating... (live nodes size: [1])
   [junit4]   2> 524623 INFO  (TEST-TestCloudPivotFacet.test-seed#[39D34BE0B4D5CCCC]) [n:127.0.0.1:36206_    ] o.a.s.c.ZkController Register node as live in ZooKeeper:/live_nodes/127.0.0.1:36206_
   [junit4]   2> 524624 INFO  (TEST-TestCloudPivotFacet.test-seed#[39D34BE0B4D5CCCC]) [n:127.0.0.1:36206_    ] o.a.s.c.c.SolrZkClient makePath: /live_nodes/127.0.0.1:36206_
   [junit4]   2> 524624 INFO  (zkCallback-440-thread-1-processing-n:127.0.0.1:36206_) [n:127.0.0.1:36206_    ] o.a.s.c.c.ZkStateReader A live node change: [WatchedEvent state:SyncConnected type:NodeChildrenChanged path:/live_nodes], has occurred - updating... (live nodes size: [1])
   [junit4]   2> 524624 INFO  (zkCallback-434-thread-1) [    ] o.a.s.c.c.ZkStateReader A live node change: [WatchedEvent state:SyncConnected type:NodeChildrenChanged path:/live_nodes], has occurred - updating... (live nodes size: [1])
   [junit4]   2> 524624 INFO  (zkCallback-432-thread-1-processing-n:127.0.0.1:42127_) [n:127.0.0.1:42127_    ] o.a.s.c.c.ZkStateReader A live node change: [WatchedEvent state:SyncConnected type:NodeChildrenChanged path:/live_nodes], has occurred - updating... (live nodes size: [1])
   [junit4]   2> 524626 INFO  (zkCallback-432-thread-1-processing-n:127.0.0.1:42127_) [n:127.0.0.1:42127_    ] o.a.s.c.c.ZkStateReader Updated live nodes from ZooKeeper... (1) -> (2)
   [junit4]   2> 524626 INFO  (zkCallback-434-thread-1) [    ] o.a.s.c.c.ZkStateReader Updated live nodes from ZooKeeper... (1) -> (2)
   [junit4]   2> 524626 INFO  (zkCallback-440-thread-1-processing-n:127.0.0.1:36206_) [n:127.0.0.1:36206_    ] o.a.s.c.c.ZkStateReader Updated live nodes from ZooKeeper... (1) -> (2)
   [junit4]   2> 524641 INFO  (TEST-TestCloudPivotFacet.test-seed#[39D34BE0B4D5CCCC]) [n:127.0.0.1:36206_    ] o.a.s.c.CoreContainer Security conf doesn't exist. Skipping setup for authorization module.
   [junit4]   2> 524642 INFO  (TEST-TestCloudPivotFacet.test-seed#[39D34BE0B4D5CCCC]) [n:127.0.0.1:36206_    ] o.a.s.c.CoreContainer No authentication plugin used.
   [junit4]   2> 524642 INFO  (TEST-TestCloudPivotFacet.test-seed#[39D34BE0B4D5CCCC]) [n:127.0.0.1:36206_    ] o.a.s.c.CorePropertiesLocator Looking for core definitions underneath /home/jenkins/workspace/Lucene-Solr-master-Linux/solr/build/solr-core/test/J1/../../../../../../../../../home/jenkins/workspace/Lucene-Solr-master-Linux/solr/build/solr-core/test/J1/temp/solr.cloud.TestCloudPivotFacet_39D34BE0B4D5CCCC-001/shard-1-001/cores
   [junit4]   2> 524643 INFO  (TEST-TestCloudPivotFacet.test-seed#[39D34BE0B4D5CCCC]) [n:127.0.0.1:36206_    ] o.a.s.c.CoreDescriptor Created CoreDescriptor: {name=collection1, config=solrconfig.xml, transient=false, schema=schema.xml, loadOnStartup=true, configSetProperties=configsetprops.json, collection=collection1, coreNodeName=, dataDir=data/, shard=}
   [junit4]   2> 524643 INFO  (TEST-TestCloudPivotFacet.test-seed#[39D34BE0B4D5CCCC]) [n:127.0.0.1:36206_    ] o.a.s.c.CorePropertiesLocator Found core collection1 in /home/jenkins/workspace/Lucene-Solr-master-Linux/solr/build/solr-core/test/J1/../../../../../../../../../home/jenkins/workspace/Lucene-Solr-master-Linux/solr/build/solr-core/test/J1/temp/solr.cloud.TestCloudPivotFacet_39D34BE0B4D5CCCC-001/shard-1-001/cores/collection1
   [junit4]   2> 524643 INFO  (TEST-TestCloudPivotFacet.test-seed#[39D34BE0B4D5CCCC]) [n:127.0.0.1:36206_    ] o.a.s.c.CorePropertiesLocator Found 1 core definitions
   [junit4]   2> 524645 INFO  (TEST-TestCloudPivotFacet.test-seed#[39D34BE0B4D5CCCC]) [n:127.0.0.1:36206_    ] o.a.s.s.SolrDispatchFilter user.dir=/home/jenkins/workspace/Lucene-Solr-master-Linux/solr/build/solr-core/test/J1
   [junit4]   2> 524645 INFO  (TEST-TestCloudPivotFacet.test-seed#[39D34BE0B4D5CCCC]) [n:127.0.0.1:36206_    ] o.a.s.s.SolrDispatchFilter SolrDispatchFilter.init() done
   [junit4]   2> 524645 INFO  (coreLoadExecutor-1476-thread-1-processing-n:127.0.0.1:36206_) [n:127.0.0.1:36206_ c:collection1   x:collection1] o.a.s.c.ZkController publishing state=down
   [junit4]   2> 524645 INFO  (coreLoadExecutor-1476-thread-1-processing-n:127.0.0.1:36206_) [n:127.0.0.1:36206_ c:collection1   x:collection1] o.a.s.c.ZkController numShards not found on descriptor - reading it from system property
   [junit4]   2> 524647 INFO  (coreLoadExecutor-1476-thread-1-processing-n:127.0.0.1:36206_) [n:127.0.0.1:36206_ c:collection1   x:collection1] o.a.s.c.ZkController Registering watch for collection collection1
   [junit4]   2> 524647 INFO  (coreLoadExecutor-1476-thread-1-processing-n:127.0.0.1:36206_) [n:127.0.0.1:36206_ c:collection1   x:collection1] o.a.s.c.c.ZkStateReader addZkWatch [collection1]
   [junit4]   2> 524647 INFO  (coreLoadExecutor-1476-thread-1-processing-n:127.0.0.1:36206_) [n:127.0.0.1:36206_ c:collection1   x:collection1] o.a.s.c.c.ZkStateReader Add data for [collection1] ver [0]
   [junit4]   2> 524647 INFO  (coreLoadExecutor-1476-thread-1-processing-n:127.0.0.1:36206_) [n:127.0.0.1:36206_ c:collection1   x:collection1] o.a.s.c.ZkController look for our core node name
   [junit4]   2> 524647 INFO  (OverseerStateUpdate-95597570045116420-127.0.0.1:42127_-n_0000000000) [n:127.0.0.1:42127_    ] o.a.s.c.Overseer processMessage: queueSize: 1, message = {
   [junit4]   2>   "core":"collection1",
   [junit4]   2>   "roles":null,
   [junit4]   2>   "base_url":"http://127.0.0.1:36206",
   [junit4]   2>   "node_name":"127.0.0.1:36206_",
   [junit4]   2>   "numShards":"2",
   [junit4]   2>   "state":"down",
   [junit4]   2>   "shard":null,
   [junit4]   2>   "collection":"collection1",
   [junit4]   2>   "operation":"state"} current state version: 4
   [junit4]   2> 524647 INFO  (OverseerStateUpdate-95597570045116420-127.0.0.1:42127_-n_0000000000) [n:127.0.0.1:42127_    ] o.a.s.c.o.ReplicaMutator Update state numShards=2 message={
   [junit4]   2>   "core":"collection1",
   [junit4]   2>   "roles":null,
   [junit4]   2>   "base_url":"http://127.0.0.1:36206",
   [junit4]   2>   "node_name":"127.0.0.1:36206_",
   [junit4]   2>   "numShards":"2",
   [junit4]   2>   "state":"down",
   [junit4]   2>   "shard":null,
   [junit4]   2>   "collection":"collection1",
   [junit4]   2>   "operation":"state"}
   [junit4]   2> 524647 INFO  (OverseerStateUpdate-95597570045116420-127.0.0.1:42127_-n_0000000000) [n:127.0.0.1:42127_    ] o.a.s.c.o.ReplicaMutator Collection already exists with numShards=2
   [junit4]   2> 524647 INFO  (OverseerStateUpdate-95597570045116420-127.0.0.1:42127_-n_0000000000) [n:127.0.0.1:42127_    ] o.a.s.c.o.ReplicaMutator Assigning new node to shard shard=shard2
   [junit4]   2> 524749 INFO  (OverseerStateUpdate-95597570045116420-127.0.0.1:42127_-n_0000000000) [n:127.0.0.1:42127_    ] o.a.s.c.o.ZkStateWriter going to update_collection /collections/collection1/state.json version: 0
   [junit4]   2> 524749 INFO  (zkCallback-440-thread-1-processing-n:127.0.0.1:36206_) [n:127.0.0.1:36206_    ] o.a.s.c.c.ZkStateReader A cluster state change: [WatchedEvent state:SyncConnected type:NodeDataChanged path:/collections/collection1/state.json] for collection [collection1] has occurred - updating... (live nodes size: [2])
   [junit4]   2> 524749 INFO  (zkCallback-440-thread-1-processing-n:127.0.0.1:36206_) [n:127.0.0.1:36206_    ] o.a.s.c.c.ZkStateReader Updating data for [collection1] from [0] to [1]
   [junit4]   2> 525647 INFO  (coreLoadExecutor-1476-thread-1-processing-n:127.0.0.1:36206_) [n:127.0.0.1:36206_ c:collection1   x:collection1] o.a.s.c.ZkController waiting to find shard id in clusterstate for collection1
   [junit4]   2> 525647 INFO  (coreLoadExecutor-1476-thread-1-processing-n:127.0.0.1:36206_) [n:127.0.0.1:36206_ c:collection1   x:collection1] o.a.s.c.ZkController Check for collection zkNode:collection1
   [junit4]   2> 525647 INFO  (coreLoadExecutor-1476-thread-1-processing-n:127.0.0.1:36206_) [n:127.0.0.1:36206_ c:collection1   x:collection1] o.a.s.c.ZkController Collection zkNode exists
   [junit4]   2> 525647 INFO  (coreLoadExecutor-1476-thread-1-processing-n:127.0.0.1:36206_) [n:127.0.0.1:36206_ c:collection1   x:collection1] o.a.s.c.c.ZkStateReader Load collection config from: [/collections/collection1]
   [junit4]   2> 525648 INFO  (coreLoadExecutor-1476-thread-1-processing-n:127.0.0.1:36206_) [n:127.0.0.1:36206_ c:collection1   x:collection1] o.a.s.c.c.ZkStateReader path=[/collections/collection1] [configName]=[conf1] specified config exists in ZooKeeper
   [junit4]   2> 525648 INFO  (coreLoadExecutor-1476-thread-1-processing-n:127.0.0.1:36206_) [n:127.0.0.1:36206_ c:collection1   x:collection1] o.a.s.c.SolrResourceLoader new SolrResourceLoader for directory: '/home/jenkins/workspace/Lucene-Solr-master-Linux/solr/build/solr-core/test/J1/temp/solr.cloud.TestCloudPivotFacet_39D34BE0B4D5CCCC-001/shard-1-001/cores/collection1'
   [junit4]   2> 525648 INFO  (coreLoadExecutor-1476-thread-1-processing-n:127.0.0.1:36206_) [n:127.0.0.1:36206_ c:collection1   x:collection1] o.a.s.c.SolrResourceLoader JNDI not configured for solr (NoInitialContextEx)
   [junit4]   2> 525648 INFO  (coreLoadExecutor-1476-thread-1-processing-n:127.0.0.1:36206_) [n:127.0.0.1:36206_ c:collection1   x:collection1] o.a.s.c.SolrResourceLoader solr home defaulted to 'solr/' (could not find system property or JNDI)
   [junit4]   2> 525649 INFO  (coreLoadExecutor-1476-thread-1-processing-n:127.0.0.1:36206_) [n:127.0.0.1:36206_ c:collection1   x:collection1] o.a.s.c.Config loaded config solrconfig.xml with version 0 
   [junit4]   2> 525652 INFO  (coreLoadExecutor-1476-thread-1-processing-n:127.0.0.1:36206_) [n:127.0.0.1:36206_ c:collection1   x:collection1] o.a.s.c.SolrConfig current version of requestparams : -1
   [junit4]   2> 525655 WARN  (coreLoadExecutor-1476-thread-1-processing-n:127.0.0.1:36206_) [n:127.0.0.1:36206_ c:collection1   x:collection1] o.a.s.c.Config Beginning with Solr 5.5, <mergePolicy> is deprecated, use <mergePolicyFactory> instead.
   [junit4]   2> 525655 INFO  (coreLoadExecutor-1476-thread-1-processing-n:127.0.0.1:36206_) [n:127.0.0.1:36206_ c:collection1   x:collection1] o.a.s.c.SolrConfig Using Lucene MatchVersion: 7.0.0
   [junit4]   2> 525662 INFO  (coreLoadExecutor-1476-thread-1-processing-n:127.0.0.1:36206_) [n:127.0.0.1:36206_ c:collection1   x:collection1] o.a.s.c.SolrConfig Loaded SolrConfig: solrconfig.xml
   [junit4]   2> 525666 INFO  (coreLoadExecutor-1476-thread-1-processing-n:127.0.0.1:36206_) [n:127.0.0.1:36206_ c:collection1   x:collection1] o.a.s.s.IndexSchema [collection1] Schema name=test
   [junit4]   2> 526635 INFO  (coreLoadExecutor-1476-thread-1-processing-n:127.0.0.1:36206_) [n:127.0.0.1:36206_ c:collection1   x:collection1] o.a.s.s.OpenExchangeRatesOrgProvider Initialized with rates=open-exchange-rates.json, refreshInterval=1440.
   [junit4]   2> 526638 INFO  (coreLoadExecutor-1476-thread-1-processing-n:127.0.0.1:36206_) [n:127.0.0.1:36206_ c:collection1   x:collection1] o.a.s.s.IndexSchema default search field in schema is text
   [junit4]   2> 526639 INFO  (coreLoadExecutor-1476-thread-1-processing-n:127.0.0.1:36206_) [n:127.0.0.1:36206_ c:collection1   x:collection1] o.a.s.s.IndexSchema unique key field: id
   [junit4]   2> 526643 INFO  (coreLoadExecutor-1476-thread-1-processing-n:127.0.0.1:36206_) [n:127.0.0.1:36206_ c:collection1   x:collection1] o.a.s.s.FileExchangeRateProvider Reloading exchange rates from file currency.xml
   [junit4]   2> 526644 INFO  (coreLoadExecutor-1476-thread-1-processing-n:127.0.0.1:36206_) [n:127.0.0.1:36206_ c:collection1   x:collection1] o.a.s.s.FileExchangeRateProvider Reloading exchange rates from file currency.xml
   [junit4]   2> 526645 INFO  (coreLoadExecutor-1476-thread-1-processing-n:127.0.0.1:36206_) [n:127.0.0.1:36206_ c:collection1   x:collection1] o.a.s.s.OpenExchangeRatesOrgProvider Reloading exchange rates from open-exchange-rates.json
   [junit4]   2> 526646 INFO  (coreLoadExecutor-1476-thread-1-processing-n:127.0.0.1:36206_) [n:127.0.0.1:36206_ c:collection1   x:collection1] o.a.s.s.OpenExchangeRatesOrgProvider Reloading exchange rates from open-exchange-rates.json
   [junit4]   2> 526647 INFO  (coreLoadExecutor-1476-thread-1-processing-n:127.0.0.1:36206_) [n:127.0.0.1:36206_ c:collection1   x:collection1] o.a.s.c.ConfigSetProperties Did not find ConfigSet properties, assuming default properties: Can't find resource 'configsetprops.json' in classpath or '/configs/conf1', cwd=/home/jenkins/workspace/Lucene-Solr-master-Linux/solr/build/solr-core/test/J1
   [junit4]   2> 526647 INFO  (coreLoadExecutor-1476-thread-1-processing-n:127.0.0.1:36206_) [n:127.0.0.1:36206_ c:collection1   x:collection1] o.a.s.c.CoreContainer Creating SolrCore 'collection1' using configuration from collection collection1
   [junit4]   2> 526647 INFO  (coreLoadExecutor-1476-thread-1-processing-n:127.0.0.1:36206_) [n:127.0.0.1:36206_ c:collection1 s:shard2 r:core_node1 x:collection1] o.a.s.c.SolrCore org.apache.solr.core.MockDirectoryFactory
   [junit4]   2> 526647 INFO  (coreLoadExecutor-1476-thread-1-processing-n:127.0.0.1:36206_) [n:127.0.0.1:36206_ c:collection1 s:shard2 r:core_node1 x:collection1] o.a.s.c.SolrCore [[collection1] ] Opening new SolrCore at [/home/jenkins/workspace/Lucene-Solr-master-Linux/solr/build/solr-core/test/J1/temp/solr.cloud.TestCloudPivotFacet_39D34BE0B4D5CCCC-001/shard-1-001/cores/collection1], dataDir=[/home/jenkins/workspace/Lucene-Solr-master-Linux/solr/build/solr-core/test/J1/../../../../../../../../../home/jenkins/workspace/Lucene-Solr-master-Linux/solr/build/solr-core/test/J1/temp/solr.cloud.TestCloudPivotFacet_39D34BE0B4D5CCCC-001/shard-1-001/cores/collection1/data/]
   [junit4]   2> 526647 INFO  (coreLoadExecutor-1476-thread-1-processing-n:127.0.0.1:36206_) [n:127.0.0.1:36206_ c:collection1 s:shard2 r:core_node1 x:collection1] o.a.s.c.JmxMonitoredMap JMX monitoring is enabled. Adding Solr mbeans to JMX Server: com.sun.jmx.mbeanserver.JmxMBeanServer@4a65de4
   [junit4]   2> 526647 INFO  (coreLoadExecutor-1476-thread-1-processing-n:127.0.0.1:36206_) [n:127.0.0.1:36206_ c:collection1 s:shard2 r:core_node1 x:collection1] o.a.s.c.CachingDirectoryFactory return new directory for /home/jenkins/workspace/Lucene-Solr-master-Linux/solr/build/solr-core/test/J1/../../../../../../../../../home/jenkins/workspace/Lucene-Solr-master-Linux/solr/build/solr-core/test/J1/temp/solr.cloud.TestCloudPivotFacet_39D34BE0B4D5CCCC-001/shard-1-001/cores/collection1/data
   [junit4]   2> 526648 INFO  (coreLoadExecutor-1476-thread-1-processing-n:127.0.0.1:36206_) [n:127.0.0.1:36206_ c:collection1 s:shard2 r:core_node1 x:collection1] o.a.s.c.SolrCore New index directory detected: old=null new=/home/jenkins/workspace/Lucene-Solr-master-Linux/solr/build/solr-core/test/J1/../../../../../../../../../home/jenkins/workspace/Lucene-Solr-master-Linux/solr/build/solr-core/test/J1/temp/solr.cloud.TestCloudPivotFacet_39D34BE0B4D5CCCC-001/shard-1-001/cores/collection1/data/index/
   [junit4]   2> 526648 WARN  (coreLoadExecutor-1476-thread-1-processing-n:127.0.0.1:36206_) [n:127.0.0.1:36206_ c:collection1 s:shard2 r:core_node1 x:collection1] o.a.s.c.SolrCore [collection1] Solr index directory '/home/jenkins/workspace/Lucene-Solr-master-Linux/solr/build/solr-core/test/J1/../../../../../../../../../home/jenkins/workspace/Lucene-Solr-master-Linux/solr/build/solr-core/test/J1/temp/solr.cloud.TestCloudPivotFacet_39D34BE0B4D5CCCC-001/shard-1-001/cores/collection1/data/index' doesn't exist. Creating new index...
   [junit4]   2> 526648 INFO  (coreLoadExecutor-1476-thread-1-processing-n:127.0.0.1:36206_) [n:127.0.0.1:36206_ c:collection1 s:shard2 r:core_node1 x:collection1] o.a.s.c.CachingDirectoryFactory return new directory for /home/jenkins/workspace/Lucene-Solr-master-Linux/solr/build/solr-core/test/J1/../../../../../../../../../home/jenkins/workspace/Lucene-Solr-master-Linux/solr/build/solr-core/test/J1/temp/solr.cloud.TestCloudPivotFacet_39D34BE0B4D5CCCC-001/shard-1-001/cores/collection1/data/index
   [junit4]   2> 526648 INFO  (coreLoadExecutor-1476-thread-1-processing-n:127.0.0.1:36206_) [n:127.0.0.1:36206_ c:collection1 s:shard2 r:core_node1 x:collection1] o.a.s.u.RandomMergePolicy RandomMergePolicy wrapping class org.apache.lucene.index.LogByteSizeMergePolicy: [LogByteSizeMergePolicy: minMergeSize=1677721, mergeFactor=33, maxMergeSize=2147483648, maxMergeSizeForForcedMerge=9223372036854775807, calibrateSizeByDeletes=true, maxMergeDocs=2147483647, maxCFSSegmentSizeMB=8.796093022207999E12, noCFSRatio=0.4294119871040005]
   [junit4]   2> 526648 INFO  (coreLoadExecutor-1476-thread-1-processing-n:127.0.0.1:36206_) [n:127.0.0.1:36206_ c:collection1 s:shard2 r:core_node1 x:collection1] o.a.s.c.SolrDeletionPolicy SolrDeletionPolicy.onCommit: commits: num=1
   [junit4]   2> 	commit{dir=MockDirectoryWrapper(RAMDirectory@48d1289a lockFactory=org.apache.lucene.store.SingleInstanceLockFactory@21daffe7),segFN=segments_1,generation=1}
   [junit4]   2> 526648 INFO  (coreLoadExecutor-1476-thread-1-processing-n:127.0.0.1:36206_) [n:127.0.0.1:36206_ c:collection1 s:shard2 r:core_node1 x:collection1] o.a.s.c.SolrDeletionPolicy newest commit generation = 1
   [junit4]   2> 526649 INFO  (OldIndexDirectoryCleanupThreadForCore-collection1) [n:127.0.0.1:36206_ c:collection1 s:shard2 r:core_node1 x:collection1] o.a.s.c.SolrCore Looking for old index directories to cleanup for core collection1 in /home/jenkins/workspace/Lucene-Solr-master-Linux/solr/build/solr-core/test/J1/../../../../../../../../../home/jenkins/workspace/Lucene-Solr-master-Linux/solr/build/solr-core/test/J1/temp/solr.cloud.TestCloudPivotFacet_39D34BE0B4D5CCCC-001/shard-1-001/cores/collection1/data/
   [junit4]   2> 526649 WARN  (OldIndexDirectoryCleanupThreadForCore-collection1) [n:127.0.0.1:36206_ c:collection1 s:shard2 r:core_node1 x:collection1] o.a.s.c.DirectoryFactory /home/jenkins/workspace/Lucene-Solr-master-Linux/solr/build/solr-core/test/J1/../../../../../../../../../home/jenkins/workspace/Lucene-Solr-master-Linux/solr/build/solr-core/test/J1/temp/solr.cloud.TestCloudPivotFacet_39D34BE0B4D5CCCC-001/shard-1-001/cores/collection1/data/ does not point to a valid data directory; skipping clean-up of old index directories.
   [junit4]   2> 526651 INFO  (coreLoadExecutor-1476-thread-1-processing-n:127.0.0.1:36206_) [n:127.0.0.1:36206_ c:collection1 s:shard2 r:core_node1 x:collection1] o.a.s.u.p.UpdateRequestProcessorChain creating updateRequestProcessorChain "nodistrib"
   [junit4]   2> 526651 INFO  (coreLoadExecutor-1476-thread-1-processing-n:127.0.0.1:36206_) [n:127.0.0.1:36206_ c:collection1 s:shard2 r:core_node1 x:collection1] o.a.s.u.p.UpdateRequestProcessorChain creating updateRequestProcessorChain "dedupe"
   [junit4]   2> 526651 INFO  (coreLoadExecutor-1476-thread-1-processing-n:127.0.0.1:36206_) [n:127.0.0.1:36206_ c:collection1 s:shard2 r:core_node1 x:collection1] o.a.s.u.p.UpdateRequestProcessorChain inserting DistributedUpdateProcessorFactory into updateRequestProcessorChain "dedupe"
   [junit4]   2> 526651 INFO  (coreLoadExecutor-1476-thread-1-processing-n:127.0.0.1:36206_) [n:127.0.0.1:36206_ c:collection1 s:shard2 r:core_node1 x:collection1] o.a.s.u.p.UpdateRequestProcessorChain creating updateRequestProcessorChain "stored_sig"
   [junit4]   2> 526651 INFO  (coreLoadExecutor-1476-thread-1-processing-n:127.0.0.1:36206_) [n:127.0.0.1:36206_ c:collection1 s:shard2 r:core_node1 x:collection1] o.a.s.u.p.UpdateRequestProcessorChain inserting DistributedUpdateProcessorFact

[...truncated too long message...]

[n:127.0.0.1:40982_ c:collection1 s:shard1 r:core_node4 x:collection1] o.a.s.u.DefaultSolrCoreState closing IndexWriter with IndexWriterCloser
   [junit4]   2> 889433 INFO  (coreCloseExecutor-1523-thread-1) [n:127.0.0.1:40982_ c:collection1 s:shard1 r:core_node4 x:collection1] o.a.s.c.SolrCore [collection1] Closing main searcher on request.
   [junit4]   2> 889440 INFO  (coreCloseExecutor-1523-thread-1) [n:127.0.0.1:40982_ c:collection1 s:shard1 r:core_node4 x:collection1] o.a.s.c.CachingDirectoryFactory Closing MockDirectoryFactory - 2 directories currently being tracked
   [junit4]   2> 889440 INFO  (coreCloseExecutor-1523-thread-1) [n:127.0.0.1:40982_ c:collection1 s:shard1 r:core_node4 x:collection1] o.a.s.c.CachingDirectoryFactory looking to close /home/jenkins/workspace/Lucene-Solr-master-Linux/solr/build/solr-core/test/J1/../../../../../../../../../home/jenkins/workspace/Lucene-Solr-master-Linux/solr/build/solr-core/test/J1/temp/solr.cloud.TestCloudPivotFacet_39D34BE0B4D5CCCC-001/shard-4-001/cores/collection1/data/index [CachedDir<<refCount=0;path=/home/jenkins/workspace/Lucene-Solr-master-Linux/solr/build/solr-core/test/J1/../../../../../../../../../home/jenkins/workspace/Lucene-Solr-master-Linux/solr/build/solr-core/test/J1/temp/solr.cloud.TestCloudPivotFacet_39D34BE0B4D5CCCC-001/shard-4-001/cores/collection1/data/index;done=false>>]
   [junit4]   2> 889440 INFO  (coreCloseExecutor-1523-thread-1) [n:127.0.0.1:40982_ c:collection1 s:shard1 r:core_node4 x:collection1] o.a.s.c.CachingDirectoryFactory Closing directory, CoreContainer#isShutdown=true
   [junit4]   2> 889441 INFO  (coreCloseExecutor-1523-thread-1) [n:127.0.0.1:40982_ c:collection1 s:shard1 r:core_node4 x:collection1] o.a.s.c.CachingDirectoryFactory Closing directory: /home/jenkins/workspace/Lucene-Solr-master-Linux/solr/build/solr-core/test/J1/../../../../../../../../../home/jenkins/workspace/Lucene-Solr-master-Linux/solr/build/solr-core/test/J1/temp/solr.cloud.TestCloudPivotFacet_39D34BE0B4D5CCCC-001/shard-4-001/cores/collection1/data/index
   [junit4]   2> 889441 INFO  (coreCloseExecutor-1523-thread-1) [n:127.0.0.1:40982_ c:collection1 s:shard1 r:core_node4 x:collection1] o.a.s.c.CachingDirectoryFactory looking to close /home/jenkins/workspace/Lucene-Solr-master-Linux/solr/build/solr-core/test/J1/../../../../../../../../../home/jenkins/workspace/Lucene-Solr-master-Linux/solr/build/solr-core/test/J1/temp/solr.cloud.TestCloudPivotFacet_39D34BE0B4D5CCCC-001/shard-4-001/cores/collection1/data [CachedDir<<refCount=0;path=/home/jenkins/workspace/Lucene-Solr-master-Linux/solr/build/solr-core/test/J1/../../../../../../../../../home/jenkins/workspace/Lucene-Solr-master-Linux/solr/build/solr-core/test/J1/temp/solr.cloud.TestCloudPivotFacet_39D34BE0B4D5CCCC-001/shard-4-001/cores/collection1/data;done=false>>]
   [junit4]   2> 889441 INFO  (coreCloseExecutor-1523-thread-1) [n:127.0.0.1:40982_ c:collection1 s:shard1 r:core_node4 x:collection1] o.a.s.c.CachingDirectoryFactory Closing directory, CoreContainer#isShutdown=true
   [junit4]   2> 889441 INFO  (coreCloseExecutor-1523-thread-1) [n:127.0.0.1:40982_ c:collection1 s:shard1 r:core_node4 x:collection1] o.a.s.c.CachingDirectoryFactory Closing directory: /home/jenkins/workspace/Lucene-Solr-master-Linux/solr/build/solr-core/test/J1/../../../../../../../../../home/jenkins/workspace/Lucene-Solr-master-Linux/solr/build/solr-core/test/J1/temp/solr.cloud.TestCloudPivotFacet_39D34BE0B4D5CCCC-001/shard-4-001/cores/collection1/data
   [junit4]   2> 890341 INFO  (TEST-TestCloudPivotFacet.test-seed#[39D34BE0B4D5CCCC]) [    ] o.e.j.s.ServerConnector Stopped ServerConnector@2e80e409{HTTP/1.1,[http/1.1]}{127.0.0.1:0}
   [junit4]   2> 890341 INFO  (TEST-TestCloudPivotFacet.test-seed#[39D34BE0B4D5CCCC]) [    ] o.e.j.s.h.ContextHandler Stopped o.e.j.s.ServletContextHandler@418a5331{/,null,UNAVAILABLE}
   [junit4]   2> 890341 INFO  (TEST-TestCloudPivotFacet.test-seed#[39D34BE0B4D5CCCC]) [    ] o.a.s.c.ZkTestServer connecting to 127.0.0.1:33288 33288
   [junit4]   2> NOTE: reproduce with: ant test  -Dtestcase=TestCloudPivotFacet -Dtests.method=test -Dtests.seed=39D34BE0B4D5CCCC -Dtests.multiplier=3 -Dtests.slow=true -Dtests.locale=it-IT -Dtests.timezone=America/Bahia_Banderas -Dtests.asserts=true -Dtests.file.encoding=US-ASCII
   [junit4] ERROR    369s J1 | TestCloudPivotFacet.test <<<
   [junit4]    > Throwable #1: java.lang.AssertionError: {main(facet=true&facet.pivot={!stats%3Dst2}dense_pivot_i,dense_pivot_ti1,dense_pivot_y_s1&facet.pivot={!stats%3Dst2}pivot_z_s1,pivot_tdt,pivot_i&facet.limit=13&facet.offset=6&facet.sort=count),extra(rows=0&q=*:*&stats=true&stats.field={!key%3Dsk1+tag%3Dst1,st2}pivot_y_s&stats.field={!key%3Dsk2+tag%3Dst2,st3}pivot_ti1&stats.field={!key%3Dsk3+tag%3Dst3,st4}pivot_f&_test_sort=count)} has null pivots?
   [junit4]    > 	at org.apache.solr.cloud.TestCloudPivotFacet.assertPivotCountsAreCorrect(TestCloudPivotFacet.java:256)
   [junit4]    > 	at org.apache.solr.cloud.TestCloudPivotFacet.test(TestCloudPivotFacet.java:234)
   [junit4]    > 	at org.apache.solr.BaseDistributedSearchTestCase$ShardsRepeatRule$ShardsFixedStatement.callStatement(BaseDistributedSearchTestCase.java:996)
   [junit4]    > 	at org.apache.solr.BaseDistributedSearchTestCase$ShardsRepeatRule$ShardsStatement.evaluate(BaseDistributedSearchTestCase.java:971)
   [junit4]    > 	at java.lang.Thread.run(Thread.java:745)Throwable #2: com.carrotsearch.randomizedtesting.UncaughtExceptionError: Captured an uncaught exception in thread: Thread[id=2934, name=SessionTracker, state=RUNNABLE, group=TGRP-TestCloudPivotFacet]
   [junit4]    > Caused by: java.lang.OutOfMemoryError: GC overhead limit exceeded
   [junit4]   2> 890439 INFO  (SUITE-TestCloudPivotFacet-seed#[39D34BE0B4D5CCCC]-worker) [    ] o.a.s.SolrTestCaseJ4 ###deleteCore
   [junit4]   2> NOTE: leaving temporary files on disk at: /home/jenkins/workspace/Lucene-Solr-master-Linux/solr/build/solr-core/test/J1/temp/solr.cloud.TestCloudPivotFacet_39D34BE0B4D5CCCC-001
   [junit4]   2> NOTE: test params are: codec=FastCompressingStoredFields(storedFieldsFormat=CompressingStoredFieldsFormat(compressionMode=FAST, chunkSize=3810, maxDocsPerChunk=314, blockSize=7), termVectorsFormat=CompressingTermVectorsFormat(compressionMode=FAST, chunkSize=3810, blockSize=7)), sim=RandomSimilarity(queryNorm=false,coord=yes): {}, locale=it-IT, timezone=America/Bahia_Banderas
   [junit4]   2> NOTE: Linux 4.2.0-34-generic amd64/Oracle Corporation 1.8.0_72 (64-bit)/cpus=12,threads=1,free=425301144,total=477626368
   [junit4]   2> NOTE: All tests run in this JVM: [TestSimpleTrackingShardHandler, DeleteInactiveReplicaTest, ZkControllerTest, TestNRTOpen, TestFieldCollectionResource, UpdateRequestProcessorFactoryTest, CollectionReloadTest, TestMiniSolrCloudClusterBase, LoggingHandlerTest, TestUseDocValuesAsStored, TestQuerySenderListener, TestQuerySenderNoQuery, TestMissingGroups, TestCustomSort, InfoHandlerTest, HdfsWriteToMultipleCollectionsTest, TestSolrCoreProperties, TestIntervalFaceting, ChaosMonkeySafeLeaderTest, TestFiltering, TriLevelCompositeIdRoutingTest, TestFieldTypeResource, DocValuesTest, DataDrivenBlockJoinTest, SpellingQueryConverterTest, TestLeaderElectionZkExpiry, SolrCmdDistributorTest, TestPartialUpdateDeduplication, HdfsThreadLeakTest, TestImplicitCoreProperties, DistributedFacetPivotWhiteBoxTest, DistanceUnitsTest, FastVectorHighlighterTest, TermVectorComponentTest, TestRequestForwarding, TestQueryTypes, NotRequiredUniqueKeyTest, LeaderFailoverAfterPartitionTest, TestConfigSetProperties, SolrInfoMBeanTest, TestBlendedInfixSuggestions, SimplePostToolTest, JavabinLoaderTest, CollectionsAPIDistributedZkTest, TestCloudPivotFacet]
   [junit4] Completed [241/581 (1!)] on J1 in 368.61s, 1 test, 1 error <<< FAILURES!

[...truncated 1088 lines...]
   [junit4] JVM J1: stdout was not empty, see: /home/jenkins/workspace/Lucene-Solr-master-Linux/solr/build/solr-core/test/temp/junit4-J1-20160323_031032_673.sysout
   [junit4] >>> JVM J1 emitted unexpected output (verbatim) ----
   [junit4] java.lang.OutOfMemoryError: GC overhead limit exceeded
   [junit4] Dumping heap to /home/jenkins/workspace/Lucene-Solr-master-Linux/heapdumps/java_pid26210.hprof ...
   [junit4] Heap dump file created [449724802 bytes in 2.807 secs]
   [junit4] <<< JVM J1: EOF ----

   [junit4] JVM J1: stderr was not empty, see: /home/jenkins/workspace/Lucene-Solr-master-Linux/solr/build/solr-core/test/temp/junit4-J1-20160323_031032_673.syserr
   [junit4] >>> JVM J1 emitted unexpected output (verbatim) ----
   [junit4] 
   [junit4] Exception: java.lang.OutOfMemoryError thrown from the UncaughtExceptionHandler in thread "NIOServerCxn.Factory:0.0.0.0/0.0.0.0:0"
   [junit4] <<< JVM J1: EOF ----

[...truncated 16 lines...]
BUILD FAILED
/home/jenkins/workspace/Lucene-Solr-master-Linux/build.xml:740: The following error occurred while executing this line:
/home/jenkins/workspace/Lucene-Solr-master-Linux/build.xml:684: The following error occurred while executing this line:
/home/jenkins/workspace/Lucene-Solr-master-Linux/build.xml:59: The following error occurred while executing this line:
/home/jenkins/workspace/Lucene-Solr-master-Linux/solr/build.xml:233: The following error occurred while executing this line:
/home/jenkins/workspace/Lucene-Solr-master-Linux/solr/common-build.xml:529: The following error occurred while executing this line:
/home/jenkins/workspace/Lucene-Solr-master-Linux/lucene/common-build.xml:1457: The following error occurred while executing this line:
/home/jenkins/workspace/Lucene-Solr-master-Linux/lucene/common-build.xml:1014: There were test failures: 581 suites (10 ignored), 2324 tests, 1 error, 115 ignored (70 assumptions) [seed: 39D34BE0B4D5CCCC]

Total time: 49 minutes 34 seconds
Build step 'Invoke Ant' marked build as failure
Archiving artifacts
[WARNINGS] Skipping publisher since build result is FAILURE
Recording test results
Email was triggered for: Failure - Any
Sending email for trigger: Failure - Any



Mime
View raw message