lucene-dev mailing list archives

Site index · List index
Message view « Date » · « Thread »
Top « Date » · « Thread »
From Policeman Jenkins Server <jenk...@thetaphi.de>
Subject [JENKINS] Lucene-Solr-master-Linux (32bit/jdk1.8.0_72) - Build # 16328 - Failure!
Date Fri, 25 Mar 2016 13:28:54 GMT
Build: http://jenkins.thetaphi.de/job/Lucene-Solr-master-Linux/16328/
Java: 32bit/jdk1.8.0_72 -client -XX:+UseConcMarkSweepGC

1 tests failed.
FAILED:  org.apache.solr.handler.TestReqParamsAPI.test

Error Message:
Could not get expected value  'first' for path 'response/params/x/_appends_/add' full output: {   "responseHeader":{     "status":0,     "QTime":0},   "response":{     "znodeVersion":3,     "params":{       "x":{         "a":"A val",         "b":"B val",         "":{"v":0}},       "y":{         "p":"P val",         "q":"Q val",         "":{"v":2}}}}}

Stack Trace:
java.lang.AssertionError: Could not get expected value  'first' for path 'response/params/x/_appends_/add' full output: {
  "responseHeader":{
    "status":0,
    "QTime":0},
  "response":{
    "znodeVersion":3,
    "params":{
      "x":{
        "a":"A val",
        "b":"B val",
        "":{"v":0}},
      "y":{
        "p":"P val",
        "q":"Q val",
        "":{"v":2}}}}}
	at __randomizedtesting.SeedInfo.seed([1479B1FD48669C72:9C2D8E27E69AF18A]:0)
	at org.junit.Assert.fail(Assert.java:93)
	at org.junit.Assert.assertTrue(Assert.java:43)
	at org.apache.solr.core.TestSolrConfigHandler.testForResponseElement(TestSolrConfigHandler.java:458)
	at org.apache.solr.handler.TestReqParamsAPI.testReqParams(TestReqParamsAPI.java:236)
	at org.apache.solr.handler.TestReqParamsAPI.test(TestReqParamsAPI.java:67)
	at sun.reflect.NativeMethodAccessorImpl.invoke0(Native Method)
	at sun.reflect.NativeMethodAccessorImpl.invoke(NativeMethodAccessorImpl.java:62)
	at sun.reflect.DelegatingMethodAccessorImpl.invoke(DelegatingMethodAccessorImpl.java:43)
	at java.lang.reflect.Method.invoke(Method.java:498)
	at com.carrotsearch.randomizedtesting.RandomizedRunner.invoke(RandomizedRunner.java:1764)
	at com.carrotsearch.randomizedtesting.RandomizedRunner$8.evaluate(RandomizedRunner.java:871)
	at com.carrotsearch.randomizedtesting.RandomizedRunner$9.evaluate(RandomizedRunner.java:907)
	at com.carrotsearch.randomizedtesting.RandomizedRunner$10.evaluate(RandomizedRunner.java:921)
	at org.apache.solr.BaseDistributedSearchTestCase$ShardsRepeatRule$ShardsFixedStatement.callStatement(BaseDistributedSearchTestCase.java:996)
	at org.apache.solr.BaseDistributedSearchTestCase$ShardsRepeatRule$ShardsStatement.evaluate(BaseDistributedSearchTestCase.java:971)
	at com.carrotsearch.randomizedtesting.rules.SystemPropertiesRestoreRule$1.evaluate(SystemPropertiesRestoreRule.java:57)
	at org.apache.lucene.util.TestRuleSetupTeardownChained$1.evaluate(TestRuleSetupTeardownChained.java:49)
	at org.apache.lucene.util.AbstractBeforeAfterRule$1.evaluate(AbstractBeforeAfterRule.java:45)
	at org.apache.lucene.util.TestRuleThreadAndTestName$1.evaluate(TestRuleThreadAndTestName.java:48)
	at org.apache.lucene.util.TestRuleIgnoreAfterMaxFailures$1.evaluate(TestRuleIgnoreAfterMaxFailures.java:64)
	at org.apache.lucene.util.TestRuleMarkFailure$1.evaluate(TestRuleMarkFailure.java:47)
	at com.carrotsearch.randomizedtesting.rules.StatementAdapter.evaluate(StatementAdapter.java:36)
	at com.carrotsearch.randomizedtesting.ThreadLeakControl$StatementRunner.run(ThreadLeakControl.java:367)
	at com.carrotsearch.randomizedtesting.ThreadLeakControl.forkTimeoutingTask(ThreadLeakControl.java:809)
	at com.carrotsearch.randomizedtesting.ThreadLeakControl$3.evaluate(ThreadLeakControl.java:460)
	at com.carrotsearch.randomizedtesting.RandomizedRunner.runSingleTest(RandomizedRunner.java:880)
	at com.carrotsearch.randomizedtesting.RandomizedRunner$5.evaluate(RandomizedRunner.java:781)
	at com.carrotsearch.randomizedtesting.RandomizedRunner$6.evaluate(RandomizedRunner.java:816)
	at com.carrotsearch.randomizedtesting.RandomizedRunner$7.evaluate(RandomizedRunner.java:827)
	at com.carrotsearch.randomizedtesting.rules.StatementAdapter.evaluate(StatementAdapter.java:36)
	at com.carrotsearch.randomizedtesting.rules.SystemPropertiesRestoreRule$1.evaluate(SystemPropertiesRestoreRule.java:57)
	at org.apache.lucene.util.AbstractBeforeAfterRule$1.evaluate(AbstractBeforeAfterRule.java:45)
	at com.carrotsearch.randomizedtesting.rules.StatementAdapter.evaluate(StatementAdapter.java:36)
	at org.apache.lucene.util.TestRuleStoreClassName$1.evaluate(TestRuleStoreClassName.java:41)
	at com.carrotsearch.randomizedtesting.rules.NoShadowingOrOverridesOnMethodsRule$1.evaluate(NoShadowingOrOverridesOnMethodsRule.java:40)
	at com.carrotsearch.randomizedtesting.rules.NoShadowingOrOverridesOnMethodsRule$1.evaluate(NoShadowingOrOverridesOnMethodsRule.java:40)
	at com.carrotsearch.randomizedtesting.rules.StatementAdapter.evaluate(StatementAdapter.java:36)
	at com.carrotsearch.randomizedtesting.rules.StatementAdapter.evaluate(StatementAdapter.java:36)
	at com.carrotsearch.randomizedtesting.rules.StatementAdapter.evaluate(StatementAdapter.java:36)
	at org.apache.lucene.util.TestRuleAssertionsRequired$1.evaluate(TestRuleAssertionsRequired.java:53)
	at org.apache.lucene.util.TestRuleMarkFailure$1.evaluate(TestRuleMarkFailure.java:47)
	at org.apache.lucene.util.TestRuleIgnoreAfterMaxFailures$1.evaluate(TestRuleIgnoreAfterMaxFailures.java:64)
	at org.apache.lucene.util.TestRuleIgnoreTestSuites$1.evaluate(TestRuleIgnoreTestSuites.java:54)
	at com.carrotsearch.randomizedtesting.rules.StatementAdapter.evaluate(StatementAdapter.java:36)
	at com.carrotsearch.randomizedtesting.ThreadLeakControl$StatementRunner.run(ThreadLeakControl.java:367)
	at java.lang.Thread.run(Thread.java:745)




Build Log:
[...truncated 12133 lines...]
   [junit4] Suite: org.apache.solr.handler.TestReqParamsAPI
   [junit4]   2> Creating dataDir: /home/jenkins/workspace/Lucene-Solr-master-Linux/solr/build/solr-core/test/J0/temp/solr.handler.TestReqParamsAPI_1479B1FD48669C72-001/init-core-data-001
   [junit4]   2> 1809255 INFO  (SUITE-TestReqParamsAPI-seed#[1479B1FD48669C72]-worker) [    ] o.a.s.SolrTestCaseJ4 Randomized ssl (false) and clientAuth (false)
   [junit4]   2> 1809255 INFO  (SUITE-TestReqParamsAPI-seed#[1479B1FD48669C72]-worker) [    ] o.a.s.BaseDistributedSearchTestCase Setting hostContext system property: /ob/
   [junit4]   2> 1809257 INFO  (TEST-TestReqParamsAPI.test-seed#[1479B1FD48669C72]) [    ] o.a.s.c.ZkTestServer STARTING ZK TEST SERVER
   [junit4]   2> 1809257 INFO  (Thread-5256) [    ] o.a.s.c.ZkTestServer client port:0.0.0.0/0.0.0.0:0
   [junit4]   2> 1809258 INFO  (Thread-5256) [    ] o.a.s.c.ZkTestServer Starting server
   [junit4]   2> 1809358 INFO  (TEST-TestReqParamsAPI.test-seed#[1479B1FD48669C72]) [    ] o.a.s.c.ZkTestServer start zk server on port:34458
   [junit4]   2> 1809358 INFO  (TEST-TestReqParamsAPI.test-seed#[1479B1FD48669C72]) [    ] o.a.s.c.c.SolrZkClient Using default ZkCredentialsProvider
   [junit4]   2> 1809358 INFO  (TEST-TestReqParamsAPI.test-seed#[1479B1FD48669C72]) [    ] o.a.s.c.c.ConnectionManager Waiting for client to connect to ZooKeeper
   [junit4]   2> 1809361 INFO  (zkCallback-2216-thread-1) [    ] o.a.s.c.c.ConnectionManager Watcher org.apache.solr.common.cloud.ConnectionManager@15d11ce name:ZooKeeperConnection Watcher:127.0.0.1:34458 got event WatchedEvent state:SyncConnected type:None path:null path:null type:None
   [junit4]   2> 1809361 INFO  (TEST-TestReqParamsAPI.test-seed#[1479B1FD48669C72]) [    ] o.a.s.c.c.ConnectionManager Client is connected to ZooKeeper
   [junit4]   2> 1809361 INFO  (TEST-TestReqParamsAPI.test-seed#[1479B1FD48669C72]) [    ] o.a.s.c.c.SolrZkClient Using default ZkACLProvider
   [junit4]   2> 1809361 INFO  (TEST-TestReqParamsAPI.test-seed#[1479B1FD48669C72]) [    ] o.a.s.c.c.SolrZkClient makePath: /solr
   [junit4]   2> 1809363 INFO  (TEST-TestReqParamsAPI.test-seed#[1479B1FD48669C72]) [    ] o.a.s.c.c.SolrZkClient Using default ZkCredentialsProvider
   [junit4]   2> 1809363 WARN  (NIOServerCxn.Factory:0.0.0.0/0.0.0.0:0) [    ] o.a.z.s.NIOServerCnxn caught end of stream exception
   [junit4]   2> EndOfStreamException: Unable to read additional data from client sessionid 0x153adf313170000, likely client has closed socket
   [junit4]   2> 	at org.apache.zookeeper.server.NIOServerCnxn.doIO(NIOServerCnxn.java:228)
   [junit4]   2> 	at org.apache.zookeeper.server.NIOServerCnxnFactory.run(NIOServerCnxnFactory.java:208)
   [junit4]   2> 	at java.lang.Thread.run(Thread.java:745)
   [junit4]   2> 1809364 INFO  (TEST-TestReqParamsAPI.test-seed#[1479B1FD48669C72]) [    ] o.a.s.c.c.ConnectionManager Waiting for client to connect to ZooKeeper
   [junit4]   2> 1809365 INFO  (zkCallback-2217-thread-1) [    ] o.a.s.c.c.ConnectionManager Watcher org.apache.solr.common.cloud.ConnectionManager@15c907d name:ZooKeeperConnection Watcher:127.0.0.1:34458/solr got event WatchedEvent state:SyncConnected type:None path:null path:null type:None
   [junit4]   2> 1809365 INFO  (TEST-TestReqParamsAPI.test-seed#[1479B1FD48669C72]) [    ] o.a.s.c.c.ConnectionManager Client is connected to ZooKeeper
   [junit4]   2> 1809365 INFO  (TEST-TestReqParamsAPI.test-seed#[1479B1FD48669C72]) [    ] o.a.s.c.c.SolrZkClient Using default ZkACLProvider
   [junit4]   2> 1809365 INFO  (TEST-TestReqParamsAPI.test-seed#[1479B1FD48669C72]) [    ] o.a.s.c.c.SolrZkClient makePath: /collections/collection1
   [junit4]   2> 1809367 INFO  (TEST-TestReqParamsAPI.test-seed#[1479B1FD48669C72]) [    ] o.a.s.c.c.SolrZkClient makePath: /collections/collection1/shards
   [junit4]   2> 1809369 INFO  (TEST-TestReqParamsAPI.test-seed#[1479B1FD48669C72]) [    ] o.a.s.c.c.SolrZkClient makePath: /collections/control_collection
   [junit4]   2> 1809370 INFO  (TEST-TestReqParamsAPI.test-seed#[1479B1FD48669C72]) [    ] o.a.s.c.c.SolrZkClient makePath: /collections/control_collection/shards
   [junit4]   2> 1809373 INFO  (TEST-TestReqParamsAPI.test-seed#[1479B1FD48669C72]) [    ] o.a.s.c.AbstractZkTestCase put /home/jenkins/workspace/Lucene-Solr-master-Linux/solr/core/src/test-files/solr/collection1/conf/solrconfig-tlog.xml to /configs/conf1/solrconfig.xml
   [junit4]   2> 1809373 INFO  (TEST-TestReqParamsAPI.test-seed#[1479B1FD48669C72]) [    ] o.a.s.c.c.SolrZkClient makePath: /configs/conf1/solrconfig.xml
   [junit4]   2> 1809375 INFO  (TEST-TestReqParamsAPI.test-seed#[1479B1FD48669C72]) [    ] o.a.s.c.AbstractZkTestCase put /home/jenkins/workspace/Lucene-Solr-master-Linux/solr/core/src/test-files/solr/collection1/conf/schema.xml to /configs/conf1/schema.xml
   [junit4]   2> 1809376 INFO  (TEST-TestReqParamsAPI.test-seed#[1479B1FD48669C72]) [    ] o.a.s.c.c.SolrZkClient makePath: /configs/conf1/schema.xml
   [junit4]   2> 1809377 INFO  (TEST-TestReqParamsAPI.test-seed#[1479B1FD48669C72]) [    ] o.a.s.c.AbstractZkTestCase put /home/jenkins/workspace/Lucene-Solr-master-Linux/solr/core/src/test-files/solr/collection1/conf/solrconfig.snippet.randomindexconfig.xml to /configs/conf1/solrconfig.snippet.randomindexconfig.xml
   [junit4]   2> 1809378 INFO  (TEST-TestReqParamsAPI.test-seed#[1479B1FD48669C72]) [    ] o.a.s.c.c.SolrZkClient makePath: /configs/conf1/solrconfig.snippet.randomindexconfig.xml
   [junit4]   2> 1809379 INFO  (TEST-TestReqParamsAPI.test-seed#[1479B1FD48669C72]) [    ] o.a.s.c.AbstractZkTestCase put /home/jenkins/workspace/Lucene-Solr-master-Linux/solr/core/src/test-files/solr/collection1/conf/stopwords.txt to /configs/conf1/stopwords.txt
   [junit4]   2> 1809379 INFO  (TEST-TestReqParamsAPI.test-seed#[1479B1FD48669C72]) [    ] o.a.s.c.c.SolrZkClient makePath: /configs/conf1/stopwords.txt
   [junit4]   2> 1809381 INFO  (TEST-TestReqParamsAPI.test-seed#[1479B1FD48669C72]) [    ] o.a.s.c.AbstractZkTestCase put /home/jenkins/workspace/Lucene-Solr-master-Linux/solr/core/src/test-files/solr/collection1/conf/protwords.txt to /configs/conf1/protwords.txt
   [junit4]   2> 1809381 INFO  (TEST-TestReqParamsAPI.test-seed#[1479B1FD48669C72]) [    ] o.a.s.c.c.SolrZkClient makePath: /configs/conf1/protwords.txt
   [junit4]   2> 1809382 INFO  (TEST-TestReqParamsAPI.test-seed#[1479B1FD48669C72]) [    ] o.a.s.c.AbstractZkTestCase put /home/jenkins/workspace/Lucene-Solr-master-Linux/solr/core/src/test-files/solr/collection1/conf/currency.xml to /configs/conf1/currency.xml
   [junit4]   2> 1809382 INFO  (TEST-TestReqParamsAPI.test-seed#[1479B1FD48669C72]) [    ] o.a.s.c.c.SolrZkClient makePath: /configs/conf1/currency.xml
   [junit4]   2> 1809384 INFO  (TEST-TestReqParamsAPI.test-seed#[1479B1FD48669C72]) [    ] o.a.s.c.AbstractZkTestCase put /home/jenkins/workspace/Lucene-Solr-master-Linux/solr/core/src/test-files/solr/collection1/conf/enumsConfig.xml to /configs/conf1/enumsConfig.xml
   [junit4]   2> 1809384 INFO  (TEST-TestReqParamsAPI.test-seed#[1479B1FD48669C72]) [    ] o.a.s.c.c.SolrZkClient makePath: /configs/conf1/enumsConfig.xml
   [junit4]   2> 1809386 INFO  (TEST-TestReqParamsAPI.test-seed#[1479B1FD48669C72]) [    ] o.a.s.c.AbstractZkTestCase put /home/jenkins/workspace/Lucene-Solr-master-Linux/solr/core/src/test-files/solr/collection1/conf/open-exchange-rates.json to /configs/conf1/open-exchange-rates.json
   [junit4]   2> 1809386 INFO  (TEST-TestReqParamsAPI.test-seed#[1479B1FD48669C72]) [    ] o.a.s.c.c.SolrZkClient makePath: /configs/conf1/open-exchange-rates.json
   [junit4]   2> 1809392 INFO  (TEST-TestReqParamsAPI.test-seed#[1479B1FD48669C72]) [    ] o.a.s.c.AbstractZkTestCase put /home/jenkins/workspace/Lucene-Solr-master-Linux/solr/core/src/test-files/solr/collection1/conf/mapping-ISOLatin1Accent.txt to /configs/conf1/mapping-ISOLatin1Accent.txt
   [junit4]   2> 1809392 INFO  (TEST-TestReqParamsAPI.test-seed#[1479B1FD48669C72]) [    ] o.a.s.c.c.SolrZkClient makePath: /configs/conf1/mapping-ISOLatin1Accent.txt
   [junit4]   2> 1809394 INFO  (TEST-TestReqParamsAPI.test-seed#[1479B1FD48669C72]) [    ] o.a.s.c.AbstractZkTestCase put /home/jenkins/workspace/Lucene-Solr-master-Linux/solr/core/src/test-files/solr/collection1/conf/old_synonyms.txt to /configs/conf1/old_synonyms.txt
   [junit4]   2> 1809394 INFO  (TEST-TestReqParamsAPI.test-seed#[1479B1FD48669C72]) [    ] o.a.s.c.c.SolrZkClient makePath: /configs/conf1/old_synonyms.txt
   [junit4]   2> 1809396 INFO  (TEST-TestReqParamsAPI.test-seed#[1479B1FD48669C72]) [    ] o.a.s.c.AbstractZkTestCase put /home/jenkins/workspace/Lucene-Solr-master-Linux/solr/core/src/test-files/solr/collection1/conf/synonyms.txt to /configs/conf1/synonyms.txt
   [junit4]   2> 1809396 INFO  (TEST-TestReqParamsAPI.test-seed#[1479B1FD48669C72]) [    ] o.a.s.c.c.SolrZkClient makePath: /configs/conf1/synonyms.txt
   [junit4]   2> 1809466 INFO  (TEST-TestReqParamsAPI.test-seed#[1479B1FD48669C72]) [    ] o.a.s.SolrTestCaseJ4 Writing core.properties file to /home/jenkins/workspace/Lucene-Solr-master-Linux/solr/build/solr-core/test/J0/temp/solr.handler.TestReqParamsAPI_1479B1FD48669C72-001/control-001/cores/collection1
   [junit4]   2> 1809469 INFO  (TEST-TestReqParamsAPI.test-seed#[1479B1FD48669C72]) [    ] o.e.j.s.Server jetty-9.3.8.v20160314
   [junit4]   2> 1809470 INFO  (TEST-TestReqParamsAPI.test-seed#[1479B1FD48669C72]) [    ] o.e.j.s.h.ContextHandler Started o.e.j.s.ServletContextHandler@7d6e83{/ob,null,AVAILABLE}
   [junit4]   2> 1809471 INFO  (TEST-TestReqParamsAPI.test-seed#[1479B1FD48669C72]) [    ] o.e.j.s.ServerConnector Started ServerConnector@1f99eb1{HTTP/1.1,[http/1.1]}{127.0.0.1:34018}
   [junit4]   2> 1809471 INFO  (TEST-TestReqParamsAPI.test-seed#[1479B1FD48669C72]) [    ] o.e.j.s.Server Started @1810749ms
   [junit4]   2> 1809472 INFO  (TEST-TestReqParamsAPI.test-seed#[1479B1FD48669C72]) [    ] o.a.s.c.s.e.JettySolrRunner Jetty properties: {solr.data.dir=/home/jenkins/workspace/Lucene-Solr-master-Linux/solr/build/solr-core/test/J0/temp/solr.handler.TestReqParamsAPI_1479B1FD48669C72-001/tempDir-001/control/data, hostContext=/ob, hostPort=34018, coreRootDirectory=/home/jenkins/workspace/Lucene-Solr-master-Linux/solr/build/solr-core/test/J0/../../../../../../../../../home/jenkins/workspace/Lucene-Solr-master-Linux/solr/build/solr-core/test/J0/temp/solr.handler.TestReqParamsAPI_1479B1FD48669C72-001/control-001/cores}
   [junit4]   2> 1809472 INFO  (TEST-TestReqParamsAPI.test-seed#[1479B1FD48669C72]) [    ] o.a.s.s.SolrDispatchFilter SolrDispatchFilter.init(): sun.misc.Launcher$AppClassLoader@1d16e93
   [junit4]   2> 1809472 INFO  (TEST-TestReqParamsAPI.test-seed#[1479B1FD48669C72]) [    ] o.a.s.c.SolrResourceLoader new SolrResourceLoader for directory: '/home/jenkins/workspace/Lucene-Solr-master-Linux/solr/build/solr-core/test/J0/temp/solr.handler.TestReqParamsAPI_1479B1FD48669C72-001/control-001'
   [junit4]   2> 1809472 INFO  (TEST-TestReqParamsAPI.test-seed#[1479B1FD48669C72]) [    ] o.a.s.c.SolrResourceLoader JNDI not configured for solr (NoInitialContextEx)
   [junit4]   2> 1809472 INFO  (TEST-TestReqParamsAPI.test-seed#[1479B1FD48669C72]) [    ] o.a.s.c.SolrResourceLoader solr home defaulted to 'solr/' (could not find system property or JNDI)
   [junit4]   2> 1809472 INFO  (TEST-TestReqParamsAPI.test-seed#[1479B1FD48669C72]) [    ] o.a.s.c.c.SolrZkClient Using default ZkCredentialsProvider
   [junit4]   2> 1809473 INFO  (TEST-TestReqParamsAPI.test-seed#[1479B1FD48669C72]) [    ] o.a.s.c.c.ConnectionManager Waiting for client to connect to ZooKeeper
   [junit4]   2> 1809474 INFO  (zkCallback-2218-thread-1) [    ] o.a.s.c.c.ConnectionManager Watcher org.apache.solr.common.cloud.ConnectionManager@1755f29 name:ZooKeeperConnection Watcher:127.0.0.1:34458/solr got event WatchedEvent state:SyncConnected type:None path:null path:null type:None
   [junit4]   2> 1809474 INFO  (TEST-TestReqParamsAPI.test-seed#[1479B1FD48669C72]) [    ] o.a.s.c.c.ConnectionManager Client is connected to ZooKeeper
   [junit4]   2> 1809474 INFO  (TEST-TestReqParamsAPI.test-seed#[1479B1FD48669C72]) [    ] o.a.s.c.c.SolrZkClient Using default ZkACLProvider
   [junit4]   2> 1809475 INFO  (TEST-TestReqParamsAPI.test-seed#[1479B1FD48669C72]) [    ] o.a.s.s.SolrDispatchFilter Loading solr.xml from SolrHome (not found in ZooKeeper)
   [junit4]   2> 1809475 INFO  (TEST-TestReqParamsAPI.test-seed#[1479B1FD48669C72]) [    ] o.a.s.c.SolrXmlConfig Loading container configuration from /home/jenkins/workspace/Lucene-Solr-master-Linux/solr/build/solr-core/test/J0/temp/solr.handler.TestReqParamsAPI_1479B1FD48669C72-001/control-001/solr.xml
   [junit4]   2> 1809483 INFO  (TEST-TestReqParamsAPI.test-seed#[1479B1FD48669C72]) [    ] o.a.s.c.CorePropertiesLocator Config-defined core root directory: /home/jenkins/workspace/Lucene-Solr-master-Linux/solr/build/solr-core/test/J0/../../../../../../../../../home/jenkins/workspace/Lucene-Solr-master-Linux/solr/build/solr-core/test/J0/temp/solr.handler.TestReqParamsAPI_1479B1FD48669C72-001/control-001/cores
   [junit4]   2> 1809483 INFO  (TEST-TestReqParamsAPI.test-seed#[1479B1FD48669C72]) [    ] o.a.s.c.CoreContainer New CoreContainer 18105345
   [junit4]   2> 1809483 INFO  (TEST-TestReqParamsAPI.test-seed#[1479B1FD48669C72]) [    ] o.a.s.c.CoreContainer Loading cores into CoreContainer [instanceDir=/home/jenkins/workspace/Lucene-Solr-master-Linux/solr/build/solr-core/test/J0/temp/solr.handler.TestReqParamsAPI_1479B1FD48669C72-001/control-001]
   [junit4]   2> 1809483 WARN  (TEST-TestReqParamsAPI.test-seed#[1479B1FD48669C72]) [    ] o.a.s.c.CoreContainer Couldn't add files from /home/jenkins/workspace/Lucene-Solr-master-Linux/solr/build/solr-core/test/J0/temp/solr.handler.TestReqParamsAPI_1479B1FD48669C72-001/control-001/lib to classpath: /home/jenkins/workspace/Lucene-Solr-master-Linux/solr/build/solr-core/test/J0/temp/solr.handler.TestReqParamsAPI_1479B1FD48669C72-001/control-001/lib
   [junit4]   2> 1809483 INFO  (TEST-TestReqParamsAPI.test-seed#[1479B1FD48669C72]) [    ] o.a.s.h.c.HttpShardHandlerFactory created with socketTimeout : 90000,urlScheme : ,connTimeout : 15000,maxConnectionsPerHost : 20,maxConnections : 10000,corePoolSize : 0,maximumPoolSize : 2147483647,maxThreadIdleTime : 5,sizeOfQueue : -1,fairnessPolicy : false,useRetries : false,
   [junit4]   2> 1809484 INFO  (TEST-TestReqParamsAPI.test-seed#[1479B1FD48669C72]) [    ] o.a.s.u.UpdateShardHandler Creating UpdateShardHandler HTTP client with params: socketTimeout=340000&connTimeout=45000&retry=true
   [junit4]   2> 1809485 INFO  (TEST-TestReqParamsAPI.test-seed#[1479B1FD48669C72]) [    ] o.a.s.l.LogWatcher SLF4J impl is org.slf4j.impl.Log4jLoggerFactory
   [junit4]   2> 1809485 INFO  (TEST-TestReqParamsAPI.test-seed#[1479B1FD48669C72]) [    ] o.a.s.l.LogWatcher Registering Log Listener [Log4j (org.slf4j.impl.Log4jLoggerFactory)]
   [junit4]   2> 1809485 INFO  (TEST-TestReqParamsAPI.test-seed#[1479B1FD48669C72]) [    ] o.a.s.c.ZkContainer Zookeeper client=127.0.0.1:34458/solr
   [junit4]   2> 1809485 INFO  (TEST-TestReqParamsAPI.test-seed#[1479B1FD48669C72]) [    ] o.a.s.c.ZkController zkHost includes chroot
   [junit4]   2> 1809485 INFO  (TEST-TestReqParamsAPI.test-seed#[1479B1FD48669C72]) [    ] o.a.s.c.c.SolrZkClient Using default ZkCredentialsProvider
   [junit4]   2> 1809486 INFO  (TEST-TestReqParamsAPI.test-seed#[1479B1FD48669C72]) [    ] o.a.s.c.c.ConnectionManager Waiting for client to connect to ZooKeeper
   [junit4]   2> 1809487 INFO  (zkCallback-2221-thread-1) [    ] o.a.s.c.c.ConnectionManager Watcher org.apache.solr.common.cloud.ConnectionManager@a0f1ee name:ZooKeeperConnection Watcher:127.0.0.1:34458 got event WatchedEvent state:SyncConnected type:None path:null path:null type:None
   [junit4]   2> 1809487 INFO  (TEST-TestReqParamsAPI.test-seed#[1479B1FD48669C72]) [    ] o.a.s.c.c.ConnectionManager Client is connected to ZooKeeper
   [junit4]   2> 1809488 INFO  (TEST-TestReqParamsAPI.test-seed#[1479B1FD48669C72]) [    ] o.a.s.c.c.SolrZkClient Using default ZkACLProvider
   [junit4]   2> 1809489 INFO  (TEST-TestReqParamsAPI.test-seed#[1479B1FD48669C72]) [n:127.0.0.1:34018_ob    ] o.a.s.c.c.ConnectionManager Waiting for client to connect to ZooKeeper
   [junit4]   2> 1809490 INFO  (zkCallback-2222-thread-1-processing-n:127.0.0.1:34018_ob) [n:127.0.0.1:34018_ob    ] o.a.s.c.c.ConnectionManager Watcher org.apache.solr.common.cloud.ConnectionManager@15d67c name:ZooKeeperConnection Watcher:127.0.0.1:34458/solr got event WatchedEvent state:SyncConnected type:None path:null path:null type:None
   [junit4]   2> 1809490 INFO  (TEST-TestReqParamsAPI.test-seed#[1479B1FD48669C72]) [n:127.0.0.1:34018_ob    ] o.a.s.c.c.ConnectionManager Client is connected to ZooKeeper
   [junit4]   2> 1809491 INFO  (TEST-TestReqParamsAPI.test-seed#[1479B1FD48669C72]) [n:127.0.0.1:34018_ob    ] o.a.s.c.c.SolrZkClient makePath: /overseer/queue
   [junit4]   2> 1809493 INFO  (TEST-TestReqParamsAPI.test-seed#[1479B1FD48669C72]) [n:127.0.0.1:34018_ob    ] o.a.s.c.c.SolrZkClient makePath: /overseer/collection-queue-work
   [junit4]   2> 1809496 INFO  (TEST-TestReqParamsAPI.test-seed#[1479B1FD48669C72]) [n:127.0.0.1:34018_ob    ] o.a.s.c.c.SolrZkClient makePath: /overseer/collection-map-running
   [junit4]   2> 1809497 INFO  (TEST-TestReqParamsAPI.test-seed#[1479B1FD48669C72]) [n:127.0.0.1:34018_ob    ] o.a.s.c.c.SolrZkClient makePath: /overseer/collection-map-completed
   [junit4]   2> 1809499 INFO  (TEST-TestReqParamsAPI.test-seed#[1479B1FD48669C72]) [n:127.0.0.1:34018_ob    ] o.a.s.c.c.SolrZkClient makePath: /overseer/collection-map-failure
   [junit4]   2> 1809501 INFO  (TEST-TestReqParamsAPI.test-seed#[1479B1FD48669C72]) [n:127.0.0.1:34018_ob    ] o.a.s.c.c.SolrZkClient makePath: /live_nodes
   [junit4]   2> 1809502 INFO  (TEST-TestReqParamsAPI.test-seed#[1479B1FD48669C72]) [n:127.0.0.1:34018_ob    ] o.a.s.c.c.SolrZkClient makePath: /aliases.json
   [junit4]   2> 1809504 INFO  (TEST-TestReqParamsAPI.test-seed#[1479B1FD48669C72]) [n:127.0.0.1:34018_ob    ] o.a.s.c.c.SolrZkClient makePath: /clusterstate.json
   [junit4]   2> 1809505 INFO  (TEST-TestReqParamsAPI.test-seed#[1479B1FD48669C72]) [n:127.0.0.1:34018_ob    ] o.a.s.c.c.SolrZkClient makePath: /security.json
   [junit4]   2> 1809506 INFO  (TEST-TestReqParamsAPI.test-seed#[1479B1FD48669C72]) [n:127.0.0.1:34018_ob    ] o.a.s.c.c.ZkStateReader Updating cluster state from ZooKeeper... 
   [junit4]   2> 1809507 INFO  (TEST-TestReqParamsAPI.test-seed#[1479B1FD48669C72]) [n:127.0.0.1:34018_ob    ] o.a.s.c.c.ZkStateReader Updated live nodes from ZooKeeper... (0) -> (0)
   [junit4]   2> 1809513 INFO  (TEST-TestReqParamsAPI.test-seed#[1479B1FD48669C72]) [n:127.0.0.1:34018_ob    ] o.a.s.c.c.SolrZkClient makePath: /overseer_elect
   [junit4]   2> 1809514 INFO  (TEST-TestReqParamsAPI.test-seed#[1479B1FD48669C72]) [n:127.0.0.1:34018_ob    ] o.a.s.c.c.SolrZkClient makePath: /overseer_elect/election
   [junit4]   2> 1809516 INFO  (TEST-TestReqParamsAPI.test-seed#[1479B1FD48669C72]) [n:127.0.0.1:34018_ob    ] o.a.s.c.Overseer Overseer (id=null) closing
   [junit4]   2> 1809517 INFO  (TEST-TestReqParamsAPI.test-seed#[1479B1FD48669C72]) [n:127.0.0.1:34018_ob    ] o.a.s.c.LeaderElector Joined leadership election with path: /overseer_elect/election/95611276613844996-127.0.0.1:34018_ob-n_0000000000
   [junit4]   2> 1809518 INFO  (TEST-TestReqParamsAPI.test-seed#[1479B1FD48669C72]) [n:127.0.0.1:34018_ob    ] o.a.s.c.OverseerElectionContext I am going to be the leader 127.0.0.1:34018_ob
   [junit4]   2> 1809518 INFO  (TEST-TestReqParamsAPI.test-seed#[1479B1FD48669C72]) [n:127.0.0.1:34018_ob    ] o.a.s.c.c.SolrZkClient makePath: /overseer_elect/leader
   [junit4]   2> 1809519 INFO  (TEST-TestReqParamsAPI.test-seed#[1479B1FD48669C72]) [n:127.0.0.1:34018_ob    ] o.a.s.c.Overseer Overseer (id=95611276613844996-127.0.0.1:34018_ob-n_0000000000) starting
   [junit4]   2> 1809520 INFO  (TEST-TestReqParamsAPI.test-seed#[1479B1FD48669C72]) [n:127.0.0.1:34018_ob    ] o.a.s.c.c.SolrZkClient makePath: /overseer/queue-work
   [junit4]   2> 1809526 INFO  (TEST-TestReqParamsAPI.test-seed#[1479B1FD48669C72]) [n:127.0.0.1:34018_ob    ] o.a.s.c.OverseerAutoReplicaFailoverThread Starting OverseerAutoReplicaFailoverThread autoReplicaFailoverWorkLoopDelay=10000 autoReplicaFailoverWaitAfterExpiration=30000 autoReplicaFailoverBadNodeExpiration=60000
   [junit4]   2> 1809526 INFO  (OverseerCollectionConfigSetProcessor-95611276613844996-127.0.0.1:34018_ob-n_0000000000) [n:127.0.0.1:34018_ob    ] o.a.s.c.OverseerTaskProcessor Process current queue of overseer operations
   [junit4]   2> 1809527 INFO  (TEST-TestReqParamsAPI.test-seed#[1479B1FD48669C72]) [n:127.0.0.1:34018_ob    ] o.a.s.c.ZkController Register node as live in ZooKeeper:/live_nodes/127.0.0.1:34018_ob
   [junit4]   2> 1809527 INFO  (OverseerStateUpdate-95611276613844996-127.0.0.1:34018_ob-n_0000000000) [n:127.0.0.1:34018_ob    ] o.a.s.c.Overseer Starting to work on the main queue
   [junit4]   2> 1809527 INFO  (TEST-TestReqParamsAPI.test-seed#[1479B1FD48669C72]) [n:127.0.0.1:34018_ob    ] o.a.s.c.c.SolrZkClient makePath: /live_nodes/127.0.0.1:34018_ob
   [junit4]   2> 1809529 INFO  (zkCallback-2222-thread-1-processing-n:127.0.0.1:34018_ob) [n:127.0.0.1:34018_ob    ] o.a.s.c.c.ZkStateReader A live node change: [WatchedEvent state:SyncConnected type:NodeChildrenChanged path:/live_nodes], has occurred - updating... (live nodes size: [0])
   [junit4]   2> 1809529 INFO  (OverseerStateUpdate-95611276613844996-127.0.0.1:34018_ob-n_0000000000) [n:127.0.0.1:34018_ob    ] o.a.s.c.c.ZkStateReader Updated live nodes from ZooKeeper... (0) -> (1)
   [junit4]   2> 1809529 INFO  (zkCallback-2222-thread-1-processing-n:127.0.0.1:34018_ob) [n:127.0.0.1:34018_ob    ] o.a.s.c.c.ZkStateReader Updated live nodes from ZooKeeper... (1) -> (1)
   [junit4]   2> 1809611 INFO  (TEST-TestReqParamsAPI.test-seed#[1479B1FD48669C72]) [n:127.0.0.1:34018_ob    ] o.a.s.c.CoreContainer Security conf doesn't exist. Skipping setup for authorization module.
   [junit4]   2> 1809611 INFO  (TEST-TestReqParamsAPI.test-seed#[1479B1FD48669C72]) [n:127.0.0.1:34018_ob    ] o.a.s.c.CoreContainer No authentication plugin used.
   [junit4]   2> 1809612 INFO  (TEST-TestReqParamsAPI.test-seed#[1479B1FD48669C72]) [n:127.0.0.1:34018_ob    ] o.a.s.c.CorePropertiesLocator Looking for core definitions underneath /home/jenkins/workspace/Lucene-Solr-master-Linux/solr/build/solr-core/test/J0/../../../../../../../../../home/jenkins/workspace/Lucene-Solr-master-Linux/solr/build/solr-core/test/J0/temp/solr.handler.TestReqParamsAPI_1479B1FD48669C72-001/control-001/cores
   [junit4]   2> 1809613 INFO  (TEST-TestReqParamsAPI.test-seed#[1479B1FD48669C72]) [n:127.0.0.1:34018_ob    ] o.a.s.c.CoreDescriptor Created CoreDescriptor: {name=collection1, config=solrconfig.xml, transient=false, schema=schema.xml, loadOnStartup=true, configSetProperties=configsetprops.json, collection=control_collection, coreNodeName=, dataDir=data/, shard=}
   [junit4]   2> 1809613 INFO  (TEST-TestReqParamsAPI.test-seed#[1479B1FD48669C72]) [n:127.0.0.1:34018_ob    ] o.a.s.c.CorePropertiesLocator Found core collection1 in /home/jenkins/workspace/Lucene-Solr-master-Linux/solr/build/solr-core/test/J0/../../../../../../../../../home/jenkins/workspace/Lucene-Solr-master-Linux/solr/build/solr-core/test/J0/temp/solr.handler.TestReqParamsAPI_1479B1FD48669C72-001/control-001/cores/collection1
   [junit4]   2> 1809613 INFO  (TEST-TestReqParamsAPI.test-seed#[1479B1FD48669C72]) [n:127.0.0.1:34018_ob    ] o.a.s.c.CorePropertiesLocator Found 1 core definitions
   [junit4]   2> 1809614 INFO  (TEST-TestReqParamsAPI.test-seed#[1479B1FD48669C72]) [n:127.0.0.1:34018_ob    ] o.a.s.s.SolrDispatchFilter user.dir=/home/jenkins/workspace/Lucene-Solr-master-Linux/solr/build/solr-core/test/J0
   [junit4]   2> 1809614 INFO  (TEST-TestReqParamsAPI.test-seed#[1479B1FD48669C72]) [n:127.0.0.1:34018_ob    ] o.a.s.s.SolrDispatchFilter SolrDispatchFilter.init() done
   [junit4]   2> 1809615 INFO  (coreLoadExecutor-6923-thread-1-processing-n:127.0.0.1:34018_ob) [n:127.0.0.1:34018_ob c:control_collection   x:collection1] o.a.s.c.ZkController publishing state=down
   [junit4]   2> 1809615 INFO  (coreLoadExecutor-6923-thread-1-processing-n:127.0.0.1:34018_ob) [n:127.0.0.1:34018_ob c:control_collection   x:collection1] o.a.s.c.ZkController numShards not found on descriptor - reading it from system property
   [junit4]   2> 1809617 INFO  (coreLoadExecutor-6923-thread-1-processing-n:127.0.0.1:34018_ob) [n:127.0.0.1:34018_ob c:control_collection   x:collection1] o.a.s.c.ZkController look for our core node name
   [junit4]   2> 1809617 INFO  (OverseerStateUpdate-95611276613844996-127.0.0.1:34018_ob-n_0000000000) [n:127.0.0.1:34018_ob    ] o.a.s.c.Overseer processMessage: queueSize: 1, message = {
   [junit4]   2>   "core":"collection1",
   [junit4]   2>   "roles":null,
   [junit4]   2>   "base_url":"http://127.0.0.1:34018/ob",
   [junit4]   2>   "node_name":"127.0.0.1:34018_ob",
   [junit4]   2>   "numShards":"1",
   [junit4]   2>   "state":"down",
   [junit4]   2>   "shard":null,
   [junit4]   2>   "collection":"control_collection",
   [junit4]   2>   "operation":"state"} current state version: 0
   [junit4]   2> 1809617 INFO  (OverseerStateUpdate-95611276613844996-127.0.0.1:34018_ob-n_0000000000) [n:127.0.0.1:34018_ob    ] o.a.s.c.o.ReplicaMutator Update state numShards=1 message={
   [junit4]   2>   "core":"collection1",
   [junit4]   2>   "roles":null,
   [junit4]   2>   "base_url":"http://127.0.0.1:34018/ob",
   [junit4]   2>   "node_name":"127.0.0.1:34018_ob",
   [junit4]   2>   "numShards":"1",
   [junit4]   2>   "state":"down",
   [junit4]   2>   "shard":null,
   [junit4]   2>   "collection":"control_collection",
   [junit4]   2>   "operation":"state"}
   [junit4]   2> 1809618 INFO  (OverseerStateUpdate-95611276613844996-127.0.0.1:34018_ob-n_0000000000) [n:127.0.0.1:34018_ob    ] o.a.s.c.o.ClusterStateMutator building a new cName: control_collection
   [junit4]   2> 1809618 INFO  (OverseerStateUpdate-95611276613844996-127.0.0.1:34018_ob-n_0000000000) [n:127.0.0.1:34018_ob    ] o.a.s.c.o.ReplicaMutator Assigning new node to shard shard=shard1
   [junit4]   2> 1809619 INFO  (zkCallback-2222-thread-1-processing-n:127.0.0.1:34018_ob) [n:127.0.0.1:34018_ob    ] o.a.s.c.c.ZkStateReader A cluster state change: [WatchedEvent state:SyncConnected type:NodeDataChanged path:/clusterstate.json], has occurred - updating... (live nodes size: [1])
   [junit4]   2> 1810617 INFO  (coreLoadExecutor-6923-thread-1-processing-n:127.0.0.1:34018_ob) [n:127.0.0.1:34018_ob c:control_collection   x:collection1] o.a.s.c.ZkController waiting to find shard id in clusterstate for collection1
   [junit4]   2> 1810618 INFO  (coreLoadExecutor-6923-thread-1-processing-n:127.0.0.1:34018_ob) [n:127.0.0.1:34018_ob c:control_collection   x:collection1] o.a.s.c.ZkController Check for collection zkNode:control_collection
   [junit4]   2> 1810618 INFO  (coreLoadExecutor-6923-thread-1-processing-n:127.0.0.1:34018_ob) [n:127.0.0.1:34018_ob c:control_collection   x:collection1] o.a.s.c.ZkController Collection zkNode exists
   [junit4]   2> 1810618 INFO  (coreLoadExecutor-6923-thread-1-processing-n:127.0.0.1:34018_ob) [n:127.0.0.1:34018_ob c:control_collection   x:collection1] o.a.s.c.c.ZkStateReader Load collection config from: [/collections/control_collection]
   [junit4]   2> 1810619 INFO  (coreLoadExecutor-6923-thread-1-processing-n:127.0.0.1:34018_ob) [n:127.0.0.1:34018_ob c:control_collection   x:collection1] o.a.s.c.c.ZkStateReader path=[/collections/control_collection] [configName]=[conf1] specified config exists in ZooKeeper
   [junit4]   2> 1810619 INFO  (coreLoadExecutor-6923-thread-1-processing-n:127.0.0.1:34018_ob) [n:127.0.0.1:34018_ob c:control_collection   x:collection1] o.a.s.c.SolrResourceLoader new SolrResourceLoader for directory: '/home/jenkins/workspace/Lucene-Solr-master-Linux/solr/build/solr-core/test/J0/temp/solr.handler.TestReqParamsAPI_1479B1FD48669C72-001/control-001/cores/collection1'
   [junit4]   2> 1810619 INFO  (coreLoadExecutor-6923-thread-1-processing-n:127.0.0.1:34018_ob) [n:127.0.0.1:34018_ob c:control_collection   x:collection1] o.a.s.c.SolrResourceLoader JNDI not configured for solr (NoInitialContextEx)
   [junit4]   2> 1810619 INFO  (coreLoadExecutor-6923-thread-1-processing-n:127.0.0.1:34018_ob) [n:127.0.0.1:34018_ob c:control_collection   x:collection1] o.a.s.c.SolrResourceLoader solr home defaulted to 'solr/' (could not find system property or JNDI)
   [junit4]   2> 1810620 INFO  (coreLoadExecutor-6923-thread-1-processing-n:127.0.0.1:34018_ob) [n:127.0.0.1:34018_ob c:control_collection   x:collection1] o.a.s.c.Config loaded config solrconfig.xml with version 0 
   [junit4]   2> 1810627 INFO  (coreLoadExecutor-6923-thread-1-processing-n:127.0.0.1:34018_ob) [n:127.0.0.1:34018_ob c:control_collection   x:collection1] o.a.s.c.SolrConfig current version of requestparams : -1
   [junit4]   2> 1810636 INFO  (coreLoadExecutor-6923-thread-1-processing-n:127.0.0.1:34018_ob) [n:127.0.0.1:34018_ob c:control_collection   x:collection1] o.a.s.c.SolrConfig Using Lucene MatchVersion: 7.0.0
   [junit4]   2> 1810647 INFO  (coreLoadExecutor-6923-thread-1-processing-n:127.0.0.1:34018_ob) [n:127.0.0.1:34018_ob c:control_collection   x:collection1] o.a.s.c.SolrConfig Loaded SolrConfig: solrconfig.xml
   [junit4]   2> 1810666 INFO  (coreLoadExecutor-6923-thread-1-processing-n:127.0.0.1:34018_ob) [n:127.0.0.1:34018_ob c:control_collection   x:collection1] o.a.s.s.IndexSchema [collection1] Schema name=test
   [junit4]   2> 1810764 INFO  (coreLoadExecutor-6923-thread-1-processing-n:127.0.0.1:34018_ob) [n:127.0.0.1:34018_ob c:control_collection   x:collection1] o.a.s.s.OpenExchangeRatesOrgProvider Initialized with rates=open-exchange-rates.json, refreshInterval=1440.
   [junit4]   2> 1810770 INFO  (coreLoadExecutor-6923-thread-1-processing-n:127.0.0.1:34018_ob) [n:127.0.0.1:34018_ob c:control_collection   x:collection1] o.a.s.s.IndexSchema default search field in schema is text
   [junit4]   2> 1810771 INFO  (coreLoadExecutor-6923-thread-1-processing-n:127.0.0.1:34018_ob) [n:127.0.0.1:34018_ob c:control_collection   x:collection1] o.a.s.s.IndexSchema unique key field: id
   [junit4]   2> 1810783 INFO  (coreLoadExecutor-6923-thread-1-processing-n:127.0.0.1:34018_ob) [n:127.0.0.1:34018_ob c:control_collection   x:collection1] o.a.s.s.FileExchangeRateProvider Reloading exchange rates from file currency.xml
   [junit4]   2> 1810785 INFO  (coreLoadExecutor-6923-thread-1-processing-n:127.0.0.1:34018_ob) [n:127.0.0.1:34018_ob c:control_collection   x:collection1] o.a.s.s.FileExchangeRateProvider Reloading exchange rates from file currency.xml
   [junit4]   2> 1810787 INFO  (coreLoadExecutor-6923-thread-1-processing-n:127.0.0.1:34018_ob) [n:127.0.0.1:34018_ob c:control_collection   x:collection1] o.a.s.s.OpenExchangeRatesOrgProvider Reloading exchange rates from open-exchange-rates.json
   [junit4]   2> 1810788 INFO  (coreLoadExecutor-6923-thread-1-processing-n:127.0.0.1:34018_ob) [n:127.0.0.1:34018_ob c:control_collection   x:collection1] o.a.s.s.OpenExchangeRatesOrgProvider Reloading exchange rates from open-exchange-rates.json
   [junit4]   2> 1810789 INFO  (coreLoadExecutor-6923-thread-1-processing-n:127.0.0.1:34018_ob) [n:127.0.0.1:34018_ob c:control_collection   x:collection1] o.a.s.c.ConfigSetProperties Did not find ConfigSet properties, assuming default properties: Can't find resource 'configsetprops.json' in classpath or '/configs/conf1', cwd=/home/jenkins/workspace/Lucene-Solr-master-Linux/solr/build/solr-core/test/J0
   [junit4]   2> 1810789 INFO  (coreLoadExecutor-6923-thread-1-processing-n:127.0.0.1:34018_ob) [n:127.0.0.1:34018_ob c:control_collection   x:collection1] o.a.s.c.CoreContainer Creating SolrCore 'collection1' using configuration from collection control_collection
   [junit4]   2> 1810789 INFO  (coreLoadExecutor-6923-thread-1-processing-n:127.0.0.1:34018_ob) [n:127.0.0.1:34018_ob c:control_collection s:shard1 r:core_node1 x:collection1] o.a.s.c.SolrCore org.apache.solr.core.MockDirectoryFactory
   [junit4]   2> 1810789 INFO  (coreLoadExecutor-6923-thread-1-processing-n:127.0.0.1:34018_ob) [n:127.0.0.1:34018_ob c:control_collection s:shard1 r:core_node1 x:collection1] o.a.s.c.SolrCore [[collection1] ] Opening new SolrCore at [/home/jenkins/workspace/Lucene-Solr-master-Linux/solr/build/solr-core/test/J0/temp/solr.handler.TestReqParamsAPI_1479B1FD48669C72-001/control-001/cores/collection1], dataDir=[/home/jenkins/workspace/Lucene-Solr-master-Linux/solr/build/solr-core/test/J0/../../../../../../../../../home/jenkins/workspace/Lucene-Solr-master-Linux/solr/build/solr-core/test/J0/temp/solr.handler.TestReqParamsAPI_1479B1FD48669C72-001/control-001/cores/collection1/data/]
   [junit4]   2> 1810790 INFO  (coreLoadExecutor-6923-thread-1-processing-n:127.0.0.1:34018_ob) [n:127.0.0.1:34018_ob c:control_collection s:shard1 r:core_node1 x:collection1] o.a.s.c.JmxMonitoredMap JMX monitoring is enabled. Adding Solr mbeans to JMX Server: com.sun.jmx.mbeanserver.JmxMBeanServer@d7ccb3
   [junit4]   2> 1810790 INFO  (coreLoadExecutor-6923-thread-1-processing-n:127.0.0.1:34018_ob) [n:127.0.0.1:34018_ob c:control_collection s:shard1 r:core_node1 x:collection1] o.a.s.c.CachingDirectoryFactory return new directory for /home/jenkins/workspace/Lucene-Solr-master-Linux/solr/build/solr-core/test/J0/../../../../../../../../../home/jenkins/workspace/Lucene-Solr-master-Linux/solr/build/solr-core/test/J0/temp/solr.handler.TestReqParamsAPI_1479B1FD48669C72-001/control-001/cores/collection1/data
   [junit4]   2> 1810790 INFO  (coreLoadExecutor-6923-thread-1-processing-n:127.0.0.1:34018_ob) [n:127.0.0.1:34018_ob c:control_collection s:shard1 r:core_node1 x:collection1] o.a.s.c.SolrCore New index directory detected: old=null new=/home/jenkins/workspace/Lucene-Solr-master-Linux/solr/build/solr-core/test/J0/../../../../../../../../../home/jenkins/workspace/Lucene-Solr-master-Linux/solr/build/solr-core/test/J0/temp/solr.handler.TestReqParamsAPI_1479B1FD48669C72-001/control-001/cores/collection1/data/index/
   [junit4]   2> 1810790 WARN  (coreLoadExecutor-6923-thread-1-processing-n:127.0.0.1:34018_ob) [n:127.0.0.1:34018_ob c:control_collection s:shard1 r:core_node1 x:collection1] o.a.s.c.SolrCore [collection1] Solr index directory '/home/jenkins/workspace/Lucene-Solr-master-Linux/solr/build/solr-core/test/J0/../../../../../../../../../home/jenkins/workspace/Lucene-Solr-master-Linux/solr/build/solr-core/test/J0/temp/solr.handler.TestReqParamsAPI_1479B1FD48669C72-001/control-001/cores/collection1/data/index' doesn't exist. Creating new index...
   [junit4]   2> 1810791 INFO  (coreLoadExecutor-6923-thread-1-processing-n:127.0.0.1:34018_ob) [n:127.0.0.1:34018_ob c:control_collection s:shard1 r:core_node1 x:collection1] o.a.s.c.CachingDirectoryFactory return new directory for /home/jenkins/workspace/Lucene-Solr-master-Linux/solr/build/solr-core/test/J0/../../../../../../../../../home/jenkins/workspace/Lucene-Solr-master-Linux/solr/build/solr-core/test/J0/temp/solr.handler.TestReqParamsAPI_1479B1FD48669C72-001/control-001/cores/collection1/data/index
   [junit4]   2> 1810791 INFO  (coreLoadExecutor-6923-thread-1-processing-n:127.0.0.1:34018_ob) [n:127.0.0.1:34018_ob c:control_collection s:shard1 r:core_node1 x:collection1] o.a.s.u.RandomMergePolicy RandomMergePolicy wrapping class org.apache.lucene.index.LogDocMergePolicy: [LogDocMergePolicy: minMergeSize=1000, mergeFactor=12, maxMergeSize=9223372036854775807, maxMergeSizeForForcedMerge=9223372036854775807, calibrateSizeByDeletes=true, maxMergeDocs=2147483647, maxCFSSegmentSizeMB=8.796093022207999E12, noCFSRatio=0.0]
   [junit4]   2> 1810791 INFO  (coreLoadExecutor-6923-thread-1-processing-n:127.0.0.1:34018_ob) [n:127.0.0.1:34018_ob c:control_collection s:shard1 r:core_node1 x:collection1] o.a.s.c.SolrDeletionPolicy SolrDeletionPolicy.onCommit: commits: num=1
   [junit4]   2> 	commit{dir=MockDirectoryWrapper(RAMDirectory@1f88a05 lockFactory=org.apache.lucene.store.SingleInstanceLockFactory@2457f5),segFN=segments_1,generation=1}
   [junit4]   2> 1810792 INFO  (coreLoadExecutor-6923-thread-1-processing-n:127.0.0.1:34018_ob) [n:127.0.0.1:34018_ob c:control_collection s:shard1 r:core_node1 x:collection1] o.a.s.c.SolrDeletionPolicy newest commit generation = 1
   [junit4]   2> 1810792 INFO  (OldIndexDirectoryCleanupThreadForCore-collection1) [n:127.0.0.1:34018_ob c:control_collection s:shard1 r:core_node1 x:collection1] o.a.s.c.SolrCore Looking for old index directories to cleanup for core collection1 in /home/jenkins/workspace/Lucene-Solr-master-Linux/solr/build/solr-core/test/J0/../../../../../../../../../home/jenkins/workspace/Lucene-Solr-master-Linux/solr/build/solr-core/test/J0/temp/solr.handler.TestReqParamsAPI_1479B1FD48669C72-001/control-001/cores/collection1/data/
   [junit4]   2> 1810792 WARN  (OldIndexDirectoryCleanupThreadForCore-collection1) [n:127.0.0.1:34018_ob c:control_collection s:shard1 r:core_node1 x:collection1] o.a.s.c.DirectoryFactory /home/jenkins/workspace/Lucene-Solr-master-Linux/solr/build/solr-core/test/J0/../../../../../../../../../home/jenkins/workspace/Lucene-Solr-master-Linux/solr/build/solr-core/test/J0/temp/solr.handler.TestReqParamsAPI_1479B1FD48669C72-001/control-001/cores/collection1/data/ does not point to a valid data directory; skipping clean-up of old index directories.
   [junit4]   2> 1810797 INFO  (coreLoadExecutor-6923-thread-1-processing-n:127.0.0.1:34018_ob) [n:127.0.0.1:34018_ob c:control_collection s:shard1 r:core_node1 x:collection1] o.a.s.u.p.UpdateRequestProcessorChain creating updateRequestProcessorChain "nodistrib"
   [junit4]   2> 1810797 INFO  (coreLoadExecutor-6923-thread-1-processing-n:127.0.0.1:34018_ob) [n:127.0.0.1:34018_ob c:control_collection s:shard1 r:core_node1 x:collection1] o.a.s.u.p.UpdateRequestProcessorChain creating updateRequestProcessorChain "dedupe"
   [junit4]   2> 1810798 INFO  (coreLoadExecutor-6923-thread-1-processing-n:127.0.0.1:34018_ob) [n:127.0.0.1:34018_ob c:control_collection s:shard1 r:core_node1 x:collection1] o.a.s.u.p.UpdateRequestProcessorChain inserting DistributedUpdateProcessorFactory into updateRequestProcessorChain "dedupe"
   [junit4]   2> 1810798 INFO  (coreLoadExecutor-6923-thread-1-processing-n:127.0.0.1:34018_ob) [n:127.0.0.1:34018_ob c:control_collection s:shard1 r:core_node1 x:collection1] o.a.s.u.p.UpdateRequestProcessorChain creating updateRequestProcessorChain "stored_sig"
   [junit4]   2> 1810798 INFO  (coreLoadExecutor-6923-thread-1-processing-n:127.0.0.1:34018_ob) [n:127.0.0.1:34018_ob c:control_collection s:shard1 r:core_node1 x:collection1] o.a.s.u.p.UpdateRequestProcessorChain inserting DistributedUpdateProcessorFactory into updateRequestProcessorChain "stored_sig"
   [junit4]   2> 1810798 INFO  (coreLoadExecutor-6923-thread-1-processing-n:127.0.0.1:34018_ob) [n:127.0.0.1:34018_ob c:control_collection s:shard1 r:core_node1 x:collection1] o.a.s.u.p.UpdateRequestProcessorChain creating updateRequestProcessorChain "distrib-dup-test-chain-explicit"
   [junit4]   2> 1810798 INFO  (coreLoadExecutor-6923-thread-1-processing-n:127.0.0.1:34018_ob) [n:127.0.0.1:34018_ob c:control_collection s:shard1 r:core_node1 x:collection1] o.a.s.u.p.UpdateRequestProcessorChain creating updateRequestProcessorChain "distrib-dup-test-chain-implicit"
   [junit4]   2> 1810798 INFO  (coreLoadExecutor-6923-thread-1-processing-n:127.0.0.1:34018_ob) [n:127.0.0.1:34018_ob c:control_collection s:shard1 r:core_node1 x:collection1] o.a.s.u.p.UpdateRequestProcessorChain inserting DistributedUpdateProcessorFactory into updateRequestProcessorChain "distrib-dup-test-chain-implicit"
   [junit4]   2> 1810798 INFO  (coreLoadExecutor-6923-thread-1-processing-n:127.0.0.1:34018_ob) [n:127.0.0.1:34018_ob c:control_collection s:shard1 r:core_node1 x:collection1] o.a.s.c.SolrCore no updateRequestProcessorChain defined as default, creating implicit default
   [junit4]   2> 1810799 WARN  (coreLoadExecutor-6923-thread-1-processing-n:127.0.0.1:34018_ob) [n:127.0.0.1:34018_ob c:control_collection s:shard1 r:core_node1 x:collection1] o.a.s.c.RequestHandlers INVALID paramSet a in requestHandler {type = requestHandler,name = /dump,class = DumpRequestHandler,args = {defaults={a=A,b=B}}}
   [junit4]   2> 1810800 INFO  (coreLoadExecutor-6923-thread-1-processing-n:127.0.0.1:34018_ob) [n:127.0.0.1:34018_ob c:control_collection s:shard1 r:core_node1 x:collection1] o.a.s.h.l.XMLLoader xsltCacheLifetimeSeconds=60
   [junit4]   2> 1810802 INFO  (coreLoadExecutor-6923-thread-1-processing-n:127.0.0.1:34018_ob) [n:127.0.0.1:34018_ob c:control_collection s:shard1 r:core_node1 x:collection1] o.a.s.h.l.XMLLoader xsltCacheLifetimeSeconds=60
   [junit4]   2> 1810803 INFO  (coreLoadExecutor-6923-thread-1-processing-n:127.0.0.1:34018_ob) [n:127.0.0.1:34018_ob c:control_collection s:shard1 r:core_node1 x:collection1] o.a.s.h.l.XMLLoader xsltCacheLifetimeSeconds=60
   [junit4]   2> 1810804 INFO  (coreLoadExecutor-6923-thread-1-processing-n:127.0.0.1:34018_ob) [n:127.0.0.1:34018_ob c:control_collection s:shard1 r:core_node1 x:collection1] o.a.s.h.l.XMLLoader xsltCacheLifetimeSeconds=60
   [junit4]   2> 1810813 INFO  (coreLoadExecutor-6923-thread-1-processing-n:127.0.0.1:34018_ob) [n:127.0.0.1:34018_ob c:control_collection s:shard1 r:core_node1 x:collection1] o.a.s.c.RequestHandlers Registered paths: /admin/mbeans,standard,/dump,/update/csv,/sql,/update/json/docs,/admin/luke,/export,/admin/segments,/get,/admin/system,/replication,/admin/properties,/config,/stream,/schema,/admin/plugins,/admin/logging,/update/json,/admin/ping,/admin/threads,/update,/admin/file
   [junit4]   2> 1810813 INFO  (coreLoadExecutor-6923-thread-1-processing-n:127.0.0.1:34018_ob) [n:127.0.0.1:34018_ob c:control_collection s:shard1 r:core_node1 x:collection1] o.a.s.c.SolrCore Using default statsCache cache: org.apache.solr.search.stats.LocalStatsCache
   [junit4]   2> 1810813 INFO  (coreLoadExecutor-6923-thread-1-processing-n:127.0.0.1:34018_ob) [n:127.0.0.1:34018_ob c:control_collection s:shard1 r:core_node1 x:collection1] o.a.s.u.UpdateHandler Using UpdateLog implementation: org.apache.solr.update.UpdateLog
   [junit4]   2> 1810813 INFO  (coreLoadExecutor-6923-thread-1-processing-n:127.0.0.1:34018_ob) [n:127.0.0.1:34018_ob c:control_collection s:shard1 r:core_node1 x:collection1] o.a.s.u.UpdateLog Initializing UpdateLog: dataDir= defaultSyncLevel=FLUSH numRecordsToKeep=100 maxNumLogsToKeep=10 numVersionBuckets=65536
   [junit4]   2> 1810815 INFO  (coreLoadExecutor-6923-thread-1-processing-n:127.0.0.1:34018_ob) [n:127.0.0.1:34018_ob c:control_collection s:shard1 r:core_node1 x:collection1] o.a.s.u.CommitTracker Hard AutoCommit: disabled
   [junit4]   2> 1810815 INFO  (coreLoadExecutor-6923-thread-1-processing-n:127.0.0.1:34018_ob) [n:127.0.0.1:34018_ob c:control_collection s:shard1 r:core_node1 x:collection1] o.a.s.u.CommitTracker Soft AutoCommit: disabled
   [junit4]   2> 1810815 INFO  (coreLoadExecutor-6923-thread-1-processing-n:127.0.0.1:34018_ob) [n:127.0.0.1:34018_ob c:control_collection s:shard1 r:core_node1 x:collection1] o.a.s.u.RandomMergePolicy RandomMergePolicy wrapping class org.apache.lucene.index.LogDocMergePolicy: [LogDocMergePolicy: minMergeSize=1000, mergeFactor=32, maxMergeSize=9223372036854775807, maxMergeSizeForForcedMerge=9223372036854775807, calibrateSizeByDeletes=false, maxMergeDocs=2147483647, maxCFSSegmentSizeMB=8.796093022207999E12, noCFSRatio=0.0]
   [junit4]   2> 1810816 INFO  (coreLoadExecutor-6923-thread-1-processing-n:127.0.0.1:34018_ob) [n:127.0.0.1:34018_ob c:control_collection s:shard1 r:core_node1 x:collection1] o.a.s.c.SolrDeletionPolicy SolrDeletionPolicy.onInit: commits: num=1
   [junit4]   2> 	commit{dir=MockDirectoryWrapper(RAMDirectory@1f88a05 lockFactory=org.apache.lucene.store.SingleInstanceLockFactory@2457f5),segFN=segments_1,generation=1}
   [junit4]   2> 1810816 INFO  (coreLoadExecutor-6923-thread-1-processing-n:127.0.0.1:34018_ob) [n:127.0.0.1:34018_ob c:control_collection s:shard1 r:core_node1 x:collection1] o.a.s.c.SolrDeletionPolicy newest commit generation = 1
   [junit4]   2> 1810816 INFO  (coreLoadExecutor-6923-thread-1-processing-n:127.0.0.1:34018_ob) [n:127.0.0.1:34018_ob c:control_collection s:shard1 r:core_node1 x:collection1] o.a.s.s.SolrIndexSearcher Opening [Searcher@3df5a9[collection1] main]
   [junit4]   2> 1810816 INFO  (coreLoadExecutor-6923-thread-1-processing-n:127.0.0.1:34018_ob) [n:127.0.0.1:34018_ob c:control_collection s:shard1 r:core_node1 x:collection1] o.a.s.c.c.ZkStateReader Load collection config from: [/collections/control_collection]
   [junit4]   2> 1810817 INFO  (coreLoadExecutor-6923-thread-1-processing-n:127.0.0.1:34018_ob) [n:127.0.0.1:34018_ob c:control_collection s:shard1 r:core_node1 x:collection1] o.a.s.c.c.ZkStateReader path=[/collections/control_collection] [configName]=[conf1] specified config exists in ZooKeeper
   [junit4]   2> 1810817 INFO  (coreLoadExecutor-6923-thread-1-processing-n:127.0.0.1:34018_ob) [n:127.0.0.1:34018_ob c:control_collection s:shard1 r:core_node1 x:collection1] o.a.s.r.ManagedResourceStorage Setting up ZooKeeper-based storage for the RestManager with znodeBase: /configs/conf1
   [junit4]   2> 1810817 INFO  (coreLoadExecutor-6923-thread-1-processing-n:127.0.0.1:34018_ob) [n:127.0.0.1:34018_ob c:control_collection s:shard1 r:core_node1 x:collection1] o.a.s.r.ManagedResourceStorage Configured ZooKeeperStorageIO with znodeBase: /configs/conf1
   [junit4]   2> 1810817 INFO  (coreLoadExecutor-6923-thread-1-processing-n:127.0.0.1:34018_ob) [n:127.0.0.1:34018_ob c:control_collection s:shard1 r:core_node1 x:collection1] o.a.s.r.RestManager Initializing RestManager with initArgs: {}
   [junit4]   2> 1810817 INFO  (coreLoadExecutor-6923-thread-1-processing-n:127.0.0.1:34018_ob) [n:127.0.0.1:34018_ob c:control_collection s:shard1 r:core_node1 x:collection1] o.a.s.r.ManagedResourceStorage Reading _rest_managed.json using ZooKeeperStorageIO:path=/configs/conf1
   [junit4]   2> 1810817 INFO  (coreLoadExecutor-6923-thread-1-processing-n:127.0.0.1:34018_ob) [n:127.0.0.1:34018_ob c:control_collection s:shard1 r:core_node1 x:collection1] o.a.s.r.ManagedResourceStorage No data found for znode /configs/conf1/_rest_managed.json
   [junit4]   2> 1810818 INFO  (coreLoadExecutor-6923-thread-1-processing-n:127.0.0.1:34018_ob) [n:127.0.0.1:34018_ob c:control_collection s:shard1 r:core_node1 x:collection1] o.a.s.r.ManagedResourceStorage Loaded null at path _rest_managed.json using ZooKeeperStorageIO:path=/configs/conf1
   [junit4]   2> 1810818 INFO  (coreLoadExecutor-6923-thread-1-processing-n:127.0.0.1:34018_ob) [n:127.0.0.1:34018_ob c:control_collection s:shard1 r:core_node1 x:collection1] o.a.s.r.RestManager Initializing 0 registered ManagedResources
   [junit4]   2> 1810818 INFO  (coreLoadExecutor-6923-thread-1-processing-n:127.0.0.1:34018_ob) [n:127.0.0.1:34018_ob c:control_collection s:shard1 r:core_node1 x:collection1] o.a.s.h.ReplicationHandler Commits will be reserved for  10000
   [junit4]   2> 1810820 INFO  (searcherExecutor-6924-thread-1-processing-n:127.0.0.1:34018_ob x:collection1 s:shard1 c:control_collection r:core_node1) [n:127.0.0.1:34018_ob c:control_collection s:shard1 r:core_node1 x:collection1] o.a.s.c.SolrCore [collection1] Registered new searcher Searcher@3df5a9[collection1] main{ExitableDirectoryReader(UninvertingDirectoryReader())}
   [junit4]   2> 1810820 INFO  (coreLoadExecutor-6923-thread-1-processing-n:127.0.0.1:34018_ob) [n:127.0.0.1:34018_ob c:control_collection s:shard1 r:core_node1 x:collection1] o.a.s.u.UpdateLog Looking up max value of version field to seed version buckets
   [junit4]   2> 1810820 INFO  (coreLoadExecutor-6923-thread-1-processing-n:127.0.0.1:34018_ob) [n:127.0.0.1:34018_ob c:control_collection s:shard1 r:core_node1 x:collection1] o.a.s.u.VersionInfo Refreshing highest value of _version_ for 65536 version buckets from index
   [junit4]   2> 1810820 INFO  (coreLoadExecutor-6923-thread-1-processing-n:127.0.0.1:34018_ob) [n:127.0.0.1:34018_ob c:control_collection s:shard1 r:core_node1 x:collection1] o.a.s.u.VersionInfo No terms found for _version_, cannot seed version bucket highest value from index
   [junit4]   2> 1810820 INFO  (coreLoadExecutor-6923-thread-1-processing-n:127.0.0.1:34018_ob) [n:127.0.0.1:34018_ob c:control_collection s:shard1 r:core_node1 x:collection1] o.a.s.u.UpdateLog Could not find max version in index or recent updates, using new clock 1529780427459395584
   [junit4]   2> 1810822 INFO  (coreLoadExecutor-6923-thread-1-processing-n:127.0.0.1:34018_ob) [n:127.0.0.1:34018_ob c:control_collection s:shard1 r:core_node1 x:collection1] o.a.s.u.UpdateLog Took 2.0ms to seed version buckets with highest version 1529780427459395584
   [junit4]   2> 1810822 INFO  (coreLoadExecutor-6923-thread-1-processing-n:127.0.0.1:34018_ob) [n:127.0.0.1:34018_ob c:control_collection s:shard1 r:core_node1 x:collection1] o.a.s.c.ZkController watch zkdir /configs/conf1
   [junit4]   2> 1810823 INFO  (coreLoadExecutor-6923-thread-1-processing-n:127.0.0.1:34018_ob) [n:127.0.0.1:34018_ob c:control_collection s:shard1 r:core_node1 x:collection1] o.a.s.c.CoreContainer registering core: collection1
   [junit4]   2> 1810824 INFO  (coreZkRegister-6917-thread-1-processing-n:127.0.0.1:34018_ob x:collection1 s:shard1 c:control_collection r:core_node1) [n:127.0.0.1:34018_ob c:control_collection s:shard1 r:core_node1 x:collection1] o.a.s.c.ZkController Register replica - core:collection1 address:http://127.0.0.1:34018/ob collection:control_collection shard:shard1
   [junit4]   2> 1810824 INFO  (coreZkRegister-6917-thread-1-processing-n:127.0.0.1:34018_ob x:collection1 s:shard1 c:control_collection r:core_node1) [n:127.0.0.1:34018_ob c:control_collection s:shard1 r:core_node1 x:collection1] o.a.s.c.c.SolrZkClient makePath: /collections/control_collection/leader_elect/shard1/election
   [junit4]   2> 1810827 INFO  (coreZkRegister-6917-thread-1-processing-n:127.0.0.1:34018_ob x:collection1 s:shard1 c:control_collection r:core_node1) [n:127.0.0.1:34018_ob c:control_collection s:shard1 r:core_node1 x:collection1] o.a.s.c.LeaderElector Joined leadership election with path: /collections/control_collection/leader_elect/shard1/election/95611276613844996-core_node1-n_0000000000
   [junit4]   2> 1810827 INFO  (coreZkRegister-6917-thread-1-processing-n:127.0.0.1:34018_ob x:collection1 s:shard1 c:control_collection r:core_node1) [n:127.0.0.1:34018_ob c:control_collection s:shard1 r:core_node1 x:collection1] o.a.s.c.ShardLeaderElectionContext Running the leader process for shard=shard1 and weAreReplacement=false and leaderVoteWait=10000
   [junit4]   2> 1810828 INFO  (coreZkRegister-6917-thread-1-processing-n:127.0.0.1:34018_ob x:collection1 s:shard1 c:control_collection r:core_node1) [n:127.0.0.1:34018_ob c:control_collection s:shard1 r:core_node1 x:collection1] o.a.s.c.ShardLeaderElectionContext Enough replicas found to continue.
   [junit4]   2> 1810829 INFO  (coreZkRegister-6917-thread-1-processing-n:127.0.0.1:34018_ob x:collection1 s:shard1 c:control_collection r:core_node1) [n:127.0.0.1:34018_ob c:control_collection s:shard1 r:core_node1 x:collection1] o.a.s.c.ShardLeaderElectionContext I may be the new leader - try and sync
   [junit4]   2> 1810829 INFO  (coreZkRegister-6917-thread-1-processing-n:127.0.0.1:34018_ob x:collection1 s:shard1 c:control_collection r:core_node1) [n:127.0.0.1:34018_ob c:control_collection s:shard1 r:core_node1 x:collection1] o.a.s.c.SyncStrategy Sync replicas to http://127.0.0.1:34018/ob/collection1/
   [junit4]   2> 1810829 INFO  (OverseerStateUpdate-95611276613844996-127.0.0.1:34018_ob-n_0000000000) [n:127.0.0.1:34018_ob    ] o.a.s.c.Overseer processMessage: queueSize: 1, message = {
   [junit4]   2>   "operation":"leader",
   [junit4]   2>   "shard":"shard1",
   [junit4]   2>   "collection":"control_collection"} current state version: 1
   [junit4]   2> 1810829 INFO  (coreZkRegister-6917-thread-1-processing-n:127.0.0.1:34018_ob x:collection1 s:shard1 c:control_collection r:core_node1) [n:127.0.0.1:34018_ob c:control_collection s:shard1 r:core_node1 x:collection1] o.a.s.c.SyncStrategy Sync Success - now sync replicas to me
   [junit4]   2> 1810829 INFO  (coreZkRegister-6917-thread-1-processing-n:127.0.0.1:34018_ob x:collection1 s:shard1 c:control_collection r:core_node1) [n:127.0.0.1:34018_ob c:control_collection s:shard1 r:core_node1 x:collection1] o.a.s.c.SyncStrategy http://127.0.0.1:34018/ob/collection1/ has no replicas
   [junit4]   2> 1810830 INFO  (coreZkRegister-6917-thread-1-processing-n:127.0.0.1:34018_ob x:collection1 s:shard1 c:control_collection r:core_node1) [n:127.0.0.1:34018_ob c:control_collection s:shard1 r:core_node1 x:collection1] o.a.s.c.c.SolrZkClient makePath: /collections/control_collection/leaders/shard1
   [junit4]   2> 1810831 INFO  (coreZkRegister-6917-thread-1-processing-n:127.0.0.1:34018_ob x:collection1 s:shard1 c:control_collection r:core_node1) [n:127.0.0.1:34018_ob c:control_collection s:shard1 r:core_node1 x:collection1] o.a.s.c.ShardLeaderElectionContextBase Creating leader registration node /collections/control_collection/leaders/shard1/leader after winning as /collections/control_collection/leader_elect/shard1/election/95611276613844996-core_node1-n_0000000000
   [junit4]   2> 1810832 INFO  (coreZkRegister-6917-thread-1-processing-n:127.0.0.1:34018_ob x:collection1 s:shard1 c:control_collection r:core_node1) [n:127.0.0.1:34018_ob c:control_collection s:shard1 r:core_node1 x:collection1] o.a.s.c.ShardLeaderElectionContext I am the new leader: http://127.0.0.1:34018/ob/collection1/ shard1
   [junit4]   2> 1810833 INFO  (OverseerStateUpdate-95611276613844996-127.0.0.1:34018_ob-n_0000000000) [n:127.0.0.1:34018_ob    ] o.a.s.c.Overseer processMessage: queueSize: 1, message = {
   [junit4]   2>   "operation":"leader",
   [junit4]   2>   "shard":"shard1",
   [junit4]   2>   "collection":"control_collection",
   [junit4]   2>   "base_url":"http://127.0.0.1:34018/ob",
   [junit4]   2>   "core":"collection1",
   [junit4]   2>   "state":"active"} current state version: 1
   [junit4]   2> 1810935 INFO  (zkCallback-2222-thread-1-processing-n:127.0.0.1:34018_ob) [n:127.0.0.1:34018_ob    ] o.a.s.c.c.ZkStateReader A cluster state change: [WatchedEvent state:SyncConnected type:NodeDataChanged path:/clusterstate.json], has occurred - updating... (live nodes size: [1])
   [junit4]   2> 1810983 INFO  (coreZkRegister-6917-thread-1-processing-n:127.0.0.1:34018_ob x:collection1 s:shard1 c:control_collection r:core_node1) [n:127.0.0.1:34018_ob c:control_collection s:shard1 r:core_node1 x:collection1] o.a.s.c.ZkController We are http://127.0.0.1:34018/ob/collection1/ and leader is http://127.0.0.1:34018/ob/collection1/
   [junit4]   2> 1810983 INFO  (coreZkRegister-6917-thread-1-processing-n:127.0.0.1:34018_ob x:collection1 s:shard1 c:control_collection r:core_node1) [n:127.0.0.1:34018_ob c:control_collection s:shard1 r:core_node1 x:collection1] o.a.s.c.ZkController No LogReplay needed for core=collection1 baseURL=http://127.0.0.1:34018/ob
   [junit4]   2> 1810983 INFO  (coreZkRegister-6917-thread-1-processing-n:127.0.0.1:34018_ob x:collection1 s:shard1 c:control_collection r:core_node1) [n:127.0.0.1:34018_ob c:control_collection s:shard1 r:core_node1 x:collection1] o.a.s.c.ZkController I am the leader, no recovery necessary
   [junit4]   2> 1810983 INFO  (coreZkRegister-6917-thread-1-processing-n:127.0.0.1:34018_ob x:collection1 s:shard1 c:control_collection r:core_node1) [n:127.0.0.1:34018_ob c:control_collection s:shard1 r:core_node1 x:collection1] o.a.s.c.ZkController publishing state=active
   [junit4]   2> 1810984 INFO  (coreZkRegister-6917-thread-1-processing-n:127.0.0.1:34018_ob x:collection1 s:shard1 c:control_collection r:core_node1) [n:127.0.0.1:34018_ob c:control_collection s:shard1 r:core_node1 x:collection1] o.a.s.c.ZkController numShards not found on descriptor - reading it from system property
   [junit4]   2> 1810985 INFO  (OverseerStateUpdate-95611276613844996-127.0.0.1:34018_ob-n_0000000000) [n:127.0.0.1:34018_ob    ] o.a.s.c.Overseer processMessage: queueSize: 1, message = {
   [junit4]   2>   "core":"collection1",
   [junit4]   2>   "core_node_name":"core_node1",
   [junit4]   2>   "roles":null,
   [junit4]   2>   "base_url":"http://127.0.0.1:34018/ob",
   [junit4]   2>   "node_name":"127.0.0.1:34018_ob",
   [junit4]   2>   "numShards":"1",
   [junit4]   2>   "state":"active",
   [junit4]   2>   "shard":"shard1",
   [junit4]   2>   "collection":"control_collection",
   [junit4]   2>   "operation":"state"} current state version: 2
   [junit4]   2> 1810985 INFO  (OverseerStateUpdate-95611276613844996-127.0.0.1:34018_ob-n_0000000000) [n:127.0.0.1:34018_ob    ] o.a.s.c.o.ReplicaMutator Update state numShards=1 message={
   [junit4]   2>   "core":"collection1",
   [junit4]   2>   "core_node_name":"core_node1",
   [junit4]   2>   "roles":null,
   [junit4]   2>   "base_url":"http://127.0.0.1:34018/ob",
   [junit4]   2>   "node_name":"127.0.0.1:34018_ob",
   [junit4]   2>   "numShards":"1",
   [junit4]   2>   "state":"active",
   [junit4]   2>   "shard":"shard1",
   [junit4]   2>   "collection":"control_collection",
   [junit4]   2>   "operation":"state"}
   [junit4]   2> 1811087 INFO  (zkCallback-2222-thread-1-processing-n:127.0.0.1:34018_ob) [n:127.0.0.1:34018_ob    ] o.a.s.c.c.ZkStateReader A cluster state change: [WatchedEvent state:SyncConnected type:NodeDataChanged path:/clusterstate.json], has occurred - updating... (live nodes size: [1])
   [junit4]   2> 1811116 INFO  (TEST-TestReqParamsAPI.test-seed#[1479B1FD48669C72]) [    ] o.a.s.c.c.SolrZkClient Using default ZkCredentialsProvider
   [junit4]   2> 1811116 INFO  (TEST-TestReqParamsAPI.test-seed#[1479B1FD48669C72]) [    ] o.a.s.c.c.ConnectionManager Waiting for client to connect to ZooKeeper
   [junit4]   2> 1811117 INFO  (zkCallback-2224-thread-1) [    ] o.a.s.c.c.ConnectionManager Watcher org.apache.solr.common.cloud.ConnectionManager@1776534 name:ZooKeeperConnection Watcher:127.0.0.1:34458/solr got event WatchedEvent state:SyncConnected type:None path:null path:null type:None
   [junit4]   2> 1811117 INFO  (TEST-TestReqParamsAPI.test-seed#[1479B1FD48669C72]) [    ] o.a.s.c.c.ConnectionManager Client is connected to ZooKeeper
   [junit4]   2> 1811117 INFO  (TEST-TestReqParamsAPI.test-seed#[1479B1FD48669C72]) [    ] o.a.s.c.c.SolrZkClient Using default ZkACLProvider
   [junit4]   2> 1811118 INFO  (TEST-TestReqParamsAPI.test-seed#[1479B1FD48669C72]) [    ] o.a.s.c.c.ZkStateReader Updating cluster state from ZooKeeper... 
   [junit4]   2> 1811119 INFO  (TEST-TestReqParamsAPI.test-seed#[1479B1FD48669C72]) [    ] o.a.s.c.c.ZkStateReader Updated live nodes from ZooKeeper... (0) -> (1)
   [junit4]   2> 1811119 INFO  (TEST-TestReqParamsAPI.test-seed#[1479B1FD48669C72]) [    ] o.a.s.c.ChaosMonkey monkey: init - expire sessions:false cause connection loss:false
   [junit4]   2> 1811176 INFO  (TEST-TestReqParamsAPI.test-seed#[1479B1FD48669C72]) [    ] o.a.s.SolrTestCaseJ4 Writing core.properties file to /home/jenkins/workspace/Lucene-Solr-master-Linux/solr/build/solr-core/test/J0/temp/solr.handler.TestReqParamsAPI_1479B1FD48669C72-001/shard-1-001/cores/collection1
   [junit4]   2> 1811177 INFO  (TEST-TestReqParamsAPI.test-seed#[1479B1FD48669C72]) [    ] o.a.s.c.AbstractFullDistribZkTestBase create jetty 1 in directory /home/jenkins/workspace/Lucene-Solr-master-Linux/solr/build/solr-core/test/J0/temp/solr.handler.TestReqParamsAPI_1479B1FD48669C72-001/shard-1-001
   [junit4]   2> 1811177 INFO  (TEST-TestReqParamsAPI.test-seed#[1479B1FD48669C72]) [    ] o.e.j.s.Server jetty-9.3.8.v20160314
   [junit4]   2> 1811178 INFO  (TEST-TestReqParamsAPI.test-seed#[1479B1FD48669C72]) [    ] o.e.j.s.h.ContextHandler Started o.e.j.s.ServletContextHandler@1e15d81{/ob,null,AVAILABLE}
   [junit4]   2> 1811178 INFO  (TEST-TestReqParamsAPI.test-seed#[1479B1FD48669C72]) [    ] o.e.j.s.ServerConnector Started ServerConnector@24a7d6{HTTP/1.1,[http/1.1]}{127.0.0.1:37509}
   [junit4]   2> 1811179 INFO  (TEST-TestReqParamsAPI.test-seed#[1479B1FD48669C72]) [    ] o.e.j.s.Server Started @1812456ms
   [junit4]   2> 1811179 INFO  (TEST-TestReqParamsAPI.test-seed#[1479B1FD48669C72]) [    ] o.a.s.c.s.e.JettySolrRunner Jetty properties: {solr.data.dir=/home/jenkins/workspace/Lucene-Solr-master-Linux/solr/build/solr-core/test/J0/temp/solr.handler.TestReqParamsAPI_1479B1FD48669C72-001/tempDir-001/jetty1, solrconfig=solrconfig.xml, hostContext=/ob, hostPort=37509, coreRootDirectory=/home/jenkins/workspace/Lucene-Solr-master-Linux/solr/build/solr-core/test/J0/../../../../../../../../../home/jenkins/workspace/Lucene-Solr-master-Linux/solr/build/solr-core/test/J0/temp/solr.handler.TestReqParamsAPI_1479B1FD48669C72-001/shard-1-001/cores}
   [junit4]   2> 1811179 INFO  (TEST-TestReqParamsAPI.test-seed#[1479B1FD48669C72]) [    ] o.a.s.s.SolrDispatchFilter SolrDispatchFilter.init(): sun.misc.Launcher$AppClassLoader@1d16e93
   [junit4]   2> 1811179 INFO  (TEST-TestReqParamsAPI.test-seed#[1479B1FD48669C72]) [    ] o.a.s.c.SolrResourceLoader new SolrResourceLoader for directory: '/home/jenkins/workspace/Lucene-Solr-master-Linux/solr/build/solr-core/test/J0/temp/solr.handler.TestReqParamsAPI_1479B1FD48669C72-001/shard-1-001'
   [junit4]   2> 1811179 INFO  (TEST-TestReqParamsAPI.test-seed#[1479B1FD48669C72]) [    ] o.a.s.c.SolrResourceLoader JNDI not configured for solr (NoInitialContextEx)
   [junit4]   2> 1811179 INFO  (TEST-TestReqParamsAPI.test-seed#[1479B1FD48669C72]) [    ] o.a.s.c.SolrResourceLoader solr home defaulted to 'solr/' (could not find system property or JNDI)
   [junit4]   2> 1811179 INFO  (TEST-TestReqParamsAPI.test-seed#[1479B1FD48669C72]) [    ] o.a.s.c.c.SolrZkClient Using default ZkCredentialsProvider
   [junit4]   2> 1811180 INFO  (TEST-TestReqParamsAPI.test-seed#[1479B1FD48669C72]) [    ] o.a.s.c.c.ConnectionManager Waiting for client to connect to ZooKeeper
   [junit4]   2> 1811181 INFO  (zkCallback-2225-thread-1) [    ] o.a.s.c.c.ConnectionManager Watcher org.apache.solr.common.cloud.ConnectionManager@18f64b9 name:ZooKeeperConnection Watcher:127.0.0.1:34458/solr got event WatchedEvent state:SyncConnected type:None path:null path:null type:None
   [junit4]   2> 1811181 INFO  (TEST-TestReqParamsAPI.test-seed#[1479B1FD48669C72]) [    ] o.a.s.c.c.ConnectionManager Client is connected to ZooKeeper
   [junit4]   2> 1811181 INFO  (TEST-TestReqParamsAPI.test-seed#[1479B1FD48669C72]) [    ] o.a.s.c.c.SolrZkClient Using default ZkACLProvider
   [junit4]   2> 1811182 INFO  (TEST-TestReqParamsAPI.test-seed#[1479B1FD48669C72]) [    ] o.a.s.s.SolrDispatchFilter Loading solr.xml from SolrHome (not found in ZooKeeper)
   [junit4]   2> 1811182 INFO  (TEST-TestReqParamsAPI.test-seed#[1479B1FD48669C72]) [    ] o.a.s.c.SolrXmlConfig Loading container configuration from /home/jenkins/workspace/Lucene-Solr-master-Linux/solr/build/solr-core/test/J0/temp/solr.handler.TestReqParamsAPI_1479B1FD48669C72-001/shard-1-001/solr.xml
   [junit4]   2> 1811192 INFO  (TEST-TestReqParamsAPI.test-seed#[1479B1FD48669C72]) [    ] o.a.s.c.CorePropertiesLocator Config-defined core root directory: /home/jenkins/workspace/Lucene-Solr-master-Linux/solr/build/solr-core/test/J0/../../../../../../../../../home/jenkins/workspace/Lucene-Solr-master-Linux/solr/build/solr-core/test/J0/temp/solr.handler.TestReqParamsAPI_1479B1FD48669C72-001/shard-1-001/cores
   [junit4]   2> 1811192 INFO  (TEST-TestReqParamsAPI.test-seed#[1479B1FD48669C72]) [    ] o.a.s.c.CoreContainer New CoreContainer 22663598
   [junit4]   2> 1811192 INFO  (TEST-TestReqParamsAPI.test-seed#[1479B1FD48669C72]) [    ] o.a.s.c.CoreContainer Loading cores into CoreContainer [instanceDir=/home/jenkins/workspace/Lucene-Solr-master-Linux/solr/build/solr-core/test/J0/temp/solr.handler.TestReqParamsAPI_1479B1FD48669C72-001/shard-1-001]
   [junit4]   2> 1811193 WARN  (TEST-TestReqParamsAPI.test-seed#[1479B1FD48669C72]) [    ] o.a.s.c.CoreContainer Couldn't add files from /home/jenkins/workspace/Lucene-Solr-master-Linux/solr/build/solr-core/test/J0/temp/solr.handler.TestReqParamsAPI_1479B1FD48669C72-001/shard-1-001/lib to classpath: /home/jenkins/workspace/Lucene-Solr-master-Linux/solr/build/solr-core/test/J0/temp/solr.handler.TestReqParamsAPI_1479B1FD48669C72-001/shard-1-001/lib
   [junit4]   2> 1811193 INFO  (TEST-TestReqParamsAPI.test-seed#[1479B1FD48669C72]) [    ] o.a.s.h.c.HttpShardHandlerFactory created with socketTimeout : 90000,urlScheme : ,connTimeout : 15000,maxConnectionsPerHost : 20,maxConnections : 10000,corePoolSize : 0,maximumPoolSize : 2147483647,maxThreadIdleTime : 5,sizeOfQueue : -1,fairnessPolicy : false,useRetries : false,
   [junit4]   2> 1811194 INFO  (TEST-TestReqParamsAPI.test-seed#[1479B1FD48669C72]) [    ] o.a.s.u.UpdateShardHandler Creating UpdateShardHandler HTTP client with params: socketTimeout=340000&connTimeout=45000&retry=true
   [junit4]   2> 1811194 INFO  (TEST-TestReqParamsAPI.test-seed#[1479B1FD48669C72]) [    ] o.a.s.l.LogWatcher SLF4J impl is org.slf4j.impl.Log4jLoggerFactory
   [junit4]   2> 1811194 INFO  (TEST-TestReqParamsAPI.test-seed#[1479B1FD48669C72]) [    ] o.a.s.l.LogWatcher Registering Log Listener [Log4j (org.slf4j.impl.Log4jLoggerFactory)]
   [junit4]   2> 1811194 INFO  (TEST-TestReqParamsAPI.test-seed#[1479B1FD48669C72]) [    ] o.a.s.c.ZkContainer Zookeeper client=127.0.0.1:34458/solr
   [junit4]   2> 1811194 INFO  (TEST-TestReqParamsAPI.test-seed#[1479B1FD48669C72]) [    ] o.a.s.c.ZkController zkHost includes chroot
   [junit4]   2> 1811195 INFO  (TEST-TestReqParamsAPI.test-seed#[1479B1FD48669C72]) [    ] o.a.s.c.c.SolrZkClient Using default ZkCredentialsProvider
   [junit4]   2> 1811195 INFO  (TEST-TestReqParamsAPI.test-seed#[1479B1FD48669C72]) [    ] o.a.s.c.c.ConnectionManager Waiting for client to connect to ZooKeeper
   [junit4]   2> 1811196 INFO  (zkCallback-2228-thread-1) [    ] o.a.s.c.c.ConnectionManager Watcher org.apache.solr.common.cloud.ConnectionManager@171ecc9 name:ZooKeeperConnection Watcher:127.0.0.1:34458 got event WatchedEvent state:SyncConnected type:None path:null path:null type:None
   [junit4]   2> 1811197 INFO  (TEST-TestReqParamsAPI.test-seed#[1479B1FD48669C72]) [    ] o.a.s.c.c.ConnectionManager Client is connected to ZooKeeper
   [junit4]   2> 1811197 INFO  (TEST-TestReqParamsAPI.test-seed#[1479B1FD48669C72]) [    ] o.a.s.c.c.SolrZkClient Using default ZkACLProvider
   [junit4]   2> 1811198 INFO  (TEST-TestReqParamsAPI.test-seed#[1479B1FD48669C72]) [n:127.0.0.1:37509_ob    ] o.a.s.c.c.ConnectionManager Waiting for client to connect to ZooKeeper
   [junit4]   2> 1811199 INFO  (zkCallback-2229-thread-1-processing-n:127.0.0.1:37509_ob) [n:127.0.0.1:37509_ob    ] o.a.s.c.c.ConnectionManager Watcher org.apache.solr.common.cloud.ConnectionManager@adc045 name:ZooKeeperConnection Watcher:127.0.0.1:34458/solr got event WatchedEvent state:SyncConnected type:None path:null path:null type:None
   [junit4]   2> 1811199 INFO  (TEST-TestReqParamsAPI.test-seed#[1479B1FD48669C72]) [n:127.0.0.1:37509_ob    ] o.a.s.c.c.ConnectionManager Client is connected to ZooKeeper
   [junit4]   2> 1811203 INFO  (TEST-TestReqParamsAPI.test-seed#[1479B1FD48669C72]) [n:127.0.0.1:37509_ob    ] o.a.s.c.c.ZkStateReader Updating cluster state from ZooKeeper... 
   [junit4]   2> 1811204 INFO  (TEST-TestReqParamsAPI.test-seed#[1479B1FD48669C72]) [n:127.0.0.1:37509_ob    ] o.a.s.c.c.ZkStateReader Updated live nodes from ZooKeeper... (0) -> (1)
   [junit4]   2> 1811205 INFO  (TEST-TestReqParamsAPI.test-seed#[1479B1FD48669C72]) [n:127.0.0.1:37509_ob    ] o.a.s.c.Overseer Overseer (id=null) closing
   [junit4]   2> 1811205 INFO  (TEST-TestReqParamsAPI.test-seed#[1479B1FD48669C72]) [n:127.0.0.1:37509_ob    ] o.a.s.c.LeaderElector Joined leadership election with path: /overseer_elect/election/95611276613845000-127.0.0.1:37509_ob-n_0000000001
   [junit4]   2> 1811206 INFO  (TEST-TestReqParamsAPI.test-seed#[1479B1FD48669C72]) [n:127.0.0.1:37509_ob    ] o.a.s.c.LeaderElector Watching path /overseer_elect/election/95611276613844996-127.0.0.1:34018_ob-n_0000000000 to know if I could be the leader
   [junit4]   2> 1811206 INFO  (TEST-TestReqParamsAPI.test-seed#[1479B1FD48669C72]) [n:127.0.0.1:37509_ob    ] o.a.s.c.ZkController Publish node=127.0.0.1:37509_ob as DOWN
   [junit4]   2> 1811207 INFO  (OverseerStateUpdate-95611276613844996-127.0.0.1:34018_ob-n_0000000000) [n:127.0.0.1:34018_ob    ] o.a.s.c.Overseer processMessage: queueSize: 1, message = {
   [junit4]   2>   "operation":"downnode",
   [junit4]   2>   "node_name":"127.0.0.1:37509_ob"} current state version: 3
   [junit4]   2> 1811207 INFO  (OverseerStateUpdate-95611276613844996-127.0.0.1:34018_ob-n_0000000000) [n:127.0.0.1:34018_ob    ] o.a.s.c.o.NodeMutator DownNode state invoked for node: 127.0.0.1:37509_ob
   [junit4]   2> 1811309 INFO  (zkCallback-2224-thread-1) [    ] o.a.s.c.c.ZkStateReader A cluster state change: [WatchedEvent state:SyncConnected type:NodeDataChanged path:/clusterstate.json], has occurred - updating... (live nodes size: [1])
   [junit4]   2> 1811309 INFO  (zkCallback-2229-thread-1-processing-n:127.0.0.1:37509_ob) [n:127.0.0.1:37509_ob    ] o.a.s.c.c.ZkStateReader A cluster state change: [WatchedEvent state:SyncConnected type:NodeDataChanged path:/clusterstate.json], has occurred - updating... (live nodes size: [1])
   [junit4]   2> 1811309 INFO  (zkCallback-2222-thread-1-processing-n:127.0.0.1:34018_ob) [n:127.0.0.1:34018_ob    ] o.a.s.c.c.ZkStateReader A cluster state change: [WatchedEvent state:SyncConnected type:NodeDataChanged path:/clusterstate.json], has occurred - updating... (live nodes size: [1])
   [junit4]   2> 1812207 INFO  (TEST-TestReqParamsAPI.test-seed#[1479B1FD48669C72]) [n:127.0.0.1:37509_ob    ] o.a.s.c.ZkController Register node as live in ZooKeeper:/live_nodes/127.0.0.1:37509_ob
   [junit4]   2> 1812208 INFO  (TEST-TestReqParamsAPI.test-seed#[1479B1FD48669C72]) [n:127.0.0.1:37509_ob    ] o.a.s.c.c.SolrZkClient makePath: /live_nodes/127.0.0.1:37509_ob
   [junit4]   2> 1812209 INFO  (zkCallback-2224-thread-1) [    ] o.a.s.c.c.ZkStateReader A live node change: [WatchedEvent state:SyncConnected type:NodeChildrenChanged path:/live_nodes], has occurred - updating... (live nodes size: [1])
   [junit4]   2> 1812209 INFO  (zkCallback-2222-thread-1-processing-n:127.0.0.1:34018_ob) [n:127.0.0.1:34018_ob    ] o.a.s.c.c.ZkStateReader A live node change: [WatchedEvent state:SyncConnected type:NodeChildrenChanged path:/live_nodes], has occurred - updating... (live nodes size: [1])
   [junit4]   2> 1812209 INFO  (zkCallback-2229-thread-1-processing-n:127.0.0.1:37509_ob) [n:127.0.0.1:37509_ob    ] o.a.s.c.c.ZkStateReader A live node change: [WatchedEvent state:SyncConnected type:NodeChildrenChanged path:/live_nodes], has occurred - updating... (live nodes size: [1])
   [junit4]   2> 1812209 INFO  (zkCallback-2224-thread-1) [    ] o.a.s.c.c.ZkStateReader Updated live nodes from ZooKeeper... (1) -> (2)
   [junit4]   2> 1812209 INFO  (zkCallback-2222-thread-1-processing-n:127.0.0.1:34018_ob) [n:127.0.0.1:34018_ob    ] o.a.s.c.c.ZkStateReader Updated live nodes from ZooKeeper... (1) -> (2)
   [junit4]   2> 1812209 INFO  (zkCallback-2229-thread-1-processing-n:127.0.0.1:37509_ob) [n:127.0.0.1:37509_ob    ] o.a.s.c.c.ZkStateReader Updated live nodes from ZooKeeper... (1) -> (2)
   [junit4]   2> 1812237 INFO  (TEST-TestReqParamsAPI.test-seed#[1479B1FD48669C72]) [n:127.0.0.1:37509_ob    ] o.a.s.c.CoreContainer Security conf doesn't exist. Skipping setup for authorization module.
   [junit4]   2> 1812237 INFO  (TEST-TestReqParamsAPI.test-seed#[1479B1FD48669C72]) [n:127.0.0.1:37509_ob    ] o.a.s.c.CoreContainer No authentication plugin used.
   [junit4]   2> 1812238 INFO  (TEST-TestReqParamsAPI.test-seed#[1479B1FD48669C72]) [n:127.0.0.1:37509_ob    ] o.a.s.c.CorePropertiesLocator Looking for core definitions underneath /home/jenkins/workspace/Lucene-Solr-master-Linux/solr/build/solr-core/test/J0/../../../../../../../../../home/jenkins/workspace/Lucene-Solr-master-Linux/solr/build/solr-core/test/J0/temp/solr.handler.TestReqParamsAPI_1479B1FD48669C72-001/shard-1-001/cores
   [junit4]   2> 1812238 INFO  (TEST-TestReqParamsAPI.test-seed#[1479B1FD48669C72]) [n:127.0.0.1:37509_ob    ] o.a.s.c.CoreDescriptor Created CoreDescriptor: {name=collection1, config=solrconfig.xml, transient=false, schema=schema.xml, loadOnStartup=true, configSetProperties=configsetprops.json, collection=collection1, coreNodeName=, dataDir=data/, shard=}
   [junit4]   2> 1812238 INFO  (TEST-TestReqParamsAPI.test-seed#[1479B1FD48669C72]) [n:127.0.0.1:37509_ob    ] o.a.s.c.CorePropertiesLocator Found core collection1 in /home/jenkins/workspace/Lucene-Solr-master-Linux/solr/build/solr-core/test/J0/../../../../../../../../../home/jenkins/workspace/Lucene-Solr-master-Linux/solr/build/solr-core/test/J0/temp/solr.handler.TestReqParamsAPI_1479B1FD48669C72-001/shard-1-001/cores/collection1
   [junit4]   2> 1812239 INFO  (TEST-TestReqParamsAPI.test-seed#[1479B1FD48669C72]) [n:127.0.0.1:37509_ob    ] o.a.s.c.CorePropertiesLocator Found 1 core definitions
   [junit4]   2> 1812240 INFO  (TEST-TestReqParamsAPI.test-seed#[1479B1FD48669C72]) [n:127.0.0.1:37509_ob    ] o.a.s.s.SolrDispatchFilter user.dir=/home/jenkins/workspace/Lucene-Solr-master-Linux/solr/build/solr-core/test/J0
   [junit4]   2> 1812240 INFO  (coreLoadExecutor-6934-thread-1-processing-n:127.0.0.1:37509_ob) [n:127.0.0.1:37509_ob c:collection1   x:collection1] o.a.s.c.ZkController publishing state=down
   [junit4]   2> 1812240 INFO  (coreLoadExecutor-6934-thread-1-processing-n:127.0.0.1:37509_ob) [n:127.0.0.1:37509_ob c:collection1   x:collection1] o.a.s.c.ZkController numShards not found on descriptor - reading it from system property
   [junit4]   2> 1812240 INFO  (TEST-TestReqParamsAPI.test-seed#[1479B1FD48669C72]) [n:127.0.0.1:37509_ob    ] o.a.s.s.SolrDispatchFilter SolrDispatchFilter.init() done
   [junit4]   2> 1812241 INFO  (coreLoadExecutor-6934-thread-1-processing-n:127.0.0.1:37509_ob) [n:127.0.0.1:37509_ob c:collection1   x:collection1] o.a.s.c.ZkController look for our core node name
   [junit4]   2> 1812241 INFO  (OverseerStateUpdate-95611276613844996-127.0.0.1:34018_ob-n_0000000000) [n:127.0.0.1:34018_ob    ] o.a.s.c.Overseer processMessage: queueSize: 1, message = {
   [junit4]   2>   "core":"collection1",
   [junit4]   2>   "roles":null,
   [junit4]   2>   "base_url":"http://127.0.0.1:37509/ob",
   [junit4]   2>   "node_name":"127.0.0.1:37509_ob",
   [junit4]   2>   "numShards":"2",
   [junit4]   2>   "state":"down",
   [junit4]   2>   "shard":null,
   [junit4]   2>   "collection":"collection1",
   [junit4]   2>   "operation":"state"} current state version: 4
   [junit4]   2> 1812241 INFO  (OverseerStateUpdate-95611276613844996-127.0.0.1:34018_ob-n_0000000000) [n:127.0.0.1:34018_ob    ] o.a.s.c.o.ReplicaMutator Update state numShards=2 message={
   [junit4]   2>   "core":"collection1",
   [junit4]   2>   "roles":null,
   [junit4]   2>   "base_url":"http://127.0.0.1:37509/ob",
   [junit4]   2>   "node_name":"127.0.0.1:37509_ob",
   [junit4]   2>   "numShards":"2",
   [junit4]   2>   "state":"down",
   [junit4]   2>   "shard":null,
   [junit4]   2>   "collection":"collection1",
   [junit4]   2>   "operation":"state"}
   [junit4]   2> 1812241 INFO  (OverseerStateUpdate-95611276613844996-127.0.0.1:34018_ob-n_0000000000) [n:127.0.0.1:34018_ob    ] o.a.s.c.o.ClusterStateMutator building a new cName: collection1
   [junit4]   2> 1812242 INFO  (OverseerStateUpdate-95611276613844996-127.0.0.1:34018_ob-n_0000000000) [n:127.0.0.1:34018_ob    ] o.a.s.c.o.ReplicaMutator Assigning new node to shard shard=shard2
   [junit4]   2> 1812343 INFO  (zkCallback-2224-thread-1) [    ] o.a.s.c.c.ZkStateReader A cluster state change: [WatchedEvent state:SyncConnected type:NodeDataChanged path:/clusterstate.json], has occurred - updating... (live nodes size: [2])
   [junit4]   2> 1812343 INFO  (zkCallback-2229-thread-1-processing-n:127.0.0.1:37509_ob) [n:127.0.0.1:37509_ob    ] o.a.s.c.c.ZkStateReader A cluster state change: [WatchedEvent state:SyncConnected type:NodeDataChanged path:/clusterstate.json], has occurred - updating... (live nodes size: [2])
   [junit4]   2> 1812343 INFO  (zkCallback-2222-thread-1-processing-n:127.0.0.1:34018_ob) [n:127.0.0.1:34018_ob    ] o.a.s.c.c.ZkStateReader A cluster state change: [WatchedEvent state:SyncConnected type:NodeDataChanged path:/clusterstate.json], has occurred - updating... (live nodes size: [2])
   [junit4]   2> 1813241 INFO  (coreLoadExecutor-6934-thread-1-processing-n:127.0.0.1:37509_ob) [n:127.0.0.1:37509_ob c:collection1   x:collection1] o.a.s.c.ZkController waiting to find shard id in clusterstate for collection1
   [junit4]   2> 1813241 INFO  (coreLoadExecutor-6934-thread-1-processing-n:127.0.0.1:37509_ob) [n:127.0.0.1:37509_ob c:collection1   x:collection1] o.a.s.c.ZkController Check for collection zkNode:collection1
   [junit4]   2> 1813242 INFO  (coreLoadExecutor-6934-thread-1-processing-n:127.0.0.1:37509_ob) [n:127.0.0.1:37509_ob c:collection1   x:collection1] o.a.s.c.ZkController Collection zkNode exists
   [junit4]   2> 1813242 INFO  (coreLoadExecutor-6934-thread-1-processing-n:127.0.0.1:37509_ob) [n:127.0.0.1:37509_ob c:collection1   x:collection1] o.a.s.c.c.ZkStateReader Load collection config from: [/collections/collection1]
   [junit4]   2> 1813242 INFO  (coreLoadExecutor-6934-thread-1-processing-n:127.0.0.1:37509_ob) [n:127.0.0.1:37509_ob c:collection1   x:collection1] o.a.s.c.c.ZkStateReader path=[/collections/collection1] [configName]=[conf1] specified config exists in ZooKeeper
   [junit4]   2> 1813242 INFO  (coreLoadExecutor-6934-thread-1-processing-n:127.0.0.1:37509_ob) [n:127.0.0.1:37509_ob c:collection1   x:collection1] o.a.s.c.SolrResourceLoader new SolrResourceLoader for directory: '/home/jenkins/workspace/Lucene-Solr-master-Linux/solr/build/solr-core/test/J0/temp/solr.handler.TestReqParamsAPI_1479B1FD48669C72-001/shard-1-001/cores/collection1'
   [junit4]   2> 1813243 INFO  (coreLoadExecutor-6934-thread-1-processing-n:127.0.0.1:37509_ob) [n:127.0.0.1:37509_ob c:collection1   x:collection1] o.a.s.c.SolrResourceLoader JNDI not configured for solr (NoInitialContextEx)
   [junit4]   2> 1813243 INFO  (coreLoadExecutor-6934-thread-1-processing-n:127.0.0.1:37509_ob) [n:127.0.0.1:37509_ob c:collection1   x:collection1] o.a.s.c.SolrResourceLoader solr home defaulted to 'solr/' (could not find system property or JNDI)
   [junit4]   2> 1813244 INFO  (coreLoadExecutor-6934-thread-1-processing-n:127.0.0.1:37509_ob) [n:127.0.0.1:37509_ob c:collection1   x:collection1] o.a.s.c.Config loaded config solrconfig.xml with version 0 
   [junit4]   2> 1813250 INFO  (coreLoadExecutor-6934-thread-1-processing-n:127.0.0.1:37509_ob) [n:127.0.0.1:37509_ob c:collection1   x:collection1] o.a.s.c.SolrConfig current version of requestparams : -1
   [junit4]   2> 1813254 INFO  (coreLoadExecutor-6934-thread-1-processing-n:127.0.0.1:37509_ob) [n:127.0.0.1:37509_ob c:collection1   x:collection1] o.a.s.c.SolrConfig Using Lucene MatchVersion: 7.0.0
   [junit4]   2> 1813269 INFO  (coreLoadExecutor-6934-thread-1-processing-n:127.0.0.1:37509_ob) [n:127.0.0.1:37509_ob c:collection1   x:collection1] o.a.s.c.SolrConfig Loaded SolrConfig: solrconfig.xml
   [junit4]   2> 1813277 INFO  (coreLoadExecutor-6934-thread-1-processing-n:127.0.0.1:37509_ob) [n:127.0.0.1:37509_ob c:collection1   x:collection1] o.a.s.s.IndexSchema [collection1] Schema name=test
   [junit4]   2> 1813355 INFO  (coreLoadExecutor-6934-thread-1-processing-n:127.0.0.1:37509_ob) [n:127.0.0.1:37509_ob c:collection1   x:collection1] o.a.s.s.OpenExchangeRatesOrgProvider Initialized with rates=open-exchange-rates.json, refreshInterval=1440.
   [junit4]   2> 1813361 INFO  (coreLoadExecutor-6934-thread-1-processing-n:127.0.0.1:37509_ob) [n:127.0.0.1:37509_ob c:collection1   x:collection1] o.a.s.s.IndexSchema default search field in schema is text
   [junit4]   2> 1813361 INFO  (coreLoadExecutor-6934-thread-1-processing-n:127.0.0.1:37509_ob) [n:127.0.0.1:37509_ob c:collection1   x:collection1] o.a.s.s.IndexSchema unique key field: id
   [junit4]   2> 1813370 INFO  (coreLoadExecutor-6934-thread-1-processing-n:127.0.0.1:37509_ob) [n:127.0.0.1:37509_ob c:collection1   x:collection1] o.a.s.s.FileExchangeRateProvider Reloading exchange rates from file currency.xml
   [junit4]   2> 1813372 INFO  (coreLoadExecutor-6934-thread-1-processing-n:127.0.0.1:37509_ob) [n:127.0.0.1:37509_ob c:collection1   x:collection1] o.a.s.s.FileExchangeRateProvider Reloading exchange rates from file currency.xml
   [junit4]   2> 1813374 INFO  (coreLoadExecutor-6934-thread-1-processing-n:127.0.0.1:37509_ob) [n:127.0.0.1:37509_ob c:collection1   x:collection1] o.a.s.s.OpenExchangeRatesOrgProvider Reloading exchange rates from open-exchange-rates.json
   [junit4]   2> 1813374 INFO  (coreLoadExecutor-6934-thread-1-processing-n:127.0.0.1:37509_ob) [n:127.0.0.1:37509_ob c:collection1   x:collection1] o.a.s.s.OpenExchangeRatesOrgProvider Reloading exchange rates from open-exchange-rates.json
   [junit4]   2> 1813375 INFO  (coreLoadExecutor-6934-thread-1-processing-n:127.0.0.1:37509_ob) [n:127.0.0.1:37509_ob c:collection1   x:collection1] o.a.s.c.ConfigSetProperties Did not find ConfigSet properties, assuming default properties: Can't find resource 'configsetprops.json' in classpath or '/configs/conf1', cwd=/home/jenkins/workspace/Lucene-Solr-master-Linux/solr/build/solr-core/test/J0
   [junit4]   2> 1813375 INFO  (coreLoadExecutor-6934-thread-1-processing-n:127.0.0.1:37509_ob) [n:127.0.0.1:37509_ob c:collection1   x:collection1] o.a.s.c.CoreContainer Creating SolrCore 'collection1' using configuration from collection collection1
   [junit4]   2> 1813375 INFO  (coreLoadExecutor-6934-thread-1-processing-n:127.0.0.1:37509_ob) [n:127.0.0.1:37509_ob c:collection1 s:shard2 r:core_node1 x:collection1] o.a.s.c.SolrCore org.apache.solr.core.MockDirectoryFactory
   [junit4]   2> 1813376 INFO  (coreLoadExecutor-6934-thread-1-processing-n:127.0.0.1:37509_ob) [n:127.0.0.1:37509_ob c:collection1 s:shard2 r:core_node1 x:collection1] o.a.s.c.SolrCore [[collection1] ] Opening new SolrCore at [/home/jenkins/workspace/Lucene-Solr-master-Linux/solr/build/solr-core/test/J0/temp/solr.handler.TestReqParamsAPI_1479B1FD48669C72-001/shard-1-001/cores/collection1], dataDir=[/home/jenkins/workspace/Lucene-Solr-master-Linux/solr/build/solr-core/test/J0/../../../../../../../../../home/jenkins/workspace/Lucene-Solr-master-Linux/solr/build/solr-core/test/J0/temp/solr.handler.TestReqParamsAPI_1479B1FD48669C72-001/shard-1-001/cores/collection1/data/]
   [junit4]   2> 1813376 INFO  (coreLoadExecutor-6934-thread-1-processing-n:127.0.0.1:37509_ob) [n:127.0.0.1:37509_ob c:collection1 s:shard2 r:core_node1 x:collection1] o.a.s.c.JmxMonitoredMap JMX monitoring is enabled. Adding Solr mbeans to JMX Server: com.sun.jmx.mbeanserver.JmxMBeanServer@d7ccb3
   [junit4]   2> 1813376 INFO  (coreLoadExecutor-6934-thread-1-processing-n:127.0.0.1:37509_ob) [n:127.0.0.1:37509_ob c:collection1 s:shard2 r:core_node1 x:collection1] o.a.s.c.CachingDirectoryFactory return new directory for /home/jenkins/workspace/Lucene-Solr-master-Linux/solr/build/solr-core/test/J0/../../../../../../../../../home/jenkins/workspace/Lucene-Solr-master-Linux/solr/build/solr-core/test/J0/temp/solr.handler.TestReqParamsAPI_1479B1FD48669C72-001/shard-1-001/cores/collection1/data
   [junit4]   2> 1813377 INFO  (coreLoadExecutor-6934-thread-1-processing-n:127.0.0.1:37509_ob) [n:127.0.0.1:37509_ob c:collection1 s:shard2 r:core_node1 x:collection1] o.a.s.c.SolrCore New index directory detected: old=null new=/home/jenkins/workspace/Lucene-Solr-master-Linux/solr/build/solr-core/test/J0/../../../../../../../../../home/jenkins/workspace/Lucene-Solr-master-Linux/solr/build/solr-core/test/J0/temp/solr.handler.TestReqParamsAPI_1479B1FD48669C72-001/shard-1-001/cores/collection1/data/index/
   [junit4]   2> 1813377 WARN  (coreLoadExecutor-6934-thread-1-processing-n:127.0.0.1:37509_ob) [n:127.0.0.1:37509_ob c:collection1 s:shard2 r:core_node1 x:collection1] o.a.s.c.SolrCore [collection1] Solr index directory '/home/jenkins/workspace/Lucene-Solr-master-Linux/solr/build/solr-core/test/J0/../../../../../../../../

[...truncated too long message...]

r.java:348)
   [junit4]   2> 	at org.apache.solr.common.cloud.SolrZkClient$3.lambda$process$0(SolrZkClient.java:266)
   [junit4]   2> 	at java.util.concurrent.Executors$RunnableAdapter.call(Executors.java:511)
   [junit4]   2> 	at java.util.concurrent.FutureTask.run(FutureTask.java:266)
   [junit4]   2> 	at org.apache.solr.common.util.ExecutorUtil$MDCAwareThreadPoolExecutor.lambda$execute$0(ExecutorUtil.java:229)
   [junit4]   2> 	at java.util.concurrent.ThreadPoolExecutor.runWorker(ThreadPoolExecutor.java:1142)
   [junit4]   2> 	at java.util.concurrent.ThreadPoolExecutor$Worker.run(ThreadPoolExecutor.java:617)
   [junit4]   2> 	at java.lang.Thread.run(Thread.java:745)
   [junit4]   2> 1836714 INFO  (TEST-TestReqParamsAPI.test-seed#[1479B1FD48669C72]) [    ] o.e.j.s.ServerConnector Stopped ServerConnector@19a4c03{HTTP/1.1,[http/1.1]}{127.0.0.1:0}
   [junit4]   2> 1836714 INFO  (TEST-TestReqParamsAPI.test-seed#[1479B1FD48669C72]) [    ] o.e.j.s.h.ContextHandler Stopped o.e.j.s.ServletContextHandler@d193fa{/ob,null,UNAVAILABLE}
   [junit4]   2> 1836715 INFO  (TEST-TestReqParamsAPI.test-seed#[1479B1FD48669C72]) [    ] o.a.s.c.ZkTestServer connecting to 127.0.0.1:34458 34458
   [junit4]   2> 1836726 INFO  (Thread-5256) [    ] o.a.s.c.ZkTestServer connecting to 127.0.0.1:34458 34458
   [junit4]   2> 1836726 WARN  (Thread-5256) [    ] o.a.s.c.ZkTestServer Watch limit violations: 
   [junit4]   2> Maximum concurrent create/delete watches above limit:
   [junit4]   2> 
   [junit4]   2> 	40	/solr/configs/conf1
   [junit4]   2> 	6	/solr/aliases.json
   [junit4]   2> 	5	/solr/security.json
   [junit4]   2> 
   [junit4]   2> Maximum concurrent data watches above limit:
   [junit4]   2> 
   [junit4]   2> 	6	/solr/clusterstate.json
   [junit4]   2> 
   [junit4]   2> Maximum concurrent children watches above limit:
   [junit4]   2> 
   [junit4]   2> 	6	/solr/live_nodes
   [junit4]   2> 	6	/solr/collections
   [junit4]   2> 	4	/solr/overseer/queue
   [junit4]   2> 	4	/solr/overseer/collection-queue-work
   [junit4]   2> 
   [junit4]   2> NOTE: reproduce with: ant test  -Dtestcase=TestReqParamsAPI -Dtests.method=test -Dtests.seed=1479B1FD48669C72 -Dtests.multiplier=3 -Dtests.slow=true -Dtests.locale=es-HN -Dtests.timezone=Asia/Ho_Chi_Minh -Dtests.asserts=true -Dtests.file.encoding=UTF-8
   [junit4] FAILURE 27.5s J0 | TestReqParamsAPI.test <<<
   [junit4]    > Throwable #1: java.lang.AssertionError: Could not get expected value  'first' for path 'response/params/x/_appends_/add' full output: {
   [junit4]    >   "responseHeader":{
   [junit4]    >     "status":0,
   [junit4]    >     "QTime":0},
   [junit4]    >   "response":{
   [junit4]    >     "znodeVersion":3,
   [junit4]    >     "params":{
   [junit4]    >       "x":{
   [junit4]    >         "a":"A val",
   [junit4]    >         "b":"B val",
   [junit4]    >         "":{"v":0}},
   [junit4]    >       "y":{
   [junit4]    >         "p":"P val",
   [junit4]    >         "q":"Q val",
   [junit4]    >         "":{"v":2}}}}}
   [junit4]    > 	at __randomizedtesting.SeedInfo.seed([1479B1FD48669C72:9C2D8E27E69AF18A]:0)
   [junit4]    > 	at org.apache.solr.core.TestSolrConfigHandler.testForResponseElement(TestSolrConfigHandler.java:458)
   [junit4]    > 	at org.apache.solr.handler.TestReqParamsAPI.testReqParams(TestReqParamsAPI.java:236)
   [junit4]    > 	at org.apache.solr.handler.TestReqParamsAPI.test(TestReqParamsAPI.java:67)
   [junit4]    > 	at org.apache.solr.BaseDistributedSearchTestCase$ShardsRepeatRule$ShardsFixedStatement.callStatement(BaseDistributedSearchTestCase.java:996)
   [junit4]    > 	at org.apache.solr.BaseDistributedSearchTestCase$ShardsRepeatRule$ShardsStatement.evaluate(BaseDistributedSearchTestCase.java:971)
   [junit4]    > 	at java.lang.Thread.run(Thread.java:745)
   [junit4]   2> 1836730 INFO  (SUITE-TestReqParamsAPI-seed#[1479B1FD48669C72]-worker) [    ] o.a.s.SolrTestCaseJ4 ###deleteCore
   [junit4]   2> NOTE: leaving temporary files on disk at: /home/jenkins/workspace/Lucene-Solr-master-Linux/solr/build/solr-core/test/J0/temp/solr.handler.TestReqParamsAPI_1479B1FD48669C72-001
   [junit4]   2> Mar 25, 2016 1:25:29 PM com.carrotsearch.randomizedtesting.ThreadLeakControl checkThreadLeaks
   [junit4]   2> WARNING: Will linger awaiting termination of 2 leaked thread(s).
   [junit4]   2> NOTE: test params are: codec=Asserting(Lucene60): {}, docValues:{}, maxPointsInLeafNode=1304, maxMBSortInHeap=5.465051639246181, sim=RandomSimilarity(queryNorm=true,coord=no): {}, locale=es-HN, timezone=Asia/Ho_Chi_Minh
   [junit4]   2> NOTE: Linux 4.2.0-34-generic i386/Oracle Corporation 1.8.0_72 (32-bit)/cpus=12,threads=1,free=152221312,total=295792640
   [junit4]   2> NOTE: All tests run in this JVM: [TestRTGBase, HdfsBasicDistributedZk2Test, TestJsonRequest, BlockDirectoryTest, TestShortCircuitedRequests, ExplicitHLLTest, FileBasedSpellCheckerTest, RAMDirectoryFactoryTest, TestOmitPositions, TestJoin, BasicZkTest, TestInitParams, TestPerFieldSimilarityWithDefaultOverride, TestBinaryField, HdfsSyncSliceTest, PolyFieldTest, TestStressLucene, PreAnalyzedFieldTest, ActionThrottleTest, UUIDFieldTest, TestReplicationHandler, TestFoldingMultitermQuery, TestShardHandlerFactory, TestExclusionRuleCollectionAccess, TestReplicaProperties, TestFunctionQuery, TestFreeTextSuggestions, TestBadConfig, SolrXmlInZkTest, SolrCoreTest, TestConfigSetImmutable, TestTrackingShardHandlerFactory, AnalyticsMergeStrategyTest, PeerSyncTest, TestRestManager, TlogReplayBufferedWhileIndexingTest, OverseerRolesTest, TestLazyCores, ResourceLoaderTest, HdfsUnloadDistributedZkTest, TestRTimerTree, IndexSchemaTest, TestSha256AuthenticationProvider, SharedFSAutoReplicaFailoverUtilsTest, TestValueSourceCache, SpatialHeatmapFacetsTest, TestPhraseSuggestions, TestAnalyzeInfixSuggestions, CdcrVersionReplicationTest, DistributedQueryComponentOptimizationTest, TestRawResponseWriter, JsonLoaderTest, TestLRUStatsCache, TestOrdValues, HdfsDirectoryFactoryTest, CacheHeaderTest, TestDocSet, AnalysisAfterCoreReloadTest, XsltUpdateRequestHandlerTest, BigEndianAscendingWordDeserializerTest, TestComplexPhraseQParserPlugin, URLClassifyProcessorTest, TestAuthorizationFramework, TestRandomDVFaceting, BadCopyFieldTest, TestDistributedSearch, CustomCollectionTest, DistributedFacetPivotSmallTest, TestReloadDeadlock, TestDynamicFieldResource, CursorPagingTest, JSONWriterTest, SystemInfoHandlerTest, TestBulkSchemaConcurrent, TestFilteredDocIdSet, DistributedQueueTest, TestConfig, TestClusterStateMutator, SynonymTokenizerTest, OutputWriterTest, SolrRequestParserTest, ConcurrentDeleteAndCreateCollectionTest, HttpPartitionTest, TestMaxScoreQueryParser, MergeStrategyTest, TestExceedMaxTermLength, TestMiniSolrCloudCluster, TestFieldTypeCollectionResource, TestCryptoKeys, TestMiniSolrCloudClusterSSL, QueryEqualityTest, TestXmlQParser, TestArbitraryIndexDir, GraphQueryTest, CachingDirectoryFactoryTest, LeaderInitiatedRecoveryOnShardRestartTest, ZkCLITest, ShardRoutingCustomTest, TestFaceting, DistributedSpellCheckComponentTest, ZkControllerTest, TestRealTimeGet, TestStressVersions, TestRangeQuery, TestSolr4Spatial, SolrCmdDistributorTest, QueryElevationComponentTest, TestIndexSearcher, CurrencyFieldOpenExchangeTest, CurrencyFieldXmlFileTest, TestCoreDiscovery, TestExtendedDismaxParser, SuggesterFSTTest, DocValuesTest, DocValuesMultiTest, DistanceFunctionTest, LukeRequestHandlerTest, StandardRequestHandlerTest, TestReversedWildcardFilterFactory, TestQueryTypes, TermsComponentTest, RequestHandlersTest, TermVectorComponentTest, FieldAnalysisRequestHandlerTest, RegexBoostProcessorTest, ReturnFieldsTest, MBeansHandlerTest, UniqFieldsUpdateProcessorFactoryTest, PingRequestHandlerTest, TestElisionMultitermQuery, ExternalFileFieldSortTest, NotRequiredUniqueKeyTest, TestCharFilters, EchoParamsTest, TestDFRSimilarityFactory, TestLMDirichletSimilarityFactory, TestBM25SimilarityFactory, OpenExchangeRatesOrgProviderTest, ChaosMonkeyNothingIsSafeTest, AssignTest, AsyncCallRequestStatusResponseTest, BaseCdcrDistributedZkTest, CdcrReplicationDistributedZkTest, CdcrReplicationHandlerTest, CdcrRequestHandlerTest, CleanupOldIndexTest, CollectionReloadTest, CollectionsAPIAsyncDistributedZkTest, CollectionsAPISolrJTest, DeleteStatusTest, DistribJoinFromCollectionTest, LeaderInitiatedRecoveryOnCommitTest, OutOfBoxZkACLAndCredentialsProvidersTest, OverriddenZkACLAndCredentialsProvidersTest, RecoveryAfterSoftCommitTest, RestartWhileUpdatingTest, RollingRestartTest, SolrCloudExampleTest, TestConfigSetsAPI, TestLeaderInitiatedRecoveryThread, TestDynamicLoading, TestSolrConfigHandler, TestReplicationHandlerBackup, TestReqParamsAPI]
   [junit4] Completed [489/581 (1!)] on J0 in 28.27s, 1 test, 1 failure <<< FAILURES!

[...truncated 318 lines...]
BUILD FAILED
/home/jenkins/workspace/Lucene-Solr-master-Linux/build.xml:740: The following error occurred while executing this line:
/home/jenkins/workspace/Lucene-Solr-master-Linux/build.xml:684: The following error occurred while executing this line:
/home/jenkins/workspace/Lucene-Solr-master-Linux/build.xml:59: The following error occurred while executing this line:
/home/jenkins/workspace/Lucene-Solr-master-Linux/solr/build.xml:233: The following error occurred while executing this line:
/home/jenkins/workspace/Lucene-Solr-master-Linux/solr/common-build.xml:529: The following error occurred while executing this line:
/home/jenkins/workspace/Lucene-Solr-master-Linux/lucene/common-build.xml:1457: The following error occurred while executing this line:
/home/jenkins/workspace/Lucene-Solr-master-Linux/lucene/common-build.xml:1014: There were test failures: 581 suites (10 ignored), 2324 tests, 1 failure, 115 ignored (70 assumptions) [seed: 1479B1FD48669C72]

Total time: 57 minutes 48 seconds
Build step 'Invoke Ant' marked build as failure
Archiving artifacts
[WARNINGS] Skipping publisher since build result is FAILURE
Recording test results
Email was triggered for: Failure - Any
Sending email for trigger: Failure - Any



Mime
View raw message