lucene-dev mailing list archives

Site index · List index
Message view « Date » · « Thread »
Top « Date » · « Thread »
From Policeman Jenkins Server <jenk...@thetaphi.de>
Subject [JENKINS] Lucene-Solr-master-Linux (64bit/jdk1.8.0_72) - Build # 16100 - Still Failing!
Date Fri, 04 Mar 2016 20:00:00 GMT
Build: http://jenkins.thetaphi.de/job/Lucene-Solr-master-Linux/16100/
Java: 64bit/jdk1.8.0_72 -XX:+UseCompressedOops -XX:+UseSerialGC

1 tests failed.
FAILED:  org.apache.solr.cloud.CollectionTooManyReplicasTest.testDownedShards

Error Message:
Should have gotten a message about shard not 

Stack Trace:
java.lang.AssertionError: Should have gotten a message about shard not 
	at __randomizedtesting.SeedInfo.seed([18ACC9A02D2EA756:7A8461F5A6D5EA12]:0)
	at org.junit.Assert.fail(Assert.java:93)
	at org.junit.Assert.assertTrue(Assert.java:43)
	at org.apache.solr.cloud.CollectionTooManyReplicasTest.testDownedShards(CollectionTooManyReplicasTest.java:256)
	at sun.reflect.NativeMethodAccessorImpl.invoke0(Native Method)
	at sun.reflect.NativeMethodAccessorImpl.invoke(NativeMethodAccessorImpl.java:62)
	at sun.reflect.DelegatingMethodAccessorImpl.invoke(DelegatingMethodAccessorImpl.java:43)
	at java.lang.reflect.Method.invoke(Method.java:498)
	at com.carrotsearch.randomizedtesting.RandomizedRunner.invoke(RandomizedRunner.java:1764)
	at com.carrotsearch.randomizedtesting.RandomizedRunner$8.evaluate(RandomizedRunner.java:871)
	at com.carrotsearch.randomizedtesting.RandomizedRunner$9.evaluate(RandomizedRunner.java:907)
	at com.carrotsearch.randomizedtesting.RandomizedRunner$10.evaluate(RandomizedRunner.java:921)
	at org.apache.solr.BaseDistributedSearchTestCase$ShardsRepeatRule$ShardsFixedStatement.callStatement(BaseDistributedSearchTestCase.java:996)
	at org.apache.solr.BaseDistributedSearchTestCase$ShardsRepeatRule$ShardsStatement.evaluate(BaseDistributedSearchTestCase.java:971)
	at com.carrotsearch.randomizedtesting.rules.SystemPropertiesRestoreRule$1.evaluate(SystemPropertiesRestoreRule.java:57)
	at org.apache.lucene.util.TestRuleSetupTeardownChained$1.evaluate(TestRuleSetupTeardownChained.java:49)
	at org.apache.lucene.util.AbstractBeforeAfterRule$1.evaluate(AbstractBeforeAfterRule.java:45)
	at org.apache.lucene.util.TestRuleThreadAndTestName$1.evaluate(TestRuleThreadAndTestName.java:48)
	at org.apache.lucene.util.TestRuleIgnoreAfterMaxFailures$1.evaluate(TestRuleIgnoreAfterMaxFailures.java:64)
	at org.apache.lucene.util.TestRuleMarkFailure$1.evaluate(TestRuleMarkFailure.java:47)
	at com.carrotsearch.randomizedtesting.rules.StatementAdapter.evaluate(StatementAdapter.java:36)
	at com.carrotsearch.randomizedtesting.ThreadLeakControl$StatementRunner.run(ThreadLeakControl.java:367)
	at com.carrotsearch.randomizedtesting.ThreadLeakControl.forkTimeoutingTask(ThreadLeakControl.java:809)
	at com.carrotsearch.randomizedtesting.ThreadLeakControl$3.evaluate(ThreadLeakControl.java:460)
	at com.carrotsearch.randomizedtesting.RandomizedRunner.runSingleTest(RandomizedRunner.java:880)
	at com.carrotsearch.randomizedtesting.RandomizedRunner$5.evaluate(RandomizedRunner.java:781)
	at com.carrotsearch.randomizedtesting.RandomizedRunner$6.evaluate(RandomizedRunner.java:816)
	at com.carrotsearch.randomizedtesting.RandomizedRunner$7.evaluate(RandomizedRunner.java:827)
	at com.carrotsearch.randomizedtesting.rules.StatementAdapter.evaluate(StatementAdapter.java:36)
	at com.carrotsearch.randomizedtesting.rules.SystemPropertiesRestoreRule$1.evaluate(SystemPropertiesRestoreRule.java:57)
	at org.apache.lucene.util.AbstractBeforeAfterRule$1.evaluate(AbstractBeforeAfterRule.java:45)
	at com.carrotsearch.randomizedtesting.rules.StatementAdapter.evaluate(StatementAdapter.java:36)
	at org.apache.lucene.util.TestRuleStoreClassName$1.evaluate(TestRuleStoreClassName.java:41)
	at com.carrotsearch.randomizedtesting.rules.NoShadowingOrOverridesOnMethodsRule$1.evaluate(NoShadowingOrOverridesOnMethodsRule.java:40)
	at com.carrotsearch.randomizedtesting.rules.NoShadowingOrOverridesOnMethodsRule$1.evaluate(NoShadowingOrOverridesOnMethodsRule.java:40)
	at com.carrotsearch.randomizedtesting.rules.StatementAdapter.evaluate(StatementAdapter.java:36)
	at com.carrotsearch.randomizedtesting.rules.StatementAdapter.evaluate(StatementAdapter.java:36)
	at com.carrotsearch.randomizedtesting.rules.StatementAdapter.evaluate(StatementAdapter.java:36)
	at org.apache.lucene.util.TestRuleAssertionsRequired$1.evaluate(TestRuleAssertionsRequired.java:53)
	at org.apache.lucene.util.TestRuleMarkFailure$1.evaluate(TestRuleMarkFailure.java:47)
	at org.apache.lucene.util.TestRuleIgnoreAfterMaxFailures$1.evaluate(TestRuleIgnoreAfterMaxFailures.java:64)
	at org.apache.lucene.util.TestRuleIgnoreTestSuites$1.evaluate(TestRuleIgnoreTestSuites.java:54)
	at com.carrotsearch.randomizedtesting.rules.StatementAdapter.evaluate(StatementAdapter.java:36)
	at com.carrotsearch.randomizedtesting.ThreadLeakControl$StatementRunner.run(ThreadLeakControl.java:367)
	at java.lang.Thread.run(Thread.java:745)




Build Log:
[...truncated 10656 lines...]
   [junit4] Suite: org.apache.solr.cloud.CollectionTooManyReplicasTest
   [junit4]   2> Creating dataDir: /home/jenkins/workspace/Lucene-Solr-master-Linux/solr/build/solr-core/test/J0/temp/solr.cloud.CollectionTooManyReplicasTest_18ACC9A02D2EA756-001/init-core-data-001
   [junit4]   2> 105729 INFO  (SUITE-CollectionTooManyReplicasTest-seed#[18ACC9A02D2EA756]-worker) [    ] o.a.s.SolrTestCaseJ4 Randomized ssl (false) and clientAuth (false)
   [junit4]   2> 105729 INFO  (SUITE-CollectionTooManyReplicasTest-seed#[18ACC9A02D2EA756]-worker) [    ] o.a.s.BaseDistributedSearchTestCase Setting hostContext system property: /
   [junit4]   2> 105730 INFO  (TEST-CollectionTooManyReplicasTest.testAddTooManyReplicas-seed#[18ACC9A02D2EA756]) [    ] o.a.s.c.ZkTestServer STARTING ZK TEST SERVER
   [junit4]   2> 105730 INFO  (Thread-438) [    ] o.a.s.c.ZkTestServer client port:0.0.0.0/0.0.0.0:0
   [junit4]   2> 105730 INFO  (Thread-438) [    ] o.a.s.c.ZkTestServer Starting server
   [junit4]   2> 105831 INFO  (TEST-CollectionTooManyReplicasTest.testAddTooManyReplicas-seed#[18ACC9A02D2EA756]) [    ] o.a.s.c.ZkTestServer start zk server on port:51461
   [junit4]   2> 105831 INFO  (TEST-CollectionTooManyReplicasTest.testAddTooManyReplicas-seed#[18ACC9A02D2EA756]) [    ] o.a.s.c.c.SolrZkClient Using default ZkCredentialsProvider
   [junit4]   2> 105831 INFO  (TEST-CollectionTooManyReplicasTest.testAddTooManyReplicas-seed#[18ACC9A02D2EA756]) [    ] o.a.s.c.c.ConnectionManager Waiting for client to connect to ZooKeeper
   [junit4]   2> 105834 INFO  (zkCallback-162-thread-1) [    ] o.a.s.c.c.ConnectionManager Watcher org.apache.solr.common.cloud.ConnectionManager@2cc3ffb4 name:ZooKeeperConnection Watcher:127.0.0.1:51461 got event WatchedEvent state:SyncConnected type:None path:null path:null type:None
   [junit4]   2> 105834 INFO  (TEST-CollectionTooManyReplicasTest.testAddTooManyReplicas-seed#[18ACC9A02D2EA756]) [    ] o.a.s.c.c.ConnectionManager Client is connected to ZooKeeper
   [junit4]   2> 105834 INFO  (TEST-CollectionTooManyReplicasTest.testAddTooManyReplicas-seed#[18ACC9A02D2EA756]) [    ] o.a.s.c.c.SolrZkClient Using default ZkACLProvider
   [junit4]   2> 105834 INFO  (TEST-CollectionTooManyReplicasTest.testAddTooManyReplicas-seed#[18ACC9A02D2EA756]) [    ] o.a.s.c.c.SolrZkClient makePath: /solr
   [junit4]   2> 105836 INFO  (TEST-CollectionTooManyReplicasTest.testAddTooManyReplicas-seed#[18ACC9A02D2EA756]) [    ] o.a.s.c.c.SolrZkClient Using default ZkCredentialsProvider
   [junit4]   2> 105836 INFO  (TEST-CollectionTooManyReplicasTest.testAddTooManyReplicas-seed#[18ACC9A02D2EA756]) [    ] o.a.s.c.c.ConnectionManager Waiting for client to connect to ZooKeeper
   [junit4]   2> 105837 INFO  (zkCallback-163-thread-1) [    ] o.a.s.c.c.ConnectionManager Watcher org.apache.solr.common.cloud.ConnectionManager@443a5ef name:ZooKeeperConnection Watcher:127.0.0.1:51461/solr got event WatchedEvent state:SyncConnected type:None path:null path:null type:None
   [junit4]   2> 105837 INFO  (TEST-CollectionTooManyReplicasTest.testAddTooManyReplicas-seed#[18ACC9A02D2EA756]) [    ] o.a.s.c.c.ConnectionManager Client is connected to ZooKeeper
   [junit4]   2> 105838 INFO  (TEST-CollectionTooManyReplicasTest.testAddTooManyReplicas-seed#[18ACC9A02D2EA756]) [    ] o.a.s.c.c.SolrZkClient Using default ZkACLProvider
   [junit4]   2> 105838 INFO  (TEST-CollectionTooManyReplicasTest.testAddTooManyReplicas-seed#[18ACC9A02D2EA756]) [    ] o.a.s.c.c.SolrZkClient makePath: /collections/collection1
   [junit4]   2> 105839 INFO  (TEST-CollectionTooManyReplicasTest.testAddTooManyReplicas-seed#[18ACC9A02D2EA756]) [    ] o.a.s.c.c.SolrZkClient makePath: /collections/collection1/shards
   [junit4]   2> 105839 INFO  (TEST-CollectionTooManyReplicasTest.testAddTooManyReplicas-seed#[18ACC9A02D2EA756]) [    ] o.a.s.c.c.SolrZkClient makePath: /collections/control_collection
   [junit4]   2> 105840 INFO  (TEST-CollectionTooManyReplicasTest.testAddTooManyReplicas-seed#[18ACC9A02D2EA756]) [    ] o.a.s.c.c.SolrZkClient makePath: /collections/control_collection/shards
   [junit4]   2> 105840 INFO  (TEST-CollectionTooManyReplicasTest.testAddTooManyReplicas-seed#[18ACC9A02D2EA756]) [    ] o.a.s.c.AbstractZkTestCase put /home/jenkins/workspace/Lucene-Solr-master-Linux/solr/core/src/test-files/solr/collection1/conf/solrconfig-tlog.xml to /configs/conf1/solrconfig.xml
   [junit4]   2> 105840 INFO  (TEST-CollectionTooManyReplicasTest.testAddTooManyReplicas-seed#[18ACC9A02D2EA756]) [    ] o.a.s.c.c.SolrZkClient makePath: /configs/conf1/solrconfig.xml
   [junit4]   2> 105842 INFO  (TEST-CollectionTooManyReplicasTest.testAddTooManyReplicas-seed#[18ACC9A02D2EA756]) [    ] o.a.s.c.AbstractZkTestCase put /home/jenkins/workspace/Lucene-Solr-master-Linux/solr/core/src/test-files/solr/collection1/conf/schema.xml to /configs/conf1/schema.xml
   [junit4]   2> 105842 INFO  (TEST-CollectionTooManyReplicasTest.testAddTooManyReplicas-seed#[18ACC9A02D2EA756]) [    ] o.a.s.c.c.SolrZkClient makePath: /configs/conf1/schema.xml
   [junit4]   2> 105843 INFO  (TEST-CollectionTooManyReplicasTest.testAddTooManyReplicas-seed#[18ACC9A02D2EA756]) [    ] o.a.s.c.AbstractZkTestCase put /home/jenkins/workspace/Lucene-Solr-master-Linux/solr/core/src/test-files/solr/collection1/conf/solrconfig.snippet.randomindexconfig.xml to /configs/conf1/solrconfig.snippet.randomindexconfig.xml
   [junit4]   2> 105844 INFO  (TEST-CollectionTooManyReplicasTest.testAddTooManyReplicas-seed#[18ACC9A02D2EA756]) [    ] o.a.s.c.c.SolrZkClient makePath: /configs/conf1/solrconfig.snippet.randomindexconfig.xml
   [junit4]   2> 105844 INFO  (TEST-CollectionTooManyReplicasTest.testAddTooManyReplicas-seed#[18ACC9A02D2EA756]) [    ] o.a.s.c.AbstractZkTestCase put /home/jenkins/workspace/Lucene-Solr-master-Linux/solr/core/src/test-files/solr/collection1/conf/stopwords.txt to /configs/conf1/stopwords.txt
   [junit4]   2> 105844 INFO  (TEST-CollectionTooManyReplicasTest.testAddTooManyReplicas-seed#[18ACC9A02D2EA756]) [    ] o.a.s.c.c.SolrZkClient makePath: /configs/conf1/stopwords.txt
   [junit4]   2> 105845 INFO  (TEST-CollectionTooManyReplicasTest.testAddTooManyReplicas-seed#[18ACC9A02D2EA756]) [    ] o.a.s.c.AbstractZkTestCase put /home/jenkins/workspace/Lucene-Solr-master-Linux/solr/core/src/test-files/solr/collection1/conf/protwords.txt to /configs/conf1/protwords.txt
   [junit4]   2> 105846 INFO  (TEST-CollectionTooManyReplicasTest.testAddTooManyReplicas-seed#[18ACC9A02D2EA756]) [    ] o.a.s.c.c.SolrZkClient makePath: /configs/conf1/protwords.txt
   [junit4]   2> 105846 INFO  (TEST-CollectionTooManyReplicasTest.testAddTooManyReplicas-seed#[18ACC9A02D2EA756]) [    ] o.a.s.c.AbstractZkTestCase put /home/jenkins/workspace/Lucene-Solr-master-Linux/solr/core/src/test-files/solr/collection1/conf/currency.xml to /configs/conf1/currency.xml
   [junit4]   2> 105846 INFO  (TEST-CollectionTooManyReplicasTest.testAddTooManyReplicas-seed#[18ACC9A02D2EA756]) [    ] o.a.s.c.c.SolrZkClient makePath: /configs/conf1/currency.xml
   [junit4]   2> 105847 INFO  (TEST-CollectionTooManyReplicasTest.testAddTooManyReplicas-seed#[18ACC9A02D2EA756]) [    ] o.a.s.c.AbstractZkTestCase put /home/jenkins/workspace/Lucene-Solr-master-Linux/solr/core/src/test-files/solr/collection1/conf/enumsConfig.xml to /configs/conf1/enumsConfig.xml
   [junit4]   2> 105847 INFO  (TEST-CollectionTooManyReplicasTest.testAddTooManyReplicas-seed#[18ACC9A02D2EA756]) [    ] o.a.s.c.c.SolrZkClient makePath: /configs/conf1/enumsConfig.xml
   [junit4]   2> 105848 INFO  (TEST-CollectionTooManyReplicasTest.testAddTooManyReplicas-seed#[18ACC9A02D2EA756]) [    ] o.a.s.c.AbstractZkTestCase put /home/jenkins/workspace/Lucene-Solr-master-Linux/solr/core/src/test-files/solr/collection1/conf/open-exchange-rates.json to /configs/conf1/open-exchange-rates.json
   [junit4]   2> 105848 INFO  (TEST-CollectionTooManyReplicasTest.testAddTooManyReplicas-seed#[18ACC9A02D2EA756]) [    ] o.a.s.c.c.SolrZkClient makePath: /configs/conf1/open-exchange-rates.json
   [junit4]   2> 105849 INFO  (TEST-CollectionTooManyReplicasTest.testAddTooManyReplicas-seed#[18ACC9A02D2EA756]) [    ] o.a.s.c.AbstractZkTestCase put /home/jenkins/workspace/Lucene-Solr-master-Linux/solr/core/src/test-files/solr/collection1/conf/mapping-ISOLatin1Accent.txt to /configs/conf1/mapping-ISOLatin1Accent.txt
   [junit4]   2> 105849 INFO  (TEST-CollectionTooManyReplicasTest.testAddTooManyReplicas-seed#[18ACC9A02D2EA756]) [    ] o.a.s.c.c.SolrZkClient makePath: /configs/conf1/mapping-ISOLatin1Accent.txt
   [junit4]   2> 105849 INFO  (TEST-CollectionTooManyReplicasTest.testAddTooManyReplicas-seed#[18ACC9A02D2EA756]) [    ] o.a.s.c.AbstractZkTestCase put /home/jenkins/workspace/Lucene-Solr-master-Linux/solr/core/src/test-files/solr/collection1/conf/old_synonyms.txt to /configs/conf1/old_synonyms.txt
   [junit4]   2> 105850 INFO  (TEST-CollectionTooManyReplicasTest.testAddTooManyReplicas-seed#[18ACC9A02D2EA756]) [    ] o.a.s.c.c.SolrZkClient makePath: /configs/conf1/old_synonyms.txt
   [junit4]   2> 105850 INFO  (TEST-CollectionTooManyReplicasTest.testAddTooManyReplicas-seed#[18ACC9A02D2EA756]) [    ] o.a.s.c.AbstractZkTestCase put /home/jenkins/workspace/Lucene-Solr-master-Linux/solr/core/src/test-files/solr/collection1/conf/synonyms.txt to /configs/conf1/synonyms.txt
   [junit4]   2> 105850 INFO  (TEST-CollectionTooManyReplicasTest.testAddTooManyReplicas-seed#[18ACC9A02D2EA756]) [    ] o.a.s.c.c.SolrZkClient makePath: /configs/conf1/synonyms.txt
   [junit4]   2> 105900 INFO  (TEST-CollectionTooManyReplicasTest.testAddTooManyReplicas-seed#[18ACC9A02D2EA756]) [    ] o.a.s.SolrTestCaseJ4 Writing core.properties file to /home/jenkins/workspace/Lucene-Solr-master-Linux/solr/build/solr-core/test/J0/temp/solr.cloud.CollectionTooManyReplicasTest_18ACC9A02D2EA756-001/control-001/cores/collection1
   [junit4]   2> 105902 INFO  (TEST-CollectionTooManyReplicasTest.testAddTooManyReplicas-seed#[18ACC9A02D2EA756]) [    ] o.e.j.s.Server jetty-9.3.6.v20151106
   [junit4]   2> 105902 INFO  (TEST-CollectionTooManyReplicasTest.testAddTooManyReplicas-seed#[18ACC9A02D2EA756]) [    ] o.e.j.s.h.ContextHandler Started o.e.j.s.ServletContextHandler@3cb404a{/,null,AVAILABLE}
   [junit4]   2> 105904 INFO  (TEST-CollectionTooManyReplicasTest.testAddTooManyReplicas-seed#[18ACC9A02D2EA756]) [    ] o.e.j.s.ServerConnector Started ServerConnector@1644383b{HTTP/1.1,[http/1.1]}{127.0.0.1:52106}
   [junit4]   2> 105904 INFO  (TEST-CollectionTooManyReplicasTest.testAddTooManyReplicas-seed#[18ACC9A02D2EA756]) [    ] o.e.j.s.Server Started @107351ms
   [junit4]   2> 105904 INFO  (TEST-CollectionTooManyReplicasTest.testAddTooManyReplicas-seed#[18ACC9A02D2EA756]) [    ] o.a.s.c.s.e.JettySolrRunner Jetty properties: {solr.data.dir=/home/jenkins/workspace/Lucene-Solr-master-Linux/solr/build/solr-core/test/J0/temp/solr.cloud.CollectionTooManyReplicasTest_18ACC9A02D2EA756-001/tempDir-001/control/data, hostContext=/, hostPort=52106, coreRootDirectory=/home/jenkins/workspace/Lucene-Solr-master-Linux/solr/build/solr-core/test/J0/temp/solr.cloud.CollectionTooManyReplicasTest_18ACC9A02D2EA756-001/control-001/cores}
   [junit4]   2> 105904 INFO  (TEST-CollectionTooManyReplicasTest.testAddTooManyReplicas-seed#[18ACC9A02D2EA756]) [    ] o.a.s.s.SolrDispatchFilter SolrDispatchFilter.init(): sun.misc.Launcher$AppClassLoader@73d16e93
   [junit4]   2> 105904 INFO  (TEST-CollectionTooManyReplicasTest.testAddTooManyReplicas-seed#[18ACC9A02D2EA756]) [    ] o.a.s.c.SolrResourceLoader new SolrResourceLoader for directory: '/home/jenkins/workspace/Lucene-Solr-master-Linux/solr/build/solr-core/test/J0/temp/solr.cloud.CollectionTooManyReplicasTest_18ACC9A02D2EA756-001/control-001'
   [junit4]   2> 105905 INFO  (TEST-CollectionTooManyReplicasTest.testAddTooManyReplicas-seed#[18ACC9A02D2EA756]) [    ] o.a.s.c.SolrResourceLoader JNDI not configured for solr (NoInitialContextEx)
   [junit4]   2> 105905 INFO  (TEST-CollectionTooManyReplicasTest.testAddTooManyReplicas-seed#[18ACC9A02D2EA756]) [    ] o.a.s.c.SolrResourceLoader solr home defaulted to 'solr/' (could not find system property or JNDI)
   [junit4]   2> 105905 INFO  (TEST-CollectionTooManyReplicasTest.testAddTooManyReplicas-seed#[18ACC9A02D2EA756]) [    ] o.a.s.c.c.SolrZkClient Using default ZkCredentialsProvider
   [junit4]   2> 105905 INFO  (TEST-CollectionTooManyReplicasTest.testAddTooManyReplicas-seed#[18ACC9A02D2EA756]) [    ] o.a.s.c.c.ConnectionManager Waiting for client to connect to ZooKeeper
   [junit4]   2> 105906 INFO  (zkCallback-164-thread-1) [    ] o.a.s.c.c.ConnectionManager Watcher org.apache.solr.common.cloud.ConnectionManager@1dca27c2 name:ZooKeeperConnection Watcher:127.0.0.1:51461/solr got event WatchedEvent state:SyncConnected type:None path:null path:null type:None
   [junit4]   2> 105906 INFO  (TEST-CollectionTooManyReplicasTest.testAddTooManyReplicas-seed#[18ACC9A02D2EA756]) [    ] o.a.s.c.c.ConnectionManager Client is connected to ZooKeeper
   [junit4]   2> 105906 INFO  (TEST-CollectionTooManyReplicasTest.testAddTooManyReplicas-seed#[18ACC9A02D2EA756]) [    ] o.a.s.c.c.SolrZkClient Using default ZkACLProvider
   [junit4]   2> 105907 INFO  (TEST-CollectionTooManyReplicasTest.testAddTooManyReplicas-seed#[18ACC9A02D2EA756]) [    ] o.a.s.s.SolrDispatchFilter Loading solr.xml from SolrHome (not found in ZooKeeper)
   [junit4]   2> 105907 INFO  (TEST-CollectionTooManyReplicasTest.testAddTooManyReplicas-seed#[18ACC9A02D2EA756]) [    ] o.a.s.c.SolrXmlConfig Loading container configuration from /home/jenkins/workspace/Lucene-Solr-master-Linux/solr/build/solr-core/test/J0/temp/solr.cloud.CollectionTooManyReplicasTest_18ACC9A02D2EA756-001/control-001/solr.xml
   [junit4]   2> 105911 INFO  (TEST-CollectionTooManyReplicasTest.testAddTooManyReplicas-seed#[18ACC9A02D2EA756]) [    ] o.a.s.c.CorePropertiesLocator Config-defined core root directory: /home/jenkins/workspace/Lucene-Solr-master-Linux/solr/build/solr-core/test/J0/temp/solr.cloud.CollectionTooManyReplicasTest_18ACC9A02D2EA756-001/control-001/cores
   [junit4]   2> 105911 INFO  (TEST-CollectionTooManyReplicasTest.testAddTooManyReplicas-seed#[18ACC9A02D2EA756]) [    ] o.a.s.c.CoreContainer New CoreContainer 517562995
   [junit4]   2> 105911 INFO  (TEST-CollectionTooManyReplicasTest.testAddTooManyReplicas-seed#[18ACC9A02D2EA756]) [    ] o.a.s.c.CoreContainer Loading cores into CoreContainer [instanceDir=/home/jenkins/workspace/Lucene-Solr-master-Linux/solr/build/solr-core/test/J0/temp/solr.cloud.CollectionTooManyReplicasTest_18ACC9A02D2EA756-001/control-001]
   [junit4]   2> 105911 WARN  (TEST-CollectionTooManyReplicasTest.testAddTooManyReplicas-seed#[18ACC9A02D2EA756]) [    ] o.a.s.c.CoreContainer Couldn't add files from /home/jenkins/workspace/Lucene-Solr-master-Linux/solr/build/solr-core/test/J0/temp/solr.cloud.CollectionTooManyReplicasTest_18ACC9A02D2EA756-001/control-001/lib to classpath: /home/jenkins/workspace/Lucene-Solr-master-Linux/solr/build/solr-core/test/J0/temp/solr.cloud.CollectionTooManyReplicasTest_18ACC9A02D2EA756-001/control-001/lib
   [junit4]   2> 105911 INFO  (TEST-CollectionTooManyReplicasTest.testAddTooManyReplicas-seed#[18ACC9A02D2EA756]) [    ] o.a.s.h.c.HttpShardHandlerFactory created with socketTimeout : 90000,urlScheme : ,connTimeout : 15000,maxConnectionsPerHost : 20,maxConnections : 10000,corePoolSize : 0,maximumPoolSize : 2147483647,maxThreadIdleTime : 5,sizeOfQueue : -1,fairnessPolicy : false,useRetries : false,
   [junit4]   2> 105912 INFO  (TEST-CollectionTooManyReplicasTest.testAddTooManyReplicas-seed#[18ACC9A02D2EA756]) [    ] o.a.s.u.UpdateShardHandler Creating UpdateShardHandler HTTP client with params: socketTimeout=340000&connTimeout=45000&retry=true
   [junit4]   2> 105912 INFO  (TEST-CollectionTooManyReplicasTest.testAddTooManyReplicas-seed#[18ACC9A02D2EA756]) [    ] o.a.s.l.LogWatcher SLF4J impl is org.slf4j.impl.Log4jLoggerFactory
   [junit4]   2> 105912 INFO  (TEST-CollectionTooManyReplicasTest.testAddTooManyReplicas-seed#[18ACC9A02D2EA756]) [    ] o.a.s.l.LogWatcher Registering Log Listener [Log4j (org.slf4j.impl.Log4jLoggerFactory)]
   [junit4]   2> 105913 INFO  (TEST-CollectionTooManyReplicasTest.testAddTooManyReplicas-seed#[18ACC9A02D2EA756]) [    ] o.a.s.c.ZkContainer Zookeeper client=127.0.0.1:51461/solr
   [junit4]   2> 105913 INFO  (TEST-CollectionTooManyReplicasTest.testAddTooManyReplicas-seed#[18ACC9A02D2EA756]) [    ] o.a.s.c.ZkController zkHost includes chroot
   [junit4]   2> 105913 INFO  (TEST-CollectionTooManyReplicasTest.testAddTooManyReplicas-seed#[18ACC9A02D2EA756]) [    ] o.a.s.c.c.SolrZkClient Using default ZkCredentialsProvider
   [junit4]   2> 105913 INFO  (TEST-CollectionTooManyReplicasTest.testAddTooManyReplicas-seed#[18ACC9A02D2EA756]) [    ] o.a.s.c.c.ConnectionManager Waiting for client to connect to ZooKeeper
   [junit4]   2> 105914 INFO  (zkCallback-167-thread-1) [    ] o.a.s.c.c.ConnectionManager Watcher org.apache.solr.common.cloud.ConnectionManager@ba8c4a7 name:ZooKeeperConnection Watcher:127.0.0.1:51461 got event WatchedEvent state:SyncConnected type:None path:null path:null type:None
   [junit4]   2> 105914 INFO  (TEST-CollectionTooManyReplicasTest.testAddTooManyReplicas-seed#[18ACC9A02D2EA756]) [    ] o.a.s.c.c.ConnectionManager Client is connected to ZooKeeper
   [junit4]   2> 105915 INFO  (TEST-CollectionTooManyReplicasTest.testAddTooManyReplicas-seed#[18ACC9A02D2EA756]) [    ] o.a.s.c.c.SolrZkClient Using default ZkACLProvider
   [junit4]   2> 105915 INFO  (TEST-CollectionTooManyReplicasTest.testAddTooManyReplicas-seed#[18ACC9A02D2EA756]) [n:127.0.0.1:52106_    ] o.a.s.c.c.ConnectionManager Waiting for client to connect to ZooKeeper
   [junit4]   2> 105916 INFO  (zkCallback-168-thread-1-processing-n:127.0.0.1:52106_) [n:127.0.0.1:52106_    ] o.a.s.c.c.ConnectionManager Watcher org.apache.solr.common.cloud.ConnectionManager@1e9e0268 name:ZooKeeperConnection Watcher:127.0.0.1:51461/solr got event WatchedEvent state:SyncConnected type:None path:null path:null type:None
   [junit4]   2> 105916 INFO  (TEST-CollectionTooManyReplicasTest.testAddTooManyReplicas-seed#[18ACC9A02D2EA756]) [n:127.0.0.1:52106_    ] o.a.s.c.c.ConnectionManager Client is connected to ZooKeeper
   [junit4]   2> 105917 INFO  (TEST-CollectionTooManyReplicasTest.testAddTooManyReplicas-seed#[18ACC9A02D2EA756]) [n:127.0.0.1:52106_    ] o.a.s.c.c.SolrZkClient makePath: /overseer/queue
   [junit4]   2> 105918 INFO  (TEST-CollectionTooManyReplicasTest.testAddTooManyReplicas-seed#[18ACC9A02D2EA756]) [n:127.0.0.1:52106_    ] o.a.s.c.c.SolrZkClient makePath: /overseer/collection-queue-work
   [junit4]   2> 105919 INFO  (TEST-CollectionTooManyReplicasTest.testAddTooManyReplicas-seed#[18ACC9A02D2EA756]) [n:127.0.0.1:52106_    ] o.a.s.c.c.SolrZkClient makePath: /overseer/collection-map-running
   [junit4]   2> 105920 INFO  (TEST-CollectionTooManyReplicasTest.testAddTooManyReplicas-seed#[18ACC9A02D2EA756]) [n:127.0.0.1:52106_    ] o.a.s.c.c.SolrZkClient makePath: /overseer/collection-map-completed
   [junit4]   2> 105921 INFO  (TEST-CollectionTooManyReplicasTest.testAddTooManyReplicas-seed#[18ACC9A02D2EA756]) [n:127.0.0.1:52106_    ] o.a.s.c.c.SolrZkClient makePath: /overseer/collection-map-failure
   [junit4]   2> 105922 INFO  (TEST-CollectionTooManyReplicasTest.testAddTooManyReplicas-seed#[18ACC9A02D2EA756]) [n:127.0.0.1:52106_    ] o.a.s.c.c.SolrZkClient makePath: /live_nodes
   [junit4]   2> 105922 INFO  (TEST-CollectionTooManyReplicasTest.testAddTooManyReplicas-seed#[18ACC9A02D2EA756]) [n:127.0.0.1:52106_    ] o.a.s.c.c.SolrZkClient makePath: /aliases.json
   [junit4]   2> 105923 INFO  (TEST-CollectionTooManyReplicasTest.testAddTooManyReplicas-seed#[18ACC9A02D2EA756]) [n:127.0.0.1:52106_    ] o.a.s.c.c.SolrZkClient makePath: /clusterstate.json
   [junit4]   2> 105923 INFO  (TEST-CollectionTooManyReplicasTest.testAddTooManyReplicas-seed#[18ACC9A02D2EA756]) [n:127.0.0.1:52106_    ] o.a.s.c.c.SolrZkClient makePath: /security.json
   [junit4]   2> 105924 INFO  (TEST-CollectionTooManyReplicasTest.testAddTooManyReplicas-seed#[18ACC9A02D2EA756]) [n:127.0.0.1:52106_    ] o.a.s.c.c.ZkStateReader Updating cluster state from ZooKeeper... 
   [junit4]   2> 105924 INFO  (TEST-CollectionTooManyReplicasTest.testAddTooManyReplicas-seed#[18ACC9A02D2EA756]) [n:127.0.0.1:52106_    ] o.a.s.c.c.ZkStateReader Updated live nodes from ZooKeeper... (0) -> (0)
   [junit4]   2> 105925 INFO  (TEST-CollectionTooManyReplicasTest.testAddTooManyReplicas-seed#[18ACC9A02D2EA756]) [n:127.0.0.1:52106_    ] o.a.s.c.c.SolrZkClient makePath: /overseer_elect
   [junit4]   2> 105926 INFO  (TEST-CollectionTooManyReplicasTest.testAddTooManyReplicas-seed#[18ACC9A02D2EA756]) [n:127.0.0.1:52106_    ] o.a.s.c.c.SolrZkClient makePath: /overseer_elect/election
   [junit4]   2> 105927 INFO  (TEST-CollectionTooManyReplicasTest.testAddTooManyReplicas-seed#[18ACC9A02D2EA756]) [n:127.0.0.1:52106_    ] o.a.s.c.Overseer Overseer (id=null) closing
   [junit4]   2> 105927 INFO  (TEST-CollectionTooManyReplicasTest.testAddTooManyReplicas-seed#[18ACC9A02D2EA756]) [n:127.0.0.1:52106_    ] o.a.s.c.LeaderElector Joined leadership election with path: /overseer_elect/election/95493804848381956-127.0.0.1:52106_-n_0000000000
   [junit4]   2> 105927 INFO  (TEST-CollectionTooManyReplicasTest.testAddTooManyReplicas-seed#[18ACC9A02D2EA756]) [n:127.0.0.1:52106_    ] o.a.s.c.OverseerElectionContext I am going to be the leader 127.0.0.1:52106_
   [junit4]   2> 105927 INFO  (TEST-CollectionTooManyReplicasTest.testAddTooManyReplicas-seed#[18ACC9A02D2EA756]) [n:127.0.0.1:52106_    ] o.a.s.c.c.SolrZkClient makePath: /overseer_elect/leader
   [junit4]   2> 105928 INFO  (TEST-CollectionTooManyReplicasTest.testAddTooManyReplicas-seed#[18ACC9A02D2EA756]) [n:127.0.0.1:52106_    ] o.a.s.c.Overseer Overseer (id=95493804848381956-127.0.0.1:52106_-n_0000000000) starting
   [junit4]   2> 105928 INFO  (TEST-CollectionTooManyReplicasTest.testAddTooManyReplicas-seed#[18ACC9A02D2EA756]) [n:127.0.0.1:52106_    ] o.a.s.c.c.SolrZkClient makePath: /overseer/queue-work
   [junit4]   2> 105931 INFO  (TEST-CollectionTooManyReplicasTest.testAddTooManyReplicas-seed#[18ACC9A02D2EA756]) [n:127.0.0.1:52106_    ] o.a.s.c.OverseerAutoReplicaFailoverThread Starting OverseerAutoReplicaFailoverThread autoReplicaFailoverWorkLoopDelay=10000 autoReplicaFailoverWaitAfterExpiration=30000 autoReplicaFailoverBadNodeExpiration=60000
   [junit4]   2> 105931 INFO  (OverseerCollectionConfigSetProcessor-95493804848381956-127.0.0.1:52106_-n_0000000000) [n:127.0.0.1:52106_    ] o.a.s.c.OverseerTaskProcessor Process current queue of overseer operations
   [junit4]   2> 105932 INFO  (TEST-CollectionTooManyReplicasTest.testAddTooManyReplicas-seed#[18ACC9A02D2EA756]) [n:127.0.0.1:52106_    ] o.a.s.c.ZkController Register node as live in ZooKeeper:/live_nodes/127.0.0.1:52106_
   [junit4]   2> 105932 INFO  (OverseerStateUpdate-95493804848381956-127.0.0.1:52106_-n_0000000000) [n:127.0.0.1:52106_    ] o.a.s.c.Overseer Starting to work on the main queue
   [junit4]   2> 105932 INFO  (TEST-CollectionTooManyReplicasTest.testAddTooManyReplicas-seed#[18ACC9A02D2EA756]) [n:127.0.0.1:52106_    ] o.a.s.c.c.SolrZkClient makePath: /live_nodes/127.0.0.1:52106_
   [junit4]   2> 105933 INFO  (OverseerStateUpdate-95493804848381956-127.0.0.1:52106_-n_0000000000) [n:127.0.0.1:52106_    ] o.a.s.c.c.ZkStateReader Updated live nodes from ZooKeeper... (0) -> (0)
   [junit4]   2> 105933 INFO  (zkCallback-168-thread-1-processing-n:127.0.0.1:52106_) [n:127.0.0.1:52106_    ] o.a.s.c.c.ZkStateReader A live node change: [WatchedEvent state:SyncConnected type:NodeChildrenChanged path:/live_nodes], has occurred - updating... (live nodes size: [0])
   [junit4]   2> 105933 INFO  (zkCallback-168-thread-1-processing-n:127.0.0.1:52106_) [n:127.0.0.1:52106_    ] o.a.s.c.c.ZkStateReader Updated live nodes from ZooKeeper... (0) -> (1)
   [junit4]   2> 105941 INFO  (TEST-CollectionTooManyReplicasTest.testAddTooManyReplicas-seed#[18ACC9A02D2EA756]) [n:127.0.0.1:52106_    ] o.a.s.c.CoreContainer Security conf doesn't exist. Skipping setup for authorization module.
   [junit4]   2> 105941 INFO  (TEST-CollectionTooManyReplicasTest.testAddTooManyReplicas-seed#[18ACC9A02D2EA756]) [n:127.0.0.1:52106_    ] o.a.s.c.CoreContainer No authentication plugin used.
   [junit4]   2> 105942 INFO  (TEST-CollectionTooManyReplicasTest.testAddTooManyReplicas-seed#[18ACC9A02D2EA756]) [n:127.0.0.1:52106_    ] o.a.s.c.CorePropertiesLocator Looking for core definitions underneath /home/jenkins/workspace/Lucene-Solr-master-Linux/solr/build/solr-core/test/J0/temp/solr.cloud.CollectionTooManyReplicasTest_18ACC9A02D2EA756-001/control-001/cores
   [junit4]   2> 105942 INFO  (TEST-CollectionTooManyReplicasTest.testAddTooManyReplicas-seed#[18ACC9A02D2EA756]) [n:127.0.0.1:52106_    ] o.a.s.c.CoreDescriptor Created CoreDescriptor: {name=collection1, config=solrconfig.xml, transient=false, schema=schema.xml, loadOnStartup=true, configSetProperties=configsetprops.json, collection=control_collection, coreNodeName=, dataDir=data/, shard=}
   [junit4]   2> 105942 INFO  (TEST-CollectionTooManyReplicasTest.testAddTooManyReplicas-seed#[18ACC9A02D2EA756]) [n:127.0.0.1:52106_    ] o.a.s.c.CorePropertiesLocator Found core collection1 in /home/jenkins/workspace/Lucene-Solr-master-Linux/solr/build/solr-core/test/J0/temp/solr.cloud.CollectionTooManyReplicasTest_18ACC9A02D2EA756-001/control-001/cores/collection1
   [junit4]   2> 105942 INFO  (TEST-CollectionTooManyReplicasTest.testAddTooManyReplicas-seed#[18ACC9A02D2EA756]) [n:127.0.0.1:52106_    ] o.a.s.c.CorePropertiesLocator Found 1 core definitions
   [junit4]   2> 105943 INFO  (TEST-CollectionTooManyReplicasTest.testAddTooManyReplicas-seed#[18ACC9A02D2EA756]) [n:127.0.0.1:52106_    ] o.a.s.s.SolrDispatchFilter user.dir=/home/jenkins/workspace/Lucene-Solr-master-Linux/solr/build/solr-core/test/J0
   [junit4]   2> 105943 INFO  (TEST-CollectionTooManyReplicasTest.testAddTooManyReplicas-seed#[18ACC9A02D2EA756]) [n:127.0.0.1:52106_    ] o.a.s.s.SolrDispatchFilter SolrDispatchFilter.init() done
   [junit4]   2> 105943 INFO  (coreLoadExecutor-622-thread-1-processing-n:127.0.0.1:52106_) [n:127.0.0.1:52106_ c:control_collection   x:collection1] o.a.s.c.ZkController publishing state=down
   [junit4]   2> 105943 INFO  (coreLoadExecutor-622-thread-1-processing-n:127.0.0.1:52106_) [n:127.0.0.1:52106_ c:control_collection   x:collection1] o.a.s.c.ZkController numShards not found on descriptor - reading it from system property
   [junit4]   2> 105944 INFO  (OverseerStateUpdate-95493804848381956-127.0.0.1:52106_-n_0000000000) [n:127.0.0.1:52106_    ] o.a.s.c.Overseer processMessage: queueSize: 1, message = {
   [junit4]   2>   "core":"collection1",
   [junit4]   2>   "roles":null,
   [junit4]   2>   "base_url":"http://127.0.0.1:52106",
   [junit4]   2>   "node_name":"127.0.0.1:52106_",
   [junit4]   2>   "numShards":"1",
   [junit4]   2>   "state":"down",
   [junit4]   2>   "shard":null,
   [junit4]   2>   "collection":"control_collection",
   [junit4]   2>   "operation":"state"} current state version: 0
   [junit4]   2> 105945 INFO  (coreLoadExecutor-622-thread-1-processing-n:127.0.0.1:52106_) [n:127.0.0.1:52106_ c:control_collection   x:collection1] o.a.s.c.ZkController look for our core node name
   [junit4]   2> 105945 INFO  (OverseerStateUpdate-95493804848381956-127.0.0.1:52106_-n_0000000000) [n:127.0.0.1:52106_    ] o.a.s.c.o.ReplicaMutator Update state numShards=1 message={
   [junit4]   2>   "core":"collection1",
   [junit4]   2>   "roles":null,
   [junit4]   2>   "base_url":"http://127.0.0.1:52106",
   [junit4]   2>   "node_name":"127.0.0.1:52106_",
   [junit4]   2>   "numShards":"1",
   [junit4]   2>   "state":"down",
   [junit4]   2>   "shard":null,
   [junit4]   2>   "collection":"control_collection",
   [junit4]   2>   "operation":"state"}
   [junit4]   2> 105945 INFO  (OverseerStateUpdate-95493804848381956-127.0.0.1:52106_-n_0000000000) [n:127.0.0.1:52106_    ] o.a.s.c.o.ClusterStateMutator building a new cName: control_collection
   [junit4]   2> 105946 INFO  (OverseerStateUpdate-95493804848381956-127.0.0.1:52106_-n_0000000000) [n:127.0.0.1:52106_    ] o.a.s.c.o.ReplicaMutator Assigning new node to shard shard=shard1
   [junit4]   2> 105947 INFO  (zkCallback-168-thread-1-processing-n:127.0.0.1:52106_) [n:127.0.0.1:52106_    ] o.a.s.c.c.ZkStateReader A cluster state change: [WatchedEvent state:SyncConnected type:NodeDataChanged path:/clusterstate.json], has occurred - updating... (live nodes size: [1])
   [junit4]   2> 106945 INFO  (coreLoadExecutor-622-thread-1-processing-n:127.0.0.1:52106_) [n:127.0.0.1:52106_ c:control_collection   x:collection1] o.a.s.c.ZkController waiting to find shard id in clusterstate for collection1
   [junit4]   2> 106945 INFO  (coreLoadExecutor-622-thread-1-processing-n:127.0.0.1:52106_) [n:127.0.0.1:52106_ c:control_collection   x:collection1] o.a.s.c.ZkController Check for collection zkNode:control_collection
   [junit4]   2> 106945 INFO  (coreLoadExecutor-622-thread-1-processing-n:127.0.0.1:52106_) [n:127.0.0.1:52106_ c:control_collection   x:collection1] o.a.s.c.ZkController Collection zkNode exists
   [junit4]   2> 106946 INFO  (coreLoadExecutor-622-thread-1-processing-n:127.0.0.1:52106_) [n:127.0.0.1:52106_ c:control_collection   x:collection1] o.a.s.c.c.ZkStateReader Load collection config from: [/collections/control_collection]
   [junit4]   2> 106946 INFO  (coreLoadExecutor-622-thread-1-processing-n:127.0.0.1:52106_) [n:127.0.0.1:52106_ c:control_collection   x:collection1] o.a.s.c.c.ZkStateReader path=[/collections/control_collection] [configName]=[conf1] specified config exists in ZooKeeper
   [junit4]   2> 106946 INFO  (coreLoadExecutor-622-thread-1-processing-n:127.0.0.1:52106_) [n:127.0.0.1:52106_ c:control_collection   x:collection1] o.a.s.c.SolrResourceLoader new SolrResourceLoader for directory: '/home/jenkins/workspace/Lucene-Solr-master-Linux/solr/build/solr-core/test/J0/temp/solr.cloud.CollectionTooManyReplicasTest_18ACC9A02D2EA756-001/control-001/cores/collection1'
   [junit4]   2> 106946 INFO  (coreLoadExecutor-622-thread-1-processing-n:127.0.0.1:52106_) [n:127.0.0.1:52106_ c:control_collection   x:collection1] o.a.s.c.SolrResourceLoader JNDI not configured for solr (NoInitialContextEx)
   [junit4]   2> 106946 INFO  (coreLoadExecutor-622-thread-1-processing-n:127.0.0.1:52106_) [n:127.0.0.1:52106_ c:control_collection   x:collection1] o.a.s.c.SolrResourceLoader solr home defaulted to 'solr/' (could not find system property or JNDI)
   [junit4]   2> 106947 INFO  (coreLoadExecutor-622-thread-1-processing-n:127.0.0.1:52106_) [n:127.0.0.1:52106_ c:control_collection   x:collection1] o.a.s.c.Config loaded config solrconfig.xml with version 0 
   [junit4]   2> 106950 INFO  (coreLoadExecutor-622-thread-1-processing-n:127.0.0.1:52106_) [n:127.0.0.1:52106_ c:control_collection   x:collection1] o.a.s.c.SolrConfig current version of requestparams : -1
   [junit4]   2> 106952 INFO  (coreLoadExecutor-622-thread-1-processing-n:127.0.0.1:52106_) [n:127.0.0.1:52106_ c:control_collection   x:collection1] o.a.s.c.SolrConfig Using Lucene MatchVersion: 7.0.0
   [junit4]   2> 106958 INFO  (coreLoadExecutor-622-thread-1-processing-n:127.0.0.1:52106_) [n:127.0.0.1:52106_ c:control_collection   x:collection1] o.a.s.c.SolrConfig Loaded SolrConfig: solrconfig.xml
   [junit4]   2> 106962 INFO  (coreLoadExecutor-622-thread-1-processing-n:127.0.0.1:52106_) [n:127.0.0.1:52106_ c:control_collection   x:collection1] o.a.s.s.IndexSchema [collection1] Schema name=test
   [junit4]   2> 107024 INFO  (coreLoadExecutor-622-thread-1-processing-n:127.0.0.1:52106_) [n:127.0.0.1:52106_ c:control_collection   x:collection1] o.a.s.s.OpenExchangeRatesOrgProvider Initialized with rates=open-exchange-rates.json, refreshInterval=1440.
   [junit4]   2> 107028 INFO  (coreLoadExecutor-622-thread-1-processing-n:127.0.0.1:52106_) [n:127.0.0.1:52106_ c:control_collection   x:collection1] o.a.s.s.IndexSchema default search field in schema is text
   [junit4]   2> 107029 INFO  (coreLoadExecutor-622-thread-1-processing-n:127.0.0.1:52106_) [n:127.0.0.1:52106_ c:control_collection   x:collection1] o.a.s.s.IndexSchema unique key field: id
   [junit4]   2> 107034 INFO  (coreLoadExecutor-622-thread-1-processing-n:127.0.0.1:52106_) [n:127.0.0.1:52106_ c:control_collection   x:collection1] o.a.s.s.FileExchangeRateProvider Reloading exchange rates from file currency.xml
   [junit4]   2> 107036 INFO  (coreLoadExecutor-622-thread-1-processing-n:127.0.0.1:52106_) [n:127.0.0.1:52106_ c:control_collection   x:collection1] o.a.s.s.FileExchangeRateProvider Reloading exchange rates from file currency.xml
   [junit4]   2> 107037 INFO  (coreLoadExecutor-622-thread-1-processing-n:127.0.0.1:52106_) [n:127.0.0.1:52106_ c:control_collection   x:collection1] o.a.s.s.OpenExchangeRatesOrgProvider Reloading exchange rates from open-exchange-rates.json
   [junit4]   2> 107038 INFO  (coreLoadExecutor-622-thread-1-processing-n:127.0.0.1:52106_) [n:127.0.0.1:52106_ c:control_collection   x:collection1] o.a.s.s.OpenExchangeRatesOrgProvider Reloading exchange rates from open-exchange-rates.json
   [junit4]   2> 107038 INFO  (coreLoadExecutor-622-thread-1-processing-n:127.0.0.1:52106_) [n:127.0.0.1:52106_ c:control_collection   x:collection1] o.a.s.c.ConfigSetProperties Did not find ConfigSet properties, assuming default properties: Can't find resource 'configsetprops.json' in classpath or '/configs/conf1', cwd=/home/jenkins/workspace/Lucene-Solr-master-Linux/solr/build/solr-core/test/J0
   [junit4]   2> 107038 INFO  (coreLoadExecutor-622-thread-1-processing-n:127.0.0.1:52106_) [n:127.0.0.1:52106_ c:control_collection   x:collection1] o.a.s.c.CoreContainer Creating SolrCore 'collection1' using configuration from collection control_collection
   [junit4]   2> 107039 INFO  (coreLoadExecutor-622-thread-1-processing-n:127.0.0.1:52106_) [n:127.0.0.1:52106_ c:control_collection s:shard1 r:core_node1 x:collection1] o.a.s.c.SolrCore org.apache.solr.core.MockDirectoryFactory
   [junit4]   2> 107039 INFO  (coreLoadExecutor-622-thread-1-processing-n:127.0.0.1:52106_) [n:127.0.0.1:52106_ c:control_collection s:shard1 r:core_node1 x:collection1] o.a.s.c.SolrCore [[collection1] ] Opening new SolrCore at [/home/jenkins/workspace/Lucene-Solr-master-Linux/solr/build/solr-core/test/J0/temp/solr.cloud.CollectionTooManyReplicasTest_18ACC9A02D2EA756-001/control-001/cores/collection1], dataDir=[/home/jenkins/workspace/Lucene-Solr-master-Linux/solr/build/solr-core/test/J0/temp/solr.cloud.CollectionTooManyReplicasTest_18ACC9A02D2EA756-001/control-001/cores/collection1/data/]
   [junit4]   2> 107039 INFO  (coreLoadExecutor-622-thread-1-processing-n:127.0.0.1:52106_) [n:127.0.0.1:52106_ c:control_collection s:shard1 r:core_node1 x:collection1] o.a.s.c.JmxMonitoredMap JMX monitoring is enabled. Adding Solr mbeans to JMX Server: com.sun.jmx.mbeanserver.JmxMBeanServer@15620b82
   [junit4]   2> 107039 INFO  (coreLoadExecutor-622-thread-1-processing-n:127.0.0.1:52106_) [n:127.0.0.1:52106_ c:control_collection s:shard1 r:core_node1 x:collection1] o.a.s.c.CachingDirectoryFactory return new directory for /home/jenkins/workspace/Lucene-Solr-master-Linux/solr/build/solr-core/test/J0/temp/solr.cloud.CollectionTooManyReplicasTest_18ACC9A02D2EA756-001/control-001/cores/collection1/data
   [junit4]   2> 107039 INFO  (coreLoadExecutor-622-thread-1-processing-n:127.0.0.1:52106_) [n:127.0.0.1:52106_ c:control_collection s:shard1 r:core_node1 x:collection1] o.a.s.c.SolrCore New index directory detected: old=null new=/home/jenkins/workspace/Lucene-Solr-master-Linux/solr/build/solr-core/test/J0/temp/solr.cloud.CollectionTooManyReplicasTest_18ACC9A02D2EA756-001/control-001/cores/collection1/data/index/
   [junit4]   2> 107039 WARN  (coreLoadExecutor-622-thread-1-processing-n:127.0.0.1:52106_) [n:127.0.0.1:52106_ c:control_collection s:shard1 r:core_node1 x:collection1] o.a.s.c.SolrCore [collection1] Solr index directory '/home/jenkins/workspace/Lucene-Solr-master-Linux/solr/build/solr-core/test/J0/temp/solr.cloud.CollectionTooManyReplicasTest_18ACC9A02D2EA756-001/control-001/cores/collection1/data/index' doesn't exist. Creating new index...
   [junit4]   2> 107040 INFO  (coreLoadExecutor-622-thread-1-processing-n:127.0.0.1:52106_) [n:127.0.0.1:52106_ c:control_collection s:shard1 r:core_node1 x:collection1] o.a.s.c.CachingDirectoryFactory return new directory for /home/jenkins/workspace/Lucene-Solr-master-Linux/solr/build/solr-core/test/J0/temp/solr.cloud.CollectionTooManyReplicasTest_18ACC9A02D2EA756-001/control-001/cores/collection1/data/index
   [junit4]   2> 107040 INFO  (coreLoadExecutor-622-thread-1-processing-n:127.0.0.1:52106_) [n:127.0.0.1:52106_ c:control_collection s:shard1 r:core_node1 x:collection1] o.a.s.u.RandomMergePolicy RandomMergePolicy wrapping class org.apache.lucene.index.LogByteSizeMergePolicy: [LogByteSizeMergePolicy: minMergeSize=1677721, mergeFactor=32, maxMergeSize=2147483648, maxMergeSizeForForcedMerge=9223372036854775807, calibrateSizeByDeletes=true, maxMergeDocs=2147483647, maxCFSSegmentSizeMB=8.796093022207999E12, noCFSRatio=1.0]
   [junit4]   2> 107040 INFO  (coreLoadExecutor-622-thread-1-processing-n:127.0.0.1:52106_) [n:127.0.0.1:52106_ c:control_collection s:shard1 r:core_node1 x:collection1] o.a.s.c.SolrDeletionPolicy SolrDeletionPolicy.onCommit: commits: num=1
   [junit4]   2> 	commit{dir=MockDirectoryWrapper(RAMDirectory@1137bdf8 lockFactory=org.apache.lucene.store.SingleInstanceLockFactory@57de8c5c),segFN=segments_1,generation=1}
   [junit4]   2> 107040 INFO  (coreLoadExecutor-622-thread-1-processing-n:127.0.0.1:52106_) [n:127.0.0.1:52106_ c:control_collection s:shard1 r:core_node1 x:collection1] o.a.s.c.SolrDeletionPolicy newest commit generation = 1
   [junit4]   2> 107040 INFO  (OldIndexDirectoryCleanupThreadForCore-collection1) [n:127.0.0.1:52106_ c:control_collection s:shard1 r:core_node1 x:collection1] o.a.s.c.SolrCore Looking for old index directories to cleanup for core collection1 in /home/jenkins/workspace/Lucene-Solr-master-Linux/solr/build/solr-core/test/J0/temp/solr.cloud.CollectionTooManyReplicasTest_18ACC9A02D2EA756-001/control-001/cores/collection1/data/
   [junit4]   2> 107041 WARN  (OldIndexDirectoryCleanupThreadForCore-collection1) [n:127.0.0.1:52106_ c:control_collection s:shard1 r:core_node1 x:collection1] o.a.s.c.DirectoryFactory /home/jenkins/workspace/Lucene-Solr-master-Linux/solr/build/solr-core/test/J0/temp/solr.cloud.CollectionTooManyReplicasTest_18ACC9A02D2EA756-001/control-001/cores/collection1/data/ does not point to a valid data directory; skipping clean-up of old index directories.
   [junit4]   2> 107043 INFO  (coreLoadExecutor-622-thread-1-processing-n:127.0.0.1:52106_) [n:127.0.0.1:52106_ c:control_collection s:shard1 r:core_node1 x:collection1] o.a.s.u.p.UpdateRequestProcessorChain creating updateRequestProcessorChain "nodistrib"
   [junit4]   2> 107043 INFO  (coreLoadExecutor-622-thread-1-processing-n:127.0.0.1:52106_) [n:127.0.0.1:52106_ c:control_collection s:shard1 r:core_node1 x:collection1] o.a.s.u.p.UpdateRequestProcessorChain creating updateRequestProcessorChain "dedupe"
   [junit4]   2> 107043 INFO  (coreLoadExecutor-622-thread-1-processing-n:127.0.0.1:52106_) [n:127.0.0.1:52106_ c:control_collection s:shard1 r:core_node1 x:collection1] o.a.s.u.p.UpdateRequestProcessorChain inserting DistributedUpdateProcessorFactory into updateRequestProcessorChain "dedupe"
   [junit4]   2> 107043 INFO  (coreLoadExecutor-622-thread-1-processing-n:127.0.0.1:52106_) [n:127.0.0.1:52106_ c:control_collection s:shard1 r:core_node1 x:collection1] o.a.s.u.p.UpdateRequestProcessorChain creating updateRequestProcessorChain "stored_sig"
   [junit4]   2> 107043 INFO  (coreLoadExecutor-622-thread-1-processing-n:127.0.0.1:52106_) [n:127.0.0.1:52106_ c:control_collection s:shard1 r:core_node1 x:collection1] o.a.s.u.p.UpdateRequestProcessorChain inserting DistributedUpdateProcessorFactory into updateRequestProcessorChain "stored_sig"
   [junit4]   2> 107043 INFO  (coreLoadExecutor-622-thread-1-processing-n:127.0.0.1:52106_) [n:127.0.0.1:52106_ c:control_collection s:shard1 r:core_node1 x:collection1] o.a.s.u.p.UpdateRequestProcessorChain creating updateRequestProcessorChain "distrib-dup-test-chain-explicit"
   [junit4]   2> 107043 INFO  (coreLoadExecutor-622-thread-1-processing-n:127.0.0.1:52106_) [n:127.0.0.1:52106_ c:control_collection s:shard1 r:core_node1 x:collection1] o.a.s.u.p.UpdateRequestProcessorChain creating updateRequestProcessorChain "distrib-dup-test-chain-implicit"
   [junit4]   2> 107043 INFO  (coreLoadExecutor-622-thread-1-processing-n:127.0.0.1:52106_) [n:127.0.0.1:52106_ c:control_collection s:shard1 r:core_node1 x:collection1] o.a.s.u.p.UpdateRequestProcessorChain inserting DistributedUpdateProcessorFactory into updateRequestProcessorChain "distrib-dup-test-chain-implicit"
   [junit4]   2> 107043 INFO  (coreLoadExecutor-622-thread-1-processing-n:127.0.0.1:52106_) [n:127.0.0.1:52106_ c:control_collection s:shard1 r:core_node1 x:collection1] o.a.s.c.SolrCore no updateRequestProcessorChain defined as default, creating implicit default
   [junit4]   2> 107043 WARN  (coreLoadExecutor-622-thread-1-processing-n:127.0.0.1:52106_) [n:127.0.0.1:52106_ c:control_collection s:shard1 r:core_node1 x:collection1] o.a.s.c.RequestHandlers INVALID paramSet a in requestHandler {type = requestHandler,name = /dump,class = DumpRequestHandler,args = {defaults={a=A,b=B}}}
   [junit4]   2> 107044 INFO  (coreLoadExecutor-622-thread-1-processing-n:127.0.0.1:52106_) [n:127.0.0.1:52106_ c:control_collection s:shard1 r:core_node1 x:collection1] o.a.s.h.l.XMLLoader xsltCacheLifetimeSeconds=60
   [junit4]   2> 107046 INFO  (coreLoadExecutor-622-thread-1-processing-n:127.0.0.1:52106_) [n:127.0.0.1:52106_ c:control_collection s:shard1 r:core_node1 x:collection1] o.a.s.h.l.XMLLoader xsltCacheLifetimeSeconds=60
   [junit4]   2> 107046 INFO  (coreLoadExecutor-622-thread-1-processing-n:127.0.0.1:52106_) [n:127.0.0.1:52106_ c:control_collection s:shard1 r:core_node1 x:collection1] o.a.s.h.l.XMLLoader xsltCacheLifetimeSeconds=60
   [junit4]   2> 107047 INFO  (coreLoadExecutor-622-thread-1-processing-n:127.0.0.1:52106_) [n:127.0.0.1:52106_ c:control_collection s:shard1 r:core_node1 x:collection1] o.a.s.h.l.XMLLoader xsltCacheLifetimeSeconds=60
   [junit4]   2> 107050 INFO  (coreLoadExecutor-622-thread-1-processing-n:127.0.0.1:52106_) [n:127.0.0.1:52106_ c:control_collection s:shard1 r:core_node1 x:collection1] o.a.s.c.RequestHandlers Registered paths: /admin/mbeans,standard,/dump,/update/csv,/sql,/update/json/docs,/admin/luke,/export,/admin/segments,/get,/admin/system,/replication,/admin/properties,/config,/stream,/schema,/admin/plugins,/admin/logging,/update/json,/admin/ping,/admin/threads,/update,/admin/file
   [junit4]   2> 107050 INFO  (coreLoadExecutor-622-thread-1-processing-n:127.0.0.1:52106_) [n:127.0.0.1:52106_ c:control_collection s:shard1 r:core_node1 x:collection1] o.a.s.c.SolrCore Using default statsCache cache: org.apache.solr.search.stats.LocalStatsCache
   [junit4]   2> 107050 INFO  (coreLoadExecutor-622-thread-1-processing-n:127.0.0.1:52106_) [n:127.0.0.1:52106_ c:control_collection s:shard1 r:core_node1 x:collection1] o.a.s.u.UpdateHandler Using UpdateLog implementation: org.apache.solr.update.UpdateLog
   [junit4]   2> 107050 INFO  (coreLoadExecutor-622-thread-1-processing-n:127.0.0.1:52106_) [n:127.0.0.1:52106_ c:control_collection s:shard1 r:core_node1 x:collection1] o.a.s.u.UpdateLog Initializing UpdateLog: dataDir= defaultSyncLevel=FLUSH numRecordsToKeep=100 maxNumLogsToKeep=10 numVersionBuckets=65536
   [junit4]   2> 107051 INFO  (coreLoadExecutor-622-thread-1-processing-n:127.0.0.1:52106_) [n:127.0.0.1:52106_ c:control_collection s:shard1 r:core_node1 x:collection1] o.a.s.u.CommitTracker Hard AutoCommit: disabled
   [junit4]   2> 107051 INFO  (coreLoadExecutor-622-thread-1-processing-n:127.0.0.1:52106_) [n:127.0.0.1:52106_ c:control_collection s:shard1 r:core_node1 x:collection1] o.a.s.u.CommitTracker Soft AutoCommit: disabled
   [junit4]   2> 107051 INFO  (coreLoadExecutor-622-thread-1-processing-n:127.0.0.1:52106_) [n:127.0.0.1:52106_ c:control_collection s:shard1 r:core_node1 x:collection1] o.a.s.u.RandomMergePolicy RandomMergePolicy wrapping class org.apache.lucene.index.LogByteSizeMergePolicy: [LogByteSizeMergePolicy: minMergeSize=1677721, mergeFactor=29, maxMergeSize=2147483648, maxMergeSizeForForcedMerge=9223372036854775807, calibrateSizeByDeletes=false, maxMergeDocs=2147483647, maxCFSSegmentSizeMB=8.796093022207999E12, noCFSRatio=0.0]
   [junit4]   2> 107051 INFO  (coreLoadExecutor-622-thread-1-processing-n:127.0.0.1:52106_) [n:127.0.0.1:52106_ c:control_collection s:shard1 r:core_node1 x:collection1] o.a.s.c.SolrDeletionPolicy SolrDeletionPolicy.onInit: commits: num=1
   [junit4]   2> 	commit{dir=MockDirectoryWrapper(RAMDirectory@1137bdf8 lockFactory=org.apache.lucene.store.SingleInstanceLockFactory@57de8c5c),segFN=segments_1,generation=1}
   [junit4]   2> 107052 INFO  (coreLoadExecutor-622-thread-1-processing-n:127.0.0.1:52106_) [n:127.0.0.1:52106_ c:control_collection s:shard1 r:core_node1 x:collection1] o.a.s.c.SolrDeletionPolicy newest commit generation = 1
   [junit4]   2> 107052 INFO  (coreLoadExecutor-622-thread-1-processing-n:127.0.0.1:52106_) [n:127.0.0.1:52106_ c:control_collection s:shard1 r:core_node1 x:collection1] o.a.s.s.SolrIndexSearcher Opening [Searcher@29761429[collection1] main]
   [junit4]   2> 107052 INFO  (coreLoadExecutor-622-thread-1-processing-n:127.0.0.1:52106_) [n:127.0.0.1:52106_ c:control_collection s:shard1 r:core_node1 x:collection1] o.a.s.c.c.ZkStateReader Load collection config from: [/collections/control_collection]
   [junit4]   2> 107052 INFO  (coreLoadExecutor-622-thread-1-processing-n:127.0.0.1:52106_) [n:127.0.0.1:52106_ c:control_collection s:shard1 r:core_node1 x:collection1] o.a.s.c.c.ZkStateReader path=[/collections/control_collection] [configName]=[conf1] specified config exists in ZooKeeper
   [junit4]   2> 107052 INFO  (coreLoadExecutor-622-thread-1-processing-n:127.0.0.1:52106_) [n:127.0.0.1:52106_ c:control_collection s:shard1 r:core_node1 x:collection1] o.a.s.r.ManagedResourceStorage Setting up ZooKeeper-based storage for the RestManager with znodeBase: /configs/conf1
   [junit4]   2> 107052 INFO  (coreLoadExecutor-622-thread-1-processing-n:127.0.0.1:52106_) [n:127.0.0.1:52106_ c:control_collection s:shard1 r:core_node1 x:collection1] o.a.s.r.ManagedResourceStorage Configured ZooKeeperStorageIO with znodeBase: /configs/conf1
   [junit4]   2> 107052 INFO  (coreLoadExecutor-622-thread-1-processing-n:127.0.0.1:52106_) [n:127.0.0.1:52106_ c:control_collection s:shard1 r:core_node1 x:collection1] o.a.s.r.RestManager Initializing RestManager with initArgs: {}
   [junit4]   2> 107052 INFO  (coreLoadExecutor-622-thread-1-processing-n:127.0.0.1:52106_) [n:127.0.0.1:52106_ c:control_collection s:shard1 r:core_node1 x:collection1] o.a.s.r.ManagedResourceStorage Reading _rest_managed.json using ZooKeeperStorageIO:path=/configs/conf1
   [junit4]   2> 107053 INFO  (coreLoadExecutor-622-thread-1-processing-n:127.0.0.1:52106_) [n:127.0.0.1:52106_ c:control_collection s:shard1 r:core_node1 x:collection1] o.a.s.r.ManagedResourceStorage No data found for znode /configs/conf1/_rest_managed.json
   [junit4]   2> 107053 INFO  (coreLoadExecutor-622-thread-1-processing-n:127.0.0.1:52106_) [n:127.0.0.1:52106_ c:control_collection s:shard1 r:core_node1 x:collection1] o.a.s.r.ManagedResourceStorage Loaded null at path _rest_managed.json using ZooKeeperStorageIO:path=/configs/conf1
   [junit4]   2> 107053 INFO  (coreLoadExecutor-622-thread-1-processing-n:127.0.0.1:52106_) [n:127.0.0.1:52106_ c:control_collection s:shard1 r:core_node1 x:collection1] o.a.s.r.RestManager Initializing 0 registered ManagedResources
   [junit4]   2> 107053 INFO  (coreLoadExecutor-622-thread-1-processing-n:127.0.0.1:52106_) [n:127.0.0.1:52106_ c:control_collection s:shard1 r:core_node1 x:collection1] o.a.s.h.ReplicationHandler Commits will be reserved for  10000
   [junit4]   2> 107054 INFO  (searcherExecutor-623-thread-1-processing-n:127.0.0.1:52106_ x:collection1 s:shard1 c:control_collection r:core_node1) [n:127.0.0.1:52106_ c:control_collection s:shard1 r:core_node1 x:collection1] o.a.s.c.SolrCore [collection1] Registered new searcher Searcher@29761429[collection1] main{ExitableDirectoryReader(UninvertingDirectoryReader())}
   [junit4]   2> 107054 INFO  (coreLoadExecutor-622-thread-1-processing-n:127.0.0.1:52106_) [n:127.0.0.1:52106_ c:control_collection s:shard1 r:core_node1 x:collection1] o.a.s.u.UpdateLog Looking up max value of version field to seed version buckets
   [junit4]   2> 107054 INFO  (coreLoadExecutor-622-thread-1-processing-n:127.0.0.1:52106_) [n:127.0.0.1:52106_ c:control_collection s:shard1 r:core_node1 x:collection1] o.a.s.u.VersionInfo Refreshing highest value of _version_ for 65536 version buckets from index
   [junit4]   2> 107055 INFO  (coreLoadExecutor-622-thread-1-processing-n:127.0.0.1:52106_) [n:127.0.0.1:52106_ c:control_collection s:shard1 r:core_node1 x:collection1] o.a.s.u.VersionInfo No terms found for _version_, cannot seed version bucket highest value from index
   [junit4]   2> 107055 INFO  (coreLoadExecutor-622-thread-1-processing-n:127.0.0.1:52106_) [n:127.0.0.1:52106_ c:control_collection s:shard1 r:core_node1 x:collection1] o.a.s.u.UpdateLog Could not find max version in index or recent updates, using new clock 1527900878961377280
   [junit4]   2> 107056 INFO  (coreLoadExecutor-622-thread-1-processing-n:127.0.0.1:52106_) [n:127.0.0.1:52106_ c:control_collection s:shard1 r:core_node1 x:collection1] o.a.s.u.UpdateLog Took 1.0ms to seed version buckets with highest version 1527900878961377280
   [junit4]   2> 107056 INFO  (coreLoadExecutor-622-thread-1-processing-n:127.0.0.1:52106_) [n:127.0.0.1:52106_ c:control_collection s:shard1 r:core_node1 x:collection1] o.a.s.c.ZkController watch zkdir /configs/conf1
   [junit4]   2> 107056 INFO  (coreLoadExecutor-622-thread-1-processing-n:127.0.0.1:52106_) [n:127.0.0.1:52106_ c:control_collection s:shard1 r:core_node1 x:collection1] o.a.s.c.CoreContainer registering core: collection1
   [junit4]   2> 107057 INFO  (coreZkRegister-616-thread-1-processing-n:127.0.0.1:52106_ x:collection1 s:shard1 c:control_collection r:core_node1) [n:127.0.0.1:52106_ c:control_collection s:shard1 r:core_node1 x:collection1] o.a.s.c.ZkController Register replica - core:collection1 address:http://127.0.0.1:52106 collection:control_collection shard:shard1
   [junit4]   2> 107057 INFO  (coreZkRegister-616-thread-1-processing-n:127.0.0.1:52106_ x:collection1 s:shard1 c:control_collection r:core_node1) [n:127.0.0.1:52106_ c:control_collection s:shard1 r:core_node1 x:collection1] o.a.s.c.c.SolrZkClient makePath: /collections/control_collection/leader_elect/shard1/election
   [junit4]   2> 107059 INFO  (coreZkRegister-616-thread-1-processing-n:127.0.0.1:52106_ x:collection1 s:shard1 c:control_collection r:core_node1) [n:127.0.0.1:52106_ c:control_collection s:shard1 r:core_node1 x:collection1] o.a.s.c.LeaderElector Joined leadership election with path: /collections/control_collection/leader_elect/shard1/election/95493804848381956-core_node1-n_0000000000
   [junit4]   2> 107059 INFO  (coreZkRegister-616-thread-1-processing-n:127.0.0.1:52106_ x:collection1 s:shard1 c:control_collection r:core_node1) [n:127.0.0.1:52106_ c:control_collection s:shard1 r:core_node1 x:collection1] o.a.s.c.ShardLeaderElectionContext Running the leader process for shard=shard1 and weAreReplacement=false and leaderVoteWait=10000
   [junit4]   2> 107060 INFO  (coreZkRegister-616-thread-1-processing-n:127.0.0.1:52106_ x:collection1 s:shard1 c:control_collection r:core_node1) [n:127.0.0.1:52106_ c:control_collection s:shard1 r:core_node1 x:collection1] o.a.s.c.ShardLeaderElectionContext Enough replicas found to continue.
   [junit4]   2> 107060 INFO  (coreZkRegister-616-thread-1-processing-n:127.0.0.1:52106_ x:collection1 s:shard1 c:control_collection r:core_node1) [n:127.0.0.1:52106_ c:control_collection s:shard1 r:core_node1 x:collection1] o.a.s.c.ShardLeaderElectionContext I may be the new leader - try and sync
   [junit4]   2> 107060 INFO  (coreZkRegister-616-thread-1-processing-n:127.0.0.1:52106_ x:collection1 s:shard1 c:control_collection r:core_node1) [n:127.0.0.1:52106_ c:control_collection s:shard1 r:core_node1 x:collection1] o.a.s.c.SyncStrategy Sync replicas to http://127.0.0.1:52106/collection1/
   [junit4]   2> 107060 INFO  (coreZkRegister-616-thread-1-processing-n:127.0.0.1:52106_ x:collection1 s:shard1 c:control_collection r:core_node1) [n:127.0.0.1:52106_ c:control_collection s:shard1 r:core_node1 x:collection1] o.a.s.c.SyncStrategy Sync Success - now sync replicas to me
   [junit4]   2> 107060 INFO  (OverseerStateUpdate-95493804848381956-127.0.0.1:52106_-n_0000000000) [n:127.0.0.1:52106_    ] o.a.s.c.Overseer processMessage: queueSize: 1, message = {
   [junit4]   2>   "operation":"leader",
   [junit4]   2>   "shard":"shard1",
   [junit4]   2>   "collection":"control_collection"} current state version: 1
   [junit4]   2> 107060 INFO  (coreZkRegister-616-thread-1-processing-n:127.0.0.1:52106_ x:collection1 s:shard1 c:control_collection r:core_node1) [n:127.0.0.1:52106_ c:control_collection s:shard1 r:core_node1 x:collection1] o.a.s.c.SyncStrategy http://127.0.0.1:52106/collection1/ has no replicas
   [junit4]   2> 107060 INFO  (coreZkRegister-616-thread-1-processing-n:127.0.0.1:52106_ x:collection1 s:shard1 c:control_collection r:core_node1) [n:127.0.0.1:52106_ c:control_collection s:shard1 r:core_node1 x:collection1] o.a.s.c.c.SolrZkClient makePath: /collections/control_collection/leaders/shard1
   [junit4]   2> 107061 INFO  (coreZkRegister-616-thread-1-processing-n:127.0.0.1:52106_ x:collection1 s:shard1 c:control_collection r:core_node1) [n:127.0.0.1:52106_ c:control_collection s:shard1 r:core_node1 x:collection1] o.a.s.c.ShardLeaderElectionContextBase Creating leader registration node /collections/control_collection/leaders/shard1/leader after winning as /collections/control_collection/leader_elect/shard1/election/95493804848381956-core_node1-n_0000000000
   [junit4]   2> 107062 INFO  (coreZkRegister-616-thread-1-processing-n:127.0.0.1:52106_ x:collection1 s:shard1 c:control_collection r:core_node1) [n:127.0.0.1:52106_ c:control_collection s:shard1 r:core_node1 x:collection1] o.a.s.c.ShardLeaderElectionContext I am the new leader: http://127.0.0.1:52106/collection1/ shard1
   [junit4]   2> 107063 INFO  (OverseerStateUpdate-95493804848381956-127.0.0.1:52106_-n_0000000000) [n:127.0.0.1:52106_    ] o.a.s.c.Overseer processMessage: queueSize: 1, message = {
   [junit4]   2>   "operation":"leader",
   [junit4]   2>   "shard":"shard1",
   [junit4]   2>   "collection":"control_collection",
   [junit4]   2>   "base_url":"http://127.0.0.1:52106",
   [junit4]   2>   "core":"collection1",
   [junit4]   2>   "state":"active"} current state version: 1
   [junit4]   2> 107164 INFO  (zkCallback-168-thread-1-processing-n:127.0.0.1:52106_) [n:127.0.0.1:52106_    ] o.a.s.c.c.ZkStateReader A cluster state change: [WatchedEvent state:SyncConnected type:NodeDataChanged path:/clusterstate.json], has occurred - updating... (live nodes size: [1])
   [junit4]   2> 107213 INFO  (coreZkRegister-616-thread-1-processing-n:127.0.0.1:52106_ x:collection1 s:shard1 c:control_collection r:core_node1) [n:127.0.0.1:52106_ c:control_collection s:shard1 r:core_node1 x:collection1] o.a.s.c.ZkController We are http://127.0.0.1:52106/collection1/ and leader is http://127.0.0.1:52106/collection1/
   [junit4]   2> 107213 INFO  (coreZkRegister-616-thread-1-processing-n:127.0.0.1:52106_ x:collection1 s:shard1 c:control_collection r:core_node1) [n:127.0.0.1:52106_ c:control_collection s:shard1 r:core_node1 x:collection1] o.a.s.c.ZkController No LogReplay needed for core=collection1 baseURL=http://127.0.0.1:52106
   [junit4]   2> 107213 INFO  (coreZkRegister-616-thread-1-processing-n:127.0.0.1:52106_ x:collection1 s:shard1 c:control_collection r:core_node1) [n:127.0.0.1:52106_ c:control_collection s:shard1 r:core_node1 x:collection1] o.a.s.c.ZkController I am the leader, no recovery necessary
   [junit4]   2> 107214 INFO  (coreZkRegister-616-thread-1-processing-n:127.0.0.1:52106_ x:collection1 s:shard1 c:control_collection r:core_node1) [n:127.0.0.1:52106_ c:control_collection s:shard1 r:core_node1 x:collection1] o.a.s.c.ZkController publishing state=active
   [junit4]   2> 107214 INFO  (coreZkRegister-616-thread-1-processing-n:127.0.0.1:52106_ x:collection1 s:shard1 c:control_collection r:core_node1) [n:127.0.0.1:52106_ c:control_collection s:shard1 r:core_node1 x:collection1] o.a.s.c.ZkController numShards not found on descriptor - reading it from system property
   [junit4]   2> 107215 INFO  (OverseerStateUpdate-95493804848381956-127.0.0.1:52106_-n_0000000000) [n:127.0.0.1:52106_    ] o.a.s.c.Overseer processMessage: queueSize: 1, message = {
   [junit4]   2>   "core":"collection1",
   [junit4]   2>   "core_node_name":"core_node1",
   [junit4]   2>   "roles":null,
   [junit4]   2>   "base_url":"http://127.0.0.1:52106",
   [junit4]   2>   "node_name":"127.0.0.1:52106_",
   [junit4]   2>   "numShards":"1",
   [junit4]   2>   "state":"active",
   [junit4]   2>   "shard":"shard1",
   [junit4]   2>   "collection":"control_collection",
   [junit4]   2>   "operation":"state"} current state version: 2
   [junit4]   2> 107215 INFO  (coreZkRegister-616-thread-1-processing-n:127.0.0.1:52106_ x:collection1 s:shard1 c:control_collection r:core_node1) [n:127.0.0.1:52106_ c:control_collection s:shard1 r:core_node1 x:collection1] o.a.s.c.c.ZkStateReader Updated live nodes from ZooKeeper... (1) -> (1)
   [junit4]   2> 107215 INFO  (OverseerStateUpdate-95493804848381956-127.0.0.1:52106_-n_0000000000) [n:127.0.0.1:52106_    ] o.a.s.c.o.ReplicaMutator Update state numShards=1 message={
   [junit4]   2>   "core":"collection1",
   [junit4]   2>   "core_node_name":"core_node1",
   [junit4]   2>   "roles":null,
   [junit4]   2>   "base_url":"http://127.0.0.1:52106",
   [junit4]   2>   "node_name":"127.0.0.1:52106_",
   [junit4]   2>   "numShards":"1",
   [junit4]   2>   "state":"active",
   [junit4]   2>   "shard":"shard1",
   [junit4]   2>   "collection":"control_collection",
   [junit4]   2>   "operation":"state"}
   [junit4]   2> 107316 INFO  (zkCallback-168-thread-1-processing-n:127.0.0.1:52106_) [n:127.0.0.1:52106_    ] o.a.s.c.c.ZkStateReader A cluster state change: [WatchedEvent state:SyncConnected type:NodeDataChanged path:/clusterstate.json], has occurred - updating... (live nodes size: [1])
   [junit4]   2> 107444 INFO  (TEST-CollectionTooManyReplicasTest.testAddTooManyReplicas-seed#[18ACC9A02D2EA756]) [    ] o.a.s.c.c.SolrZkClient Using default ZkCredentialsProvider
   [junit4]   2> 107445 INFO  (TEST-CollectionTooManyReplicasTest.testAddTooManyReplicas-seed#[18ACC9A02D2EA756]) [    ] o.a.s.c.c.ConnectionManager Waiting for client to connect to ZooKeeper
   [junit4]   2> 107446 INFO  (zkCallback-170-thread-1) [    ] o.a.s.c.c.ConnectionManager Watcher org.apache.solr.common.cloud.ConnectionManager@1ce93ed3 name:ZooKeeperConnection Watcher:127.0.0.1:51461/solr got event WatchedEvent state:SyncConnected type:None path:null path:null type:None
   [junit4]   2> 107446 INFO  (TEST-CollectionTooManyReplicasTest.testAddTooManyReplicas-seed#[18ACC9A02D2EA756]) [    ] o.a.s.c.c.ConnectionManager Client is connected to ZooKeeper
   [junit4]   2> 107446 INFO  (TEST-CollectionTooManyReplicasTest.testAddTooManyReplicas-seed#[18ACC9A02D2EA756]) [    ] o.a.s.c.c.SolrZkClient Using default ZkACLProvider
   [junit4]   2> 107446 INFO  (TEST-CollectionTooManyReplicasTest.testAddTooManyReplicas-seed#[18ACC9A02D2EA756]) [    ] o.a.s.c.c.ZkStateReader Updating cluster state from ZooKeeper... 
   [junit4]   2> 107447 INFO  (TEST-CollectionTooManyReplicasTest.testAddTooManyReplicas-seed#[18ACC9A02D2EA756]) [    ] o.a.s.c.c.ZkStateReader Updated live nodes from ZooKeeper... (0) -> (1)
   [junit4]   2> 107447 INFO  (TEST-CollectionTooManyReplicasTest.testAddTooManyReplicas-seed#[18ACC9A02D2EA756]) [    ] o.a.s.c.ChaosMonkey monkey: init - expire sessions:false cause connection loss:false
   [junit4]   2> 107495 INFO  (TEST-CollectionTooManyReplicasTest.testAddTooManyReplicas-seed#[18ACC9A02D2EA756]) [    ] o.a.s.SolrTestCaseJ4 Writing core.properties file to /home/jenkins/workspace/Lucene-Solr-master-Linux/solr/build/solr-core/test/J0/temp/solr.cloud.CollectionTooManyReplicasTest_18ACC9A02D2EA756-001/shard-1-001/cores/collection1
   [junit4]   2> 107495 INFO  (TEST-CollectionTooManyReplicasTest.testAddTooManyReplicas-seed#[18ACC9A02D2EA756]) [    ] o.a.s.c.AbstractFullDistribZkTestBase create jetty 1 in directory /home/jenkins/workspace/Lucene-Solr-master-Linux/solr/build/solr-core/test/J0/temp/solr.cloud.CollectionTooManyReplicasTest_18ACC9A02D2EA756-001/shard-1-001
   [junit4]   2> 107496 INFO  (TEST-CollectionTooManyReplicasTest.testAddTooManyReplicas-seed#[18ACC9A02D2EA756]) [    ] o.e.j.s.Server jetty-9.3.6.v20151106
   [junit4]   2> 107498 INFO  (TEST-CollectionTooManyReplicasTest.testAddTooManyReplicas-seed#[18ACC9A02D2EA756]) [    ] o.e.j.s.h.ContextHandler Started o.e.j.s.ServletContextHandler@18404b1a{/,null,AVAILABLE}
   [junit4]   2> 107498 INFO  (TEST-CollectionTooManyReplicasTest.testAddTooManyReplicas-seed#[18ACC9A02D2EA756]) [    ] o.e.j.s.ServerConnector Started ServerConnector@7eaced8f{HTTP/1.1,[http/1.1]}{127.0.0.1:36033}
   [junit4]   2> 107498 INFO  (TEST-CollectionTooManyReplicasTest.testAddTooManyReplicas-seed#[18ACC9A02D2EA756]) [    ] o.e.j.s.Server Started @108945ms
   [junit4]   2> 107498 INFO  (TEST-CollectionTooManyReplicasTest.testAddTooManyReplicas-seed#[18ACC9A02D2EA756]) [    ] o.a.s.c.s.e.JettySolrRunner Jetty properties: {solr.data.dir=/home/jenkins/workspace/Lucene-Solr-master-Linux/solr/build/solr-core/test/J0/temp/solr.cloud.CollectionTooManyReplicasTest_18ACC9A02D2EA756-001/tempDir-001/jetty1, solrconfig=solrconfig.xml, hostContext=/, hostPort=36033, coreRootDirectory=/home/jenkins/workspace/Lucene-Solr-master-Linux/solr/build/solr-core/test/J0/../../../../../../../../../home/jenkins/workspace/Lucene-Solr-master-Linux/solr/build/solr-core/test/J0/temp/solr.cloud.CollectionTooManyReplicasTest_18ACC9A02D2EA756-001/shard-1-001/cores}
   [junit4]   2> 107499 INFO  (TEST-CollectionTooManyReplicasTest.testAddTooManyReplicas-seed#[18ACC9A02D2EA756]) [    ] o.a.s.s.SolrDispatchFilter SolrDispatchFilter.init(): sun.misc.Launcher$AppClassLoader@73d16e93
   [junit4]   2> 107499 INFO  (TEST-CollectionTooManyReplicasTest.testAddTooManyReplicas-seed#[18ACC9A02D2EA756]) [    ] o.a.s.c.SolrResourceLoader new SolrResourceLoader for directory: '/home/jenkins/workspace/Lucene-Solr-master-Linux/solr/build/solr-core/test/J0/temp/solr.cloud.CollectionTooManyReplicasTest_18ACC9A02D2EA756-001/shard-1-001'
   [junit4]   2> 107499 INFO  (TEST-CollectionTooManyReplicasTest.testAddTooManyReplicas-seed#[18ACC9A02D2EA756]) [    ] o.a.s.c.SolrResourceLoader JNDI not configured for solr (NoInitialContextEx)
   [junit4]   2> 107499 INFO  (TEST-CollectionTooManyReplicasTest.testAddTooManyReplicas-seed#[18ACC9A02D2EA756]) [    ] o.a.s.c.SolrResourceLoader solr home defaulted to 'solr/' (could not find system property or JNDI)
   [junit4]   2> 107499 INFO  (TEST-CollectionTooManyReplicasTest.testAddTooManyReplicas-seed#[18ACC9A02D2EA756]) [    ] o.a.s.c.c.SolrZkClient Using default ZkCredentialsProvider
   [junit4]   2> 107499 INFO  (TEST-CollectionTooManyReplicasTest.testAddTooManyReplicas-seed#[18ACC9A02D2EA756]) [    ] o.a.s.c.c.ConnectionManager Waiting for client to connect to ZooKeeper
   [junit4]   2> 107500 INFO  (zkCallback-171-thread-1) [    ] o.a.s.c.c.ConnectionManager Watcher org.apache.solr.common.cloud.ConnectionManager@5bee82d0 name:ZooKeeperConnection Watcher:127.0.0.1:51461/solr got event WatchedEvent state:SyncConnected type:None path:null path:null type:None
   [junit4]   2> 107500 INFO  (TEST-CollectionTooManyReplicasTest.testAddTooManyReplicas-seed#[18ACC9A02D2EA756]) [    ] o.a.s.c.c.ConnectionManager Client is connected to ZooKeeper
   [junit4]   2> 107500 INFO  (TEST-CollectionTooManyReplicasTest.testAddTooManyReplicas-seed#[18ACC9A02D2EA756]) [    ] o.a.s.c.c.SolrZkClient Using default ZkACLProvider
   [junit4]   2> 107501 INFO  (TEST-CollectionTooManyReplicasTest.testAddTooManyReplicas-seed#[18ACC9A02D2EA756]) [    ] o.a.s.s.SolrDispatchFilter Loading solr.xml from SolrHome (not found in ZooKeeper)
   [junit4]   2> 107501 INFO  (TEST-CollectionTooManyReplicasTest.testAddTooManyReplicas-seed#[18ACC9A02D2EA756]) [    ] o.a.s.c.SolrXmlConfig Loading container configuration from /home/jenkins/workspace/Lucene-Solr-master-Linux/solr/build/solr-core/test/J0/temp/solr.cloud.CollectionTooManyReplicasTest_18ACC9A02D2EA756-001/shard-1-001/solr.xml
   [junit4]   2> 107519 INFO  (TEST-CollectionTooManyReplicasTest.testAddTooManyReplicas-seed#[18ACC9A02D2EA756]) [    ] o.a.s.c.CorePropertiesLocator Config-defined core root directory: /home/jenkins/workspace/Lucene-Solr-master-Linux/solr/build/solr-core/test/J0/../../../../../../../../../home/jenkins/workspace/Lucene-Solr-master-Linux/solr/build/solr-core/test/J0/temp/solr.cloud.CollectionTooManyReplicasTest_18ACC9A02D2EA756-001/shard-1-001/cores
   [junit4]   2> 107519 INFO  (TEST-CollectionTooManyReplicasTest.testAddTooManyReplicas-seed#[18ACC9A02D2EA756]) [    ] o.a.s.c.CoreContainer New CoreContainer 1572892701
   [junit4]   2> 107519 INFO  (TEST-CollectionTooManyReplicasTest.testAddTooManyReplicas-seed#[18ACC9A02D2EA756]) [    ] o.a.s.c.CoreContainer Loading cores into CoreContainer [instanceDir=/home/jenkins/workspace/Lucene-Solr-master-Linux/solr/build/solr-core/test/J0/temp/solr.cloud.CollectionTooManyReplicasTest_18ACC9A02D2EA756-001/shard-1-001]
   [junit4]   2> 107519 WARN  (TEST-CollectionTooManyReplicasTest.testAddTooManyReplicas-seed#[18ACC9A02D2EA756]) [    ] o.a.s.c.CoreContainer Couldn't add files from /home/jenkins/workspace/Lucene-Solr-master-Linux/solr/build/solr-core/test/J0/temp/solr.cloud.CollectionTooManyReplicasTest_18ACC9A02D2EA756-001/shard-1-001/lib to classpath: /home/jenkins/workspace/Lucene-Solr-master-Linux/solr/build/solr-core/test/J0/temp/solr.cloud.CollectionTooManyReplicasTest_18ACC9A02D2EA756-001/shard-1-001/lib
   [junit4]   2> 107520 INFO  (TEST-CollectionTooManyReplicasTest.testAddTooManyReplicas-seed#[18ACC9A02D2EA756]) [    ] o.a.s.h.c.HttpShardHandlerFactory created with socketTimeout : 90000,urlScheme : ,connTimeout : 15000,maxConnectionsPerHost : 20,maxConnections : 10000,corePoolSize : 0,maximumPoolSize : 2147483647,maxThreadIdleTime : 5,sizeOfQueue : -1,fairnessPolicy : false,useRetries : false,
   [junit4]   2> 107520 INFO  (TEST-CollectionTooManyReplicasTest.testAddTooManyReplicas-seed#[18ACC9A02D2EA756]) [    ] o.a.s.u.UpdateShardHandler Creating UpdateShardHandler HTTP client with params: socketTimeout=340000&connTimeout=45000&retry=true
   [junit4]   2> 107521 INFO  (TEST-CollectionTooManyReplicasTest.testAddTooManyReplicas-seed#[18ACC9A02D2EA756]) [    ] o.a.s.l.LogWatcher SLF4J impl is org.slf4j.impl.Log4jLoggerFactory
   [junit4]   2> 107521 INFO  (TEST-CollectionTooManyReplicasTest.testAddTooManyReplicas-seed#[18ACC9A02D2EA756]) [    ] o.a.s.l.LogWatcher Registering Log Listener [Log4j (org.slf4j.impl.Log4jLoggerFactory)]
   [junit4]   2> 107521 INFO  (TEST-CollectionTooManyReplicasTest.testAddTooManyReplicas-seed#[18ACC9A02D2EA756]) [    ] o.a.s.c.ZkContainer Zookeeper client=127.0.0.1:51461/solr
   [junit4]   2> 107521 INFO  (TEST-CollectionTooManyReplicasTest.testAddTooManyReplicas-seed#[18ACC9A02D2EA756]) [    ] o.a.s.c.ZkController zkHost includes chroot
   [junit4]   2> 107521 INFO  (TEST-CollectionTooManyReplicasTest.testAddTooManyReplicas-seed#[18ACC9A02D2EA756]) [    ] o.a.s.c.c.SolrZkClient Using default ZkCredentialsProvider
   [junit4]   2> 107522 INFO  (TEST-CollectionTooManyReplicasTest.testAddTooManyReplicas-seed#[18ACC9A02D2EA756]) [    ] o.a.s.c.c.ConnectionManager Waiting for client to connect to ZooKeeper
   [junit4]   2> 107523 INFO  (zkCallback-174-thread-1) [    ] o.a.s.c.c.ConnectionManager Watcher org.apache.solr.common.cloud.ConnectionManager@6bddaec8 name:ZooKeeperConnection Watcher:127.0.0.1:51461 got event WatchedEvent state:SyncConnected type:None path:null path:null type:None
   [junit4]   2> 107523 INFO  (TEST-CollectionTooManyReplicasTest.testAddTooManyReplicas-seed#[18ACC9A02D2EA756]) [    ] o.a.s.c.c.ConnectionManager Client is connected to ZooKeeper
   [junit4]   2> 107523 INFO  (TEST-CollectionTooManyReplicasTest.testAddTooManyReplicas-seed#[18ACC9A02D2EA756]) [    ] o.a.s.c.c.SolrZkClient Using default ZkACLProvider
   [junit4]   2> 107524 INFO  (TEST-CollectionTooManyReplicasTest.testAddTooManyReplicas-seed#[18ACC9A02D2EA756]) [n:127.0.0.1:36033_    ] o.a.s.c.c.ConnectionManager Waiting for client to connect to ZooKeeper
   [junit4]   2> 107525 INFO  (zkCallback-175-thread-1-processing-n:127.0.0.1:36033_) [n:127.0.0.1:36033_    ] o.a.s.c.c.ConnectionManager Watcher org.apache.solr.common.cloud.ConnectionManager@6fb29c85 name:ZooKeeperConnection Watcher:127.0.0.1:51461/solr got event WatchedEvent state:SyncConnected type:None path:null path:null type:None
   [junit4]   2> 107525 INFO  (TEST-CollectionTooManyReplicasTest.testAddTooManyReplicas-seed#[18ACC9A02D2EA756]) [n:127.0.0.1:36033_    ] o.a.s.c.c.ConnectionManager Client is connected to ZooKeeper
   [junit4]   2> 107527 INFO  (TEST-CollectionTooManyReplicasTest.testAddTooManyReplicas-seed#[18ACC9A02D2EA756]) [n:127.0.0.1:36033_    ] o.a.s.c.c.ZkStateReader Updating cluster state from ZooKeeper... 
   [junit4]   2> 107528 INFO  (TEST-CollectionTooManyReplicasTest.testAddTooManyReplicas-seed#[18ACC9A02D2EA756]) [n:127.0.0.1:36033_    ] o.a.s.c.c.ZkStateReader Updated live nodes from ZooKeeper... (0) -> (1)
   [junit4]   2> 107528 INFO  (TEST-CollectionTooManyReplicasTest.testAddTooManyReplicas-seed#[18ACC9A02D2EA756]) [n:127.0.0.1:36033_    ] o.a.s.c.Overseer Overseer (id=null) closing
   [junit4]   2> 107529 INFO  (TEST-CollectionTooManyReplicasTest.testAddTooManyReplicas-seed#[18ACC9A02D2EA756]) [n:127.0.0.1:36033_    ] o.a.s.c.LeaderElector Joined leadership election with path: /overseer_elect/election/95493804848381960-127.0.0.1:36033_-n_0000000001
   [junit4]   2> 107529 INFO  (TEST-CollectionTooManyReplicasTest.testAddTooManyReplicas-seed#[18ACC9A02D2EA756]) [n:127.0.0.1:36033_    ] o.a.s.c.LeaderElector Watching path /overseer_elect/election/95493804848381956-127.0.0.1:52106_-n_0000000000 to know if I could be the leader
   [junit4]   2> 107529 INFO  (TEST-CollectionTooManyReplicasTest.testAddTooManyReplicas-seed#[18ACC9A02D2EA756]) [n:127.0.0.1:36033_    ] o.a.s.c.ZkController Publish node=127.0.0.1:36033_ as DOWN
   [junit4]   2> 107530 INFO  (OverseerStateUpdate-95493804848381956-127.0.0.1:52106_-n_0000000000) [n:127.0.0.1:52106_    ] o.a.s.c.Overseer processMessage: queueSize: 1, message = {
   [junit4]   2>   "operation":"downnode",
   [junit4]   2>   "node_name":"127.0.0.1:36033_"} current state version: 3
   [junit4]   2> 107530 INFO  (OverseerStateUpdate-95493804848381956-127.0.0.1:52106_-n_0000000000) [n:127.0.0.1:52106_    ] o.a.s.c.o.NodeMutator DownNode state invoked for node: 127.0.0.1:36033_
   [junit4]   2> 107631 INFO  (zkCallback-168-thread-1-processing-n:127.0.0.1:52106_) [n:127.0.0.1:52106_    ] o.a.s.c.c.ZkStateReader A cluster state change: [WatchedEvent state:SyncConnected type:NodeDataChanged path:/clusterstate.json], has occurred - updating... (live nodes size: [1])
   [junit4]   2> 107631 INFO  (zkCallback-175-thread-1-processing-n:127.0.0.1:36033_) [n:127.0.0.1:36033_    ] o.a.s.c.c.ZkStateReader A cluster state change: [WatchedEvent state:SyncConnected type:NodeDataChanged path:/clusterstate.json], has occurred - updating... (live nodes size: [1])
   [junit4]   2> 107631 INFO  (zkCallback-170-thread-1) [    ] o.a.s.c.c.ZkStateReader A cluster state change: [WatchedEvent state:SyncConnected type:NodeDataChanged path:/clusterstate.json], has occurred - updating... (live nodes size: [1])
   [junit4]   2> 108530 INFO  (TEST-CollectionTooManyReplicasTest.testAddTooManyReplicas-seed#[18ACC9A02D2EA756]) [n:127.0.0.1:36033_    ] o.a.s.c.ZkController Register node as live in ZooKeeper:/live_nodes/127.0.0.1:36033_
   [junit4]   2> 108530 INFO  (TEST-CollectionTooManyReplicasTest.testAddTooManyReplicas-seed#[18ACC9A02D2EA756]) [n:127.0.0.1:36033_    ] o.a.s.c.c.SolrZkClient makePath: /live_nodes/127.0.0.1:36033_
   [junit4]   2> 108531 INFO  (zkCallback-168-thread-1-processing-n:127.0.0.1:52106_) [n:127.0.0.1:52106_    ] o.a.s.c.c.ZkStateReader A live node change: [WatchedEvent state:SyncConnected type:NodeChildrenChanged path:/live_nodes], has occurred - updating... (live nodes size: [1])
   [junit4]   2> 108531 INFO  (zkCallback-170-thread-1) [    ] o.a.s.c.c.ZkStateReader A live node change: [WatchedEvent state:SyncConnected type:NodeChildrenChanged path:/live_nodes], has occurred - updating... (live nodes size: [1])
   [junit4]   2> 108531 INFO  (zkCallback-175-thread-1-processing-n:127.0.0.1:36033_) [n:127.0.0.1:36033_    ] o.a.s.c.c.ZkStateReader A live node change: [WatchedEvent state:SyncConnected type:NodeChildrenChanged path:/live_nodes], has occurred - updating... (live nodes size: [1])
   [junit4]   2> 108531 INFO  (zkCallback-168-thread-1-processing-n:127.0.0.1:52106_) [n:127.0.0.1:52106_    ] o.a.s.c.c.ZkStateReader Updated live nodes from ZooKeeper... (1) -> (2)
   [junit4]   2> 108531 INFO  (zkCallback-175-thread-1-processing-n:127.0.0.1:36033_) [n:127.0.0.1:36033_    ] o.a.s.c.c.ZkStateReader Updated live nodes from ZooKeeper... (1) -> (2)
   [junit4]   2> 108531 INFO  (zkCallback-170-thread-1) [    ] o.a.s.c.c.ZkStateReader Updated live nodes from ZooKeeper... (1) -> (2)
   [junit4]   2> 108542 INFO  (TEST-CollectionTooManyReplicasTest.testAddTooManyReplicas-seed#[18ACC9A02D2EA756]) [n:127.0.0.1:36033_    ] o.a.s.c.CoreContainer Security conf doesn't exist. Skipping setup for authorization module.
   [junit4]   2> 108542 INFO  (TEST-CollectionTooManyReplicasTest.testAddTooManyReplicas-seed#[18ACC9A02D2EA756]) [n:127.0.0.1:36033_    ] o.a.s.c.CoreContainer No authentication plugin used.
   [junit4]   2> 108543 INFO  (TEST-CollectionTooManyReplicasTest.testAddTooManyReplicas-seed#[18ACC9A02D2EA756]) [n:127.0.0.1:36033_    ] o.a.s.c.CorePropertiesLocator Looking for core definitions underneath /home/jenkins/workspace/Lucene-Solr-master-Linux/solr/build/solr-core/test/J0/../../../../../../../../../home/jenkins/workspace/Lucene-Solr-master-Linux/solr/build/solr-core/test/J0/temp/solr.cloud.CollectionTooManyReplicasTest_18ACC9A02D2EA756-001/shard-1-001/cores
   [junit4]   2> 108543 INFO  (TEST-CollectionTooManyReplicasTest.testAddTooManyReplicas-seed#[18ACC9A02D2EA756]) [n:127.0.0.1:36033_    ] o.a.s.c.CoreDescriptor Created CoreDescriptor: {name=collection1, config=solrconfig.xml, transient=false, schema=schema.xml, loadOnStartup=true, configSetProperties=configsetprops.json, collection=collection1, coreNodeName=, dataDir=data/, shard=}
   [junit4]   2> 108543 INFO  (TEST-CollectionTooManyReplicasTest.testAddTooManyReplicas-seed#[18ACC9A02D2EA756]) [n:127.0.0.1:36033_    ] o.a.s.c.CorePropertiesLocator Found core collection1 in /home/jenkins/workspace/Lucene-Solr-master-Linux/solr/build/solr-core/test/J0/../../../../../../../../../home/jenkins/workspace/Lucene-Solr-master-Linux/solr/build/solr-core/test/J0/temp/solr.cloud.CollectionTooManyReplicasTest_18ACC9A02D2EA756-001/shard-1-001/cores/collection1
   [junit4]   2> 108543 INFO  (TEST-CollectionTooManyReplicasTest.testAddTooManyReplicas-seed#[18ACC9A02D2EA756]) [n:127.0.0.1:36033_    ] o.a.s.c.CorePropertiesLocator Found 1 core definitions
   [junit4]   2> 108544 INFO  (TEST-CollectionTooManyReplicasTest.testAddTooManyReplicas-seed#[18ACC9A02D2EA756]) [n:127.0.0.1:36033_    ] o.a.s.s.SolrDispatchFilter user.dir=/home/jenkins/workspace/Lucene-Solr-master-Linux/solr/build/solr-core/test/J0
   [junit4]   2> 108544 INFO  (TEST-CollectionTooManyReplicasTest.testAddTooManyReplicas-seed#[18ACC9A02D2EA756]) [n:127.0.0.1:36033_    ] o.a.s.s.SolrDispatchFilter SolrDispatchFilter.init() done
   [junit4]   2> 108545 INFO  (coreLoadExecutor-633-thread-1-processing-n:127.0.0.1:36033_) [n:127.0.0.1:36033_ c:collection1   x:collection1] o.a.s.c.ZkController publishing state=down
   [junit4]   2> 108545 INFO  (coreLoadExecutor-633-thread-1-processing-n:127.0.0.1:36033_) [n:127.0.0.1:36033_ c:collection1   x:collection1] o.a.s.c.ZkController numShards not found on descriptor - reading it from system property
   [junit4]   2> 108546 INFO  (coreLoadExecutor-633-thread-1-processing-n:127.0.0.1:36033_) [n:127.0.0.1:36033_ c:collection1   x:collection1] o.a.s.c.ZkController look for our core node name
   [junit4]   2> 108546 INFO  (OverseerStateUpdate-95493804848381956-127.0.0.1:52106_-n_0000000000) [n:127.0.0.1:52106_    ] o.a.s.c.Overseer processMessage: queueSize: 1, message = {
   [junit4]   2>   "core":"collection1",
   [junit4]   2>   "roles":null,
   [junit4]   2>   "base_url":"http://127.0.0.1:36033",
   [junit4]   2>   "node_name":"127.0.0.1:36033_",
   [junit4]   2>   "numShards":"1",
   [junit4]   2>   "state":"down",
   [junit4]   2>   "shard":null,
   [junit4]   2>   "collection":"collection1",
   [junit4]   2>   "operation":"state"} current state version: 4
   [junit4]   2> 108546 INFO  (OverseerStateUpdate-95493804848381956-127.0.0.1:52106_-n_0000000000) [n:127.0.0.1:52106_    ] o.a.s.c.o.ReplicaMutator Update state numShards=1 message={
   [junit4]   2>   "core":"collection1",
   [junit4]   2>   "roles":null,
   [junit4]   2>   "base_url":"http://127.0.0.1:36033",
   [junit4]   2>   "node_name":"127.0.0.1:36033_",
   [junit4]   2>   "numShards":"1",
   [junit4]   2>   "state":"down",
   [junit4]   2>   "shard":null,
   [junit4]   2>   "collection":"collection1",
   [junit4]   2>   "operation":"state"}
   [junit4]   2> 108546 INFO  (OverseerStateUpdate-95493804848381956-127.0.0.1:52106_-n_0000000000) [n:127.0.0.1:52106_    ] o.a.s.c.o.ClusterStateMutator building a new cName: collection1
   [junit4]   2> 108546 INFO  (OverseerStateUpdate-95493804848381956-127.0.0.1:52106_-n_0000000000) [n:127.0.0.1:52106_    ] o.a.s.c.o.ReplicaMutator Assigning new node to shard shard=shard1
   [junit4]   2> 108647 INFO  (zkCallback-170-thread-1) [    ] o.a.s.c.c.ZkStateReader A cluster state change: [WatchedEvent state:SyncConnected type:NodeDataChanged path:/clusterstate.json], has occurred - updating... (live nodes size: [2])
   [junit4]   2> 108647 INFO  (zkCallback-168-thread-1-processing-n:127.0.0.1:52106_) [n:127.0.0.1:52106_    ] o.a.s.c.c.ZkStateReader A cluster state change: [WatchedEvent state:SyncConnected type:NodeDataChanged path:/clusterstate.json], has occurred - updating... (live nodes size: [2])
   [junit4]   2> 108648 INFO  (zkCallback-175-thread-1-processing-n:127.0.0.1:36033_) [n:127.0.0.1:36033_    ] o.a.s.c.c.ZkStateReader A cluster state change: [WatchedEvent state:SyncConnected type:NodeDataChanged path:/clusterstate.json], has occurred - updating... (live nodes size: [2])
   [junit4]   2> 109546 INFO  (coreLoadExecutor-633-thread-1-processing-n:127.0.0.1:36033_) [n:127.0.0.1:36033_ c:collection1   x:collection1] o.a.s.c.ZkController waiting to find shard id in clusterstate for collection1
   [junit4]   2> 109546 INFO  (coreLoadExecutor-633-thread-1-processing-n:127.0.0.1:36033_) [n:127.0.0.1:36033_ c:collection1   x:collection1] o.a.s.c.ZkController Check for collection zkNode:collection1
   [junit4]   2> 109546 INFO  (coreLoadExecutor-633-thread-1-processing-n:127.0.0.1:36033_) [n:127.0.0.1:36033_ c:collection1   x:collection1] o.a.s.c.ZkController Collection zkNode exists
   [junit4]   2> 109546 INFO  (coreLoadExecutor-633-thread-1-processing-n:127.0.0.1:36033_) [n:127.0.0.1:36033_ c:collection1   x:collection1] o.a.s.c.c.ZkStateReader Load collection config from: [/collections/collection1]
   [junit4]   2> 109546 INFO  (coreLoadExecutor-633-thread-1-processing-n:127.0.0.1:36033_) [n:127.0.0.1:36033_ c:collection1   x:collection1] o.a.s.c.c.ZkStateReader path=[/collections/collection1] [configName]=[conf1] specified config exists in ZooKeeper
   [junit4]   2> 109546 INFO  (coreLoadExecutor-633-thread-1-processing-n:127.0.0.1:36033_) [n:127.0.0.1:36033_ c:collection1   x:collection1] o.a.s.c.SolrResourceLoader new SolrResourceLoader for directory: '/home/jenkins/workspace/Lucene-Solr-master-Linux/solr/build/solr-core/test/J0/temp/solr.cloud.CollectionTooManyReplicasTest_18ACC9A02D2EA756-001/shard-1-001/cores/collection1'
   [junit4]   2> 109547 INFO  (coreLoadExecutor-633-thread-1-processing-n:127.0.0.1:36033_) [n:127.0.0.1:36033_ c:collection1   x:collection1] o.a.s.c.SolrResourceLoader JNDI not configured for solr (NoInitialContextEx)
   [junit4]   2> 109547 INFO  (coreLoadExecutor-633-thread-1-processing-n:127.0.0.1:36033_) [n:127.0.0.1:36033_ c:collection1   x:collection1] o.a.s.c.SolrResourceLoader solr home defaulted to 'solr/' (could not find system property or JNDI)
   [junit4]   2> 109548 INFO  (coreLoadExecutor-633-thread-1-processing-n:127.0.0.1:36033_) [n:127.0.0.1:36033_ c:collection1   x:collection1] o.a.s.c.Config loaded config solrconfig.xml with version 0 
   [junit4]   2> 109552 INFO  (coreLoadExecutor-633-thread-1-processing-n:127.0.0.1:36033_) [n:127.0.0.1:36033_ c:collection1   x:collection1] o.a.s.c.SolrConfig current version of requestparams : -1
   [junit4]   2> 109555 INFO  (coreLoadExecutor-633-thread-1-processing-n:127.0.0.1:36033_) [n:127.0.0.1:36033_ c:collection1   x:collection1] o.a.s.c.SolrConfig Using Lucene MatchVersion: 7.0.0
   [junit4]   2> 109560 INFO  (coreLoadExecutor-633-thread-1-processing-n:127.0.0.1:36033_) [n:127.0.0.1:36033_ c:collection1   x:collection1] o.a.s.c.SolrConfig Loaded SolrConfig: solrconfig.xml
   [junit4]   2> 109566 INFO  (coreLoadExecutor-633-thread-1-processing-n:127.0.0.1:36033_) [n:127.0.0.1:36033_ c:collection1   x:collection1] o.a.s.s.IndexSchema [collection1] Schema name=test
   [junit4]   2> 109642 INFO  (coreLoadExecutor-633-thread-1-processing-n:127.0.0.1:36033_) [n:127.0.0.1:36033_ c:collection1   x:collection1] o.a.s.s.OpenExchangeRatesOrgProvider Initialized with rates=open-exchange-rates.json, refreshInterval=1440.
   [junit4]   2> 109646 INFO  (coreLoadExecutor-633-thread-1-processing-n:127.0.0.1:36033_) [n:127.0.0.1:36033_ c:collection1   x:collection1] o.a.s.s.IndexSchema default search field in schema is text
   [junit4]   2> 109647 INFO  (coreLoadExecutor-633-thread-1-processing-n:127.0.0.1:36033_) [n:127.0.0.1:36033_ c:collection1   x:collection1] o.a.s.s.IndexSchema unique key field: id
   [junit4]   2> 109651 INFO  (coreLoadExecutor-633-thread-1-processing-n:127.0.0.1:36033_) [n:127.0.0.1:36033_ c:collection1   x:collection1] o.a.s.s.FileExchangeRateProvider Reloading exchange rates from file currency.xml
   [junit4]   2> 109652 INFO  (coreLoadExecutor-633-thread-1-processing-n:127.0.0.1:36033_) [n:127.0.0.1:36033_ c:collection1   x:collection1] o.a.s.s.FileExchangeRateProvider Reloading exchange rates from file currency.xml
   [junit4]   2> 109653 INFO  (coreLoadExecutor-633-thread-1-processing-n:127.0.0.1:36033_) [n:127.0.0.1:36033_ c:collection1   x:collection1] o.a.s.s.OpenExchangeRatesOrgProvider Reloading exchange rates from open-exchange-rates.json
   [junit4]   2> 109654 INFO  (coreLoadExecutor-633-thread-1-processing-n:127.0.0.1:36033_) [n:127.0.0.1:36033_ c:collection1   x:collection1] o.a.s.s.OpenExchangeRatesOrgProvider Reloading exchange rates from open-exchange-rates.json
   [junit4]   2> 109654 INFO  (coreLoadExecutor-633-thread-1-processing-n:127.0.0.1:36033_) [n:127.0.0.1:36033_ c:collection1   x:collection1] o.a.s.c.ConfigSetProperties Did not find ConfigSet properties, assuming default properties: Can't find resource 'configsetprops.json' in classpath or '/configs/conf1', cwd=/home/jenkins/workspace/Lucene-Solr-master-Linux/solr/build/solr-core/test/J0
   [junit4]   2> 109654 INFO  (coreLoadExecutor-633-thread-1-processing-n:127.0.0.1:36033_) [n:127.0.0.1:36033_ c:collection1   x:collection1] o.a.s.c.CoreContainer Creating SolrCore 'collection1' using configuration from collection collection1
   [junit4]   2> 109655 INFO  (coreLoadExecutor-633-thread-1-processing-n:127.0.0.1:36033_) [n:127.0.0.1:36033_ c:collection1 s:shard1 r:core_node1 x:collection1] o.a.s.c.SolrCore org.apache.solr.core.MockDirectoryFactory
   [junit4]   2> 109655 INFO  (coreLoadExecutor-633-thread-1-processing-n:127.0.0.1:36033_) [n:127.0.0.1:36033_ c:collection1 s:shard1 r:core_node1 x:collection1] o.a.s.c.SolrCore [[collection1] ] Opening new SolrCore at [/home/jenkins/workspace/Lucene-Solr-master-Linux/solr/build/solr-core/test/J0/temp/solr.cloud.CollectionTooManyReplicasTest_18ACC9A02D2EA756-001/shard-1-001/cores/collection1], dataDir=[/home/jenkins/workspace/Lucene-So

[...truncated too long message...]

ava:229)
   [junit4]   2> 	at java.util.concurrent.ThreadPoolExecutor.runWorker(ThreadPoolExecutor.java:1142)
   [junit4]   2> 	at java.util.concurrent.ThreadPoolExecutor$Worker.run(ThreadPoolExecutor.java:617)
   [junit4]   2> 	at java.lang.Thread.run(Thread.java:745)
   [junit4]   2> 176566 INFO  (zkCallback-220-thread-2-processing-n:127.0.0.1:43545_) [n:127.0.0.1:43545_ c:TooManyReplicasWhenAddingShards s:shard1 r:core_node4 x:TooManyReplicasWhenAddingShards_shard1_replica1] o.a.s.c.CachingDirectoryFactory Closing directory: /home/jenkins/workspace/Lucene-Solr-master-Linux/solr/build/solr-core/test/J0/../../../../../../../../../home/jenkins/workspace/Lucene-Solr-master-Linux/solr/build/solr-core/test/J0/temp/solr.cloud.CollectionTooManyReplicasTest_18ACC9A02D2EA756-001/shard-2-002/cores/TooManyReplicasWhenAddingShards_shard1_replica1/data
   [junit4]   2> 176566 INFO  (zkCallback-220-thread-2-processing-n:127.0.0.1:43545_) [n:127.0.0.1:43545_ c:TooManyReplicasWhenAddingShards s:shard1 r:core_node4 x:TooManyReplicasWhenAddingShards_shard1_replica1] o.a.s.c.CachingDirectoryFactory looking to close /home/jenkins/workspace/Lucene-Solr-master-Linux/solr/build/solr-core/test/J0/../../../../../../../../../home/jenkins/workspace/Lucene-Solr-master-Linux/solr/build/solr-core/test/J0/temp/solr.cloud.CollectionTooManyReplicasTest_18ACC9A02D2EA756-001/shard-2-002/cores/TooManyReplicasWhenAddingShards_shard1_replica1/data/index [CachedDir<<refCount=0;path=/home/jenkins/workspace/Lucene-Solr-master-Linux/solr/build/solr-core/test/J0/../../../../../../../../../home/jenkins/workspace/Lucene-Solr-master-Linux/solr/build/solr-core/test/J0/temp/solr.cloud.CollectionTooManyReplicasTest_18ACC9A02D2EA756-001/shard-2-002/cores/TooManyReplicasWhenAddingShards_shard1_replica1/data/index;done=false>>]
   [junit4]   2> 176566 INFO  (zkCallback-220-thread-2-processing-n:127.0.0.1:43545_) [n:127.0.0.1:43545_ c:TooManyReplicasWhenAddingShards s:shard1 r:core_node4 x:TooManyReplicasWhenAddingShards_shard1_replica1] o.a.s.c.CachingDirectoryFactory Closing directory: /home/jenkins/workspace/Lucene-Solr-master-Linux/solr/build/solr-core/test/J0/../../../../../../../../../home/jenkins/workspace/Lucene-Solr-master-Linux/solr/build/solr-core/test/J0/temp/solr.cloud.CollectionTooManyReplicasTest_18ACC9A02D2EA756-001/shard-2-002/cores/TooManyReplicasWhenAddingShards_shard1_replica1/data/index
   [junit4]   2> 176567 INFO  (zkCallback-220-thread-2-processing-n:127.0.0.1:43545_) [n:127.0.0.1:43545_ c:TooManyReplicasWhenAddingShards s:shard1 r:core_node4 x:TooManyReplicasWhenAddingShards_shard1_replica1] o.a.s.c.ElectionContext Canceling election /collections/TooManyReplicasWhenAddingShards/leader_elect/shard1/election/95493807126478859-core_node4-n_0000000001
   [junit4]   2> 176567 WARN  (zkCallback-220-thread-2-processing-n:127.0.0.1:43545_) [n:127.0.0.1:43545_ c:TooManyReplicasWhenAddingShards s:shard1 r:core_node4 x:TooManyReplicasWhenAddingShards_shard1_replica1] o.a.s.c.LeaderElector 
   [junit4]   2> org.apache.zookeeper.KeeperException$SessionExpiredException: KeeperErrorCode = Session expired for /collections/TooManyReplicasWhenAddingShards/leader_elect/shard1/election/95493807126478859-core_node4-n_0000000001
   [junit4]   2> 	at org.apache.zookeeper.KeeperException.create(KeeperException.java:127)
   [junit4]   2> 	at org.apache.zookeeper.KeeperException.create(KeeperException.java:51)
   [junit4]   2> 	at org.apache.zookeeper.ZooKeeper.delete(ZooKeeper.java:873)
   [junit4]   2> 	at org.apache.solr.common.cloud.SolrZkClient$2.execute(SolrZkClient.java:244)
   [junit4]   2> 	at org.apache.solr.common.cloud.SolrZkClient$2.execute(SolrZkClient.java:241)
   [junit4]   2> 	at org.apache.solr.common.cloud.ZkCmdExecutor.retryOperation(ZkCmdExecutor.java:60)
   [junit4]   2> 	at org.apache.solr.common.cloud.SolrZkClient.delete(SolrZkClient.java:241)
   [junit4]   2> 	at org.apache.solr.cloud.ElectionContext.cancelElection(ElectionContext.java:86)
   [junit4]   2> 	at org.apache.solr.cloud.ShardLeaderElectionContextBase.cancelElection(ElectionContext.java:143)
   [junit4]   2> 	at org.apache.solr.cloud.ShardLeaderElectionContext.cancelElection(ElectionContext.java:279)
   [junit4]   2> 	at org.apache.solr.cloud.ShardLeaderElectionContext.runLeaderProcess(ElectionContext.java:455)
   [junit4]   2> 	at org.apache.solr.cloud.LeaderElector.runIamLeaderProcess(LeaderElector.java:173)
   [junit4]   2> 	at org.apache.solr.cloud.LeaderElector.checkIfIamLeader(LeaderElector.java:138)
   [junit4]   2> 	at org.apache.solr.cloud.LeaderElector.access$200(LeaderElector.java:59)
   [junit4]   2> 	at org.apache.solr.cloud.LeaderElector$ElectionWatcher.process(LeaderElector.java:351)
   [junit4]   2> 	at org.apache.solr.common.cloud.SolrZkClient$3.lambda$process$0(SolrZkClient.java:266)
   [junit4]   2> 	at java.util.concurrent.Executors$RunnableAdapter.call(Executors.java:511)
   [junit4]   2> 	at java.util.concurrent.FutureTask.run(FutureTask.java:266)
   [junit4]   2> 	at org.apache.solr.common.util.ExecutorUtil$MDCAwareThreadPoolExecutor.lambda$execute$0(ExecutorUtil.java:229)
   [junit4]   2> 	at java.util.concurrent.ThreadPoolExecutor.runWorker(ThreadPoolExecutor.java:1142)
   [junit4]   2> 	at java.util.concurrent.ThreadPoolExecutor$Worker.run(ThreadPoolExecutor.java:617)
   [junit4]   2> 	at java.lang.Thread.run(Thread.java:745)
   [junit4]   2> 176568 INFO  (TEST-CollectionTooManyReplicasTest.testAddShard-seed#[18ACC9A02D2EA756]) [    ] o.e.j.s.ServerConnector Stopped ServerConnector@1cbc4d6d{HTTP/1.1,[http/1.1]}{127.0.0.1:0}
   [junit4]   2> 176568 INFO  (TEST-CollectionTooManyReplicasTest.testAddShard-seed#[18ACC9A02D2EA756]) [    ] o.e.j.s.h.ContextHandler Stopped o.e.j.s.ServletContextHandler@55700264{/,null,UNAVAILABLE}
   [junit4]   2> 176569 INFO  (TEST-CollectionTooManyReplicasTest.testAddShard-seed#[18ACC9A02D2EA756]) [    ] o.a.s.c.ChaosMonkey monkey: stop shard! 50073
   [junit4]   2> 176569 INFO  (TEST-CollectionTooManyReplicasTest.testAddShard-seed#[18ACC9A02D2EA756]) [    ] o.a.s.c.ZkTestServer connecting to 127.0.0.1:59306 59306
   [junit4]   2> 176590 INFO  (Thread-531) [    ] o.a.s.c.ZkTestServer connecting to 127.0.0.1:59306 59306
   [junit4]   2> 176591 WARN  (Thread-531) [    ] o.a.s.c.ZkTestServer Watch limit violations: 
   [junit4]   2> Maximum concurrent create/delete watches above limit:
   [junit4]   2> 
   [junit4]   2> 	5	/solr/aliases.json
   [junit4]   2> 	3	/solr/security.json
   [junit4]   2> 	3	/solr/configs/conf1
   [junit4]   2> 
   [junit4]   2> Maximum concurrent data watches above limit:
   [junit4]   2> 
   [junit4]   2> 	5	/solr/clusterstate.json
   [junit4]   2> 	3	/solr/collections/TooManyReplicasWhenAddingShards/state.json
   [junit4]   2> 
   [junit4]   2> Maximum concurrent children watches above limit:
   [junit4]   2> 
   [junit4]   2> 	5	/solr/live_nodes
   [junit4]   2> 	5	/solr/collections
   [junit4]   2> 	3	/solr/overseer/queue
   [junit4]   2> 	3	/solr/overseer/collection-queue-work
   [junit4]   2> 	2	/solr/overseer/queue-work
   [junit4]   2> 
   [junit4]   2> 176592 INFO  (SUITE-CollectionTooManyReplicasTest-seed#[18ACC9A02D2EA756]-worker) [    ] o.a.s.SolrTestCaseJ4 ###deleteCore
   [junit4]   2> NOTE: leaving temporary files on disk at: /home/jenkins/workspace/Lucene-Solr-master-Linux/solr/build/solr-core/test/J0/temp/solr.cloud.CollectionTooManyReplicasTest_18ACC9A02D2EA756-001
   [junit4]   2> Mar 04, 2016 7:31:35 PM com.carrotsearch.randomizedtesting.ThreadLeakControl checkThreadLeaks
   [junit4]   2> WARNING: Will linger awaiting termination of 3 leaked thread(s).
   [junit4]   2> NOTE: test params are: codec=Asserting(Lucene60): {}, docValues:{}, maxPointsInLeafNode=1761, maxMBSortInHeap=5.993769577447561, sim=ClassicSimilarity, locale=es-NI, timezone=Africa/Harare
   [junit4]   2> NOTE: Linux 3.19.0-51-generic amd64/Oracle Corporation 1.8.0_72 (64-bit)/cpus=12,threads=1,free=261616312,total=509018112
   [junit4]   2> NOTE: All tests run in this JVM: [BlockJoinFacetSimpleTest, UUIDUpdateProcessorFallbackTest, TestRandomFaceting, HdfsDirectoryTest, TestConfigSetsAPIExclusivity, RankQueryTest, OverriddenZkACLAndCredentialsProvidersTest, EchoParamsTest, TestSolrConfigHandler, TestIntervalFaceting, TestOmitPositions, AlternateDirectoryTest, TestHashQParserPlugin, TestQueryWrapperFilter, DeleteShardTest, TestCustomDocTransformer, CurrencyFieldOpenExchangeTest, StandardRequestHandlerTest, TestRealTimeGet, TestRandomDVFaceting, DistributedSuggestComponentTest, TestValueSourceCache, TestImplicitCoreProperties, TestManagedStopFilterFactory, CollectionTooManyReplicasTest]
   [junit4] Completed [64/581 (1!)] on J0 in 71.13s, 3 tests, 1 failure <<< FAILURES!

[...truncated 1700 lines...]
BUILD FAILED
/home/jenkins/workspace/Lucene-Solr-master-Linux/build.xml:740: The following error occurred while executing this line:
/home/jenkins/workspace/Lucene-Solr-master-Linux/build.xml:684: The following error occurred while executing this line:
/home/jenkins/workspace/Lucene-Solr-master-Linux/build.xml:59: The following error occurred while executing this line:
/home/jenkins/workspace/Lucene-Solr-master-Linux/solr/build.xml:233: The following error occurred while executing this line:
/home/jenkins/workspace/Lucene-Solr-master-Linux/solr/common-build.xml:524: The following error occurred while executing this line:
/home/jenkins/workspace/Lucene-Solr-master-Linux/lucene/common-build.xml:1457: The following error occurred while executing this line:
/home/jenkins/workspace/Lucene-Solr-master-Linux/lucene/common-build.xml:1014: There were test failures: 581 suites (8 ignored), 2344 tests, 1 failure, 116 ignored (71 assumptions) [seed: 18ACC9A02D2EA756]

Total time: 49 minutes 53 seconds
Build step 'Invoke Ant' marked build as failure
Archiving artifacts
[WARNINGS] Skipping publisher since build result is FAILURE
Recording test results
Email was triggered for: Failure - Any
Sending email for trigger: Failure - Any



Mime
View raw message