lucene-dev mailing list archives

Site index · List index
Message view « Date » · « Thread »
Top « Date » · « Thread »
From Policeman Jenkins Server <jenk...@thetaphi.de>
Subject [JENKINS-EA] Lucene-Solr-master-Linux (32bit/jdk-9-ea+109) - Build # 16189 - Still Failing!
Date Sat, 12 Mar 2016 11:46:26 GMT
Build: http://jenkins.thetaphi.de/job/Lucene-Solr-master-Linux/16189/
Java: 32bit/jdk-9-ea+109 -client -XX:+UseSerialGC

1 tests failed.
FAILED:  org.apache.solr.cloud.UnloadDistributedZkTest.test

Error Message:
Captured an uncaught exception in thread: Thread[id=7399, name=testExecutor-3343-thread-3, state=RUNNABLE, group=TGRP-UnloadDistributedZkTest]

Stack Trace:
com.carrotsearch.randomizedtesting.UncaughtExceptionError: Captured an uncaught exception in thread: Thread[id=7399, name=testExecutor-3343-thread-3, state=RUNNABLE, group=TGRP-UnloadDistributedZkTest]
	at __randomizedtesting.SeedInfo.seed([A4ED74EFCD7962BA:2CB94B3563850F42]:0)
Caused by: java.lang.RuntimeException: org.apache.solr.client.solrj.SolrServerException: Timeout occured while waiting response from server at: http://127.0.0.1:57065/w
	at __randomizedtesting.SeedInfo.seed([A4ED74EFCD7962BA]:0)
	at org.apache.solr.cloud.BasicDistributedZkTest.lambda$createCores$0(BasicDistributedZkTest.java:583)
	at org.apache.solr.common.util.ExecutorUtil$MDCAwareThreadPoolExecutor.lambda$execute$0(ExecutorUtil.java:229)
	at java.util.concurrent.ThreadPoolExecutor.runWorker(ThreadPoolExecutor.java:1158)
	at java.util.concurrent.ThreadPoolExecutor$Worker.run(ThreadPoolExecutor.java:632)
	at java.lang.Thread.run(Thread.java:804)
Caused by: org.apache.solr.client.solrj.SolrServerException: Timeout occured while waiting response from server at: http://127.0.0.1:57065/w
	at org.apache.solr.client.solrj.impl.HttpSolrClient.executeMethod(HttpSolrClient.java:588)
	at org.apache.solr.client.solrj.impl.HttpSolrClient.request(HttpSolrClient.java:241)
	at org.apache.solr.client.solrj.impl.HttpSolrClient.request(HttpSolrClient.java:230)
	at org.apache.solr.client.solrj.SolrClient.request(SolrClient.java:1219)
	at org.apache.solr.cloud.BasicDistributedZkTest.lambda$createCores$0(BasicDistributedZkTest.java:581)
	... 4 more
Caused by: java.net.SocketTimeoutException: Read timed out
	at java.net.SocketInputStream.socketRead0(Native Method)
	at java.net.SocketInputStream.socketRead(SocketInputStream.java:116)
	at java.net.SocketInputStream.read(SocketInputStream.java:170)
	at java.net.SocketInputStream.read(SocketInputStream.java:141)
	at org.apache.http.impl.io.AbstractSessionInputBuffer.fillBuffer(AbstractSessionInputBuffer.java:160)
	at org.apache.http.impl.io.SocketInputBuffer.fillBuffer(SocketInputBuffer.java:84)
	at org.apache.http.impl.io.AbstractSessionInputBuffer.readLine(AbstractSessionInputBuffer.java:273)
	at org.apache.http.impl.conn.DefaultHttpResponseParser.parseHead(DefaultHttpResponseParser.java:140)
	at org.apache.http.impl.conn.DefaultHttpResponseParser.parseHead(DefaultHttpResponseParser.java:57)
	at org.apache.http.impl.io.AbstractMessageParser.parse(AbstractMessageParser.java:261)
	at org.apache.http.impl.AbstractHttpClientConnection.receiveResponseHeader(AbstractHttpClientConnection.java:283)
	at org.apache.http.impl.conn.DefaultClientConnection.receiveResponseHeader(DefaultClientConnection.java:251)
	at org.apache.http.impl.conn.ManagedClientConnectionImpl.receiveResponseHeader(ManagedClientConnectionImpl.java:197)
	at org.apache.http.protocol.HttpRequestExecutor.doReceiveResponse(HttpRequestExecutor.java:272)
	at org.apache.http.protocol.HttpRequestExecutor.execute(HttpRequestExecutor.java:124)
	at org.apache.http.impl.client.DefaultRequestDirector.tryExecute(DefaultRequestDirector.java:685)
	at org.apache.http.impl.client.DefaultRequestDirector.execute(DefaultRequestDirector.java:487)
	at org.apache.http.impl.client.AbstractHttpClient.doExecute(AbstractHttpClient.java:882)
	at org.apache.http.impl.client.CloseableHttpClient.execute(CloseableHttpClient.java:82)
	at org.apache.http.impl.client.CloseableHttpClient.execute(CloseableHttpClient.java:107)
	at org.apache.http.impl.client.CloseableHttpClient.execute(CloseableHttpClient.java:55)
	at org.apache.solr.client.solrj.impl.HttpSolrClient.executeMethod(HttpSolrClient.java:482)
	... 8 more




Build Log:
[...truncated 11286 lines...]
   [junit4] Suite: org.apache.solr.cloud.UnloadDistributedZkTest
   [junit4]   2> Creating dataDir: /home/jenkins/workspace/Lucene-Solr-master-Linux/solr/build/solr-core/test/J2/temp/solr.cloud.UnloadDistributedZkTest_A4ED74EFCD7962BA-001/init-core-data-001
   [junit4]   2> 935574 INFO  (SUITE-UnloadDistributedZkTest-seed#[A4ED74EFCD7962BA]-worker) [    ] o.a.s.BaseDistributedSearchTestCase Setting hostContext system property: /w/
   [junit4]   2> 935576 INFO  (TEST-UnloadDistributedZkTest.test-seed#[A4ED74EFCD7962BA]) [    ] o.a.s.c.ZkTestServer STARTING ZK TEST SERVER
   [junit4]   2> 935576 INFO  (Thread-2639) [    ] o.a.s.c.ZkTestServer client port:0.0.0.0/0.0.0.0:0
   [junit4]   2> 935576 INFO  (Thread-2639) [    ] o.a.s.c.ZkTestServer Starting server
   [junit4]   2> 935676 INFO  (TEST-UnloadDistributedZkTest.test-seed#[A4ED74EFCD7962BA]) [    ] o.a.s.c.ZkTestServer start zk server on port:38275
   [junit4]   2> 935676 INFO  (TEST-UnloadDistributedZkTest.test-seed#[A4ED74EFCD7962BA]) [    ] o.a.s.c.c.SolrZkClient Using default ZkCredentialsProvider
   [junit4]   2> 935677 INFO  (TEST-UnloadDistributedZkTest.test-seed#[A4ED74EFCD7962BA]) [    ] o.a.s.c.c.ConnectionManager Waiting for client to connect to ZooKeeper
   [junit4]   2> 935678 INFO  (zkCallback-1010-thread-1) [    ] o.a.s.c.c.ConnectionManager Watcher org.apache.solr.common.cloud.ConnectionManager@a4c268 name:ZooKeeperConnection Watcher:127.0.0.1:38275 got event WatchedEvent state:SyncConnected type:None path:null path:null type:None
   [junit4]   2> 935678 INFO  (TEST-UnloadDistributedZkTest.test-seed#[A4ED74EFCD7962BA]) [    ] o.a.s.c.c.ConnectionManager Client is connected to ZooKeeper
   [junit4]   2> 935679 INFO  (TEST-UnloadDistributedZkTest.test-seed#[A4ED74EFCD7962BA]) [    ] o.a.s.c.c.SolrZkClient Using default ZkACLProvider
   [junit4]   2> 935679 INFO  (TEST-UnloadDistributedZkTest.test-seed#[A4ED74EFCD7962BA]) [    ] o.a.s.c.c.SolrZkClient makePath: /solr
   [junit4]   2> 935680 INFO  (TEST-UnloadDistributedZkTest.test-seed#[A4ED74EFCD7962BA]) [    ] o.a.s.c.c.SolrZkClient Using default ZkCredentialsProvider
   [junit4]   2> 935680 INFO  (TEST-UnloadDistributedZkTest.test-seed#[A4ED74EFCD7962BA]) [    ] o.a.s.c.c.ConnectionManager Waiting for client to connect to ZooKeeper
   [junit4]   2> 935681 INFO  (zkCallback-1011-thread-1) [    ] o.a.s.c.c.ConnectionManager Watcher org.apache.solr.common.cloud.ConnectionManager@1f8e68b name:ZooKeeperConnection Watcher:127.0.0.1:38275/solr got event WatchedEvent state:SyncConnected type:None path:null path:null type:None
   [junit4]   2> 935681 INFO  (TEST-UnloadDistributedZkTest.test-seed#[A4ED74EFCD7962BA]) [    ] o.a.s.c.c.ConnectionManager Client is connected to ZooKeeper
   [junit4]   2> 935681 INFO  (TEST-UnloadDistributedZkTest.test-seed#[A4ED74EFCD7962BA]) [    ] o.a.s.c.c.SolrZkClient Using default ZkACLProvider
   [junit4]   2> 935681 INFO  (TEST-UnloadDistributedZkTest.test-seed#[A4ED74EFCD7962BA]) [    ] o.a.s.c.c.SolrZkClient makePath: /collections/collection1
   [junit4]   2> 935682 INFO  (TEST-UnloadDistributedZkTest.test-seed#[A4ED74EFCD7962BA]) [    ] o.a.s.c.c.SolrZkClient makePath: /collections/collection1/shards
   [junit4]   2> 935683 INFO  (TEST-UnloadDistributedZkTest.test-seed#[A4ED74EFCD7962BA]) [    ] o.a.s.c.c.SolrZkClient makePath: /collections/control_collection
   [junit4]   2> 935683 INFO  (TEST-UnloadDistributedZkTest.test-seed#[A4ED74EFCD7962BA]) [    ] o.a.s.c.c.SolrZkClient makePath: /collections/control_collection/shards
   [junit4]   2> 935684 INFO  (TEST-UnloadDistributedZkTest.test-seed#[A4ED74EFCD7962BA]) [    ] o.a.s.c.AbstractZkTestCase put /home/jenkins/workspace/Lucene-Solr-master-Linux/solr/core/src/test-files/solr/collection1/conf/solrconfig-tlog.xml to /configs/conf1/solrconfig.xml
   [junit4]   2> 935684 INFO  (TEST-UnloadDistributedZkTest.test-seed#[A4ED74EFCD7962BA]) [    ] o.a.s.c.c.SolrZkClient makePath: /configs/conf1/solrconfig.xml
   [junit4]   2> 935685 INFO  (TEST-UnloadDistributedZkTest.test-seed#[A4ED74EFCD7962BA]) [    ] o.a.s.c.AbstractZkTestCase put /home/jenkins/workspace/Lucene-Solr-master-Linux/solr/core/src/test-files/solr/collection1/conf/schema.xml to /configs/conf1/schema.xml
   [junit4]   2> 935685 INFO  (TEST-UnloadDistributedZkTest.test-seed#[A4ED74EFCD7962BA]) [    ] o.a.s.c.c.SolrZkClient makePath: /configs/conf1/schema.xml
   [junit4]   2> 935686 INFO  (TEST-UnloadDistributedZkTest.test-seed#[A4ED74EFCD7962BA]) [    ] o.a.s.c.AbstractZkTestCase put /home/jenkins/workspace/Lucene-Solr-master-Linux/solr/core/src/test-files/solr/collection1/conf/solrconfig.snippet.randomindexconfig.xml to /configs/conf1/solrconfig.snippet.randomindexconfig.xml
   [junit4]   2> 935686 INFO  (TEST-UnloadDistributedZkTest.test-seed#[A4ED74EFCD7962BA]) [    ] o.a.s.c.c.SolrZkClient makePath: /configs/conf1/solrconfig.snippet.randomindexconfig.xml
   [junit4]   2> 935687 INFO  (TEST-UnloadDistributedZkTest.test-seed#[A4ED74EFCD7962BA]) [    ] o.a.s.c.AbstractZkTestCase put /home/jenkins/workspace/Lucene-Solr-master-Linux/solr/core/src/test-files/solr/collection1/conf/stopwords.txt to /configs/conf1/stopwords.txt
   [junit4]   2> 935687 INFO  (TEST-UnloadDistributedZkTest.test-seed#[A4ED74EFCD7962BA]) [    ] o.a.s.c.c.SolrZkClient makePath: /configs/conf1/stopwords.txt
   [junit4]   2> 935687 INFO  (TEST-UnloadDistributedZkTest.test-seed#[A4ED74EFCD7962BA]) [    ] o.a.s.c.AbstractZkTestCase put /home/jenkins/workspace/Lucene-Solr-master-Linux/solr/core/src/test-files/solr/collection1/conf/protwords.txt to /configs/conf1/protwords.txt
   [junit4]   2> 935688 INFO  (TEST-UnloadDistributedZkTest.test-seed#[A4ED74EFCD7962BA]) [    ] o.a.s.c.c.SolrZkClient makePath: /configs/conf1/protwords.txt
   [junit4]   2> 935689 INFO  (TEST-UnloadDistributedZkTest.test-seed#[A4ED74EFCD7962BA]) [    ] o.a.s.c.AbstractZkTestCase put /home/jenkins/workspace/Lucene-Solr-master-Linux/solr/core/src/test-files/solr/collection1/conf/currency.xml to /configs/conf1/currency.xml
   [junit4]   2> 935689 INFO  (TEST-UnloadDistributedZkTest.test-seed#[A4ED74EFCD7962BA]) [    ] o.a.s.c.c.SolrZkClient makePath: /configs/conf1/currency.xml
   [junit4]   2> 935689 INFO  (TEST-UnloadDistributedZkTest.test-seed#[A4ED74EFCD7962BA]) [    ] o.a.s.c.AbstractZkTestCase put /home/jenkins/workspace/Lucene-Solr-master-Linux/solr/core/src/test-files/solr/collection1/conf/enumsConfig.xml to /configs/conf1/enumsConfig.xml
   [junit4]   2> 935689 INFO  (TEST-UnloadDistributedZkTest.test-seed#[A4ED74EFCD7962BA]) [    ] o.a.s.c.c.SolrZkClient makePath: /configs/conf1/enumsConfig.xml
   [junit4]   2> 935690 INFO  (TEST-UnloadDistributedZkTest.test-seed#[A4ED74EFCD7962BA]) [    ] o.a.s.c.AbstractZkTestCase put /home/jenkins/workspace/Lucene-Solr-master-Linux/solr/core/src/test-files/solr/collection1/conf/open-exchange-rates.json to /configs/conf1/open-exchange-rates.json
   [junit4]   2> 935690 INFO  (TEST-UnloadDistributedZkTest.test-seed#[A4ED74EFCD7962BA]) [    ] o.a.s.c.c.SolrZkClient makePath: /configs/conf1/open-exchange-rates.json
   [junit4]   2> 935691 INFO  (TEST-UnloadDistributedZkTest.test-seed#[A4ED74EFCD7962BA]) [    ] o.a.s.c.AbstractZkTestCase put /home/jenkins/workspace/Lucene-Solr-master-Linux/solr/core/src/test-files/solr/collection1/conf/mapping-ISOLatin1Accent.txt to /configs/conf1/mapping-ISOLatin1Accent.txt
   [junit4]   2> 935691 INFO  (TEST-UnloadDistributedZkTest.test-seed#[A4ED74EFCD7962BA]) [    ] o.a.s.c.c.SolrZkClient makePath: /configs/conf1/mapping-ISOLatin1Accent.txt
   [junit4]   2> 935692 INFO  (TEST-UnloadDistributedZkTest.test-seed#[A4ED74EFCD7962BA]) [    ] o.a.s.c.AbstractZkTestCase put /home/jenkins/workspace/Lucene-Solr-master-Linux/solr/core/src/test-files/solr/collection1/conf/old_synonyms.txt to /configs/conf1/old_synonyms.txt
   [junit4]   2> 935692 INFO  (TEST-UnloadDistributedZkTest.test-seed#[A4ED74EFCD7962BA]) [    ] o.a.s.c.c.SolrZkClient makePath: /configs/conf1/old_synonyms.txt
   [junit4]   2> 935693 INFO  (TEST-UnloadDistributedZkTest.test-seed#[A4ED74EFCD7962BA]) [    ] o.a.s.c.AbstractZkTestCase put /home/jenkins/workspace/Lucene-Solr-master-Linux/solr/core/src/test-files/solr/collection1/conf/synonyms.txt to /configs/conf1/synonyms.txt
   [junit4]   2> 935693 INFO  (TEST-UnloadDistributedZkTest.test-seed#[A4ED74EFCD7962BA]) [    ] o.a.s.c.c.SolrZkClient makePath: /configs/conf1/synonyms.txt
   [junit4]   2> 935766 INFO  (TEST-UnloadDistributedZkTest.test-seed#[A4ED74EFCD7962BA]) [    ] o.a.s.SolrTestCaseJ4 Writing core.properties file to /home/jenkins/workspace/Lucene-Solr-master-Linux/solr/build/solr-core/test/J2/temp/solr.cloud.UnloadDistributedZkTest_A4ED74EFCD7962BA-001/control-001/cores/collection1
   [junit4]   2> 935768 INFO  (TEST-UnloadDistributedZkTest.test-seed#[A4ED74EFCD7962BA]) [    ] o.e.j.s.Server jetty-9.3.6.v20151106
   [junit4]   2> 935769 INFO  (TEST-UnloadDistributedZkTest.test-seed#[A4ED74EFCD7962BA]) [    ] o.e.j.s.h.ContextHandler Started o.e.j.s.ServletContextHandler@12af0b7{/w,null,AVAILABLE}
   [junit4]   2> 935769 INFO  (TEST-UnloadDistributedZkTest.test-seed#[A4ED74EFCD7962BA]) [    ] o.e.j.s.ServerConnector Started ServerConnector@dee96a{HTTP/1.1,[http/1.1]}{127.0.0.1:44476}
   [junit4]   2> 935770 INFO  (TEST-UnloadDistributedZkTest.test-seed#[A4ED74EFCD7962BA]) [    ] o.e.j.s.Server Started @937118ms
   [junit4]   2> 935770 INFO  (TEST-UnloadDistributedZkTest.test-seed#[A4ED74EFCD7962BA]) [    ] o.a.s.c.s.e.JettySolrRunner Jetty properties: {solr.data.dir=/home/jenkins/workspace/Lucene-Solr-master-Linux/solr/build/solr-core/test/J2/temp/solr.cloud.UnloadDistributedZkTest_A4ED74EFCD7962BA-001/tempDir-001/control/data, hostContext=/w, hostPort=44476, coreRootDirectory=/home/jenkins/workspace/Lucene-Solr-master-Linux/solr/build/solr-core/test/J2/temp/solr.cloud.UnloadDistributedZkTest_A4ED74EFCD7962BA-001/control-001/cores}
   [junit4]   2> 935770 INFO  (TEST-UnloadDistributedZkTest.test-seed#[A4ED74EFCD7962BA]) [    ] o.a.s.s.SolrDispatchFilter SolrDispatchFilter.init(): sun.misc.Launcher$AppClassLoader@1591d15
   [junit4]   2> 935770 INFO  (TEST-UnloadDistributedZkTest.test-seed#[A4ED74EFCD7962BA]) [    ] o.a.s.c.SolrResourceLoader new SolrResourceLoader for directory: '/home/jenkins/workspace/Lucene-Solr-master-Linux/solr/build/solr-core/test/J2/temp/solr.cloud.UnloadDistributedZkTest_A4ED74EFCD7962BA-001/control-001'
   [junit4]   2> 935770 INFO  (TEST-UnloadDistributedZkTest.test-seed#[A4ED74EFCD7962BA]) [    ] o.a.s.c.SolrResourceLoader JNDI not configured for solr (NoInitialContextEx)
   [junit4]   2> 935770 INFO  (TEST-UnloadDistributedZkTest.test-seed#[A4ED74EFCD7962BA]) [    ] o.a.s.c.SolrResourceLoader solr home defaulted to 'solr/' (could not find system property or JNDI)
   [junit4]   2> 935770 INFO  (TEST-UnloadDistributedZkTest.test-seed#[A4ED74EFCD7962BA]) [    ] o.a.s.c.c.SolrZkClient Using default ZkCredentialsProvider
   [junit4]   2> 935770 INFO  (TEST-UnloadDistributedZkTest.test-seed#[A4ED74EFCD7962BA]) [    ] o.a.s.c.c.ConnectionManager Waiting for client to connect to ZooKeeper
   [junit4]   2> 935771 INFO  (zkCallback-1012-thread-1) [    ] o.a.s.c.c.ConnectionManager Watcher org.apache.solr.common.cloud.ConnectionManager@11bb976 name:ZooKeeperConnection Watcher:127.0.0.1:38275/solr got event WatchedEvent state:SyncConnected type:None path:null path:null type:None
   [junit4]   2> 935771 INFO  (TEST-UnloadDistributedZkTest.test-seed#[A4ED74EFCD7962BA]) [    ] o.a.s.c.c.ConnectionManager Client is connected to ZooKeeper
   [junit4]   2> 935772 INFO  (TEST-UnloadDistributedZkTest.test-seed#[A4ED74EFCD7962BA]) [    ] o.a.s.c.c.SolrZkClient Using default ZkACLProvider
   [junit4]   2> 935772 INFO  (TEST-UnloadDistributedZkTest.test-seed#[A4ED74EFCD7962BA]) [    ] o.a.s.s.SolrDispatchFilter Loading solr.xml from SolrHome (not found in ZooKeeper)
   [junit4]   2> 935773 INFO  (TEST-UnloadDistributedZkTest.test-seed#[A4ED74EFCD7962BA]) [    ] o.a.s.c.SolrXmlConfig Loading container configuration from /home/jenkins/workspace/Lucene-Solr-master-Linux/solr/build/solr-core/test/J2/temp/solr.cloud.UnloadDistributedZkTest_A4ED74EFCD7962BA-001/control-001/solr.xml
   [junit4]   2> 935777 INFO  (TEST-UnloadDistributedZkTest.test-seed#[A4ED74EFCD7962BA]) [    ] o.a.s.c.CorePropertiesLocator Config-defined core root directory: /home/jenkins/workspace/Lucene-Solr-master-Linux/solr/build/solr-core/test/J2/temp/solr.cloud.UnloadDistributedZkTest_A4ED74EFCD7962BA-001/control-001/cores
   [junit4]   2> 935777 INFO  (TEST-UnloadDistributedZkTest.test-seed#[A4ED74EFCD7962BA]) [    ] o.a.s.c.CoreContainer New CoreContainer 29553783
   [junit4]   2> 935777 INFO  (TEST-UnloadDistributedZkTest.test-seed#[A4ED74EFCD7962BA]) [    ] o.a.s.c.CoreContainer Loading cores into CoreContainer [instanceDir=/home/jenkins/workspace/Lucene-Solr-master-Linux/solr/build/solr-core/test/J2/temp/solr.cloud.UnloadDistributedZkTest_A4ED74EFCD7962BA-001/control-001]
   [junit4]   2> 935777 WARN  (TEST-UnloadDistributedZkTest.test-seed#[A4ED74EFCD7962BA]) [    ] o.a.s.c.CoreContainer Couldn't add files from /home/jenkins/workspace/Lucene-Solr-master-Linux/solr/build/solr-core/test/J2/temp/solr.cloud.UnloadDistributedZkTest_A4ED74EFCD7962BA-001/control-001/lib to classpath: /home/jenkins/workspace/Lucene-Solr-master-Linux/solr/build/solr-core/test/J2/temp/solr.cloud.UnloadDistributedZkTest_A4ED74EFCD7962BA-001/control-001/lib
   [junit4]   2> 935777 INFO  (TEST-UnloadDistributedZkTest.test-seed#[A4ED74EFCD7962BA]) [    ] o.a.s.h.c.HttpShardHandlerFactory created with socketTimeout : 90000,urlScheme : ,connTimeout : 15000,maxConnectionsPerHost : 20,maxConnections : 10000,corePoolSize : 0,maximumPoolSize : 2147483647,maxThreadIdleTime : 5,sizeOfQueue : -1,fairnessPolicy : false,useRetries : false,
   [junit4]   2> 935778 INFO  (TEST-UnloadDistributedZkTest.test-seed#[A4ED74EFCD7962BA]) [    ] o.a.s.u.UpdateShardHandler Creating UpdateShardHandler HTTP client with params: socketTimeout=340000&connTimeout=45000&retry=true
   [junit4]   2> 935779 INFO  (TEST-UnloadDistributedZkTest.test-seed#[A4ED74EFCD7962BA]) [    ] o.a.s.l.LogWatcher SLF4J impl is org.slf4j.impl.Log4jLoggerFactory
   [junit4]   2> 935779 INFO  (TEST-UnloadDistributedZkTest.test-seed#[A4ED74EFCD7962BA]) [    ] o.a.s.l.LogWatcher Registering Log Listener [Log4j (org.slf4j.impl.Log4jLoggerFactory)]
   [junit4]   2> 935779 INFO  (TEST-UnloadDistributedZkTest.test-seed#[A4ED74EFCD7962BA]) [    ] o.a.s.c.ZkContainer Zookeeper client=127.0.0.1:38275/solr
   [junit4]   2> 935779 INFO  (TEST-UnloadDistributedZkTest.test-seed#[A4ED74EFCD7962BA]) [    ] o.a.s.c.ZkController zkHost includes chroot
   [junit4]   2> 935779 INFO  (TEST-UnloadDistributedZkTest.test-seed#[A4ED74EFCD7962BA]) [    ] o.a.s.c.c.SolrZkClient Using default ZkCredentialsProvider
   [junit4]   2> 935779 INFO  (TEST-UnloadDistributedZkTest.test-seed#[A4ED74EFCD7962BA]) [    ] o.a.s.c.c.ConnectionManager Waiting for client to connect to ZooKeeper
   [junit4]   2> 935780 INFO  (zkCallback-1015-thread-1) [    ] o.a.s.c.c.ConnectionManager Watcher org.apache.solr.common.cloud.ConnectionManager@1e330f4 name:ZooKeeperConnection Watcher:127.0.0.1:38275 got event WatchedEvent state:SyncConnected type:None path:null path:null type:None
   [junit4]   2> 935780 INFO  (TEST-UnloadDistributedZkTest.test-seed#[A4ED74EFCD7962BA]) [    ] o.a.s.c.c.ConnectionManager Client is connected to ZooKeeper
   [junit4]   2> 935781 INFO  (TEST-UnloadDistributedZkTest.test-seed#[A4ED74EFCD7962BA]) [    ] o.a.s.c.c.SolrZkClient Using default ZkACLProvider
   [junit4]   2> 935781 INFO  (TEST-UnloadDistributedZkTest.test-seed#[A4ED74EFCD7962BA]) [    ] o.a.s.c.c.ConnectionManager Waiting for client to connect to ZooKeeper
   [junit4]   2> 935782 INFO  (zkCallback-1016-thread-1) [    ] o.a.s.c.c.ConnectionManager Watcher org.apache.solr.common.cloud.ConnectionManager@59af8b name:ZooKeeperConnection Watcher:127.0.0.1:38275/solr got event WatchedEvent state:SyncConnected type:None path:null path:null type:None
   [junit4]   2> 935782 INFO  (TEST-UnloadDistributedZkTest.test-seed#[A4ED74EFCD7962BA]) [    ] o.a.s.c.c.ConnectionManager Client is connected to ZooKeeper
   [junit4]   2> 935783 INFO  (TEST-UnloadDistributedZkTest.test-seed#[A4ED74EFCD7962BA]) [    ] o.a.s.c.c.SolrZkClient makePath: /overseer/queue
   [junit4]   2> 935784 INFO  (TEST-UnloadDistributedZkTest.test-seed#[A4ED74EFCD7962BA]) [    ] o.a.s.c.c.SolrZkClient makePath: /overseer/collection-queue-work
   [junit4]   2> 935785 INFO  (TEST-UnloadDistributedZkTest.test-seed#[A4ED74EFCD7962BA]) [    ] o.a.s.c.c.SolrZkClient makePath: /overseer/collection-map-running
   [junit4]   2> 935786 INFO  (TEST-UnloadDistributedZkTest.test-seed#[A4ED74EFCD7962BA]) [    ] o.a.s.c.c.SolrZkClient makePath: /overseer/collection-map-completed
   [junit4]   2> 935787 INFO  (TEST-UnloadDistributedZkTest.test-seed#[A4ED74EFCD7962BA]) [    ] o.a.s.c.c.SolrZkClient makePath: /overseer/collection-map-failure
   [junit4]   2> 935787 INFO  (TEST-UnloadDistributedZkTest.test-seed#[A4ED74EFCD7962BA]) [    ] o.a.s.c.c.SolrZkClient makePath: /live_nodes
   [junit4]   2> 935788 INFO  (TEST-UnloadDistributedZkTest.test-seed#[A4ED74EFCD7962BA]) [    ] o.a.s.c.c.SolrZkClient makePath: /aliases.json
   [junit4]   2> 935789 INFO  (TEST-UnloadDistributedZkTest.test-seed#[A4ED74EFCD7962BA]) [    ] o.a.s.c.c.SolrZkClient makePath: /clusterstate.json
   [junit4]   2> 935789 INFO  (TEST-UnloadDistributedZkTest.test-seed#[A4ED74EFCD7962BA]) [    ] o.a.s.c.c.SolrZkClient makePath: /security.json
   [junit4]   2> 935790 INFO  (TEST-UnloadDistributedZkTest.test-seed#[A4ED74EFCD7962BA]) [    ] o.a.s.c.c.ZkStateReader Updating cluster state from ZooKeeper... 
   [junit4]   2> 935790 INFO  (TEST-UnloadDistributedZkTest.test-seed#[A4ED74EFCD7962BA]) [    ] o.a.s.c.c.ZkStateReader Updated live nodes from ZooKeeper... (0) -> (0)
   [junit4]   2> 935791 INFO  (TEST-UnloadDistributedZkTest.test-seed#[A4ED74EFCD7962BA]) [    ] o.a.s.c.c.SolrZkClient makePath: /overseer_elect
   [junit4]   2> 935791 INFO  (TEST-UnloadDistributedZkTest.test-seed#[A4ED74EFCD7962BA]) [    ] o.a.s.c.c.SolrZkClient makePath: /overseer_elect/election
   [junit4]   2> 935792 INFO  (TEST-UnloadDistributedZkTest.test-seed#[A4ED74EFCD7962BA]) [    ] o.a.s.c.Overseer Overseer (id=null) closing
   [junit4]   2> 935792 INFO  (TEST-UnloadDistributedZkTest.test-seed#[A4ED74EFCD7962BA]) [    ] o.a.s.c.LeaderElector Joined leadership election with path: /overseer_elect/election/95537209624428548-127.0.0.1:44476_w-n_0000000000
   [junit4]   2> 935792 INFO  (TEST-UnloadDistributedZkTest.test-seed#[A4ED74EFCD7962BA]) [    ] o.a.s.c.OverseerElectionContext I am going to be the leader 127.0.0.1:44476_w
   [junit4]   2> 935792 INFO  (TEST-UnloadDistributedZkTest.test-seed#[A4ED74EFCD7962BA]) [    ] o.a.s.c.c.SolrZkClient makePath: /overseer_elect/leader
   [junit4]   2> 935793 INFO  (TEST-UnloadDistributedZkTest.test-seed#[A4ED74EFCD7962BA]) [    ] o.a.s.c.Overseer Overseer (id=95537209624428548-127.0.0.1:44476_w-n_0000000000) starting
   [junit4]   2> 935794 INFO  (TEST-UnloadDistributedZkTest.test-seed#[A4ED74EFCD7962BA]) [    ] o.a.s.c.c.SolrZkClient makePath: /overseer/queue-work
   [junit4]   2> 935796 INFO  (TEST-UnloadDistributedZkTest.test-seed#[A4ED74EFCD7962BA]) [    ] o.a.s.c.OverseerAutoReplicaFailoverThread Starting OverseerAutoReplicaFailoverThread autoReplicaFailoverWorkLoopDelay=10000 autoReplicaFailoverWaitAfterExpiration=10000 autoReplicaFailoverBadNodeExpiration=60000
   [junit4]   2> 935796 INFO  (OverseerCollectionConfigSetProcessor-95537209624428548-127.0.0.1:44476_w-n_0000000000) [    ] o.a.s.c.OverseerTaskProcessor Process current queue of overseer operations
   [junit4]   2> 935796 INFO  (TEST-UnloadDistributedZkTest.test-seed#[A4ED74EFCD7962BA]) [    ] o.a.s.c.ZkController Register node as live in ZooKeeper:/live_nodes/127.0.0.1:44476_w
   [junit4]   2> 935797 INFO  (OverseerStateUpdate-95537209624428548-127.0.0.1:44476_w-n_0000000000) [    ] o.a.s.c.Overseer Starting to work on the main queue
   [junit4]   2> 935797 INFO  (TEST-UnloadDistributedZkTest.test-seed#[A4ED74EFCD7962BA]) [    ] o.a.s.c.c.SolrZkClient makePath: /live_nodes/127.0.0.1:44476_w
   [junit4]   2> 935797 INFO  (zkCallback-1016-thread-1) [    ] o.a.s.c.c.ZkStateReader A live node change: [WatchedEvent state:SyncConnected type:NodeChildrenChanged path:/live_nodes], has occurred - updating... (live nodes size: [0])
   [junit4]   2> 935798 INFO  (OverseerStateUpdate-95537209624428548-127.0.0.1:44476_w-n_0000000000) [    ] o.a.s.c.c.ZkStateReader Updated live nodes from ZooKeeper... (0) -> (1)
   [junit4]   2> 935798 INFO  (zkCallback-1016-thread-1) [    ] o.a.s.c.c.ZkStateReader Updated live nodes from ZooKeeper... (1) -> (1)
   [junit4]   2> 935819 INFO  (TEST-UnloadDistributedZkTest.test-seed#[A4ED74EFCD7962BA]) [    ] o.a.s.c.CoreContainer Security conf doesn't exist. Skipping setup for authorization module.
   [junit4]   2> 935819 INFO  (TEST-UnloadDistributedZkTest.test-seed#[A4ED74EFCD7962BA]) [    ] o.a.s.c.CoreContainer No authentication plugin used.
   [junit4]   2> 935819 INFO  (TEST-UnloadDistributedZkTest.test-seed#[A4ED74EFCD7962BA]) [    ] o.a.s.c.CorePropertiesLocator Looking for core definitions underneath /home/jenkins/workspace/Lucene-Solr-master-Linux/solr/build/solr-core/test/J2/temp/solr.cloud.UnloadDistributedZkTest_A4ED74EFCD7962BA-001/control-001/cores
   [junit4]   2> 935820 INFO  (TEST-UnloadDistributedZkTest.test-seed#[A4ED74EFCD7962BA]) [    ] o.a.s.c.CoreDescriptor Created CoreDescriptor: {name=collection1, config=solrconfig.xml, transient=false, schema=schema.xml, loadOnStartup=true, configSetProperties=configsetprops.json, collection=control_collection, coreNodeName=, dataDir=data/, shard=}
   [junit4]   2> 935820 INFO  (TEST-UnloadDistributedZkTest.test-seed#[A4ED74EFCD7962BA]) [    ] o.a.s.c.CorePropertiesLocator Found core collection1 in /home/jenkins/workspace/Lucene-Solr-master-Linux/solr/build/solr-core/test/J2/temp/solr.cloud.UnloadDistributedZkTest_A4ED74EFCD7962BA-001/control-001/cores/collection1
   [junit4]   2> 935820 INFO  (TEST-UnloadDistributedZkTest.test-seed#[A4ED74EFCD7962BA]) [    ] o.a.s.c.CorePropertiesLocator Found 1 core definitions
   [junit4]   2> 935821 INFO  (TEST-UnloadDistributedZkTest.test-seed#[A4ED74EFCD7962BA]) [    ] o.a.s.s.SolrDispatchFilter user.dir=/home/jenkins/workspace/Lucene-Solr-master-Linux/solr/build/solr-core/test/J2
   [junit4]   2> 935821 INFO  (TEST-UnloadDistributedZkTest.test-seed#[A4ED74EFCD7962BA]) [    ] o.a.s.s.SolrDispatchFilter SolrDispatchFilter.init() done
   [junit4]   2> 935821 INFO  (coreLoadExecutor-3265-thread-1) [    ] o.a.s.c.ZkController publishing state=down
   [junit4]   2> 935821 INFO  (coreLoadExecutor-3265-thread-1) [    ] o.a.s.c.ZkController numShards not found on descriptor - reading it from system property
   [junit4]   2> 935822 INFO  (coreLoadExecutor-3265-thread-1) [    ] o.a.s.c.ZkController look for our core node name
   [junit4]   2> 935822 INFO  (OverseerStateUpdate-95537209624428548-127.0.0.1:44476_w-n_0000000000) [    ] o.a.s.c.Overseer processMessage: queueSize: 1, message = {
   [junit4]   2>   "core":"collection1",
   [junit4]   2>   "roles":null,
   [junit4]   2>   "base_url":"http://127.0.0.1:44476/w",
   [junit4]   2>   "node_name":"127.0.0.1:44476_w",
   [junit4]   2>   "numShards":"1",
   [junit4]   2>   "state":"down",
   [junit4]   2>   "shard":null,
   [junit4]   2>   "collection":"control_collection",
   [junit4]   2>   "operation":"state"} current state version: 0
   [junit4]   2> 935822 INFO  (OverseerStateUpdate-95537209624428548-127.0.0.1:44476_w-n_0000000000) [    ] o.a.s.c.o.ReplicaMutator Update state numShards=1 message={
   [junit4]   2>   "core":"collection1",
   [junit4]   2>   "roles":null,
   [junit4]   2>   "base_url":"http://127.0.0.1:44476/w",
   [junit4]   2>   "node_name":"127.0.0.1:44476_w",
   [junit4]   2>   "numShards":"1",
   [junit4]   2>   "state":"down",
   [junit4]   2>   "shard":null,
   [junit4]   2>   "collection":"control_collection",
   [junit4]   2>   "operation":"state"}
   [junit4]   2> 935822 INFO  (OverseerStateUpdate-95537209624428548-127.0.0.1:44476_w-n_0000000000) [    ] o.a.s.c.o.ClusterStateMutator building a new cName: control_collection
   [junit4]   2> 935822 INFO  (OverseerStateUpdate-95537209624428548-127.0.0.1:44476_w-n_0000000000) [    ] o.a.s.c.o.ReplicaMutator Assigning new node to shard shard=shard1
   [junit4]   2> 935823 INFO  (zkCallback-1016-thread-1) [    ] o.a.s.c.c.ZkStateReader A cluster state change: [WatchedEvent state:SyncConnected type:NodeDataChanged path:/clusterstate.json], has occurred - updating... (live nodes size: [1])
   [junit4]   2> 936822 INFO  (coreLoadExecutor-3265-thread-1) [    ] o.a.s.c.ZkController waiting to find shard id in clusterstate for collection1
   [junit4]   2> 936822 INFO  (coreLoadExecutor-3265-thread-1) [    ] o.a.s.c.ZkController Check for collection zkNode:control_collection
   [junit4]   2> 936822 INFO  (coreLoadExecutor-3265-thread-1) [    ] o.a.s.c.ZkController Collection zkNode exists
   [junit4]   2> 936823 INFO  (coreLoadExecutor-3265-thread-1) [    ] o.a.s.c.c.ZkStateReader Load collection config from: [/collections/control_collection]
   [junit4]   2> 936823 INFO  (coreLoadExecutor-3265-thread-1) [    ] o.a.s.c.c.ZkStateReader path=[/collections/control_collection] [configName]=[conf1] specified config exists in ZooKeeper
   [junit4]   2> 936823 INFO  (coreLoadExecutor-3265-thread-1) [    ] o.a.s.c.SolrResourceLoader new SolrResourceLoader for directory: '/home/jenkins/workspace/Lucene-Solr-master-Linux/solr/build/solr-core/test/J2/temp/solr.cloud.UnloadDistributedZkTest_A4ED74EFCD7962BA-001/control-001/cores/collection1'
   [junit4]   2> 936823 INFO  (coreLoadExecutor-3265-thread-1) [    ] o.a.s.c.SolrResourceLoader JNDI not configured for solr (NoInitialContextEx)
   [junit4]   2> 936823 INFO  (coreLoadExecutor-3265-thread-1) [    ] o.a.s.c.SolrResourceLoader solr home defaulted to 'solr/' (could not find system property or JNDI)
   [junit4]   2> 936824 INFO  (coreLoadExecutor-3265-thread-1) [    ] o.a.s.c.Config loaded config solrconfig.xml with version 0 
   [junit4]   2> 936830 INFO  (coreLoadExecutor-3265-thread-1) [    ] o.a.s.c.SolrConfig current version of requestparams : -1
   [junit4]   2> 936835 WARN  (coreLoadExecutor-3265-thread-1) [    ] o.a.s.c.Config Beginning with Solr 5.5, <mergePolicy> is deprecated, use <mergePolicyFactory> instead.
   [junit4]   2> 936836 INFO  (coreLoadExecutor-3265-thread-1) [    ] o.a.s.c.SolrConfig Using Lucene MatchVersion: 7.0.0
   [junit4]   2> 936843 INFO  (coreLoadExecutor-3265-thread-1) [    ] o.a.s.c.SolrConfig Loaded SolrConfig: solrconfig.xml
   [junit4]   2> 936848 INFO  (coreLoadExecutor-3265-thread-1) [    ] o.a.s.s.IndexSchema [collection1] Schema name=test
   [junit4]   2> 936929 INFO  (coreLoadExecutor-3265-thread-1) [    ] o.a.s.s.OpenExchangeRatesOrgProvider Initialized with rates=open-exchange-rates.json, refreshInterval=1440.
   [junit4]   2> 936934 INFO  (coreLoadExecutor-3265-thread-1) [    ] o.a.s.s.IndexSchema default search field in schema is text
   [junit4]   2> 936935 INFO  (coreLoadExecutor-3265-thread-1) [    ] o.a.s.s.IndexSchema unique key field: id
   [junit4]   2> 936940 INFO  (coreLoadExecutor-3265-thread-1) [    ] o.a.s.s.FileExchangeRateProvider Reloading exchange rates from file currency.xml
   [junit4]   2> 936941 INFO  (coreLoadExecutor-3265-thread-1) [    ] o.a.s.s.FileExchangeRateProvider Reloading exchange rates from file currency.xml
   [junit4]   2> 936943 INFO  (coreLoadExecutor-3265-thread-1) [    ] o.a.s.s.OpenExchangeRatesOrgProvider Reloading exchange rates from open-exchange-rates.json
   [junit4]   2> 936943 INFO  (coreLoadExecutor-3265-thread-1) [    ] o.a.s.s.OpenExchangeRatesOrgProvider Reloading exchange rates from open-exchange-rates.json
   [junit4]   2> 936944 INFO  (coreLoadExecutor-3265-thread-1) [    ] o.a.s.c.ConfigSetProperties Did not find ConfigSet properties, assuming default properties: Can't find resource 'configsetprops.json' in classpath or '/configs/conf1', cwd=/home/jenkins/workspace/Lucene-Solr-master-Linux/solr/build/solr-core/test/J2
   [junit4]   2> 936944 INFO  (coreLoadExecutor-3265-thread-1) [    ] o.a.s.c.CoreContainer Creating SolrCore 'collection1' using configuration from collection control_collection
   [junit4]   2> 936944 INFO  (coreLoadExecutor-3265-thread-1) [    ] o.a.s.c.SolrCore org.apache.solr.core.MockDirectoryFactory
   [junit4]   2> 936945 INFO  (coreLoadExecutor-3265-thread-1) [    ] o.a.s.c.SolrCore [[collection1] ] Opening new SolrCore at [/home/jenkins/workspace/Lucene-Solr-master-Linux/solr/build/solr-core/test/J2/temp/solr.cloud.UnloadDistributedZkTest_A4ED74EFCD7962BA-001/control-001/cores/collection1], dataDir=[/home/jenkins/workspace/Lucene-Solr-master-Linux/solr/build/solr-core/test/J2/temp/solr.cloud.UnloadDistributedZkTest_A4ED74EFCD7962BA-001/control-001/cores/collection1/data/]
   [junit4]   2> 936945 INFO  (coreLoadExecutor-3265-thread-1) [    ] o.a.s.c.JmxMonitoredMap JMX monitoring is enabled. Adding Solr mbeans to JMX Server: com.sun.jmx.mbeanserver.JmxMBeanServer@ac59d4
   [junit4]   2> 936945 INFO  (coreLoadExecutor-3265-thread-1) [    ] o.a.s.c.CachingDirectoryFactory return new directory for /home/jenkins/workspace/Lucene-Solr-master-Linux/solr/build/solr-core/test/J2/temp/solr.cloud.UnloadDistributedZkTest_A4ED74EFCD7962BA-001/control-001/cores/collection1/data
   [junit4]   2> 936945 INFO  (coreLoadExecutor-3265-thread-1) [    ] o.a.s.c.SolrCore New index directory detected: old=null new=/home/jenkins/workspace/Lucene-Solr-master-Linux/solr/build/solr-core/test/J2/temp/solr.cloud.UnloadDistributedZkTest_A4ED74EFCD7962BA-001/control-001/cores/collection1/data/index/
   [junit4]   2> 936945 WARN  (coreLoadExecutor-3265-thread-1) [    ] o.a.s.c.SolrCore [collection1] Solr index directory '/home/jenkins/workspace/Lucene-Solr-master-Linux/solr/build/solr-core/test/J2/temp/solr.cloud.UnloadDistributedZkTest_A4ED74EFCD7962BA-001/control-001/cores/collection1/data/index' doesn't exist. Creating new index...
   [junit4]   2> 936946 INFO  (coreLoadExecutor-3265-thread-1) [    ] o.a.s.c.CachingDirectoryFactory return new directory for /home/jenkins/workspace/Lucene-Solr-master-Linux/solr/build/solr-core/test/J2/temp/solr.cloud.UnloadDistributedZkTest_A4ED74EFCD7962BA-001/control-001/cores/collection1/data/index
   [junit4]   2> 936946 INFO  (coreLoadExecutor-3265-thread-1) [    ] o.a.s.u.RandomMergePolicy RandomMergePolicy wrapping class org.apache.lucene.index.LogDocMergePolicy: [LogDocMergePolicy: minMergeSize=1000, mergeFactor=44, maxMergeSize=9223372036854775807, maxMergeSizeForForcedMerge=9223372036854775807, calibrateSizeByDeletes=true, maxMergeDocs=2147483647, maxCFSSegmentSizeMB=8.796093022207999E12, noCFSRatio=0.3594968885344807]
   [junit4]   2> 936946 INFO  (coreLoadExecutor-3265-thread-1) [    ] o.a.s.c.SolrDeletionPolicy SolrDeletionPolicy.onCommit: commits: num=1
   [junit4]   2> 	commit{dir=MockDirectoryWrapper(RAMDirectory@1872ac3 lockFactory=org.apache.lucene.store.SingleInstanceLockFactory@4e84d),segFN=segments_1,generation=1}
   [junit4]   2> 936946 INFO  (coreLoadExecutor-3265-thread-1) [    ] o.a.s.c.SolrDeletionPolicy newest commit generation = 1
   [junit4]   2> 936947 INFO  (OldIndexDirectoryCleanupThreadForCore-collection1) [    ] o.a.s.c.SolrCore Looking for old index directories to cleanup for core collection1 in /home/jenkins/workspace/Lucene-Solr-master-Linux/solr/build/solr-core/test/J2/temp/solr.cloud.UnloadDistributedZkTest_A4ED74EFCD7962BA-001/control-001/cores/collection1/data/
   [junit4]   2> 936947 WARN  (OldIndexDirectoryCleanupThreadForCore-collection1) [    ] o.a.s.c.DirectoryFactory /home/jenkins/workspace/Lucene-Solr-master-Linux/solr/build/solr-core/test/J2/temp/solr.cloud.UnloadDistributedZkTest_A4ED74EFCD7962BA-001/control-001/cores/collection1/data/ does not point to a valid data directory; skipping clean-up of old index directories.
   [junit4]   2> 936949 INFO  (coreLoadExecutor-3265-thread-1) [    ] o.a.s.u.p.UpdateRequestProcessorChain creating updateRequestProcessorChain "nodistrib"
   [junit4]   2> 936949 INFO  (coreLoadExecutor-3265-thread-1) [    ] o.a.s.u.p.UpdateRequestProcessorChain creating updateRequestProcessorChain "dedupe"
   [junit4]   2> 936949 INFO  (coreLoadExecutor-3265-thread-1) [    ] o.a.s.u.p.UpdateRequestProcessorChain inserting DistributedUpdateProcessorFactory into updateRequestProcessorChain "dedupe"
   [junit4]   2> 936949 INFO  (coreLoadExecutor-3265-thread-1) [    ] o.a.s.u.p.UpdateRequestProcessorChain creating updateRequestProcessorChain "stored_sig"
   [junit4]   2> 936949 INFO  (coreLoadExecutor-3265-thread-1) [    ] o.a.s.u.p.UpdateRequestProcessorChain inserting DistributedUpdateProcessorFactory into updateRequestProcessorChain "stored_sig"
   [junit4]   2> 936950 INFO  (coreLoadExecutor-3265-thread-1) [    ] o.a.s.u.p.UpdateRequestProcessorChain creating updateRequestProcessorChain "distrib-dup-test-chain-explicit"
   [junit4]   2> 936950 INFO  (coreLoadExecutor-3265-thread-1) [    ] o.a.s.u.p.UpdateRequestProcessorChain creating updateRequestProcessorChain "distrib-dup-test-chain-implicit"
   [junit4]   2> 936950 INFO  (coreLoadExecutor-3265-thread-1) [    ] o.a.s.u.p.UpdateRequestProcessorChain inserting DistributedUpdateProcessorFactory into updateRequestProcessorChain "distrib-dup-test-chain-implicit"
   [junit4]   2> 936950 INFO  (coreLoadExecutor-3265-thread-1) [    ] o.a.s.c.SolrCore no updateRequestProcessorChain defined as default, creating implicit default
   [junit4]   2> 936950 WARN  (coreLoadExecutor-3265-thread-1) [    ] o.a.s.c.RequestHandlers INVALID paramSet a in requestHandler {type = requestHandler,name = /dump,class = DumpRequestHandler,args = {defaults={a=A,b=B}}}
   [junit4]   2> 936952 INFO  (coreLoadExecutor-3265-thread-1) [    ] o.a.s.h.l.XMLLoader xsltCacheLifetimeSeconds=60
   [junit4]   2> 936953 INFO  (coreLoadExecutor-3265-thread-1) [    ] o.a.s.h.l.XMLLoader xsltCacheLifetimeSeconds=60
   [junit4]   2> 936954 INFO  (coreLoadExecutor-3265-thread-1) [    ] o.a.s.h.l.XMLLoader xsltCacheLifetimeSeconds=60
   [junit4]   2> 936955 INFO  (coreLoadExecutor-3265-thread-1) [    ] o.a.s.h.l.XMLLoader xsltCacheLifetimeSeconds=60
   [junit4]   2> 936959 INFO  (coreLoadExecutor-3265-thread-1) [    ] o.a.s.c.RequestHandlers Registered paths: /admin/mbeans,standard,/dump,/update/csv,/sql,/update/json/docs,/admin/luke,/export,/admin/segments,/get,/admin/system,/replication,/admin/properties,/config,/stream,/schema,/admin/plugins,/admin/logging,/update/json,/admin/ping,/admin/threads,/update,/admin/file
   [junit4]   2> 936959 INFO  (coreLoadExecutor-3265-thread-1) [    ] o.a.s.c.SolrCore Using default statsCache cache: org.apache.solr.search.stats.LocalStatsCache
   [junit4]   2> 936960 INFO  (coreLoadExecutor-3265-thread-1) [    ] o.a.s.u.UpdateHandler Using UpdateLog implementation: org.apache.solr.update.UpdateLog
   [junit4]   2> 936960 INFO  (coreLoadExecutor-3265-thread-1) [    ] o.a.s.u.UpdateLog Initializing UpdateLog: dataDir= defaultSyncLevel=FLUSH numRecordsToKeep=100 maxNumLogsToKeep=10 numVersionBuckets=65536
   [junit4]   2> 936970 INFO  (coreLoadExecutor-3265-thread-1) [    ] o.a.s.u.CommitTracker Hard AutoCommit: disabled
   [junit4]   2> 936971 INFO  (coreLoadExecutor-3265-thread-1) [    ] o.a.s.u.CommitTracker Soft AutoCommit: disabled
   [junit4]   2> 936971 INFO  (coreLoadExecutor-3265-thread-1) [    ] o.a.s.u.RandomMergePolicy RandomMergePolicy wrapping class org.apache.lucene.index.LogByteSizeMergePolicy: [LogByteSizeMergePolicy: minMergeSize=1677721, mergeFactor=27, maxMergeSize=2147483648, maxMergeSizeForForcedMerge=9223372036854775807, calibrateSizeByDeletes=true, maxMergeDocs=2147483647, maxCFSSegmentSizeMB=8.796093022207999E12, noCFSRatio=0.29941284816136227]
   [junit4]   2> 936971 INFO  (coreLoadExecutor-3265-thread-1) [    ] o.a.s.c.SolrDeletionPolicy SolrDeletionPolicy.onInit: commits: num=1
   [junit4]   2> 	commit{dir=MockDirectoryWrapper(RAMDirectory@1872ac3 lockFactory=org.apache.lucene.store.SingleInstanceLockFactory@4e84d),segFN=segments_1,generation=1}
   [junit4]   2> 936971 INFO  (coreLoadExecutor-3265-thread-1) [    ] o.a.s.c.SolrDeletionPolicy newest commit generation = 1
   [junit4]   2> 936971 INFO  (coreLoadExecutor-3265-thread-1) [    ] o.a.s.s.SolrIndexSearcher Opening [Searcher@1244efe[collection1] main]
   [junit4]   2> 936971 INFO  (coreLoadExecutor-3265-thread-1) [    ] o.a.s.c.c.ZkStateReader Load collection config from: [/collections/control_collection]
   [junit4]   2> 936972 INFO  (coreLoadExecutor-3265-thread-1) [    ] o.a.s.c.c.ZkStateReader path=[/collections/control_collection] [configName]=[conf1] specified config exists in ZooKeeper
   [junit4]   2> 936972 INFO  (coreLoadExecutor-3265-thread-1) [    ] o.a.s.r.ManagedResourceStorage Setting up ZooKeeper-based storage for the RestManager with znodeBase: /configs/conf1
   [junit4]   2> 936972 INFO  (coreLoadExecutor-3265-thread-1) [    ] o.a.s.r.ManagedResourceStorage Configured ZooKeeperStorageIO with znodeBase: /configs/conf1
   [junit4]   2> 936972 INFO  (coreLoadExecutor-3265-thread-1) [    ] o.a.s.r.RestManager Initializing RestManager with initArgs: {}
   [junit4]   2> 936973 INFO  (coreLoadExecutor-3265-thread-1) [    ] o.a.s.r.ManagedResourceStorage Reading _rest_managed.json using ZooKeeperStorageIO:path=/configs/conf1
   [junit4]   2> 936973 INFO  (coreLoadExecutor-3265-thread-1) [    ] o.a.s.r.ManagedResourceStorage No data found for znode /configs/conf1/_rest_managed.json
   [junit4]   2> 936973 INFO  (coreLoadExecutor-3265-thread-1) [    ] o.a.s.r.ManagedResourceStorage Loaded null at path _rest_managed.json using ZooKeeperStorageIO:path=/configs/conf1
   [junit4]   2> 936973 INFO  (coreLoadExecutor-3265-thread-1) [    ] o.a.s.r.RestManager Initializing 0 registered ManagedResources
   [junit4]   2> 936973 INFO  (coreLoadExecutor-3265-thread-1) [    ] o.a.s.h.ReplicationHandler Commits will be reserved for  10000
   [junit4]   2> 936974 INFO  (searcherExecutor-3266-thread-1) [    ] o.a.s.c.SolrCore [collection1] Registered new searcher Searcher@1244efe[collection1] main{ExitableDirectoryReader(UninvertingDirectoryReader())}
   [junit4]   2> 936974 INFO  (coreLoadExecutor-3265-thread-1) [    ] o.a.s.u.UpdateLog Looking up max value of version field to seed version buckets
   [junit4]   2> 936974 INFO  (coreLoadExecutor-3265-thread-1) [    ] o.a.s.u.VersionInfo Refreshing highest value of _version_ for 65536 version buckets from index
   [junit4]   2> 936974 INFO  (coreLoadExecutor-3265-thread-1) [    ] o.a.s.u.VersionInfo No terms found for _version_, cannot seed version bucket highest value from index
   [junit4]   2> 936974 INFO  (coreLoadExecutor-3265-thread-1) [    ] o.a.s.u.UpdateLog Could not find max version in index or recent updates, using new clock 1528595355455717376
   [junit4]   2> 936975 INFO  (coreLoadExecutor-3265-thread-1) [    ] o.a.s.u.UpdateLog Took 1.0ms to seed version buckets with highest version 1528595355455717376
   [junit4]   2> 936975 INFO  (coreLoadExecutor-3265-thread-1) [    ] o.a.s.c.ZkController watch zkdir /configs/conf1
   [junit4]   2> 936976 INFO  (coreLoadExecutor-3265-thread-1) [    ] o.a.s.c.CoreContainer registering core: collection1
   [junit4]   2> 936976 INFO  (coreZkRegister-3259-thread-1) [    ] o.a.s.c.ZkController Register replica - core:collection1 address:http://127.0.0.1:44476/w collection:control_collection shard:shard1
   [junit4]   2> 936977 INFO  (coreZkRegister-3259-thread-1) [    ] o.a.s.c.c.SolrZkClient makePath: /collections/control_collection/leader_elect/shard1/election
   [junit4]   2> 936978 INFO  (coreZkRegister-3259-thread-1) [    ] o.a.s.c.LeaderElector Joined leadership election with path: /collections/control_collection/leader_elect/shard1/election/95537209624428548-core_node1-n_0000000000
   [junit4]   2> 936978 INFO  (coreZkRegister-3259-thread-1) [    ] o.a.s.c.ShardLeaderElectionContext Running the leader process for shard=shard1 and weAreReplacement=false and leaderVoteWait=180000
   [junit4]   2> 936979 INFO  (coreZkRegister-3259-thread-1) [    ] o.a.s.c.ShardLeaderElectionContext Enough replicas found to continue.
   [junit4]   2> 936979 INFO  (coreZkRegister-3259-thread-1) [    ] o.a.s.c.ShardLeaderElectionContext I may be the new leader - try and sync
   [junit4]   2> 936979 INFO  (coreZkRegister-3259-thread-1) [    ] o.a.s.c.SyncStrategy Sync replicas to http://127.0.0.1:44476/w/collection1/
   [junit4]   2> 936979 INFO  (OverseerStateUpdate-95537209624428548-127.0.0.1:44476_w-n_0000000000) [    ] o.a.s.c.Overseer processMessage: queueSize: 1, message = {
   [junit4]   2>   "operation":"leader",
   [junit4]   2>   "shard":"shard1",
   [junit4]   2>   "collection":"control_collection"} current state version: 1
   [junit4]   2> 936979 INFO  (coreZkRegister-3259-thread-1) [    ] o.a.s.c.SyncStrategy Sync Success - now sync replicas to me
   [junit4]   2> 936979 INFO  (coreZkRegister-3259-thread-1) [    ] o.a.s.c.SyncStrategy http://127.0.0.1:44476/w/collection1/ has no replicas
   [junit4]   2> 936980 INFO  (coreZkRegister-3259-thread-1) [    ] o.a.s.c.c.SolrZkClient makePath: /collections/control_collection/leaders/shard1
   [junit4]   2> 936981 INFO  (coreZkRegister-3259-thread-1) [    ] o.a.s.c.ShardLeaderElectionContextBase Creating leader registration node /collections/control_collection/leaders/shard1/leader after winning as /collections/control_collection/leader_elect/shard1/election/95537209624428548-core_node1-n_0000000000
   [junit4]   2> 936982 INFO  (coreZkRegister-3259-thread-1) [    ] o.a.s.c.ShardLeaderElectionContext I am the new leader: http://127.0.0.1:44476/w/collection1/ shard1
   [junit4]   2> 936982 INFO  (OverseerStateUpdate-95537209624428548-127.0.0.1:44476_w-n_0000000000) [    ] o.a.s.c.Overseer processMessage: queueSize: 1, message = {
   [junit4]   2>   "operation":"leader",
   [junit4]   2>   "shard":"shard1",
   [junit4]   2>   "collection":"control_collection",
   [junit4]   2>   "base_url":"http://127.0.0.1:44476/w",
   [junit4]   2>   "core":"collection1",
   [junit4]   2>   "state":"active"} current state version: 1
   [junit4]   2> 937083 INFO  (zkCallback-1016-thread-1) [    ] o.a.s.c.c.ZkStateReader A cluster state change: [WatchedEvent state:SyncConnected type:NodeDataChanged path:/clusterstate.json], has occurred - updating... (live nodes size: [1])
   [junit4]   2> 937132 INFO  (coreZkRegister-3259-thread-1) [    ] o.a.s.c.ZkController We are http://127.0.0.1:44476/w/collection1/ and leader is http://127.0.0.1:44476/w/collection1/
   [junit4]   2> 937132 INFO  (coreZkRegister-3259-thread-1) [    ] o.a.s.c.ZkController No LogReplay needed for core=collection1 baseURL=http://127.0.0.1:44476/w
   [junit4]   2> 937132 INFO  (coreZkRegister-3259-thread-1) [    ] o.a.s.c.ZkController I am the leader, no recovery necessary
   [junit4]   2> 937132 INFO  (coreZkRegister-3259-thread-1) [    ] o.a.s.c.ZkController publishing state=active
   [junit4]   2> 937132 INFO  (coreZkRegister-3259-thread-1) [    ] o.a.s.c.ZkController numShards not found on descriptor - reading it from system property
   [junit4]   2> 937133 INFO  (OverseerStateUpdate-95537209624428548-127.0.0.1:44476_w-n_0000000000) [    ] o.a.s.c.Overseer processMessage: queueSize: 1, message = {
   [junit4]   2>   "core":"collection1",
   [junit4]   2>   "core_node_name":"core_node1",
   [junit4]   2>   "roles":null,
   [junit4]   2>   "base_url":"http://127.0.0.1:44476/w",
   [junit4]   2>   "node_name":"127.0.0.1:44476_w",
   [junit4]   2>   "numShards":"1",
   [junit4]   2>   "state":"active",
   [junit4]   2>   "shard":"shard1",
   [junit4]   2>   "collection":"control_collection",
   [junit4]   2>   "operation":"state"} current state version: 2
   [junit4]   2> 937134 INFO  (OverseerStateUpdate-95537209624428548-127.0.0.1:44476_w-n_0000000000) [    ] o.a.s.c.o.ReplicaMutator Update state numShards=1 message={
   [junit4]   2>   "core":"collection1",
   [junit4]   2>   "core_node_name":"core_node1",
   [junit4]   2>   "roles":null,
   [junit4]   2>   "base_url":"http://127.0.0.1:44476/w",
   [junit4]   2>   "node_name":"127.0.0.1:44476_w",
   [junit4]   2>   "numShards":"1",
   [junit4]   2>   "state":"active",
   [junit4]   2>   "shard":"shard1",
   [junit4]   2>   "collection":"control_collection",
   [junit4]   2>   "operation":"state"}
   [junit4]   2> 937236 INFO  (zkCallback-1016-thread-1) [    ] o.a.s.c.c.ZkStateReader A cluster state change: [WatchedEvent state:SyncConnected type:NodeDataChanged path:/clusterstate.json], has occurred - updating... (live nodes size: [1])
   [junit4]   2> 937322 INFO  (TEST-UnloadDistributedZkTest.test-seed#[A4ED74EFCD7962BA]) [    ] o.a.s.c.c.SolrZkClient Using default ZkCredentialsProvider
   [junit4]   2> 937322 INFO  (TEST-UnloadDistributedZkTest.test-seed#[A4ED74EFCD7962BA]) [    ] o.a.s.c.c.ConnectionManager Waiting for client to connect to ZooKeeper
   [junit4]   2> 937329 INFO  (zkCallback-1018-thread-1) [    ] o.a.s.c.c.ConnectionManager Watcher org.apache.solr.common.cloud.ConnectionManager@62c32a name:ZooKeeperConnection Watcher:127.0.0.1:38275/solr got event WatchedEvent state:SyncConnected type:None path:null path:null type:None
   [junit4]   2> 937329 INFO  (TEST-UnloadDistributedZkTest.test-seed#[A4ED74EFCD7962BA]) [    ] o.a.s.c.c.ConnectionManager Client is connected to ZooKeeper
   [junit4]   2> 937330 INFO  (TEST-UnloadDistributedZkTest.test-seed#[A4ED74EFCD7962BA]) [    ] o.a.s.c.c.SolrZkClient Using default ZkACLProvider
   [junit4]   2> 937330 INFO  (TEST-UnloadDistributedZkTest.test-seed#[A4ED74EFCD7962BA]) [    ] o.a.s.c.c.ZkStateReader Updating cluster state from ZooKeeper... 
   [junit4]   2> 937330 INFO  (TEST-UnloadDistributedZkTest.test-seed#[A4ED74EFCD7962BA]) [    ] o.a.s.c.c.ZkStateReader Updated live nodes from ZooKeeper... (0) -> (1)
   [junit4]   2> 937331 INFO  (TEST-UnloadDistributedZkTest.test-seed#[A4ED74EFCD7962BA]) [    ] o.a.s.c.ChaosMonkey monkey: init - expire sessions:false cause connection loss:false
   [junit4]   2> 937331 INFO  (TEST-UnloadDistributedZkTest.test-seed#[A4ED74EFCD7962BA]) [    ] o.a.s.c.AbstractFullDistribZkTestBase Creating collection1 with stateFormat=2
   [junit4]   2> 937331 INFO  (TEST-UnloadDistributedZkTest.test-seed#[A4ED74EFCD7962BA]) [    ] o.a.s.c.c.SolrZkClient Using default ZkCredentialsProvider
   [junit4]   2> 937331 INFO  (TEST-UnloadDistributedZkTest.test-seed#[A4ED74EFCD7962BA]) [    ] o.a.s.c.c.ConnectionManager Waiting for client to connect to ZooKeeper
   [junit4]   2> 937332 INFO  (zkCallback-1019-thread-1) [    ] o.a.s.c.c.ConnectionManager Watcher org.apache.solr.common.cloud.ConnectionManager@899b04 name:ZooKeeperConnection Watcher:127.0.0.1:38275/solr got event WatchedEvent state:SyncConnected type:None path:null path:null type:None
   [junit4]   2> 937332 INFO  (TEST-UnloadDistributedZkTest.test-seed#[A4ED74EFCD7962BA]) [    ] o.a.s.c.c.ConnectionManager Client is connected to ZooKeeper
   [junit4]   2> 937332 INFO  (TEST-UnloadDistributedZkTest.test-seed#[A4ED74EFCD7962BA]) [    ] o.a.s.c.c.SolrZkClient Using default ZkACLProvider
   [junit4]   2> 937333 INFO  (OverseerStateUpdate-95537209624428548-127.0.0.1:44476_w-n_0000000000) [    ] o.a.s.c.Overseer processMessage: queueSize: 1, message = {
   [junit4]   2>   "operation":"create",
   [junit4]   2>   "name":"collection1",
   [junit4]   2>   "numShards":"2",
   [junit4]   2>   "stateFormat":"2"} current state version: 3
   [junit4]   2> 937333 INFO  (OverseerStateUpdate-95537209624428548-127.0.0.1:44476_w-n_0000000000) [    ] o.a.s.c.o.ClusterStateMutator building a new cName: collection1
   [junit4]   2> 937435 INFO  (OverseerStateUpdate-95537209624428548-127.0.0.1:44476_w-n_0000000000) [    ] o.a.s.c.o.ZkStateWriter going to create_collection /collections/collection1/state.json
   [junit4]   2> 937446 INFO  (TEST-UnloadDistributedZkTest.test-seed#[A4ED74EFCD7962BA]) [    ] o.a.s.SolrTestCaseJ4 Writing core.properties file to /home/jenkins/workspace/Lucene-Solr-master-Linux/solr/build/solr-core/test/J2/temp/solr.cloud.UnloadDistributedZkTest_A4ED74EFCD7962BA-001/shard-1-001/cores/collection1
   [junit4]   2> 937446 INFO  (TEST-UnloadDistributedZkTest.test-seed#[A4ED74EFCD7962BA]) [    ] o.a.s.c.AbstractFullDistribZkTestBase create jetty 1 in directory /home/jenkins/workspace/Lucene-Solr-master-Linux/solr/build/solr-core/test/J2/temp/solr.cloud.UnloadDistributedZkTest_A4ED74EFCD7962BA-001/shard-1-001
   [junit4]   2> 937447 INFO  (TEST-UnloadDistributedZkTest.test-seed#[A4ED74EFCD7962BA]) [    ] o.e.j.s.Server jetty-9.3.6.v20151106
   [junit4]   2> 937448 INFO  (TEST-UnloadDistributedZkTest.test-seed#[A4ED74EFCD7962BA]) [    ] o.e.j.s.h.ContextHandler Started o.e.j.s.ServletContextHandler@13b9619{/w,null,AVAILABLE}
   [junit4]   2> 937449 INFO  (TEST-UnloadDistributedZkTest.test-seed#[A4ED74EFCD7962BA]) [    ] o.e.j.s.ServerConnector Started ServerConnector@ddbcf5{HTTP/1.1,[http/1.1]}{127.0.0.1:48231}
   [junit4]   2> 937449 INFO  (TEST-UnloadDistributedZkTest.test-seed#[A4ED74EFCD7962BA]) [    ] o.e.j.s.Server Started @938798ms
   [junit4]   2> 937449 INFO  (TEST-UnloadDistributedZkTest.test-seed#[A4ED74EFCD7962BA]) [    ] o.a.s.c.s.e.JettySolrRunner Jetty properties: {solr.data.dir=/home/jenkins/workspace/Lucene-Solr-master-Linux/solr/build/solr-core/test/J2/temp/solr.cloud.UnloadDistributedZkTest_A4ED74EFCD7962BA-001/tempDir-001/jetty1, solrconfig=solrconfig.xml, hostContext=/w, hostPort=48231, coreRootDirectory=/home/jenkins/workspace/Lucene-Solr-master-Linux/solr/build/solr-core/test/J2/temp/solr.cloud.UnloadDistributedZkTest_A4ED74EFCD7962BA-001/shard-1-001/cores}
   [junit4]   2> 937449 INFO  (TEST-UnloadDistributedZkTest.test-seed#[A4ED74EFCD7962BA]) [    ] o.a.s.s.SolrDispatchFilter SolrDispatchFilter.init(): sun.misc.Launcher$AppClassLoader@1591d15
   [junit4]   2> 937449 INFO  (TEST-UnloadDistributedZkTest.test-seed#[A4ED74EFCD7962BA]) [    ] o.a.s.c.SolrResourceLoader new SolrResourceLoader for directory: '/home/jenkins/workspace/Lucene-Solr-master-Linux/solr/build/solr-core/test/J2/temp/solr.cloud.UnloadDistributedZkTest_A4ED74EFCD7962BA-001/shard-1-001'
   [junit4]   2> 937450 INFO  (TEST-UnloadDistributedZkTest.test-seed#[A4ED74EFCD7962BA]) [    ] o.a.s.c.SolrResourceLoader JNDI not configured for solr (NoInitialContextEx)
   [junit4]   2> 937450 INFO  (TEST-UnloadDistributedZkTest.test-seed#[A4ED74EFCD7962BA]) [    ] o.a.s.c.SolrResourceLoader solr home defaulted to 'solr/' (could not find system property or JNDI)
   [junit4]   2> 937450 INFO  (TEST-UnloadDistributedZkTest.test-seed#[A4ED74EFCD7962BA]) [    ] o.a.s.c.c.SolrZkClient Using default ZkCredentialsProvider
   [junit4]   2> 937450 INFO  (TEST-UnloadDistributedZkTest.test-seed#[A4ED74EFCD7962BA]) [    ] o.a.s.c.c.ConnectionManager Waiting for client to connect to ZooKeeper
   [junit4]   2> 937451 INFO  (zkCallback-1020-thread-1) [    ] o.a.s.c.c.ConnectionManager Watcher org.apache.solr.common.cloud.ConnectionManager@edea83 name:ZooKeeperConnection Watcher:127.0.0.1:38275/solr got event WatchedEvent state:SyncConnected type:None path:null path:null type:None
   [junit4]   2> 937451 INFO  (TEST-UnloadDistributedZkTest.test-seed#[A4ED74EFCD7962BA]) [    ] o.a.s.c.c.ConnectionManager Client is connected to ZooKeeper
   [junit4]   2> 937451 INFO  (TEST-UnloadDistributedZkTest.test-seed#[A4ED74EFCD7962BA]) [    ] o.a.s.c.c.SolrZkClient Using default ZkACLProvider
   [junit4]   2> 937452 INFO  (TEST-UnloadDistributedZkTest.test-seed#[A4ED74EFCD7962BA]) [    ] o.a.s.s.SolrDispatchFilter Loading solr.xml from SolrHome (not found in ZooKeeper)
   [junit4]   2> 937453 INFO  (TEST-UnloadDistributedZkTest.test-seed#[A4ED74EFCD7962BA]) [    ] o.a.s.c.SolrXmlConfig Loading container configuration from /home/jenkins/workspace/Lucene-Solr-master-Linux/solr/build/solr-core/test/J2/temp/solr.cloud.UnloadDistributedZkTest_A4ED74EFCD7962BA-001/shard-1-001/solr.xml
   [junit4]   2> 937457 INFO  (TEST-UnloadDistributedZkTest.test-seed#[A4ED74EFCD7962BA]) [    ] o.a.s.c.CorePropertiesLocator Config-defined core root directory: /home/jenkins/workspace/Lucene-Solr-master-Linux/solr/build/solr-core/test/J2/temp/solr.cloud.UnloadDistributedZkTest_A4ED74EFCD7962BA-001/shard-1-001/cores
   [junit4]   2> 937457 INFO  (TEST-UnloadDistributedZkTest.test-seed#[A4ED74EFCD7962BA]) [    ] o.a.s.c.CoreContainer New CoreContainer 10795319
   [junit4]   2> 937457 INFO  (TEST-UnloadDistributedZkTest.test-seed#[A4ED74EFCD7962BA]) [    ] o.a.s.c.CoreContainer Loading cores into CoreContainer [instanceDir=/home/jenkins/workspace/Lucene-Solr-master-Linux/solr/build/solr-core/test/J2/temp/solr.cloud.UnloadDistributedZkTest_A4ED74EFCD7962BA-001/shard-1-001]
   [junit4]   2> 937457 WARN  (TEST-UnloadDistributedZkTest.test-seed#[A4ED74EFCD7962BA]) [    ] o.a.s.c.CoreContainer Couldn't add files from /home/jenkins/workspace/Lucene-Solr-master-Linux/solr/build/solr-core/test/J2/temp/solr.cloud.UnloadDistributedZkTest_A4ED74EFCD7962BA-001/shard-1-001/lib to classpath: /home/jenkins/workspace/Lucene-Solr-master-Linux/solr/build/solr-core/test/J2/temp/solr.cloud.UnloadDistributedZkTest_A4ED74EFCD7962BA-001/shard-1-001/lib
   [junit4]   2> 937457 INFO  (TEST-UnloadDistributedZkTest.test-seed#[A4ED74EFCD7962BA]) [    ] o.a.s.h.c.HttpShardHandlerFactory created with socketTimeout : 90000,urlScheme : ,connTimeout : 15000,maxConnectionsPerHost : 20,maxConnections : 10000,corePoolSize : 0,maximumPoolSize : 2147483647,maxThreadIdleTime : 5,sizeOfQueue : -1,fairnessPolicy : false,useRetries : false,
   [junit4]   2> 937458 INFO  (TEST-UnloadDistributedZkTest.test-seed#[A4ED74EFCD7962BA]) [    ] o.a.s.u.UpdateShardHandler Creating UpdateShardHandler HTTP client with params: socketTimeout=340000&connTimeout=45000&retry=true
   [junit4]   2> 937458 INFO  (TEST-UnloadDistributedZkTest.test-seed#[A4ED74EFCD7962BA]) [    ] o.a.s.l.LogWatcher SLF4J impl is org.slf4j.impl.Log4jLoggerFactory
   [junit4]   2> 937458 INFO  (TEST-UnloadDistributedZkTest.test-seed#[A4ED74EFCD7962BA]) [    ] o.a.s.l.LogWatcher Registering Log Listener [Log4j (org.slf4j.impl.Log4jLoggerFactory)]
   [junit4]   2> 937458 INFO  (TEST-UnloadDistributedZkTest.test-seed#[A4ED74EFCD7962BA]) [    ] o.a.s.c.ZkContainer Zookeeper client=127.0.0.1:38275/solr
   [junit4]   2> 937458 INFO  (TEST-UnloadDistributedZkTest.test-seed#[A4ED74EFCD7962BA]) [    ] o.a.s.c.ZkController zkHost includes chroot
   [junit4]   2> 937458 INFO  (TEST-UnloadDistributedZkTest.test-seed#[A4ED74EFCD7962BA]) [    ] o.a.s.c.c.SolrZkClient Using default ZkCredentialsProvider
   [junit4]   2> 937459 INFO  (TEST-UnloadDistributedZkTest.test-seed#[A4ED74EFCD7962BA]) [    ] o.a.s.c.c.ConnectionManager Waiting for client to connect to ZooKeeper
   [junit4]   2> 937459 INFO  (zkCallback-1023-thread-1) [    ] o.a.s.c.c.ConnectionManager Watcher org.apache.solr.common.cloud.ConnectionManager@1ea764e name:ZooKeeperConnection Watcher:127.0.0.1:38275 got event WatchedEvent state:SyncConnected type:None path:null path:null type:None
   [junit4]   2> 937460 INFO  (TEST-UnloadDistributedZkTest.test-seed#[A4ED74EFCD7962BA]) [    ] o.a.s.c.c.ConnectionManager Client is connected to ZooKeeper
   [junit4]   2> 937460 INFO  (TEST-UnloadDistributedZkTest.test-seed#[A4ED74EFCD7962BA]) [    ] o.a.s.c.c.SolrZkClient Using default ZkACLProvider
   [junit4]   2> 937461 INFO  (TEST-UnloadDistributedZkTest.test-seed#[A4ED74EFCD7962BA]) [    ] o.a.s.c.c.ConnectionManager Waiting for client to connect to ZooKeeper
   [junit4]   2> 937462 INFO  (zkCallback-1024-thread-1) [    ] o.a.s.c.c.ConnectionManager Watcher org.apache.solr.common.cloud.ConnectionManager@1fd5dfd name:ZooKeeperConnection Watcher:127.0.0.1:38275/solr got event WatchedEvent state:SyncConnected type:None path:null path:null type:None
   [junit4]   2> 937462 INFO  (TEST-UnloadDistributedZkTest.test-seed#[A4ED74EFCD7962BA]) [    ] o.a.s.c.c.ConnectionManager Client is connected to ZooKeeper
   [junit4]   2> 937465 INFO  (TEST-UnloadDistributedZkTest.test-seed#[A4ED74EFCD7962BA]) [    ] o.a.s.c.c.ZkStateReader Updating cluster state from ZooKeeper... 
   [junit4]   2> 937465 INFO  (TEST-UnloadDistributedZkTest.test-seed#[A4ED74EFCD7962BA]) [    ] o.a.s.c.c.ZkStateReader Updated live nodes from ZooKeeper... (0) -> (1)
   [junit4]   2> 937466 INFO  (TEST-UnloadDistributedZkTest.test-seed#[A4ED74EFCD7962BA]) [    ] o.a.s.c.Overseer Overseer (id=null) closing
   [junit4]   2> 937467 INFO  (TEST-UnloadDistributedZkTest.test-seed#[A4ED74EFCD7962BA]) [    ] o.a.s.c.LeaderElector Joined leadership election with path: /overseer_elect/election/95537209624428553-127.0.0.1:48231_w-n_0000000001
   [junit4]   2> 937467 INFO  (TEST-UnloadDistributedZkTest.test-seed#[A4ED74EFCD7962BA]) [    ] o.a.s.c.LeaderElector Watching path /overseer_elect/election/95537209624428548-127.0.0.1:44476_w-n_0000000000 to know if I could be the leader
   [junit4]   2> 937467 INFO  (TEST-UnloadDistributedZkTest.test-seed#[A4ED74EFCD7962BA]) [    ] o.a.s.c.ZkController Publish node=127.0.0.1:48231_w as DOWN
   [junit4]   2> 937468 INFO  (OverseerStateUpdate-95537209624428548-127.0.0.1:44476_w-n_0000000000) [    ] o.a.s.c.Overseer processMessage: queueSize: 1, message = {
   [junit4]   2>   "operation":"downnode",
   [junit4]   2>   "node_name":"127.0.0.1:48231_w"} current state version: 3
   [junit4]   2> 937469 INFO  (OverseerStateUpdate-95537209624428548-127.0.0.1:44476_w-n_0000000000) [    ] o.a.s.c.o.NodeMutator DownNode state invoked for node: 127.0.0.1:48231_w
   [junit4]   2> 937469 INFO  (OverseerStateUpdate-95537209624428548-127.0.0.1:44476_w-n_0000000000) [    ] o.a.s.c.o.ZkStateWriter going to update_collection /collections/collection1/state.json version: 0
   [junit4]   2> 937571 INFO  (zkCallback-1024-thread-1) [    ] o.a.s.c.c.ZkStateReader A cluster state change: [WatchedEvent state:SyncConnected type:NodeDataChanged path:/clusterstate.json], has occurred - updating... (live nodes size: [1])
   [junit4]   2> 937571 INFO  (zkCallback-1018-thread-1) [    ] o.a.s.c.c.ZkStateReader A cluster state change: [WatchedEvent state:SyncConnected type:NodeDataChanged path:/clusterstate.json], has occurred - updating... (live nodes size: [1])
   [junit4]   2> 937571 INFO  (zkCallback-1016-thread-1) [    ] o.a.s.c.c.ZkStateReader A cluster state change: [WatchedEvent state:SyncConnected type:NodeDataChanged path:/clusterstate.json], has occurred - updating... (live nodes size: [1])
   [junit4]   2> 938469 INFO  (TEST-UnloadDistributedZkTest.test-seed#[A4ED74EFCD7962BA]) [    ] o.a.s.c.ZkController Register node as live in ZooKeeper:/live_nodes/127.0.0.1:48231_w
   [junit4]   2> 938469 INFO  (TEST-UnloadDistributedZkTest.test-seed#[A4ED74EFCD7962BA]) [    ] o.a.s.c.c.SolrZkClient makePath: /live_nodes/127.0.0.1:48231_w
   [junit4]   2> 938470 INFO  (zkCallback-1024-thread-1) [    ] o.a.s.c.c.ZkStateReader A live node change: [WatchedEvent state:SyncConnected type:NodeChildrenChanged path:/live_nodes], has occurred - updating... (live nodes size: [1])
   [junit4]   2> 938470 INFO  (zkCallback-1018-thread-1) [    ] o.a.s.c.c.ZkStateReader A live node change: [WatchedEvent state:SyncConnected type:NodeChildrenChanged path:/live_nodes], has occurred - updating... (live nodes size: [1])
   [junit4]   2> 938470 INFO  (zkCallback-1016-thread-1) [    ] o.a.s.c.c.ZkStateReader A live node change: [WatchedEvent state:SyncConnected type:NodeChildrenChanged path:/live_nodes], has occurred - updating... (live nodes size: [1])
   [junit4]   2> 938470 INFO  (zkCallback-1024-thread-1) [    ] o.a.s.c.c.ZkStateReader Updated live nodes from ZooKeeper... (1) -> (2)
   [junit4]   2> 938470 INFO  (zkCallback-1018-thread-1) [    ] o.a.s.c.c.ZkStateReader Updated live nodes from ZooKeeper... (1) -> (2)
   [junit4]   2> 938470 INFO  (zkCallback-1016-thread-1) [    ] o.a.s.c.c.ZkStateReader Updated live nodes from ZooKeeper... (1) -> (2)
   [junit4]   2> 938496 INFO  (TEST-UnloadDistributedZkTest.test-seed#[A4ED74EFCD7962BA]) [    ] o.a.s.c.CoreContainer Security conf doesn't exist. Skipping setup for authorization module.
   [junit4]   2> 938497 INFO  (TEST-UnloadDistributedZkTest.test-seed#[A4ED74EFCD7962BA]) [    ] o.a.s.c.CoreContainer No authentication plugin used.
   [junit4]   2> 938497 INFO  (TEST-UnloadDistributedZkTest.test-seed#[A4ED74EFCD7962BA]) [    ] o.a.s.c.CorePropertiesLocator Looking for core definitions underneath /home/jenkins/workspace/Lucene-Solr-master-Linux/solr/build/solr-core/test/J2/temp/solr.cloud.UnloadDistributedZkTest_A4ED74EFCD7962BA-001/shard-1-001/cores
   [junit4]   2> 938498 INFO  (TEST-UnloadDistributedZkTest.test-seed#[A4ED74EFCD7962BA]) [    ] o.a.s.c.CoreDescriptor Created CoreDescriptor: {name=collection1, config=solrconfig.xml, transient=false, schema=schema.xml, loadOnStartup=true, configSetProperties=configsetprops.json, collection=collection1, coreNodeName=, dataDir=data/, shard=}
   [junit4]   2> 938498 INFO  (TEST-UnloadDistributedZkTest.test-seed#[A4ED74EFCD7962BA]) [    ] o.a.s.c.CorePropertiesLocator Found core collection1 in /home/jenkins/workspace/Lucene-Solr-master-Linux/solr/build/solr-core/test/J2/temp/solr.cloud.UnloadDistributedZkTest_A4ED74EFCD7962BA-001/shard-1-001/cores/collection1
   [junit4]   2> 938498 INFO  (TEST-UnloadDistributedZkTest.test-seed#[A4ED74EFCD7962BA]) [    ] o.a.s.c.CorePropertiesLocator Found 1 core definitions
   [junit4]   2> 938498 INFO  (TEST-UnloadDistributedZkTest.test-seed#[A4ED74EFCD7962BA]) [    ] o.a.s.s.SolrDispatchFilter user.dir=/home/jenkins/workspace/Lucene-Solr-master-Linux/solr/build/solr-core/test/J2
   [junit4]   2> 938498 INFO  (TEST-UnloadDistributedZkTest.test-seed#[A4ED74EFCD7962BA]) [    ] o.a.s.s.SolrDispatchFilter SolrDispatchFilter.init() done
   [junit4]   2> 938499 INFO  (coreLoadExecutor-3276-thread-1) [    ] o.a.s.c.ZkController publishing state=down
   [junit4]   2> 938499 INFO  (coreLoadExecutor-3276-thread-1) [    ] o.a.s.c.ZkController numShards not found on descriptor - reading it from system property
   [junit4]   2> 938507 INFO  (coreLoadExecutor-3276-thread-1) [    ] o.a.s.c.ZkController Registering watch for collection collection1
   [junit4]   2> 938507 INFO  (coreLoadExecutor-3276-thread-1) [    ] o.a.s.c.c.ZkStateReader addZkWatch [collection1]
   [junit4]   2> 938508 INFO  (OverseerStateUpdate-95537209624428548-127.0.0.1:44476_w-n_0000000000) [    ] o.a.s.c.Overseer processMessage: queueSize: 1, message = {
   [junit4]   2>   "core":"collection1",
   [junit4]   2>   "roles":null,
   [junit4]   2>   "base_url":"http://127.0.0.1:48231/w",
   [junit4]   2>   "node_name":"127.0.0.1:48231_w",
   [junit4]   2>   "numShards":"2",
   [junit4]   2>   "state":"down",
   [junit4]   2>   "shard":null,
   [junit4]   2>   "collection":"collection1",
   [junit4]   2>   "operation":"state"} current state version: 4
   [junit4]   2> 938508 INFO  (coreLoadExecutor-3276-thread-1) [    ] o.a.s.c.c.ZkStateReader Add data for [collection1] ver [1]
   [junit4]   2> 938508 INFO  (coreLoadExecutor-3276-thread-1) [    ] o.a.s.c.ZkController look for our core node name
   [junit4]   2> 938508 INFO  (OverseerStateUpdate-95537209624428548-127.0.0.1:44476_w-n_0000000000) [    ] o.a.s.c.o.ReplicaMutator Update state numShards=2 message={
   [junit4]   2>   "core":"collection1",
   [junit4]   2>   "roles":null,
   [junit4]   2>   "base_url":"http://127.0.0.1:48231/w",
   [junit4]   2>   "node_name":"127.0.0.1:48231_w",
   [junit4]   2>   "numShards":"2",
   [junit4]   2>   "state":"down",
   [junit4]   2>   "shard":null,
   [junit4]   2>   "collection":"collection1",
   [junit4]   2>   "operation":"state"}
   [junit4]   2> 938508 INFO  (OverseerStateUpdate-95537209624428548-127.0.0.1:44476_w-n_0000000000) [    ] o.a.s.c.o.ReplicaMutator Collection already exists with numShards=2
   [junit4]   2> 938508 INFO  (OverseerStateUpdate-95537209624428548-127.0.0.1:44476_w-n_0000000000) [    ] o.a.s.c.o.ReplicaMutator Assigning new node to shard shard=shard2
   [junit4]   2> 938610 INFO  (OverseerStateUpdate-95537209624428548-127.0.0.1:44476_w-n_0000000000) [    ] o.a.s.c.o.ZkStateWriter going to update_collection /collections/collection1/state.json version: 1
   [junit4]   2> 938610 INFO  (zkCallback-1024-thread-1) [    ] o.a.s.c.c.ZkStateReader A cluster state change: [WatchedEvent state:SyncConnected type:NodeDataChanged path:/collections/collection1/state.json] for collection [collection1] has occurred - updating... (live nodes size: [2])
   [junit4]   2> 938610 INFO  (zkCallback-1024-thread-1) [    ] o.a.s.c.c.ZkStateReader Updating data for [collection1] from [1] to [2]
   [junit4]   2> 939508 INFO  (coreLoadExecutor-3276-thread-1) [    ] o.a.s.c.ZkController waiting to find shard id in clusterstate for collection1
   [junit4]   2> 939508 INFO  (coreLoadExecutor-3276-thread-1) [    ] o.a.s.c.ZkController Check for collection zkNode:collection1
   [junit4]   2> 939509 INFO  (coreLoadExecutor-3276-thread-1) [    ] o.a.s.c.ZkController Collection zkNode exists
   [junit4]   2> 939509 INFO  (coreLoadExecutor-3276-thread-1) [    ] o.a.s.c.c.ZkStateReader Load collection config from: [/collections/collection1]
   [junit4]   2> 939509 INFO  (coreLoadExecutor-3276-thread-1) [    ] o.a.s.c.c.ZkStateReader path=[/collections/collection1] [configName]=[conf1] specified config exists in ZooKeeper
   [junit4]   2> 939509 INFO  (coreLoadExecutor-3276-thread-1) [    ] o.a.s.c.SolrResourceLoader new SolrResourceLoader for directory: '/home/jenkins/workspace/Lucene-Solr-master-Linux/solr/build/solr-core/test/J2/temp/solr.cloud.UnloadDistributedZkTest_A4ED74EFCD7962BA-001/shard-1-001/cores/collection1'
   [junit4]   2> 939509 INFO  (coreLoadExecutor-3276-thread-1) [    ] o.a.s.c.SolrResourceLoader JNDI not configured for solr (NoInitialContextEx)
   [junit4]   2> 939509 INFO  (coreLoadExecutor-3276-thread-1) [    ] o.a.s.c.SolrResourceLoader solr home defaulted to 'solr/' (could not find system property or JNDI)
   [junit4]   2> 939510 INFO  (coreLoadExecutor-3276-thread-1) [    ] o.a.s.c.Config loaded config solrconfig.xml with version 0 
   [junit4]   2> 939517 INFO  (coreLoadExecutor-3276-thread-1) [    ] o.a.s.c.SolrConfig current version of requestparams : -1
   [junit4]   2> 939520 WARN  (coreLoadExecutor-3276-thread-1) [    ] o.a.s.c.Config Beginning with Solr 5.5, <mergePolicy> is deprecated, use <mergePolicyFactory> instead.
   [junit4]   2> 939521 INFO  (coreLoadExecutor-3276-thread-1) [    ] o.a.s.c.SolrConfig Using Lucene MatchVersion: 7.0.0
   [junit4]   2> 939528 INFO  (coreLoadExecutor-3276-thread-1) [    ] o.a.s.c.SolrConfig Loaded SolrConfig: solrconfig.xml
   [junit4]   2> 939534 INFO  (coreLoadExecutor-3276-thread-1) [    ] o.a.s.s.IndexSchema [collection1] Schema name=test
   [junit4]   2> 939618 INFO  (coreLoadExecutor-3276-thread-1) [    ] o.a.s.s.OpenExchangeRatesOrgProvider Initialized with rates=open-exchange-rates.json, refreshInterval=1440.
   [junit4]   2> 939622 INFO  (coreLoadExecutor-3276-thread-1) [    ] o.a.s.s.IndexSchema default search field in schema is text
   [junit4]   2> 939623 INFO  (coreLoadExecutor-3276-thread-1) [    ] o.a.s.s.IndexSchema unique key field: id
   [junit4]   2> 939630 INFO  (coreLoadExecutor-3276-thread-1) [    ] o.a.s.s.FileExchangeRateProvider Reloading exchange rates from file currency.xml
   [junit4]   2> 939631 INFO  (coreLoadExecutor-3276-thread-1) [    ] o.a.s.s.FileExchangeRateProvider Reloading exchange rates from file currency.xml
   [junit4]   2> 939633 INFO  (coreLoadExecutor-3276-thread-1) [    ] o.a.s.s.OpenExchangeRatesOrgProvider Reloading exchange rates from open-exchange-rates.json
   [junit4]   2> 939647 INFO  (coreLoadExecutor-3276-thread-1) [    ] o.a.s.s.OpenExchangeRatesOrgProvider Reloading exchange rates from open-exchange-rates.json
   [junit4]   2> 939648 INFO  (coreLoadExecutor-3276-thread-1) [    ] o.a.s.c.ConfigSetProperties Did not find ConfigSet properties, assuming default properties: Can't find resource 'configsetprops.json' in classpath or '/configs/conf1', cwd=/home/jenkins/workspace/Lucene-Solr-master-Linux/solr/build/solr-core/test/J2
   [junit4]   2> 939648 INFO  (coreLoadExecutor-3276-thread-1) [    ] o.a.s.c.CoreContainer Creating SolrCore 'collection1' using configuration from collection collection1
   [junit4]   2> 939648 INFO  (coreLoadExecutor-3276-thread-1) [    ] o.a.s.c.SolrCore org.apache.solr.core.MockDirectoryFactory
   [junit4]   2> 939649 INFO  (coreLoadExecutor-3276-thread-1) [    ] o.a.s.c.SolrCore [[collection1] ] Opening new SolrCore at [/home/jenkins/workspace/Lucene-Solr-master-Linux/solr/build/solr-core/test/J2/temp/solr.cloud.UnloadDistributedZkTest_A4ED74EFCD7962BA-001/shard-1-001/cores/collection1], dataDir=[/home/jenkins/workspace/Lucene-Solr-master-Linux/solr/build/solr-core/test/J2/temp/solr.cloud.UnloadDistributedZkTest_A4ED74EFCD7962BA-001/shard-1-001/cores/collection1/data/]
   [junit4]   2> 939649 INFO  (coreLoadExecutor-3276-thread-1) [    ] o.a.s.c.JmxMonitoredMap JMX monitoring is enabled. Adding Solr mbeans to JMX Server: com.sun.jmx.mbeanserver.JmxMBeanServer@ac59d4
   [junit4]   2> 939649 INFO  (coreLoadExecutor-3276-thread-1) [    ] o.a.s.c.CachingDirectoryFactory return new directory for /home/jenkins/workspace/Lucene-Solr-master-Linux/solr/build/solr-core/test/J2/temp/solr.cloud.UnloadDistributedZkTest_A4ED74EFCD7962BA-001/shard-1-001/cores/collection1/data
   [junit4]   2> 939649 INFO  (coreLoadExecutor-3276-thread-1) [    ] o.a.s.c.SolrCore New index directory detected: old=null new=/home/jenkins/workspace/Lucene-Solr-master-Linux/solr/build/solr-core/test/J2/temp/solr.cloud.UnloadDistributedZkTest_A4ED74EFCD7962BA-001/shard-1-001/cores/collection1/data/index/
   [junit4]   2> 939649 WARN  (coreLoadExecutor-3276-thread-1) [    ] o.a.s.c.SolrCore [collection1] Solr index directory '/home/jenkins/workspace/Lucene-Solr-master-Linux/solr/build/solr-core/test/J2/temp/solr.cloud.UnloadDistributedZkTest_A4ED74EFCD7962BA-001/shard-1-001/cores/collection1/data/index' doesn't exist. Creating new index...
   [junit4]   2> 939650 INFO  (coreLoadExecutor-3276-thread-1) [    ] o.a.s.c.CachingDirectoryFactory return new directory for /home/jenkins/workspace/Lucene-Solr-master-Linux/solr/build/solr-core/test/J2/temp/solr.cloud.UnloadDistributedZkTest_A4ED74EFCD7962BA-001/shard-1-001/cores/collection1/data/index
   [junit4]   2> 939650 INFO  (coreLoadExecutor-3276-thread-1) [    ] o.a.s.u.RandomMergePolicy RandomMergePolicy wrapping class org.apache.lucene.index.LogDocMergePolicy: [LogDocMergePolicy: minMergeSize=1000, mergeFactor=44, maxMergeSize=9223372036854775807, maxMergeSizeForForcedMerge=9223372036854775807, calibrateSizeByDeletes=true, maxMergeDocs=2147483647, maxCFSSegmentSizeMB=8.796093022207999E12, noCFSRatio=0.3594968885344807]
   [junit4]   2> 939650 INFO  (coreLoadExecutor-3276-thread-1) [    ] o.a.s.c.SolrDeletionPolicy SolrDeletionPolicy.onCommit: commits: num=1
   [junit4]   2> 	commit{dir=MockDirectoryWrapper(RAMDirectory@cd48fb lockFactory=org.apache.lucene.store.SingleInstanceLockFactory@e0c773),segFN=segments_1,generation=1}
   [junit4]   2> 939650 INFO  (coreLoadExecutor-3276-thread-1) [    ] o.a.s.c.SolrDeletionPolicy newest commit generation = 1
   [junit4]   2> 939650 INFO  (OldIndexDirectoryCleanupThreadForCore-collection1) [    ] o.a.s.c.SolrCore Looking for old index directories to cleanup for core collection1 in /home/jenkins/workspace/Lucene-Solr-master-Linux/solr/build/solr-core/test/J2/temp/solr.cloud.UnloadDistributedZkTest_A4ED74EFCD7962BA-001/shard-1-001/cores/collection1/data/
   [junit4]   2> 939650 WARN  (OldIndexDirectoryCleanupThreadForCore-collection1) [    ] o.a.s.c.DirectoryFactory /home/jenkins/workspace/Lucene-Solr-master-Linux/solr/build/solr-core/test/J2/temp/solr.cloud.UnloadDistributedZkTest_A4ED74EFCD7962BA-001/shard-1-001/cores/collection1/data/ does not point to a valid data directory; skipping clean-up of old index directories.
   [junit4]   2> 939653 INFO  (coreLoadExecutor-3276-thread-1) [    ] o.a.s.u.p.UpdateRequestProcessorChain creating updateRequestProcessorChain "nodistrib"
   [junit4]   2> 939653 INFO  (coreLoadExecutor-3276-thread-1) [    ] o.a.s.u.p.UpdateRequestProcessorChain creating updateRequestProcessorChain "dedupe"
   [junit4]   2> 939653 INFO  (coreLoadExecutor-3276-thread-1) [    ] o.a.s.u.p.UpdateRequestProcessorChain inserting DistributedUpdateProcessorFactory into updateRequestProcessorChain "dedupe"
   [junit4]   2> 939653 INFO  (coreLoadExecutor-3276-thread-1) [    ] o.a.s.u.p.UpdateRequestProcessorChain creating updateRequestProcessorChain "stored_sig"
   [junit4]   2> 939654 INFO  (coreLoadExecutor-3276-thread-1) [    ] o.a.s.u.p.UpdateRequestProcessorChain inserting DistributedUpdateProcessorFactory into updateRequestProcessorChain "stored_sig"
   [junit4]   2> 939654 INFO  (coreLoadExecutor-3276-thread-1) [    ] o.a.s.u.p.UpdateRequestProcessorChain creating updateRequestProcessorChain "distrib-dup-test-chain-explicit"
   [junit4]   2> 939654 INFO  (coreLoadExecutor-3276-thread-1) [    ] o.a.s.u.p.UpdateRequestProcessorChain creating updateRequestProcessorChain "distrib-dup-test-chain-implicit"
   [junit4]   2> 939654 INFO  (coreLoadExecutor-3276-thread-1) [    ] o.a.s.u.p.UpdateRequestProcessorChain inserting DistributedUpdateProcessorFactory into updateRequestProcessorChain "distrib-dup-test-chain-implicit"
   [junit4]   2> 939654 INFO  (coreLoadExecutor-3276-thread-1) [    ] o.a.s.c.SolrCore no updateRequestProcessorChain defined as default, creating implicit default
   [junit4]   2> 939654 WARN  (coreLoadExecutor-3276-thread-1) [    ] o.a.s.c.RequestHandlers INVALID paramSet a in requestHandler {type = requestHandler,name = /dump,class = DumpRequestHandler,args = {defaults={a=A,b=B}}}
   [junit4]   2> 939655 INFO  (coreLoadExecutor-3276-thread-1) [    ] o.a.s.h.l.XMLLoader xsltCacheLifetimeSeconds=60
   [junit4]   2> 939656 INFO  (coreLoadExecutor-3276-thread-1) [    ] o.a.s.h.l.XMLLoader xsltCacheLifetimeSeconds=60
   [junit4]   2> 939657 INFO  (coreLoadExecutor-3276-thread-1) [    ] o.a.s.h.l.XMLLoader xsltCacheLifetimeSeconds=60
   [junit4]   2> 939657 INFO  (coreLoadExecutor-3276-thread-1) [    ] o.a.s.h.l.XMLLoader xsltCacheLifetimeSeconds=60
   [junit4]   2> 939661 INFO  (coreLoadExecutor-3276-thread-1) [    ] o.a.s.c.RequestHandlers Registered paths: /admin/mbeans,standard,/dump,/update/csv,/sql,/update/json/docs,/admin/luke,/export,/admin/segments,/get,/admin/system,/replication,/admin/properties,/config,/stream,/schema,/admin/plugins,/admin/logging,/update/json,/admin/ping,/admin/threads,/update,/admin/file
   [junit4]   2> 939661 INFO  (coreLoadExecutor-3276-thread-1) [    ] o.a.s.c.SolrCore Using default statsCache cache: org.apache.solr.search.stats.LocalStatsCache
   [junit4]   2> 939662 INFO  (coreLoadExecutor-3276-thread-1) [    ] o.a.s.u.UpdateHandler Using UpdateLog implementation: org.apache.solr.update.UpdateLog
   [junit4]   2> 939662 INFO  (coreLoadExecutor-3276-thread-1) [    ] o.a.s.u.UpdateLog Initializing UpdateLog: dataDir= defaultSyncLevel=FLUSH numRecordsToKeep=100 maxNumLogsToKeep=10 numVersionBuckets=65536
   [junit4]   2> 939663 INFO  (coreLoadExecutor-3276-thread-1) [    ] o.a.s.u.CommitTracker Hard AutoCommit: disabled
   [junit4]   2> 939663 INFO  (coreLoadExecutor-3276-thread-1) [    ] o.a.s.u.CommitTracker Soft AutoCommit: disabled
   [junit4]   2> 939664 INFO  (coreLoadExecutor-3276-thread-1) [    ] o.a.s.u.RandomMergePolicy RandomMergePolicy wrapping class org.apache.lucene.index.LogByteSizeMergePolicy: [LogByteSizeMergePolicy: minMergeSize=1677721, mergeFactor=27, maxMergeSize=2147483648, maxMergeSizeForForcedMerge=9223372036854775807, calibrateSizeByDeletes=true, maxMergeDocs=2147483647, maxCFSSegmentSizeMB=8.796093022207999E12, noCFSRatio=0.29941284816136227]
   [junit4]   2> 939664 INFO  (coreLoadExecutor-3276-thread-1) [    ] o.a.s.c.SolrDeletionPolicy SolrDeletionPolicy.onInit: commits: num=1
   [junit4]   2> 	commit{dir=MockDirectoryWrapper(RAMDirectory@cd48fb lockFactory=org.apache.lucene.store.SingleInstanceLockFactory@e0c773),segFN=segments_1,generation=1}
   [junit4]   2> 939664 INFO  (coreLoadExecutor-3276-thread-1) [    ] o.a.s.c.SolrDeletionPolicy newest commit generation = 1
   [junit4]   2> 939664 INFO  (coreLoadExecutor-3276-thread-1) [    ] o.a.s.s.SolrIndexSearcher Opening [Searcher@1c63191[collection1] main]
   [junit4]   2> 939664 INFO  (coreLoadExecutor-3276-thread-1) [    ] o.a.s.c.c.ZkStateReader Load collection config from: [/collections/collection1]
   [junit4]   2> 939665 INFO  (coreLoadExecutor-3276-thread-1) [    ] o.a.s.c.c.ZkStateReader path=[/collections/collection1] [configName]=[conf1] specified config exists in ZooKeeper
   [junit4]   2> 939665 INFO  (coreLoadExecutor-3276-thread-1) [    ] o.a.s.r.ManagedResourceStorage Setting up ZooKeeper-based storage for the RestManager with znodeBase: /configs/conf1
   [junit4]   2> 939665 INFO  (coreLoadExecutor-3276-thread-1) [    ] o.a.s.r.ManagedResourceStorage Configured ZooKeeperStorageIO with znodeBase: /configs/conf1
   [junit4]   2> 939665 INFO  (coreLoadExecutor-3276-thread-1) [    ] o.a.s.r.RestManager Initializing RestManager with initArgs: {}
   [junit4]   2> 939665 INFO  (coreLoadExecutor-3276-thread-1) [    ] o.a.s.r.ManagedResourceStorage Reading _rest_managed.json using ZooKeeperStorageIO:path=/configs/conf1
   [junit4]   2> 939665 INFO  (coreLoadExecutor-3276-thread-1) [    ] o.a.s.r.ManagedResourceStorage No data found for znode /configs/conf1/_rest_managed.json
   [junit4]   2> 939665 INFO  (coreLoadExecutor-3276-thread-1) [    ] o.a.s.r.ManagedResourceStorage Loaded null at path _rest_managed.json using ZooKeeperStorageIO:path=/configs/conf1
   [junit4]   2> 939665 INFO  (coreLoadExecutor-3276-thread-1) [    ] o.a.s.r.RestManager Initializing 0 registered ManagedResources
   [junit4]   2> 939666 INFO  (coreLoadExecutor-3276-thread-1) [    ] o.a.s.h.ReplicationHandler Commits will be reserved for  10000
   [junit4]   2> 939666 INFO  (searcherExecutor-3277-thread-1) [    ] o.a.s.c.SolrCore [collection1] Registered new searcher Searcher@1c63191[collection1] main{ExitableDirectoryReader(UninvertingDirectoryReader())}
   [junit4]   2> 939667 INFO  (coreLoadExecutor-3276-thread-1) [    ] o.a.s.u.UpdateLog Looking up max value of version field to seed version buckets
   [junit4]   2> 939667 INFO  (coreLoadExecutor-3276-thread-1) [    ] o.a.s.u.VersionInfo Refreshing highest value of _version_ for 65536 version buckets from index
   [junit4]   2> 939667 INFO  (coreLoadExecutor-3276-thread-1) [    ] o.a.s.u.VersionInfo No terms found for _version_, cannot seed version bucket highest value from index
   [junit4]   2> 939667 INFO  (coreLoadExecutor-3276-thread-1) [    ] o.a.s.u.UpdateLog Could not find max version in index or recent updates, using new clock 1528595358279532544
   [junit4]   2> 939669 INFO  (coreLoadExecutor-3276-thread-1) [    ] o.a.s.u.UpdateLog Took 1.0ms to seed version buckets with highest version 1528595358279532544
   [junit4]   2> 939669 INFO  (coreLoadExecutor-3276-thread-1) [    ] o.a.s.c.ZkController watch zkdir /configs/conf1
   [junit4]   2> 939669 INFO  (coreLoadExecutor-3276-thread-1) [    ] o.a.s.c.CoreContainer registering core: collection1
   [junit4]   2> 939670 INFO  (coreZkRegister-3271-thread-1) [    ] o.a.s.c.ZkController Register replica - core:collection1 address:http://127.0.0.1:48231/w collection:collection1 shard:shard2
   [junit4]   2> 939670 INFO  (coreZkRegister-3271-thread-1) [    ] o.a.s.c.c.SolrZkClient makePath: /collections/collection1/leader_elect/shard2/election
   [junit4]   2> 939672 INFO  (coreZkRegister-3271-thread-1) [    ] o.a.s.c.LeaderElector Joined leadership election with path: /collections/collection1/leader_elect/shard2/election/95537209624428553-core_node1-n_0000000000
   [junit4]   2> 939672 INFO  (coreZkRegister-3271-thread-1) [    ] o.a.s.c.ShardLeaderElectionContext Running the leader process for shard=shard2 and weAreReplacement=false and leaderVoteWait=180000
   [junit4]   2> 939673 INFO  (coreZkRegister-3271-thread-1) [    ] o.a.s.c.ShardLeaderElectionContext Enough replicas found to continue.
   [junit4]   2> 939673 INFO  (coreZkRegister-3271-thread-1) [    ] o.a.s.c.ShardLeaderElectionContext I may be the new leader - try and sync
   [junit4]   2> 939673 INFO  (coreZkRegister-3271-thread-1) [    ] o.a.s.c.SyncStrategy Sync replicas to http://127.0.0.1:48231/w/collection1/
   [junit4]   2> 939673 INFO  (coreZkRegister-3271-thread-1) [    ] o.a.s.c.SyncStrategy Sync Success - now sync replicas to me
   [junit4]   2> 939673 INFO  (coreZkRegister-3271-thread-1) [    ] o.a.s.c.SyncStrategy http://127.0.0.1:48231/w/collection1/ has no replicas
   [junit4]   2> 939673 INFO  (OverseerStateUpdate-95537209624428548-127.0.0.1:44476_w-n_0000000000) [    ] o.a.s.c.Overseer processMessage: queueSize: 1, message = {
   [junit4]   2>   "operation":"leader",
   [junit4]   2>   "shard":"shard2",
   [junit4]   2>   "collection":"collection1"} current state version: 4
   [junit4]   2> 939674 INFO  (coreZkRegister-3271-thread-1) [    ] o.a.s.c.c.SolrZkClient makePath: /collections/collection1/leaders/shard2
   [junit4]   2> 939675 INFO  (coreZkRegister-3271-thread-1) [    ] o.a.s.c.ShardLeaderElectionContextBase Creating leader registration node /collections/collection1/leaders/shard2/leader after winning as /collections/collection1/leader_elect/shard2/election/95537209624428553-core_node1-n_0000000000
   [junit4]   2> 939677 INFO  (OverseerStateUpdate-95537209624428548-127.0.0.1:44476_w-n_0000000000) [    ] o.a.s.c.Overseer processMessage: queueSize: 1, message = {
   [junit4]   2>   "operation":"leader",
   [junit4]   2>   "shard":"shard2",
   [junit4]   2>   "collection":"collection1",
   [junit4]   2>   "base_url":"http://127.0.0.1:48231/w",
   [junit4]   2>   "core":"collection1",
   [junit4]   2>   "state":"active"} current state version: 4
   [junit4]   2> 939677 INFO  (coreZkRegister-3271-thread-1) [    ] o.a.s.c.ShardLeaderElectionContext I am the new leader: http://127.0.0.1:48231/w/collection1/ shard2
   [junit4]   2> 939790 INFO  (OverseerStateUpdate-95537209624428548-127.0.0.1:44476_w-n_0000000000) [    ] o.a.s.c.o.ZkStateWriter going to update_collection /collections/collection1/state.json version: 2
   [junit4]   2> 939791 INFO  (zkCallback-1024-thread-1) [    ] o.a.s.c.c.ZkStateReader A cluster state change: [WatchedEvent state:SyncConnected type:NodeDataChanged path:/collections/collection1/state.json] for collection [collection1] has occurred - updating... (live nodes size: [2])
   [junit4]   2> 939791 INFO  (zkCallback-1024-thread-1) [    ] o.a.s.c.c.ZkStateReader Updating data for [collection1] from [2] to [3]
   [junit4]   2> 939839 INFO  (coreZkRegister-3271-thread-1) [    ] o.a.s.c.ZkController We are http://127.0.0.1:48231/w/collection1/ and leader is http://127.0.0.1:48231/w/collection1/
   [junit4]   2> 939840 INFO  (coreZkRegister-3271-thread-1) [    ] o.a.s.c.ZkController No LogReplay needed for core=collection1 baseURL=http://127.0.0.1:48231/w
   [junit4]   2> 939840 INFO  (coreZkRegister-3271-thread-1) [    ] o.a.s.c.ZkController I am the leader, no recovery necessary
   [junit4]   2> 939840 INFO  (coreZkRegister-3271-thread-1) [    ] o.a.s.c.ZkController publishing state=active
   [junit4]   2> 939840 INFO  (coreZkRegister-3271-thread-1) [    ] o.a.s.c.ZkController numShards not found on descriptor - reading it from system property
   [junit4]   2> 939842 INFO  (OverseerStateUpdate-95537209624428548-127.0.0.1:44476_w-n_0000000000) [    ] o.a.s.c.Overseer processMessage: queueSize: 1, message = {
   [junit4]   2>   "core":"collection1",
   [junit4]   2>   "core_node_name":"core_node1",
   [junit4]   2>   "roles":null,
   [junit4]   2>   "base_url":"http://127.0.0.1:48231/w",
   [junit4]   2>   "node_name":"127.0.0.1:48231_w",
   [junit4]   2>   "numShards":"2",
   [junit4]   2>   "state":"active",
   [junit4]   2>   "shard":"shard2",
   [junit4]   2>   "collection":"collection1",
   [junit4]   2>   "operation":"state"} current state version: 4
   [junit4]   2> 939842 INFO  (OverseerStateUpdate-95537209624428548-127.0.0.1:44476_w-n_0000000000) [    ] o.a.s.c.o.ReplicaMutator Update state numShards=2 message={
   [junit4]   2>   "core":"collection1",
   [junit4]   2>   "core_node_name":"core_node1",
   [junit4]   2>   "roles":null,
   [junit4]   2>   "base_url":"http://127.0.0.1:48231/w",
   [junit4]   2>   "node_name":"127.0.0.1:48231_w",
   [junit4]   2>   "numShards":"2",
   [junit4]   2>   "state":"active",
   [junit4]   2>   "shard":"shard2",
   [junit4]   2>   "collection":"collection1",
   [junit4]   2>   "operation":"state"}
   [junit4]   2> 939943 INFO  (OverseerStateUpdate-95537209624428548-127.0.0.1:44476_w-n_0000000000) [    ] o.a.s.c.o.ZkStateWriter going to update_collection /collections/collection1/state.json version: 3
   [junit4]   2> 939956 INFO  (zkCallback-1024-thread-1) [    ] o.a.s.c.c.ZkStateReader A cluster state change: [WatchedEvent state:SyncConnected type:NodeDataChanged path:/collections/collection1/state.json] for collection [collection1] has occurred - updating... (live nodes size: [2])
   [junit4]   2> 939956 INFO  (zkCallback-1024-thread-1) [    ] o.a.s.c.c.ZkStateReader Updating data for [collection1] from [3] to [4]
   [junit4]   2> 940117 INFO  (TEST-UnloadDistributedZkTest.test-seed#[A4ED74EFCD7962BA]) [    ] o.a.s.SolrTestCaseJ4 Writing core.properties file to /home/jenkins/workspace/Lucene-Solr-mast

[...truncated too long message...]

   [junit4]   2> 
   [junit4]   2> 	7	/solr/live_nodes
   [junit4]   2> 	7	/solr/collections
   [junit4]   2> 	5	/solr/overseer/collection-queue-work
   [junit4]   2> 	4	/solr/overseer/queue
   [junit4]   2> 	2	/solr/overseer/queue-work
   [junit4]   2> 
   [junit4]   2> NOTE: reproduce with: ant test  -Dtestcase=UnloadDistributedZkTest -Dtests.method=test -Dtests.seed=A4ED74EFCD7962BA -Dtests.multiplier=3 -Dtests.slow=true -Dtests.locale=nl-SR -Dtests.timezone=Europe/Uzhgorod -Dtests.asserts=true -Dtests.file.encoding=ISO-8859-1
   [junit4] ERROR    135s J2 | UnloadDistributedZkTest.test <<<
   [junit4]    > Throwable #1: com.carrotsearch.randomizedtesting.UncaughtExceptionError: Captured an uncaught exception in thread: Thread[id=7399, name=testExecutor-3343-thread-3, state=RUNNABLE, group=TGRP-UnloadDistributedZkTest]
   [junit4]    > 	at __randomizedtesting.SeedInfo.seed([A4ED74EFCD7962BA:2CB94B3563850F42]:0)
   [junit4]    > Caused by: java.lang.RuntimeException: org.apache.solr.client.solrj.SolrServerException: Timeout occured while waiting response from server at: http://127.0.0.1:57065/w
   [junit4]    > 	at __randomizedtesting.SeedInfo.seed([A4ED74EFCD7962BA]:0)
   [junit4]    > 	at org.apache.solr.cloud.BasicDistributedZkTest.lambda$createCores$0(BasicDistributedZkTest.java:583)
   [junit4]    > 	at org.apache.solr.common.util.ExecutorUtil$MDCAwareThreadPoolExecutor.lambda$execute$0(ExecutorUtil.java:229)
   [junit4]    > 	at java.util.concurrent.ThreadPoolExecutor.runWorker(ThreadPoolExecutor.java:1158)
   [junit4]    > 	at java.util.concurrent.ThreadPoolExecutor$Worker.run(ThreadPoolExecutor.java:632)
   [junit4]    > 	at java.lang.Thread.run(Thread.java:804)
   [junit4]    > Caused by: org.apache.solr.client.solrj.SolrServerException: Timeout occured while waiting response from server at: http://127.0.0.1:57065/w
   [junit4]    > 	at org.apache.solr.client.solrj.impl.HttpSolrClient.executeMethod(HttpSolrClient.java:588)
   [junit4]    > 	at org.apache.solr.client.solrj.impl.HttpSolrClient.request(HttpSolrClient.java:241)
   [junit4]    > 	at org.apache.solr.client.solrj.impl.HttpSolrClient.request(HttpSolrClient.java:230)
   [junit4]    > 	at org.apache.solr.client.solrj.SolrClient.request(SolrClient.java:1219)
   [junit4]    > 	at org.apache.solr.cloud.BasicDistributedZkTest.lambda$createCores$0(BasicDistributedZkTest.java:581)
   [junit4]    > 	... 4 more
   [junit4]    > Caused by: java.net.SocketTimeoutException: Read timed out
   [junit4]    > 	at java.net.SocketInputStream.socketRead0(Native Method)
   [junit4]    > 	at java.net.SocketInputStream.socketRead(SocketInputStream.java:116)
   [junit4]    > 	at java.net.SocketInputStream.read(SocketInputStream.java:170)
   [junit4]    > 	at java.net.SocketInputStream.read(SocketInputStream.java:141)
   [junit4]    > 	at org.apache.http.impl.io.AbstractSessionInputBuffer.fillBuffer(AbstractSessionInputBuffer.java:160)
   [junit4]    > 	at org.apache.http.impl.io.SocketInputBuffer.fillBuffer(SocketInputBuffer.java:84)
   [junit4]    > 	at org.apache.http.impl.io.AbstractSessionInputBuffer.readLine(AbstractSessionInputBuffer.java:273)
   [junit4]    > 	at org.apache.http.impl.conn.DefaultHttpResponseParser.parseHead(DefaultHttpResponseParser.java:140)
   [junit4]    > 	at org.apache.http.impl.conn.DefaultHttpResponseParser.parseHead(DefaultHttpResponseParser.java:57)
   [junit4]    > 	at org.apache.http.impl.io.AbstractMessageParser.parse(AbstractMessageParser.java:261)
   [junit4]    > 	at org.apache.http.impl.AbstractHttpClientConnection.receiveResponseHeader(AbstractHttpClientConnection.java:283)
   [junit4]    > 	at org.apache.http.impl.conn.DefaultClientConnection.receiveResponseHeader(DefaultClientConnection.java:251)
   [junit4]    > 	at org.apache.http.impl.conn.ManagedClientConnectionImpl.receiveResponseHeader(ManagedClientConnectionImpl.java:197)
   [junit4]    > 	at org.apache.http.protocol.HttpRequestExecutor.doReceiveResponse(HttpRequestExecutor.java:272)
   [junit4]    > 	at org.apache.http.protocol.HttpRequestExecutor.execute(HttpRequestExecutor.java:124)
   [junit4]    > 	at org.apache.http.impl.client.DefaultRequestDirector.tryExecute(DefaultRequestDirector.java:685)
   [junit4]    > 	at org.apache.http.impl.client.DefaultRequestDirector.execute(DefaultRequestDirector.java:487)
   [junit4]    > 	at org.apache.http.impl.client.AbstractHttpClient.doExecute(AbstractHttpClient.java:882)
   [junit4]    > 	at org.apache.http.impl.client.CloseableHttpClient.execute(CloseableHttpClient.java:82)
   [junit4]    > 	at org.apache.http.impl.client.CloseableHttpClient.execute(CloseableHttpClient.java:107)
   [junit4]    > 	at org.apache.http.impl.client.CloseableHttpClient.execute(CloseableHttpClient.java:55)
   [junit4]    > 	at org.apache.solr.client.solrj.impl.HttpSolrClient.executeMethod(HttpSolrClient.java:482)
   [junit4]    > 	... 8 more
   [junit4]   2> 1070765 INFO  (SUITE-UnloadDistributedZkTest-seed#[A4ED74EFCD7962BA]-worker) [    ] o.a.s.SolrTestCaseJ4 ###deleteCore
   [junit4]   2> Mar 12, 2016 11:31:04 AM com.carrotsearch.randomizedtesting.ThreadLeakControl checkThreadLeaks
   [junit4]   2> WARNING: Will linger awaiting termination of 1 leaked thread(s).
   [junit4]   2> NOTE: test params are: codec=Asserting(Lucene60): {other_tl1=TestBloomFilteredLucenePostings(BloomFilteringPostingsFormat(Lucene50(blocksize=128))), range_facet_l_dv=BlockTreeOrds(blocksize=128), _version_=TestBloomFilteredLucenePostings(BloomFilteringPostingsFormat(Lucene50(blocksize=128))), multiDefault=PostingsFormat(name=MockRandom), a_t=PostingsFormat(name=MockRandom), intDefault=TestBloomFilteredLucenePostings(BloomFilteringPostingsFormat(Lucene50(blocksize=128))), a_i1=PostingsFormat(name=MockRandom), id=BlockTreeOrds(blocksize=128), range_facet_i_dv=PostingsFormat(name=MockRandom), text=PostingsFormat(name=LuceneVarGapDocFreqInterval), range_facet_l=PostingsFormat(name=MockRandom), timestamp=PostingsFormat(name=MockRandom)}, docValues:{range_facet_l_dv=DocValuesFormat(name=Lucene54), range_facet_i_dv=DocValuesFormat(name=Asserting), timestamp=DocValuesFormat(name=Asserting)}, maxPointsInLeafNode=985, maxMBSortInHeap=5.655124092210851, sim=RandomSimilarity(queryNorm=false,coord=yes): {}, locale=nl-SR, timezone=Europe/Uzhgorod
   [junit4]   2> NOTE: Linux 3.19.0-51-generic i386/Oracle Corporation 9-ea (32-bit)/cpus=12,threads=1,free=115962320,total=338796544
   [junit4]   2> NOTE: All tests run in this JVM: [RulesTest, DistributedExpandComponentTest, TestSort, BufferStoreTest, FacetPivotSmallTest, CleanupOldIndexTest, TestSchemaManager, HdfsRestartWhileUpdatingTest, BadCopyFieldTest, TestSolrIndexConfig, TestPKIAuthenticationPlugin, CollectionsAPISolrJTest, HdfsTlogReplayBufferedWhileIndexingTest, TestMaxScoreQueryParser, OverseerTaskQueueTest, TestGroupingSearch, XmlUpdateRequestHandlerTest, SuggesterTest, TestReloadDeadlock, PrimitiveFieldTypeTest, TestZkChroot, UpdateParamsTest, SimpleFacetsTest, TestFuzzyAnalyzedSuggestions, HardAutoCommitTest, TestExtendedDismaxParser, TestRestManager, TestAddFieldRealTimeGet, DistributedQueryComponentCustomSortTest, TestSortingResponseWriter, IgnoreCommitOptimizeUpdateProcessorFactoryTest, TestElisionMultitermQuery, TestRawResponseWriter, RecoveryZkTest, CollectionStateFormat2Test, TestTolerantSearch, DistribJoinFromCollectionTest, TestSuggestSpellingConverter, DirectUpdateHandlerOptimizeTest, TestJettySolrRunner, TestCoreDiscovery, TestSolrQueryParser, PluginInfoTest, TestIndexingPerformance, TestSmileRequest, CloudMLTQParserTest, DocValuesMissingTest, TestSolrDeletionPolicy1, QueryParsingTest, TestMacros, TestExactSharedStatsCache, SliceStateTest, TestWriterPerf, MergeStrategyTest, AutoCommitTest, TestDynamicFieldResource, TestJmxMonitoredMap, TestCSVResponseWriter, RequestHandlersTest, TestFieldTypeCollectionResource, TestJsonFacets, TestSolrDynamicMBean, TestObjectReleaseTracker, BlockJoinFacetRandomTest, TestRequestStatusCollectionAPI, HdfsChaosMonkeyNothingIsSafeTest, StressHdfsTest, DocValuesMultiTest, ForceLeaderTest, SolrCloudExampleTest, DirectSolrConnectionTest, ExitableDirectoryReaderTest, CircularListTest, TestInfoStreamLogging, RegexBoostProcessorTest, SuggestComponentTest, TestBlendedInfixSuggestions, TestConfigSets, AssignTest, TestUtils, TermVectorComponentDistributedTest, SolrCoreCheckLockOnStartupTest, TestConfigOverlay, ConnectionManagerTest, TestBlobHandler, LeaderElectionTest, TestRebalanceLeaders, TestJmxIntegration, TestSearchPerf, SuggesterTSTTest, SSLMigrationTest, TestSolrCloudWithKerberosAlt, ChaosMonkeySafeLeaderTest, BasicDistributedZk2Test, UnloadDistributedZkTest]
   [junit4] Completed [238/578 (1!)] on J2 in 135.82s, 1 test, 1 error <<< FAILURES!

[...truncated 1095 lines...]
BUILD FAILED
/home/jenkins/workspace/Lucene-Solr-master-Linux/build.xml:740: The following error occurred while executing this line:
/home/jenkins/workspace/Lucene-Solr-master-Linux/build.xml:684: The following error occurred while executing this line:
/home/jenkins/workspace/Lucene-Solr-master-Linux/build.xml:59: The following error occurred while executing this line:
/home/jenkins/workspace/Lucene-Solr-master-Linux/solr/build.xml:233: The following error occurred while executing this line:
/home/jenkins/workspace/Lucene-Solr-master-Linux/solr/common-build.xml:524: The following error occurred while executing this line:
/home/jenkins/workspace/Lucene-Solr-master-Linux/lucene/common-build.xml:1457: The following error occurred while executing this line:
/home/jenkins/workspace/Lucene-Solr-master-Linux/lucene/common-build.xml:1014: There were test failures: 578 suites (10 ignored), 2307 tests, 1 error, 116 ignored (70 assumptions) [seed: A4ED74EFCD7962BA]

Total time: 59 minutes 25 seconds
Build step 'Invoke Ant' marked build as failure
Archiving artifacts
[WARNINGS] Skipping publisher since build result is FAILURE
Recording test results
Email was triggered for: Failure - Any
Sending email for trigger: Failure - Any



Mime
View raw message