lucene-dev mailing list archives

Site index · List index
Message view « Date » · « Thread »
Top « Date » · « Thread »
From Policeman Jenkins Server <jenk...@thetaphi.de>
Subject [JENKINS-EA] Lucene-Solr-trunk-Linux (32bit/jdk-9-ea+107) - Build # 16083 - Still Failing!
Date Thu, 03 Mar 2016 07:34:38 GMT
Build: http://jenkins.thetaphi.de/job/Lucene-Solr-trunk-Linux/16083/
Java: 32bit/jdk-9-ea+107 -server -XX:+UseConcMarkSweepGC

1 tests failed.
FAILED:  org.apache.solr.internal.csv.CSVPrinterTest.testRandom

Error Message:
(line 1) Wrong unicode escape sequence found '3 UĆ'java.lang.NumberFormatException: For input
string: "3 UĆ"

Stack Trace:
java.io.IOException: (line 1) Wrong unicode escape sequence found '3
UĆ'java.lang.NumberFormatException: For input string: "3
UĆ"
	at org.apache.solr.internal.csv.CSVParser.unicodeEscapeLexer(CSVParser.java:496)
	at org.apache.solr.internal.csv.CSVParser.encapsulatedTokenLexer(CSVParser.java:422)
	at org.apache.solr.internal.csv.CSVParser.nextToken(CSVParser.java:327)
	at org.apache.solr.internal.csv.CSVParser.getLine(CSVParser.java:199)
	at org.apache.solr.internal.csv.CSVParser.getAllValues(CSVParser.java:147)
	at org.apache.solr.internal.csv.CSVPrinterTest.doOneRandom(CSVPrinterTest.java:127)
	at org.apache.solr.internal.csv.CSVPrinterTest.doRandom(CSVPrinterTest.java:95)
	at org.apache.solr.internal.csv.CSVPrinterTest.testRandom(CSVPrinterTest.java:81)
	at sun.reflect.NativeMethodAccessorImpl.invoke0(Native Method)
	at sun.reflect.NativeMethodAccessorImpl.invoke(NativeMethodAccessorImpl.java:62)
	at sun.reflect.DelegatingMethodAccessorImpl.invoke(DelegatingMethodAccessorImpl.java:43)
	at java.lang.reflect.Method.invoke(Method.java:520)
	at junit.framework.TestCase.runTest(TestCase.java:168)
	at junit.framework.TestCase.runBare(TestCase.java:134)
	at junit.framework.TestResult$1.protect(TestResult.java:110)
	at junit.framework.TestResult.runProtected(TestResult.java:128)
	at junit.framework.TestResult.run(TestResult.java:113)
	at junit.framework.TestCase.run(TestCase.java:124)
	at junit.framework.TestSuite.runTest(TestSuite.java:243)
	at junit.framework.TestSuite.run(TestSuite.java:238)
	at org.junit.internal.runners.JUnit38ClassRunner.run(JUnit38ClassRunner.java:83)
	at com.carrotsearch.ant.tasks.junit4.slave.SlaveMain.execute(SlaveMain.java:243)
	at com.carrotsearch.ant.tasks.junit4.slave.SlaveMain.main(SlaveMain.java:354)
	at com.carrotsearch.ant.tasks.junit4.slave.SlaveMainSafe.main(SlaveMainSafe.java:10)




Build Log:
[...truncated 11734 lines...]
   [junit4] Suite: org.apache.solr.internal.csv.CSVPrinterTest
   [junit4] ERROR   0.02s J2 | CSVPrinterTest.testRandom <<<
   [junit4]    > Throwable #1: java.io.IOException: (line 1) Wrong unicode escape sequence
found '3
   [junit4]    > UĆ'java.lang.NumberFormatException: For input string: "3
   [junit4]    > UĆ"
   [junit4]    > 	at org.apache.solr.internal.csv.CSVParser.unicodeEscapeLexer(CSVParser.java:496)
   [junit4]    > 	at org.apache.solr.internal.csv.CSVParser.encapsulatedTokenLexer(CSVParser.java:422)
   [junit4]    > 	at org.apache.solr.internal.csv.CSVParser.nextToken(CSVParser.java:327)
   [junit4]    > 	at org.apache.solr.internal.csv.CSVParser.getLine(CSVParser.java:199)
   [junit4]    > 	at org.apache.solr.internal.csv.CSVParser.getAllValues(CSVParser.java:147)
   [junit4]    > 	at org.apache.solr.internal.csv.CSVPrinterTest.doOneRandom(CSVPrinterTest.java:127)
   [junit4]    > 	at org.apache.solr.internal.csv.CSVPrinterTest.doRandom(CSVPrinterTest.java:95)
   [junit4]    > 	at org.apache.solr.internal.csv.CSVPrinterTest.testRandom(CSVPrinterTest.java:81)
   [junit4]    > 	at junit.framework.TestCase.runTest(TestCase.java:168)
   [junit4]    > 	at junit.framework.TestCase.runBare(TestCase.java:134)
   [junit4]    > 	at junit.framework.TestResult$1.protect(TestResult.java:110)
   [junit4]    > 	at junit.framework.TestResult.runProtected(TestResult.java:128)
   [junit4]    > 	at junit.framework.TestResult.run(TestResult.java:113)
   [junit4]    > 	at junit.framework.TestCase.run(TestCase.java:124)
   [junit4]    > 	at junit.framework.TestSuite.runTest(TestSuite.java:243)
   [junit4]    > 	at junit.framework.TestSuite.run(TestSuite.java:238)
   [junit4] Completed [385/581 (1!)] on J2 in 0.02s, 6 tests, 1 error <<< FAILURES!

[...truncated 501 lines...]
   [junit4] JVM J2: stdout was not empty, see: /home/jenkins/workspace/Lucene-Solr-trunk-Linux/solr/build/solr-core/test/temp/junit4-J2-20160303_070043_372.sysout
   [junit4] >>> JVM J2 emitted unexpected output (verbatim) ----
   [junit4] #
   [junit4] # A fatal error has been detected by the Java Runtime Environment:
   [junit4] #
   [junit4] #  SIGSEGV (0xb) at pc=0xf702713a, pid=11538, tid=11559
   [junit4] #
   [junit4] # JRE version: Java(TM) SE Runtime Environment (9.0+107) (build 9-ea+107-2016-02-24-195421.javare.4520.nc)
   [junit4] # Java VM: Java HotSpot(TM) Server VM (9-ea+107-2016-02-24-195421.javare.4520.nc,
mixed mode, tiered, concurrent mark sweep gc, linux-x86)
   [junit4] # Problematic frame:
   [junit4] # V  [libjvm.so+0x8af13a]  ParRootScanWithoutBarrierClosure::do_oop(oopDesc**)+0x1a
   [junit4] #
   [junit4] # No core dump will be written. Core dumps have been disabled. To enable core
dumping, try "ulimit -c unlimited" before starting Java again
   [junit4] #
   [junit4] # An error report file with more information is saved as:
   [junit4] # /home/jenkins/workspace/Lucene-Solr-trunk-Linux/solr/build/solr-core/test/J2/hs_err_pid11538.log
   [junit4] Compiled method (c2) 1909380 36742   !   4       org.apache.solr.update.SolrCmdDistributor::submit
(301 bytes)
   [junit4]  total in heap  [0xf0fd5b88,0xf0ff7a4c] = 138948
   [junit4]  relocation     [0xf0fd5c58,0xf0fd6ac0] = 3688
   [junit4]  main code      [0xf0fd6ac0,0xf0fde7a0] = 31968
   [junit4]  stub code      [0xf0fde7a0,0xf0fded34] = 1428
   [junit4]  oops           [0xf0fded34,0xf0fdeda4] = 112
   [junit4]  metadata       [0xf0fdeda4,0xf0fdf070] = 716
   [junit4]  scopes data    [0xf0fdf070,0xf0ff46a8] = 87608
   [junit4]  scopes pcs     [0xf0ff46a8,0xf0ff64f8] = 7760
   [junit4]  dependencies   [0xf0ff64f8,0xf0ff65a8] = 176
   [junit4]  handler table  [0xf0ff65a8,0xf0ff7748] = 4512
   [junit4]  nul chk table  [0xf0ff7748,0xf0ff7a4c] = 772
   [junit4] #
   [junit4] # If you would like to submit a bug report, please visit:
   [junit4] #   http://bugreport.java.com/bugreport/crash.jsp
   [junit4] #
   [junit4] <<< JVM J2: EOF ----

[...truncated 129 lines...]
   [junit4] ERROR: JVM J2 ended with an exception, command line: /home/jenkins/tools/java/32bit/jdk-9-ea+107/bin/java
-server -XX:+UseConcMarkSweepGC -XX:+HeapDumpOnOutOfMemoryError -XX:HeapDumpPath=/home/jenkins/workspace/Lucene-Solr-trunk-Linux/heapdumps
-ea -esa -Dtests.prefix=tests -Dtests.seed=F6C57274BC3AF5B2 -Xmx512M -Dtests.iters= -Dtests.verbose=false
-Dtests.infostream=false -Dtests.codec=random -Dtests.postingsformat=random -Dtests.docvaluesformat=random
-Dtests.locale=random -Dtests.timezone=random -Dtests.directory=random -Dtests.linedocsfile=europarl.lines.txt.gz
-Dtests.luceneMatchVersion=7.0.0 -Dtests.cleanthreads=perClass -Djava.util.logging.config.file=/home/jenkins/workspace/Lucene-Solr-trunk-Linux/lucene/tools/junit4/logging.properties
-Dtests.nightly=false -Dtests.weekly=false -Dtests.monster=false -Dtests.slow=true -Dtests.asserts=true
-Dtests.multiplier=3 -DtempDir=./temp -Djava.io.tmpdir=./temp -Djunit4.tempDir=/home/jenkins/workspace/Lucene-Solr-trunk-Linux/solr/build/solr-core/test/temp
-Dcommon.dir=/home/jenkins/workspace/Lucene-Solr-trunk-Linux/lucene -Dclover.db.dir=/home/jenkins/workspace/Lucene-Solr-trunk-Linux/lucene/build/clover/db
-Djava.security.policy=/home/jenkins/workspace/Lucene-Solr-trunk-Linux/lucene/tools/junit4/solr-tests.policy
-Dtests.LUCENE_VERSION=7.0.0 -Djetty.testMode=1 -Djetty.insecurerandom=1 -Dsolr.directoryFactory=org.apache.solr.core.MockDirectoryFactory
-Djava.awt.headless=true -Djdk.map.althashing.threshold=0 -Djunit4.childvm.cwd=/home/jenkins/workspace/Lucene-Solr-trunk-Linux/solr/build/solr-core/test/J2
-Djunit4.childvm.id=2 -Djunit4.childvm.count=3 -Dtests.leaveTemporary=false -Dtests.filterstacks=true
-Dtests.disableHdfs=true -Djava.security.manager=org.apache.lucene.util.TestSecurityManager
-classpath /home/jenkins/workspace/Lucene-Solr-trunk-Linux/solr/build/solr-core/classes/test:/home/jenkins/workspace/Lucene-Solr-trunk-Linux/solr/build/solr-test-framework/classes/java:/home/jenkins/workspace/Lucene-Solr-trunk-Linux/solr/test-framework/lib/junit4-ant-2.3.2.jar:/home/jenkins/workspace/Lucene-Solr-trunk-Linux/solr/core/src/test-files:/home/jenkins/workspace/Lucene-Solr-trunk-Linux/lucene/build/test-framework/classes/java:/home/jenkins/workspace/Lucene-Solr-trunk-Linux/lucene/build/codecs/classes/java:/home/jenkins/workspace/Lucene-Solr-trunk-Linux/solr/build/solr-solrj/classes/java:/home/jenkins/workspace/Lucene-Solr-trunk-Linux/solr/build/solr-core/classes/java:/home/jenkins/workspace/Lucene-Solr-trunk-Linux/lucene/build/analysis/common/lucene-analyzers-common-7.0.0-SNAPSHOT.jar:/home/jenkins/workspace/Lucene-Solr-trunk-Linux/lucene/build/analysis/kuromoji/lucene-analyzers-kuromoji-7.0.0-SNAPSHOT.jar:/home/jenkins/workspace/Lucene-Solr-trunk-Linux/lucene/build/analysis/phonetic/lucene-analyzers-phonetic-7.0.0-SNAPSHOT.jar:/home/jenkins/workspace/Lucene-Solr-trunk-Linux/lucene/build/codecs/lucene-codecs-7.0.0-SNAPSHOT.jar:/home/jenkins/workspace/Lucene-Solr-trunk-Linux/lucene/build/backward-codecs/lucene-backward-codecs-7.0.0-SNAPSHOT.jar:/home/jenkins/workspace/Lucene-Solr-trunk-Linux/lucene/build/highlighter/lucene-highlighter-7.0.0-SNAPSHOT.jar:/home/jenkins/workspace/Lucene-Solr-trunk-Linux/lucene/build/memory/lucene-memory-7.0.0-SNAPSHOT.jar:/home/jenkins/workspace/Lucene-Solr-trunk-Linux/lucene/build/misc/lucene-misc-7.0.0-SNAPSHOT.jar:/home/jenkins/workspace/Lucene-Solr-trunk-Linux/lucene/build/spatial-extras/lucene-spatial-extras-7.0.0-SNAPSHOT.jar:/home/jenkins/workspace/Lucene-Solr-trunk-Linux/lucene/build/expressions/lucene-expressions-7.0.0-SNAPSHOT.jar:/home/jenkins/workspace/Lucene-Solr-trunk-Linux/lucene/build/suggest/lucene-suggest-7.0.0-SNAPSHOT.jar:/home/jenkins/workspace/Lucene-Solr-trunk-Linux/lucene/build/grouping/lucene-grouping-7.0.0-SNAPSHOT.jar:/home/jenkins/workspace/Lucene-Solr-trunk-Linux/lucene/build/queries/lucene-queries-7.0.0-SNAPSHOT.jar:/home/jenkins/workspace/Lucene-Solr-trunk-Linux/lucene/build/queryparser/lucene-queryparser-7.0.0-SNAPSHOT.jar:/home/jenkins/workspace/Lucene-Solr-trunk-Linux/lucene/build/join/lucene-join-7.0.0-SNAPSHOT.jar:/home/jenkins/workspace/Lucene-Solr-trunk-Linux/lucene/build/sandbox/lucene-sandbox-7.0.0-SNAPSHOT.jar:/home/jenkins/workspace/Lucene-Solr-trunk-Linux/solr/core/lib/antlr4-runtime-4.5.1-1.jar:/home/jenkins/workspace/Lucene-Solr-trunk-Linux/solr/core/lib/asm-5.0.4.jar:/home/jenkins/workspace/Lucene-Solr-trunk-Linux/solr/core/lib/asm-commons-5.0.4.jar:/home/jenkins/workspace/Lucene-Solr-trunk-Linux/solr/core/lib/caffeine-1.0.1.jar:/home/jenkins/workspace/Lucene-Solr-trunk-Linux/solr/core/lib/commons-cli-1.2.jar:/home/jenkins/workspace/Lucene-Solr-trunk-Linux/solr/core/lib/commons-codec-1.10.jar:/home/jenkins/workspace/Lucene-Solr-trunk-Linux/solr/core/lib/commons-collections-3.2.2.jar:/home/jenkins/workspace/Lucene-Solr-trunk-Linux/solr/core/lib/commons-configuration-1.6.jar:/home/jenkins/workspace/Lucene-Solr-trunk-Linux/solr/core/lib/commons-exec-1.3.jar:/home/jenkins/workspace/Lucene-Solr-trunk-Linux/solr/core/lib/commons-fileupload-1.2.1.jar:/home/jenkins/workspace/Lucene-Solr-trunk-Linux/solr/core/lib/commons-lang-2.6.jar:/home/jenkins/workspace/Lucene-Solr-trunk-Linux/solr/core/lib/dom4j-1.6.1.jar:/home/jenkins/workspace/Lucene-Solr-trunk-Linux/solr/core/lib/guava-14.0.1.jar:/home/jenkins/workspace/Lucene-Solr-trunk-Linux/solr/core/lib/hadoop-annotations-2.6.0.jar:/home/jenkins/workspace/Lucene-Solr-trunk-Linux/solr/core/lib/hadoop-auth-2.6.0.jar:/home/jenkins/workspace/Lucene-Solr-trunk-Linux/solr/core/lib/hadoop-common-2.6.0.jar:/home/jenkins/workspace/Lucene-Solr-trunk-Linux/solr/core/lib/hadoop-hdfs-2.6.0.jar:/home/jenkins/workspace/Lucene-Solr-trunk-Linux/solr/core/lib/hppc-0.7.1.jar:/home/jenkins/workspace/Lucene-Solr-trunk-Linux/solr/core/lib/htrace-core-3.0.4.jar:/home/jenkins/workspace/Lucene-Solr-trunk-Linux/solr/core/lib/jackson-core-2.5.4.jar:/home/jenkins/workspace/Lucene-Solr-trunk-Linux/solr/core/lib/jackson-dataformat-smile-2.5.4.jar:/home/jenkins/workspace/Lucene-Solr-trunk-Linux/solr/core/lib/jcl-over-slf4j-1.7.7.jar:/home/jenkins/workspace/Lucene-Solr-trunk-Linux/solr/core/lib/joda-time-2.2.jar:/home/jenkins/workspace/Lucene-Solr-trunk-Linux/solr/core/lib/log4j-1.2.17.jar:/home/jenkins/workspace/Lucene-Solr-trunk-Linux/solr/core/lib/org.restlet-2.3.0.jar:/home/jenkins/workspace/Lucene-Solr-trunk-Linux/solr/core/lib/org.restlet.ext.servlet-2.3.0.jar:/home/jenkins/workspace/Lucene-Solr-trunk-Linux/solr/core/lib/presto-parser-0.122.jar:/home/jenkins/workspace/Lucene-Solr-trunk-Linux/solr/core/lib/protobuf-java-2.5.0.jar:/home/jenkins/workspace/Lucene-Solr-trunk-Linux/solr/core/lib/slf4j-log4j12-1.7.7.jar:/home/jenkins/workspace/Lucene-Solr-trunk-Linux/solr/core/lib/slice-0.10.jar:/home/jenkins/workspace/Lucene-Solr-trunk-Linux/solr/core/lib/spatial4j-0.6.jar:/home/jenkins/workspace/Lucene-Solr-trunk-Linux/solr/core/lib/t-digest-3.1.jar:/home/jenkins/workspace/Lucene-Solr-trunk-Linux/solr/solrj/lib/commons-io-2.4.jar:/home/jenkins/workspace/Lucene-Solr-trunk-Linux/solr/solrj/lib/httpclient-4.4.1.jar:/home/jenkins/workspace/Lucene-Solr-trunk-Linux/solr/solrj/lib/httpcore-4.4.1.jar:/home/jenkins/workspace/Lucene-Solr-trunk-Linux/solr/solrj/lib/httpmime-4.4.1.jar:/home/jenkins/workspace/Lucene-Solr-trunk-Linux/solr/solrj/lib/jcl-over-slf4j-1.7.7.jar:/home/jenkins/workspace/Lucene-Solr-trunk-Linux/solr/solrj/lib/noggit-0.6.jar:/home/jenkins/workspace/Lucene-Solr-trunk-Linux/solr/solrj/lib/slf4j-api-1.7.7.jar:/home/jenkins/workspace/Lucene-Solr-trunk-Linux/solr/solrj/lib/stax2-api-3.1.4.jar:/home/jenkins/workspace/Lucene-Solr-trunk-Linux/solr/solrj/lib/woodstox-core-asl-4.4.1.jar:/home/jenkins/workspace/Lucene-Solr-trunk-Linux/solr/solrj/lib/zookeeper-3.4.6.jar:/home/jenkins/workspace/Lucene-Solr-trunk-Linux/solr/server/lib/javax.servlet-api-3.1.0.jar:/home/jenkins/workspace/Lucene-Solr-trunk-Linux/solr/server/lib/jetty-continuation-9.3.6.v20151106.jar:/home/jenkins/workspace/Lucene-Solr-trunk-Linux/solr/server/lib/jetty-deploy-9.3.6.v20151106.jar:/home/jenkins/workspace/Lucene-Solr-trunk-Linux/solr/server/lib/jetty-http-9.3.6.v20151106.jar:/home/jenkins/workspace/Lucene-Solr-trunk-Linux/solr/server/lib/jetty-io-9.3.6.v20151106.jar:/home/jenkins/workspace/Lucene-Solr-trunk-Linux/solr/server/lib/jetty-jmx-9.3.6.v20151106.jar:/home/jenkins/workspace/Lucene-Solr-trunk-Linux/solr/server/lib/jetty-rewrite-9.3.6.v20151106.jar:/home/jenkins/workspace/Lucene-Solr-trunk-Linux/solr/server/lib/jetty-security-9.3.6.v20151106.jar:/home/jenkins/workspace/Lucene-Solr-trunk-Linux/solr/server/lib/jetty-server-9.3.6.v20151106.jar:/home/jenkins/workspace/Lucene-Solr-trunk-Linux/solr/server/lib/jetty-servlet-9.3.6.v20151106.jar:/home/jenkins/workspace/Lucene-Solr-trunk-Linux/solr/server/lib/jetty-servlets-9.3.6.v20151106.jar:/home/jenkins/workspace/Lucene-Solr-trunk-Linux/solr/server/lib/jetty-util-9.3.6.v20151106.jar:/home/jenkins/workspace/Lucene-Solr-trunk-Linux/solr/server/lib/jetty-webapp-9.3.6.v20151106.jar:/home/jenkins/workspace/Lucene-Solr-trunk-Linux/solr/server/lib/jetty-xml-9.3.6.v20151106.jar:/home/jenkins/workspace/Lucene-Solr-trunk-Linux/solr/example/example-DIH/solr/db/lib/derby-10.9.1.0.jar:/home/jenkins/workspace/Lucene-Solr-trunk-Linux/solr/example/example-DIH/solr/db/lib/hsqldb-1.8.0.10.jar:/home/jenkins/workspace/Lucene-Solr-trunk-Linux/lucene/build/core/classes/java:/home/jenkins/workspace/Lucene-Solr-trunk-Linux/lucene/test-framework/lib/junit-4.10.jar:/home/jenkins/workspace/Lucene-Solr-trunk-Linux/lucene/test-framework/lib/randomizedtesting-runner-2.3.2.jar:/home/jenkins/workspace/Lucene-Solr-trunk-Linux/solr/core/test-lib/antlr-2.7.7.jar:/home/jenkins/workspace/Lucene-Solr-trunk-Linux/solr/core/test-lib/antlr4-runtime-4.5.1-1.jar:/home/jenkins/workspace/Lucene-Solr-trunk-Linux/solr/core/test-lib/apacheds-core-2.0.0-M15.jar:/home/jenkins/workspace/Lucene-Solr-trunk-Linux/solr/core/test-lib/apacheds-core-api-2.0.0-M15.jar:/home/jenkins/workspace/Lucene-Solr-trunk-Linux/solr/core/test-lib/apacheds-core-avl-2.0.0-M15.jar:/home/jenkins/workspace/Lucene-Solr-trunk-Linux/solr/core/test-lib/apacheds-core-shared-2.0.0-M15.jar:/home/jenkins/workspace/Lucene-Solr-trunk-Linux/solr/core/test-lib/apacheds-i18n-2.0.0-M15.jar:/home/jenkins/workspace/Lucene-Solr-trunk-Linux/solr/core/test-lib/apacheds-interceptor-kerberos-2.0.0-M15.jar:/home/jenkins/workspace/Lucene-Solr-trunk-Linux/solr/core/test-lib/apacheds-interceptors-admin-2.0.0-M15.jar:/home/jenkins/workspace/Lucene-Solr-trunk-Linux/solr/core/test-lib/apacheds-interceptors-authn-2.0.0-M15.jar:/home/jenkins/workspace/Lucene-Solr-trunk-Linux/solr/core/test-lib/apacheds-interceptors-authz-2.0.0-M15.jar:/home/jenkins/workspace/Lucene-Solr-trunk-Linux/solr/core/test-lib/apacheds-interceptors-changelog-2.0.0-M15.jar:/home/jenkins/workspace/Lucene-Solr-trunk-Linux/solr/core/test-lib/apacheds-interceptors-collective-2.0.0-M15.jar:/home/jenkins/workspace/Lucene-Solr-trunk-Linux/solr/core/test-lib/apacheds-interceptors-event-2.0.0-M15.jar:/home/jenkins/workspace/Lucene-Solr-trunk-Linux/solr/core/test-lib/apacheds-interceptors-exception-2.0.0-M15.jar:/home/jenkins/workspace/Lucene-Solr-trunk-Linux/solr/core/test-lib/apacheds-interceptors-journal-2.0.0-M15.jar:/home/jenkins/workspace/Lucene-Solr-trunk-Linux/solr/core/test-lib/apacheds-interceptors-normalization-2.0.0-M15.jar:/home/jenkins/workspace/Lucene-Solr-trunk-Linux/solr/core/test-lib/apacheds-interceptors-operational-2.0.0-M15.jar:/home/jenkins/workspace/Lucene-Solr-trunk-Linux/solr/core/test-lib/apacheds-interceptors-referral-2.0.0-M15.jar:/home/jenkins/workspace/Lucene-Solr-trunk-Linux/solr/core/test-lib/apacheds-interceptors-schema-2.0.0-M15.jar:/home/jenkins/workspace/Lucene-Solr-trunk-Linux/solr/core/test-lib/apacheds-interceptors-subtree-2.0.0-M15.jar:/home/jenkins/workspace/Lucene-Solr-trunk-Linux/solr/core/test-lib/apacheds-interceptors-trigger-2.0.0-M15.jar:/home/jenkins/workspace/Lucene-Solr-trunk-Linux/solr/core/test-lib/apacheds-jdbm-partition-2.0.0-M15.jar:/home/jenkins/workspace/Lucene-Solr-trunk-Linux/solr/core/test-lib/apacheds-jdbm1-2.0.0-M2.jar:/home/jenkins/workspace/Lucene-Solr-trunk-Linux/solr/core/test-lib/apacheds-kerberos-codec-2.0.0-M15.jar:/home/jenkins/workspace/Lucene-Solr-trunk-Linux/solr/core/test-lib/apacheds-ldif-partition-2.0.0-M15.jar:/home/jenkins/workspace/Lucene-Solr-trunk-Linux/solr/core/test-lib/apacheds-mavibot-partition-2.0.0-M15.jar:/home/jenkins/workspace/Lucene-Solr-trunk-Linux/solr/core/test-lib/apacheds-protocol-kerberos-2.0.0-M15.jar:/home/jenkins/workspace/Lucene-Solr-trunk-Linux/solr/core/test-lib/apacheds-protocol-ldap-2.0.0-M15.jar:/home/jenkins/workspace/Lucene-Solr-trunk-Linux/solr/core/test-lib/apacheds-protocol-shared-2.0.0-M15.jar:/home/jenkins/workspace/Lucene-Solr-trunk-Linux/solr/core/test-lib/apacheds-xdbm-partition-2.0.0-M15.jar:/home/jenkins/workspace/Lucene-Solr-trunk-Linux/solr/core/test-lib/api-all-1.0.0-M20.jar:/home/jenkins/workspace/Lucene-Solr-trunk-Linux/solr/core/test-lib/bcprov-jdk15-1.45.jar:/home/jenkins/workspace/Lucene-Solr-trunk-Linux/solr/core/test-lib/cglib-nodep-2.2.jar:/home/jenkins/workspace/Lucene-Solr-trunk-Linux/solr/core/test-lib/commons-collections-3.2.2.jar:/home/jenkins/workspace/Lucene-Solr-trunk-Linux/solr/core/test-lib/commons-math3-3.4.1.jar:/home/jenkins/workspace/Lucene-Solr-trunk-Linux/solr/core/test-lib/easymock-3.0.jar:/home/jenkins/workspace/Lucene-Solr-trunk-Linux/solr/core/test-lib/ehcache-core-2.4.4.jar:/home/jenkins/workspace/Lucene-Solr-trunk-Linux/solr/core/test-lib/hadoop-common-2.6.0-tests.jar:/home/jenkins/workspace/Lucene-Solr-trunk-Linux/solr/core/test-lib/hadoop-hdfs-2.6.0-tests.jar:/home/jenkins/workspace/Lucene-Solr-trunk-Linux/solr/core/test-lib/hadoop-minikdc-2.6.0.jar:/home/jenkins/workspace/Lucene-Solr-trunk-Linux/solr/core/test-lib/jackson-annotations-2.5.4.jar:/home/jenkins/workspace/Lucene-Solr-trunk-Linux/solr/core/test-lib/jackson-databind-2.5.4.jar:/home/jenkins/workspace/Lucene-Solr-trunk-Linux/solr/core/test-lib/jersey-core-1.9.jar:/home/jenkins/workspace/Lucene-Solr-trunk-Linux/solr/core/test-lib/jersey-server-1.9.jar:/home/jenkins/workspace/Lucene-Solr-trunk-Linux/solr/core/test-lib/jetty-6.1.26.jar:/home/jenkins/workspace/Lucene-Solr-trunk-Linux/solr/core/test-lib/jetty-util-6.1.26.jar:/home/jenkins/workspace/Lucene-Solr-trunk-Linux/solr/core/test-lib/mina-core-2.0.0-M5.jar:/home/jenkins/workspace/Lucene-Solr-trunk-Linux/solr/core/test-lib/mockito-core-1.9.5.jar:/home/jenkins/workspace/Lucene-Solr-trunk-Linux/solr/core/test-lib/objenesis-1.2.jar:/home/jenkins/workspace/Lucene-Solr-trunk-Linux/solr/core/test-lib/presto-parser-0.122.jar:/home/jenkins/workspace/Lucene-Solr-trunk-Linux/solr/core/test-lib/slice-0.10.jar:/home/jenkins/workspace/Lucene-Solr-trunk-Linux/lucene/build/analysis/icu/lucene-analyzers-icu-7.0.0-SNAPSHOT.jar:/home/jenkins/workspace/Lucene-Solr-trunk-Linux/solr/build/contrib/solr-analysis-extras/classes/java:/home/jenkins/workspace/Lucene-Solr-trunk-Linux/lucene/build/queryparser/classes/test:/home/jenkins/workspace/Lucene-Solr-trunk-Linux/solr/contrib/analysis-extras/lib/icu4j-56.1.jar:/var/lib/jenkins/tools/hudson.tasks.Ant_AntInstallation/ANT_1.8.2/lib/ant-launcher.jar:/var/lib/jenkins/.ant/lib/ivy-2.3.0.jar:/var/lib/jenkins/tools/hudson.tasks.Ant_AntInstallation/ANT_1.8.2/lib/ant-jdepend.jar:/var/lib/jenkins/tools/hudson.tasks.Ant_AntInstallation/ANT_1.8.2/lib/ant.jar:/var/lib/jenkins/tools/hudson.tasks.Ant_AntInstallation/ANT_1.8.2/lib/ant-apache-bcel.jar:/var/lib/jenkins/tools/hudson.tasks.Ant_AntInstallation/ANT_1.8.2/lib/ant-jmf.jar:/var/lib/jenkins/tools/hudson.tasks.Ant_AntInstallation/ANT_1.8.2/lib/ant-junit4.jar:/var/lib/jenkins/tools/hudson.tasks.Ant_AntInstallation/ANT_1.8.2/lib/ant-apache-xalan2.jar:/var/lib/jenkins/tools/hudson.tasks.Ant_AntInstallation/ANT_1.8.2/lib/ant-javamail.jar:/var/lib/jenkins/tools/hudson.tasks.Ant_AntInstallation/ANT_1.8.2/lib/ant-jai.jar:/var/lib/jenkins/tools/hudson.tasks.Ant_AntInstallation/ANT_1.8.2/lib/ant-apache-bsf.jar:/var/lib/jenkins/tools/hudson.tasks.Ant_AntInstallation/ANT_1.8.2/lib/ant-commons-logging.jar:/var/lib/jenkins/tools/hudson.tasks.Ant_AntInstallation/ANT_1.8.2/lib/ant-commons-net.jar:/var/lib/jenkins/tools/hudson.tasks.Ant_AntInstallation/ANT_1.8.2/lib/ant-apache-resolver.jar:/var/lib/jenkins/tools/hudson.tasks.Ant_AntInstallation/ANT_1.8.2/lib/ant-apache-log4j.jar:/var/lib/jenkins/tools/hudson.tasks.Ant_AntInstallation/ANT_1.8.2/lib/ant-junit.jar:/var/lib/jenkins/tools/hudson.tasks.Ant_AntInstallation/ANT_1.8.2/lib/ant-apache-oro.jar:/var/lib/jenkins/tools/hudson.tasks.Ant_AntInstallation/ANT_1.8.2/lib/ant-antlr.jar:/var/lib/jenkins/tools/hudson.tasks.Ant_AntInstallation/ANT_1.8.2/lib/ant-jsch.jar:/var/lib/jenkins/tools/hudson.tasks.Ant_AntInstallation/ANT_1.8.2/lib/ant-apache-regexp.jar:/var/lib/jenkins/tools/hudson.tasks.Ant_AntInstallation/ANT_1.8.2/lib/ant-swing.jar:/var/lib/jenkins/tools/hudson.tasks.Ant_AntInstallation/ANT_1.8.2/lib/ant-testutil.jar:/var/lib/jenkins/tools/hudson.tasks.Ant_AntInstallation/ANT_1.8.2/lib/ant-netrexx.jar:/var/lib/jenkins/.ivy2/cache/com.carrotsearch.randomizedtesting/junit4-ant/jars/junit4-ant-2.3.2.jar
com.carrotsearch.ant.tasks.junit4.slave.SlaveMainSafe -eventsfile /home/jenkins/workspace/Lucene-Solr-trunk-Linux/solr/build/solr-core/test/temp/junit4-J2-20160303_070043_372.events
@/home/jenkins/workspace/Lucene-Solr-trunk-Linux/solr/build/solr-core/test/temp/junit4-J2-20160303_070043_372.suites
-stdin
   [junit4] ERROR: JVM J2 ended with an exception: Forked process returned with error code:
134. Very likely a JVM crash.  See process stdout at: /home/jenkins/workspace/Lucene-Solr-trunk-Linux/solr/build/solr-core/test/temp/junit4-J2-20160303_070043_372.sysout
   [junit4] 	at com.carrotsearch.ant.tasks.junit4.JUnit4.executeSlave(JUnit4.java:1481)
   [junit4] 	at com.carrotsearch.ant.tasks.junit4.JUnit4.access$000(JUnit4.java:121)
   [junit4] 	at com.carrotsearch.ant.tasks.junit4.JUnit4$2.call(JUnit4.java:955)
   [junit4] 	at com.carrotsearch.ant.tasks.junit4.JUnit4$2.call(JUnit4.java:952)
   [junit4] 	at java.util.concurrent.FutureTask.run(FutureTask.java:266)
   [junit4] 	at java.util.concurrent.ThreadPoolExecutor.runWorker(ThreadPoolExecutor.java:1158)
   [junit4] 	at java.util.concurrent.ThreadPoolExecutor$Worker.run(ThreadPoolExecutor.java:632)
   [junit4] 	at java.lang.Thread.run(Thread.java:804)

BUILD FAILED
/home/jenkins/workspace/Lucene-Solr-trunk-Linux/build.xml:740: The following error occurred
while executing this line:
/home/jenkins/workspace/Lucene-Solr-trunk-Linux/build.xml:684: The following error occurred
while executing this line:
/home/jenkins/workspace/Lucene-Solr-trunk-Linux/build.xml:59: The following error occurred
while executing this line:
/home/jenkins/workspace/Lucene-Solr-trunk-Linux/solr/build.xml:233: The following error occurred
while executing this line:
/home/jenkins/workspace/Lucene-Solr-trunk-Linux/solr/common-build.xml:524: The following error
occurred while executing this line:
/home/jenkins/workspace/Lucene-Solr-trunk-Linux/lucene/common-build.xml:1457: The following
error occurred while executing this line:
/home/jenkins/workspace/Lucene-Solr-trunk-Linux/lucene/common-build.xml:1014: At least one
slave process threw an exception, first: Forked process returned with error code: 134. Very
likely a JVM crash.  See process stdout at: /home/jenkins/workspace/Lucene-Solr-trunk-Linux/solr/build/solr-core/test/temp/junit4-J2-20160303_070043_372.sysout

Total time: 57 minutes 31 seconds
Build step 'Invoke Ant' marked build as failure
Archiving artifacts
[WARNINGS] Skipping publisher since build result is FAILURE
Recording test results
Email was triggered for: Failure - Any
Sending email for trigger: Failure - Any



Mime
View raw message