lucene-dev mailing list archives

Site index · List index
Message view « Date » · « Thread »
Top « Date » · « Thread »
From Policeman Jenkins Server <jenk...@thetaphi.de>
Subject [JENKINS-EA] Lucene-Solr-6.x-Linux (32bit/jdk-9-jigsaw-ea+110) - Build # 193 - Still Failing!
Date Mon, 21 Mar 2016 01:37:06 GMT
Build: http://jenkins.thetaphi.de/job/Lucene-Solr-6.x-Linux/193/
Java: 32bit/jdk-9-jigsaw-ea+110 -client -XX:+UseParallelGC -XX:-CompactStrings

1 tests failed.
FAILED:  org.apache.solr.cloud.UnloadDistributedZkTest.test

Error Message:
Captured an uncaught exception in thread: Thread[id=6474, name=testExecutor-2867-thread-1, state=RUNNABLE, group=TGRP-UnloadDistributedZkTest]

Stack Trace:
com.carrotsearch.randomizedtesting.UncaughtExceptionError: Captured an uncaught exception in thread: Thread[id=6474, name=testExecutor-2867-thread-1, state=RUNNABLE, group=TGRP-UnloadDistributedZkTest]
Caused by: java.lang.RuntimeException: org.apache.solr.client.solrj.SolrServerException: Timeout occured while waiting response from server at: http://127.0.0.1:34579
	at __randomizedtesting.SeedInfo.seed([97BB640442BEF917]:0)
	at org.apache.solr.cloud.BasicDistributedZkTest.lambda$createCores$0(BasicDistributedZkTest.java:583)
	at org.apache.solr.common.util.ExecutorUtil$MDCAwareThreadPoolExecutor.lambda$execute$0(ExecutorUtil.java:229)
	at java.util.concurrent.ThreadPoolExecutor.runWorker(java.base@9-ea/ThreadPoolExecutor.java:1158)
	at java.util.concurrent.ThreadPoolExecutor$Worker.run(java.base@9-ea/ThreadPoolExecutor.java:632)
	at java.lang.Thread.run(java.base@9-ea/Thread.java:804)
Caused by: org.apache.solr.client.solrj.SolrServerException: Timeout occured while waiting response from server at: http://127.0.0.1:34579
	at org.apache.solr.client.solrj.impl.HttpSolrClient.executeMethod(HttpSolrClient.java:588)
	at org.apache.solr.client.solrj.impl.HttpSolrClient.request(HttpSolrClient.java:241)
	at org.apache.solr.client.solrj.impl.HttpSolrClient.request(HttpSolrClient.java:230)
	at org.apache.solr.client.solrj.SolrClient.request(SolrClient.java:1219)
	at org.apache.solr.cloud.BasicDistributedZkTest.lambda$createCores$0(BasicDistributedZkTest.java:581)
	... 4 more
Caused by: java.net.SocketTimeoutException: Read timed out
	at java.net.SocketInputStream.socketRead0(java.base@9-ea/Native Method)
	at java.net.SocketInputStream.socketRead(java.base@9-ea/SocketInputStream.java:116)
	at java.net.SocketInputStream.read(java.base@9-ea/SocketInputStream.java:170)
	at java.net.SocketInputStream.read(java.base@9-ea/SocketInputStream.java:141)
	at org.apache.http.impl.io.AbstractSessionInputBuffer.fillBuffer(AbstractSessionInputBuffer.java:160)
	at org.apache.http.impl.io.SocketInputBuffer.fillBuffer(SocketInputBuffer.java:84)
	at org.apache.http.impl.io.AbstractSessionInputBuffer.readLine(AbstractSessionInputBuffer.java:273)
	at org.apache.http.impl.conn.DefaultHttpResponseParser.parseHead(DefaultHttpResponseParser.java:140)
	at org.apache.http.impl.conn.DefaultHttpResponseParser.parseHead(DefaultHttpResponseParser.java:57)
	at org.apache.http.impl.io.AbstractMessageParser.parse(AbstractMessageParser.java:261)
	at org.apache.http.impl.AbstractHttpClientConnection.receiveResponseHeader(AbstractHttpClientConnection.java:283)
	at org.apache.http.impl.conn.DefaultClientConnection.receiveResponseHeader(DefaultClientConnection.java:251)
	at org.apache.http.impl.conn.ManagedClientConnectionImpl.receiveResponseHeader(ManagedClientConnectionImpl.java:197)
	at org.apache.http.protocol.HttpRequestExecutor.doReceiveResponse(HttpRequestExecutor.java:272)
	at org.apache.http.protocol.HttpRequestExecutor.execute(HttpRequestExecutor.java:124)
	at org.apache.http.impl.client.DefaultRequestDirector.tryExecute(DefaultRequestDirector.java:685)
	at org.apache.http.impl.client.DefaultRequestDirector.execute(DefaultRequestDirector.java:487)
	at org.apache.http.impl.client.AbstractHttpClient.doExecute(AbstractHttpClient.java:882)
	at org.apache.http.impl.client.CloseableHttpClient.execute(CloseableHttpClient.java:82)
	at org.apache.http.impl.client.CloseableHttpClient.execute(CloseableHttpClient.java:107)
	at org.apache.http.impl.client.CloseableHttpClient.execute(CloseableHttpClient.java:55)
	at org.apache.solr.client.solrj.impl.HttpSolrClient.executeMethod(HttpSolrClient.java:482)
	... 8 more




Build Log:
[...truncated 11304 lines...]
   [junit4] Suite: org.apache.solr.cloud.UnloadDistributedZkTest
   [junit4]   2> Creating dataDir: /home/jenkins/workspace/Lucene-Solr-6.x-Linux/solr/build/solr-core/test/J2/temp/solr.cloud.UnloadDistributedZkTest_97BB640442BEF917-001/init-core-data-001
   [junit4]   2> 795459 INFO  (SUITE-UnloadDistributedZkTest-seed#[97BB640442BEF917]-worker) [    ] o.a.s.BaseDistributedSearchTestCase Setting hostContext system property: /
   [junit4]   2> 795462 INFO  (TEST-UnloadDistributedZkTest.test-seed#[97BB640442BEF917]) [    ] o.a.s.c.ZkTestServer STARTING ZK TEST SERVER
   [junit4]   2> 795462 INFO  (Thread-2086) [    ] o.a.s.c.ZkTestServer client port:0.0.0.0/0.0.0.0:0
   [junit4]   2> 795462 INFO  (Thread-2086) [    ] o.a.s.c.ZkTestServer Starting server
   [junit4]   2> 795562 INFO  (TEST-UnloadDistributedZkTest.test-seed#[97BB640442BEF917]) [    ] o.a.s.c.ZkTestServer start zk server on port:44582
   [junit4]   2> 795562 INFO  (TEST-UnloadDistributedZkTest.test-seed#[97BB640442BEF917]) [    ] o.a.s.c.c.SolrZkClient Using default ZkCredentialsProvider
   [junit4]   2> 795562 INFO  (TEST-UnloadDistributedZkTest.test-seed#[97BB640442BEF917]) [    ] o.a.s.c.c.ConnectionManager Waiting for client to connect to ZooKeeper
   [junit4]   2> 795564 INFO  (zkCallback-849-thread-1) [    ] o.a.s.c.c.ConnectionManager Watcher org.apache.solr.common.cloud.ConnectionManager@1feb0d7 name:ZooKeeperConnection Watcher:127.0.0.1:44582 got event WatchedEvent state:SyncConnected type:None path:null path:null type:None
   [junit4]   2> 795564 INFO  (TEST-UnloadDistributedZkTest.test-seed#[97BB640442BEF917]) [    ] o.a.s.c.c.ConnectionManager Client is connected to ZooKeeper
   [junit4]   2> 795565 INFO  (TEST-UnloadDistributedZkTest.test-seed#[97BB640442BEF917]) [    ] o.a.s.c.c.SolrZkClient Using default ZkACLProvider
   [junit4]   2> 795565 INFO  (TEST-UnloadDistributedZkTest.test-seed#[97BB640442BEF917]) [    ] o.a.s.c.c.SolrZkClient makePath: /solr
   [junit4]   2> 795566 INFO  (TEST-UnloadDistributedZkTest.test-seed#[97BB640442BEF917]) [    ] o.a.s.c.c.SolrZkClient Using default ZkCredentialsProvider
   [junit4]   2> 795567 INFO  (TEST-UnloadDistributedZkTest.test-seed#[97BB640442BEF917]) [    ] o.a.s.c.c.ConnectionManager Waiting for client to connect to ZooKeeper
   [junit4]   2> 795568 INFO  (zkCallback-850-thread-1) [    ] o.a.s.c.c.ConnectionManager Watcher org.apache.solr.common.cloud.ConnectionManager@6d090a name:ZooKeeperConnection Watcher:127.0.0.1:44582/solr got event WatchedEvent state:SyncConnected type:None path:null path:null type:None
   [junit4]   2> 795568 INFO  (TEST-UnloadDistributedZkTest.test-seed#[97BB640442BEF917]) [    ] o.a.s.c.c.ConnectionManager Client is connected to ZooKeeper
   [junit4]   2> 795568 INFO  (TEST-UnloadDistributedZkTest.test-seed#[97BB640442BEF917]) [    ] o.a.s.c.c.SolrZkClient Using default ZkACLProvider
   [junit4]   2> 795568 INFO  (TEST-UnloadDistributedZkTest.test-seed#[97BB640442BEF917]) [    ] o.a.s.c.c.SolrZkClient makePath: /collections/collection1
   [junit4]   2> 795569 INFO  (TEST-UnloadDistributedZkTest.test-seed#[97BB640442BEF917]) [    ] o.a.s.c.c.SolrZkClient makePath: /collections/collection1/shards
   [junit4]   2> 795570 INFO  (TEST-UnloadDistributedZkTest.test-seed#[97BB640442BEF917]) [    ] o.a.s.c.c.SolrZkClient makePath: /collections/control_collection
   [junit4]   2> 795571 INFO  (TEST-UnloadDistributedZkTest.test-seed#[97BB640442BEF917]) [    ] o.a.s.c.c.SolrZkClient makePath: /collections/control_collection/shards
   [junit4]   2> 795573 INFO  (TEST-UnloadDistributedZkTest.test-seed#[97BB640442BEF917]) [    ] o.a.s.c.AbstractZkTestCase put /home/jenkins/workspace/Lucene-Solr-6.x-Linux/solr/core/src/test-files/solr/collection1/conf/solrconfig-tlog.xml to /configs/conf1/solrconfig.xml
   [junit4]   2> 795573 INFO  (TEST-UnloadDistributedZkTest.test-seed#[97BB640442BEF917]) [    ] o.a.s.c.c.SolrZkClient makePath: /configs/conf1/solrconfig.xml
   [junit4]   2> 795575 INFO  (TEST-UnloadDistributedZkTest.test-seed#[97BB640442BEF917]) [    ] o.a.s.c.AbstractZkTestCase put /home/jenkins/workspace/Lucene-Solr-6.x-Linux/solr/core/src/test-files/solr/collection1/conf/schema.xml to /configs/conf1/schema.xml
   [junit4]   2> 795575 INFO  (TEST-UnloadDistributedZkTest.test-seed#[97BB640442BEF917]) [    ] o.a.s.c.c.SolrZkClient makePath: /configs/conf1/schema.xml
   [junit4]   2> 795576 INFO  (TEST-UnloadDistributedZkTest.test-seed#[97BB640442BEF917]) [    ] o.a.s.c.AbstractZkTestCase put /home/jenkins/workspace/Lucene-Solr-6.x-Linux/solr/core/src/test-files/solr/collection1/conf/solrconfig.snippet.randomindexconfig.xml to /configs/conf1/solrconfig.snippet.randomindexconfig.xml
   [junit4]   2> 795576 INFO  (TEST-UnloadDistributedZkTest.test-seed#[97BB640442BEF917]) [    ] o.a.s.c.c.SolrZkClient makePath: /configs/conf1/solrconfig.snippet.randomindexconfig.xml
   [junit4]   2> 795577 INFO  (TEST-UnloadDistributedZkTest.test-seed#[97BB640442BEF917]) [    ] o.a.s.c.AbstractZkTestCase put /home/jenkins/workspace/Lucene-Solr-6.x-Linux/solr/core/src/test-files/solr/collection1/conf/stopwords.txt to /configs/conf1/stopwords.txt
   [junit4]   2> 795577 INFO  (TEST-UnloadDistributedZkTest.test-seed#[97BB640442BEF917]) [    ] o.a.s.c.c.SolrZkClient makePath: /configs/conf1/stopwords.txt
   [junit4]   2> 795578 INFO  (TEST-UnloadDistributedZkTest.test-seed#[97BB640442BEF917]) [    ] o.a.s.c.AbstractZkTestCase put /home/jenkins/workspace/Lucene-Solr-6.x-Linux/solr/core/src/test-files/solr/collection1/conf/protwords.txt to /configs/conf1/protwords.txt
   [junit4]   2> 795578 INFO  (TEST-UnloadDistributedZkTest.test-seed#[97BB640442BEF917]) [    ] o.a.s.c.c.SolrZkClient makePath: /configs/conf1/protwords.txt
   [junit4]   2> 795579 INFO  (TEST-UnloadDistributedZkTest.test-seed#[97BB640442BEF917]) [    ] o.a.s.c.AbstractZkTestCase put /home/jenkins/workspace/Lucene-Solr-6.x-Linux/solr/core/src/test-files/solr/collection1/conf/currency.xml to /configs/conf1/currency.xml
   [junit4]   2> 795579 INFO  (TEST-UnloadDistributedZkTest.test-seed#[97BB640442BEF917]) [    ] o.a.s.c.c.SolrZkClient makePath: /configs/conf1/currency.xml
   [junit4]   2> 795580 INFO  (TEST-UnloadDistributedZkTest.test-seed#[97BB640442BEF917]) [    ] o.a.s.c.AbstractZkTestCase put /home/jenkins/workspace/Lucene-Solr-6.x-Linux/solr/core/src/test-files/solr/collection1/conf/enumsConfig.xml to /configs/conf1/enumsConfig.xml
   [junit4]   2> 795580 INFO  (TEST-UnloadDistributedZkTest.test-seed#[97BB640442BEF917]) [    ] o.a.s.c.c.SolrZkClient makePath: /configs/conf1/enumsConfig.xml
   [junit4]   2> 795581 INFO  (TEST-UnloadDistributedZkTest.test-seed#[97BB640442BEF917]) [    ] o.a.s.c.AbstractZkTestCase put /home/jenkins/workspace/Lucene-Solr-6.x-Linux/solr/core/src/test-files/solr/collection1/conf/open-exchange-rates.json to /configs/conf1/open-exchange-rates.json
   [junit4]   2> 795581 INFO  (TEST-UnloadDistributedZkTest.test-seed#[97BB640442BEF917]) [    ] o.a.s.c.c.SolrZkClient makePath: /configs/conf1/open-exchange-rates.json
   [junit4]   2> 795582 INFO  (TEST-UnloadDistributedZkTest.test-seed#[97BB640442BEF917]) [    ] o.a.s.c.AbstractZkTestCase put /home/jenkins/workspace/Lucene-Solr-6.x-Linux/solr/core/src/test-files/solr/collection1/conf/mapping-ISOLatin1Accent.txt to /configs/conf1/mapping-ISOLatin1Accent.txt
   [junit4]   2> 795582 INFO  (TEST-UnloadDistributedZkTest.test-seed#[97BB640442BEF917]) [    ] o.a.s.c.c.SolrZkClient makePath: /configs/conf1/mapping-ISOLatin1Accent.txt
   [junit4]   2> 795583 INFO  (TEST-UnloadDistributedZkTest.test-seed#[97BB640442BEF917]) [    ] o.a.s.c.AbstractZkTestCase put /home/jenkins/workspace/Lucene-Solr-6.x-Linux/solr/core/src/test-files/solr/collection1/conf/old_synonyms.txt to /configs/conf1/old_synonyms.txt
   [junit4]   2> 795584 INFO  (TEST-UnloadDistributedZkTest.test-seed#[97BB640442BEF917]) [    ] o.a.s.c.c.SolrZkClient makePath: /configs/conf1/old_synonyms.txt
   [junit4]   2> 795584 INFO  (TEST-UnloadDistributedZkTest.test-seed#[97BB640442BEF917]) [    ] o.a.s.c.AbstractZkTestCase put /home/jenkins/workspace/Lucene-Solr-6.x-Linux/solr/core/src/test-files/solr/collection1/conf/synonyms.txt to /configs/conf1/synonyms.txt
   [junit4]   2> 795585 INFO  (TEST-UnloadDistributedZkTest.test-seed#[97BB640442BEF917]) [    ] o.a.s.c.c.SolrZkClient makePath: /configs/conf1/synonyms.txt
   [junit4]   2> 795670 INFO  (TEST-UnloadDistributedZkTest.test-seed#[97BB640442BEF917]) [    ] o.a.s.SolrTestCaseJ4 Writing core.properties file to /home/jenkins/workspace/Lucene-Solr-6.x-Linux/solr/build/solr-core/test/J2/temp/solr.cloud.UnloadDistributedZkTest_97BB640442BEF917-001/control-001/cores/collection1
   [junit4]   2> 795671 INFO  (TEST-UnloadDistributedZkTest.test-seed#[97BB640442BEF917]) [    ] o.e.j.s.Server jetty-9.3.8.v20160314
   [junit4]   2> 795672 INFO  (TEST-UnloadDistributedZkTest.test-seed#[97BB640442BEF917]) [    ] o.e.j.s.h.ContextHandler Started o.e.j.s.ServletContextHandler@6e9549{/,null,AVAILABLE}
   [junit4]   2> 795674 INFO  (TEST-UnloadDistributedZkTest.test-seed#[97BB640442BEF917]) [    ] o.e.j.s.ServerConnector Started ServerConnector@8227ce{HTTP/1.1,[http/1.1]}{127.0.0.1:42411}
   [junit4]   2> 795674 INFO  (TEST-UnloadDistributedZkTest.test-seed#[97BB640442BEF917]) [    ] o.e.j.s.Server Started @797564ms
   [junit4]   2> 795674 INFO  (TEST-UnloadDistributedZkTest.test-seed#[97BB640442BEF917]) [    ] o.a.s.c.s.e.JettySolrRunner Jetty properties: {solr.data.dir=/home/jenkins/workspace/Lucene-Solr-6.x-Linux/solr/build/solr-core/test/J2/temp/solr.cloud.UnloadDistributedZkTest_97BB640442BEF917-001/tempDir-001/control/data, hostContext=/, hostPort=42411, coreRootDirectory=/home/jenkins/workspace/Lucene-Solr-6.x-Linux/solr/build/solr-core/test/J2/temp/solr.cloud.UnloadDistributedZkTest_97BB640442BEF917-001/control-001/cores}
   [junit4]   2> 795675 INFO  (TEST-UnloadDistributedZkTest.test-seed#[97BB640442BEF917]) [    ] o.a.s.s.SolrDispatchFilter SolrDispatchFilter.init(): jdk.internal.loader.ClassLoaders$AppClassLoader@6a03af
   [junit4]   2> 795675 INFO  (TEST-UnloadDistributedZkTest.test-seed#[97BB640442BEF917]) [    ] o.a.s.c.SolrResourceLoader new SolrResourceLoader for directory: '/home/jenkins/workspace/Lucene-Solr-6.x-Linux/solr/build/solr-core/test/J2/temp/solr.cloud.UnloadDistributedZkTest_97BB640442BEF917-001/control-001'
   [junit4]   2> 795675 INFO  (TEST-UnloadDistributedZkTest.test-seed#[97BB640442BEF917]) [    ] o.a.s.c.SolrResourceLoader JNDI not configured for solr (NoInitialContextEx)
   [junit4]   2> 795675 INFO  (TEST-UnloadDistributedZkTest.test-seed#[97BB640442BEF917]) [    ] o.a.s.c.SolrResourceLoader solr home defaulted to 'solr/' (could not find system property or JNDI)
   [junit4]   2> 795675 INFO  (TEST-UnloadDistributedZkTest.test-seed#[97BB640442BEF917]) [    ] o.a.s.c.c.SolrZkClient Using default ZkCredentialsProvider
   [junit4]   2> 795676 INFO  (TEST-UnloadDistributedZkTest.test-seed#[97BB640442BEF917]) [    ] o.a.s.c.c.ConnectionManager Waiting for client to connect to ZooKeeper
   [junit4]   2> 795677 INFO  (zkCallback-851-thread-1) [    ] o.a.s.c.c.ConnectionManager Watcher org.apache.solr.common.cloud.ConnectionManager@e96161 name:ZooKeeperConnection Watcher:127.0.0.1:44582/solr got event WatchedEvent state:SyncConnected type:None path:null path:null type:None
   [junit4]   2> 795677 INFO  (TEST-UnloadDistributedZkTest.test-seed#[97BB640442BEF917]) [    ] o.a.s.c.c.ConnectionManager Client is connected to ZooKeeper
   [junit4]   2> 795677 INFO  (TEST-UnloadDistributedZkTest.test-seed#[97BB640442BEF917]) [    ] o.a.s.c.c.SolrZkClient Using default ZkACLProvider
   [junit4]   2> 795678 INFO  (TEST-UnloadDistributedZkTest.test-seed#[97BB640442BEF917]) [    ] o.a.s.s.SolrDispatchFilter Loading solr.xml from SolrHome (not found in ZooKeeper)
   [junit4]   2> 795678 INFO  (TEST-UnloadDistributedZkTest.test-seed#[97BB640442BEF917]) [    ] o.a.s.c.SolrXmlConfig Loading container configuration from /home/jenkins/workspace/Lucene-Solr-6.x-Linux/solr/build/solr-core/test/J2/temp/solr.cloud.UnloadDistributedZkTest_97BB640442BEF917-001/control-001/solr.xml
   [junit4]   2> 795684 INFO  (TEST-UnloadDistributedZkTest.test-seed#[97BB640442BEF917]) [    ] o.a.s.c.CorePropertiesLocator Config-defined core root directory: /home/jenkins/workspace/Lucene-Solr-6.x-Linux/solr/build/solr-core/test/J2/temp/solr.cloud.UnloadDistributedZkTest_97BB640442BEF917-001/control-001/cores
   [junit4]   2> 795684 INFO  (TEST-UnloadDistributedZkTest.test-seed#[97BB640442BEF917]) [    ] o.a.s.c.CoreContainer New CoreContainer 1194688
   [junit4]   2> 795685 INFO  (TEST-UnloadDistributedZkTest.test-seed#[97BB640442BEF917]) [    ] o.a.s.c.CoreContainer Loading cores into CoreContainer [instanceDir=/home/jenkins/workspace/Lucene-Solr-6.x-Linux/solr/build/solr-core/test/J2/temp/solr.cloud.UnloadDistributedZkTest_97BB640442BEF917-001/control-001]
   [junit4]   2> 795685 WARN  (TEST-UnloadDistributedZkTest.test-seed#[97BB640442BEF917]) [    ] o.a.s.c.CoreContainer Couldn't add files from /home/jenkins/workspace/Lucene-Solr-6.x-Linux/solr/build/solr-core/test/J2/temp/solr.cloud.UnloadDistributedZkTest_97BB640442BEF917-001/control-001/lib to classpath: /home/jenkins/workspace/Lucene-Solr-6.x-Linux/solr/build/solr-core/test/J2/temp/solr.cloud.UnloadDistributedZkTest_97BB640442BEF917-001/control-001/lib
   [junit4]   2> 795685 INFO  (TEST-UnloadDistributedZkTest.test-seed#[97BB640442BEF917]) [    ] o.a.s.h.c.HttpShardHandlerFactory created with socketTimeout : 90000,urlScheme : ,connTimeout : 15000,maxConnectionsPerHost : 20,maxConnections : 10000,corePoolSize : 0,maximumPoolSize : 2147483647,maxThreadIdleTime : 5,sizeOfQueue : -1,fairnessPolicy : false,useRetries : false,
   [junit4]   2> 795686 INFO  (TEST-UnloadDistributedZkTest.test-seed#[97BB640442BEF917]) [    ] o.a.s.u.UpdateShardHandler Creating UpdateShardHandler HTTP client with params: socketTimeout=340000&connTimeout=45000&retry=true
   [junit4]   2> 795686 INFO  (TEST-UnloadDistributedZkTest.test-seed#[97BB640442BEF917]) [    ] o.a.s.l.LogWatcher SLF4J impl is org.slf4j.impl.Log4jLoggerFactory
   [junit4]   2> 795686 INFO  (TEST-UnloadDistributedZkTest.test-seed#[97BB640442BEF917]) [    ] o.a.s.l.LogWatcher Registering Log Listener [Log4j (org.slf4j.impl.Log4jLoggerFactory)]
   [junit4]   2> 795686 INFO  (TEST-UnloadDistributedZkTest.test-seed#[97BB640442BEF917]) [    ] o.a.s.c.ZkContainer Zookeeper client=127.0.0.1:44582/solr
   [junit4]   2> 795686 INFO  (TEST-UnloadDistributedZkTest.test-seed#[97BB640442BEF917]) [    ] o.a.s.c.ZkController zkHost includes chroot
   [junit4]   2> 795687 INFO  (TEST-UnloadDistributedZkTest.test-seed#[97BB640442BEF917]) [    ] o.a.s.c.c.SolrZkClient Using default ZkCredentialsProvider
   [junit4]   2> 795687 INFO  (TEST-UnloadDistributedZkTest.test-seed#[97BB640442BEF917]) [    ] o.a.s.c.c.ConnectionManager Waiting for client to connect to ZooKeeper
   [junit4]   2> 795688 INFO  (zkCallback-854-thread-1) [    ] o.a.s.c.c.ConnectionManager Watcher org.apache.solr.common.cloud.ConnectionManager@15b1040 name:ZooKeeperConnection Watcher:127.0.0.1:44582 got event WatchedEvent state:SyncConnected type:None path:null path:null type:None
   [junit4]   2> 795688 INFO  (TEST-UnloadDistributedZkTest.test-seed#[97BB640442BEF917]) [    ] o.a.s.c.c.ConnectionManager Client is connected to ZooKeeper
   [junit4]   2> 795689 INFO  (TEST-UnloadDistributedZkTest.test-seed#[97BB640442BEF917]) [    ] o.a.s.c.c.SolrZkClient Using default ZkACLProvider
   [junit4]   2> 795690 INFO  (TEST-UnloadDistributedZkTest.test-seed#[97BB640442BEF917]) [    ] o.a.s.c.c.ConnectionManager Waiting for client to connect to ZooKeeper
   [junit4]   2> 795690 INFO  (zkCallback-855-thread-1) [    ] o.a.s.c.c.ConnectionManager Watcher org.apache.solr.common.cloud.ConnectionManager@c8791f name:ZooKeeperConnection Watcher:127.0.0.1:44582/solr got event WatchedEvent state:SyncConnected type:None path:null path:null type:None
   [junit4]   2> 795690 INFO  (TEST-UnloadDistributedZkTest.test-seed#[97BB640442BEF917]) [    ] o.a.s.c.c.ConnectionManager Client is connected to ZooKeeper
   [junit4]   2> 795692 INFO  (TEST-UnloadDistributedZkTest.test-seed#[97BB640442BEF917]) [    ] o.a.s.c.c.SolrZkClient makePath: /overseer/queue
   [junit4]   2> 795693 INFO  (TEST-UnloadDistributedZkTest.test-seed#[97BB640442BEF917]) [    ] o.a.s.c.c.SolrZkClient makePath: /overseer/collection-queue-work
   [junit4]   2> 795695 INFO  (TEST-UnloadDistributedZkTest.test-seed#[97BB640442BEF917]) [    ] o.a.s.c.c.SolrZkClient makePath: /overseer/collection-map-running
   [junit4]   2> 795696 INFO  (TEST-UnloadDistributedZkTest.test-seed#[97BB640442BEF917]) [    ] o.a.s.c.c.SolrZkClient makePath: /overseer/collection-map-completed
   [junit4]   2> 795697 INFO  (TEST-UnloadDistributedZkTest.test-seed#[97BB640442BEF917]) [    ] o.a.s.c.c.SolrZkClient makePath: /overseer/collection-map-failure
   [junit4]   2> 795698 INFO  (TEST-UnloadDistributedZkTest.test-seed#[97BB640442BEF917]) [    ] o.a.s.c.c.SolrZkClient makePath: /live_nodes
   [junit4]   2> 795699 INFO  (TEST-UnloadDistributedZkTest.test-seed#[97BB640442BEF917]) [    ] o.a.s.c.c.SolrZkClient makePath: /aliases.json
   [junit4]   2> 795699 INFO  (TEST-UnloadDistributedZkTest.test-seed#[97BB640442BEF917]) [    ] o.a.s.c.c.SolrZkClient makePath: /clusterstate.json
   [junit4]   2> 795700 INFO  (TEST-UnloadDistributedZkTest.test-seed#[97BB640442BEF917]) [    ] o.a.s.c.c.SolrZkClient makePath: /security.json
   [junit4]   2> 795700 INFO  (TEST-UnloadDistributedZkTest.test-seed#[97BB640442BEF917]) [    ] o.a.s.c.c.ZkStateReader Updating cluster state from ZooKeeper... 
   [junit4]   2> 795701 INFO  (TEST-UnloadDistributedZkTest.test-seed#[97BB640442BEF917]) [    ] o.a.s.c.c.ZkStateReader Updated live nodes from ZooKeeper... (0) -> (0)
   [junit4]   2> 795702 INFO  (TEST-UnloadDistributedZkTest.test-seed#[97BB640442BEF917]) [    ] o.a.s.c.c.SolrZkClient makePath: /overseer_elect
   [junit4]   2> 795702 INFO  (TEST-UnloadDistributedZkTest.test-seed#[97BB640442BEF917]) [    ] o.a.s.c.c.SolrZkClient makePath: /overseer_elect/election
   [junit4]   2> 795703 INFO  (TEST-UnloadDistributedZkTest.test-seed#[97BB640442BEF917]) [    ] o.a.s.c.Overseer Overseer (id=null) closing
   [junit4]   2> 795704 INFO  (TEST-UnloadDistributedZkTest.test-seed#[97BB640442BEF917]) [    ] o.a.s.c.LeaderElector Joined leadership election with path: /overseer_elect/election/95585765018304516-127.0.0.1:42411_-n_0000000000
   [junit4]   2> 795704 INFO  (TEST-UnloadDistributedZkTest.test-seed#[97BB640442BEF917]) [    ] o.a.s.c.OverseerElectionContext I am going to be the leader 127.0.0.1:42411_
   [junit4]   2> 795704 INFO  (TEST-UnloadDistributedZkTest.test-seed#[97BB640442BEF917]) [    ] o.a.s.c.c.SolrZkClient makePath: /overseer_elect/leader
   [junit4]   2> 795705 INFO  (TEST-UnloadDistributedZkTest.test-seed#[97BB640442BEF917]) [    ] o.a.s.c.Overseer Overseer (id=95585765018304516-127.0.0.1:42411_-n_0000000000) starting
   [junit4]   2> 795706 INFO  (TEST-UnloadDistributedZkTest.test-seed#[97BB640442BEF917]) [    ] o.a.s.c.c.SolrZkClient makePath: /overseer/queue-work
   [junit4]   2> 795709 INFO  (TEST-UnloadDistributedZkTest.test-seed#[97BB640442BEF917]) [    ] o.a.s.c.OverseerAutoReplicaFailoverThread Starting OverseerAutoReplicaFailoverThread autoReplicaFailoverWorkLoopDelay=10000 autoReplicaFailoverWaitAfterExpiration=10000 autoReplicaFailoverBadNodeExpiration=60000
   [junit4]   2> 795709 INFO  (OverseerCollectionConfigSetProcessor-95585765018304516-127.0.0.1:42411_-n_0000000000) [    ] o.a.s.c.OverseerTaskProcessor Process current queue of overseer operations
   [junit4]   2> 795709 INFO  (OverseerStateUpdate-95585765018304516-127.0.0.1:42411_-n_0000000000) [    ] o.a.s.c.Overseer Starting to work on the main queue
   [junit4]   2> 795709 INFO  (TEST-UnloadDistributedZkTest.test-seed#[97BB640442BEF917]) [    ] o.a.s.c.ZkController Register node as live in ZooKeeper:/live_nodes/127.0.0.1:42411_
   [junit4]   2> 795710 INFO  (TEST-UnloadDistributedZkTest.test-seed#[97BB640442BEF917]) [    ] o.a.s.c.c.SolrZkClient makePath: /live_nodes/127.0.0.1:42411_
   [junit4]   2> 795711 INFO  (OverseerStateUpdate-95585765018304516-127.0.0.1:42411_-n_0000000000) [    ] o.a.s.c.c.ZkStateReader Updated live nodes from ZooKeeper... (0) -> (0)
   [junit4]   2> 795711 INFO  (zkCallback-855-thread-1) [    ] o.a.s.c.c.ZkStateReader A live node change: [WatchedEvent state:SyncConnected type:NodeChildrenChanged path:/live_nodes], has occurred - updating... (live nodes size: [0])
   [junit4]   2> 795712 INFO  (zkCallback-855-thread-1) [    ] o.a.s.c.c.ZkStateReader Updated live nodes from ZooKeeper... (0) -> (1)
   [junit4]   2> 795765 INFO  (TEST-UnloadDistributedZkTest.test-seed#[97BB640442BEF917]) [    ] o.a.s.c.CoreContainer Security conf doesn't exist. Skipping setup for authorization module.
   [junit4]   2> 795766 INFO  (TEST-UnloadDistributedZkTest.test-seed#[97BB640442BEF917]) [    ] o.a.s.c.CoreContainer No authentication plugin used.
   [junit4]   2> 795766 INFO  (TEST-UnloadDistributedZkTest.test-seed#[97BB640442BEF917]) [    ] o.a.s.c.CorePropertiesLocator Looking for core definitions underneath /home/jenkins/workspace/Lucene-Solr-6.x-Linux/solr/build/solr-core/test/J2/temp/solr.cloud.UnloadDistributedZkTest_97BB640442BEF917-001/control-001/cores
   [junit4]   2> 795767 INFO  (TEST-UnloadDistributedZkTest.test-seed#[97BB640442BEF917]) [    ] o.a.s.c.CoreDescriptor Created CoreDescriptor: {name=collection1, config=solrconfig.xml, transient=false, schema=schema.xml, loadOnStartup=true, configSetProperties=configsetprops.json, collection=control_collection, coreNodeName=, dataDir=data/, shard=}
   [junit4]   2> 795767 INFO  (TEST-UnloadDistributedZkTest.test-seed#[97BB640442BEF917]) [    ] o.a.s.c.CorePropertiesLocator Found core collection1 in /home/jenkins/workspace/Lucene-Solr-6.x-Linux/solr/build/solr-core/test/J2/temp/solr.cloud.UnloadDistributedZkTest_97BB640442BEF917-001/control-001/cores/collection1
   [junit4]   2> 795767 INFO  (TEST-UnloadDistributedZkTest.test-seed#[97BB640442BEF917]) [    ] o.a.s.c.CorePropertiesLocator Found 1 core definitions
   [junit4]   2> 795768 INFO  (TEST-UnloadDistributedZkTest.test-seed#[97BB640442BEF917]) [    ] o.a.s.s.SolrDispatchFilter user.dir=/home/jenkins/workspace/Lucene-Solr-6.x-Linux/solr/build/solr-core/test/J2
   [junit4]   2> 795768 INFO  (TEST-UnloadDistributedZkTest.test-seed#[97BB640442BEF917]) [    ] o.a.s.s.SolrDispatchFilter SolrDispatchFilter.init() done
   [junit4]   2> 795768 INFO  (coreLoadExecutor-2789-thread-1) [    ] o.a.s.c.ZkController publishing state=down
   [junit4]   2> 795768 INFO  (coreLoadExecutor-2789-thread-1) [    ] o.a.s.c.ZkController numShards not found on descriptor - reading it from system property
   [junit4]   2> 795769 INFO  (coreLoadExecutor-2789-thread-1) [    ] o.a.s.c.ZkController look for our core node name
   [junit4]   2> 795769 INFO  (OverseerStateUpdate-95585765018304516-127.0.0.1:42411_-n_0000000000) [    ] o.a.s.c.Overseer processMessage: queueSize: 1, message = {
   [junit4]   2>   "core":"collection1",
   [junit4]   2>   "roles":null,
   [junit4]   2>   "base_url":"http://127.0.0.1:42411",
   [junit4]   2>   "node_name":"127.0.0.1:42411_",
   [junit4]   2>   "numShards":"1",
   [junit4]   2>   "state":"down",
   [junit4]   2>   "shard":null,
   [junit4]   2>   "collection":"control_collection",
   [junit4]   2>   "operation":"state"} current state version: 0
   [junit4]   2> 795770 INFO  (OverseerStateUpdate-95585765018304516-127.0.0.1:42411_-n_0000000000) [    ] o.a.s.c.o.ReplicaMutator Update state numShards=1 message={
   [junit4]   2>   "core":"collection1",
   [junit4]   2>   "roles":null,
   [junit4]   2>   "base_url":"http://127.0.0.1:42411",
   [junit4]   2>   "node_name":"127.0.0.1:42411_",
   [junit4]   2>   "numShards":"1",
   [junit4]   2>   "state":"down",
   [junit4]   2>   "shard":null,
   [junit4]   2>   "collection":"control_collection",
   [junit4]   2>   "operation":"state"}
   [junit4]   2> 795770 INFO  (OverseerStateUpdate-95585765018304516-127.0.0.1:42411_-n_0000000000) [    ] o.a.s.c.o.ClusterStateMutator building a new cName: control_collection
   [junit4]   2> 795770 INFO  (OverseerStateUpdate-95585765018304516-127.0.0.1:42411_-n_0000000000) [    ] o.a.s.c.o.ReplicaMutator Assigning new node to shard shard=shard1
   [junit4]   2> 795771 INFO  (zkCallback-855-thread-1) [    ] o.a.s.c.c.ZkStateReader A cluster state change: [WatchedEvent state:SyncConnected type:NodeDataChanged path:/clusterstate.json], has occurred - updating... (live nodes size: [1])
   [junit4]   2> 796770 INFO  (coreLoadExecutor-2789-thread-1) [    ] o.a.s.c.ZkController waiting to find shard id in clusterstate for collection1
   [junit4]   2> 796770 INFO  (coreLoadExecutor-2789-thread-1) [    ] o.a.s.c.ZkController Check for collection zkNode:control_collection
   [junit4]   2> 796770 INFO  (coreLoadExecutor-2789-thread-1) [    ] o.a.s.c.ZkController Collection zkNode exists
   [junit4]   2> 796770 INFO  (coreLoadExecutor-2789-thread-1) [    ] o.a.s.c.c.ZkStateReader Load collection config from: [/collections/control_collection]
   [junit4]   2> 796771 INFO  (coreLoadExecutor-2789-thread-1) [    ] o.a.s.c.c.ZkStateReader path=[/collections/control_collection] [configName]=[conf1] specified config exists in ZooKeeper
   [junit4]   2> 796771 INFO  (coreLoadExecutor-2789-thread-1) [    ] o.a.s.c.SolrResourceLoader new SolrResourceLoader for directory: '/home/jenkins/workspace/Lucene-Solr-6.x-Linux/solr/build/solr-core/test/J2/temp/solr.cloud.UnloadDistributedZkTest_97BB640442BEF917-001/control-001/cores/collection1'
   [junit4]   2> 796771 INFO  (coreLoadExecutor-2789-thread-1) [    ] o.a.s.c.SolrResourceLoader JNDI not configured for solr (NoInitialContextEx)
   [junit4]   2> 796771 INFO  (coreLoadExecutor-2789-thread-1) [    ] o.a.s.c.SolrResourceLoader solr home defaulted to 'solr/' (could not find system property or JNDI)
   [junit4]   2> 796772 INFO  (coreLoadExecutor-2789-thread-1) [    ] o.a.s.c.Config loaded config solrconfig.xml with version 0 
   [junit4]   2> 796779 INFO  (coreLoadExecutor-2789-thread-1) [    ] o.a.s.c.SolrConfig current version of requestparams : -1
   [junit4]   2> 796786 WARN  (coreLoadExecutor-2789-thread-1) [    ] o.a.s.c.Config Beginning with Solr 5.5, <mergePolicy> is deprecated, use <mergePolicyFactory> instead.
   [junit4]   2> 796787 INFO  (coreLoadExecutor-2789-thread-1) [    ] o.a.s.c.SolrConfig Using Lucene MatchVersion: 6.1.0
   [junit4]   2> 796798 INFO  (coreLoadExecutor-2789-thread-1) [    ] o.a.s.c.SolrConfig Loaded SolrConfig: solrconfig.xml
   [junit4]   2> 796808 INFO  (coreLoadExecutor-2789-thread-1) [    ] o.a.s.s.IndexSchema [collection1] Schema name=test
   [junit4]   2> 796901 INFO  (coreLoadExecutor-2789-thread-1) [    ] o.a.s.s.OpenExchangeRatesOrgProvider Initialized with rates=open-exchange-rates.json, refreshInterval=1440.
   [junit4]   2> 796908 INFO  (coreLoadExecutor-2789-thread-1) [    ] o.a.s.s.IndexSchema default search field in schema is text
   [junit4]   2> 796909 INFO  (coreLoadExecutor-2789-thread-1) [    ] o.a.s.s.IndexSchema unique key field: id
   [junit4]   2> 796917 INFO  (coreLoadExecutor-2789-thread-1) [    ] o.a.s.s.FileExchangeRateProvider Reloading exchange rates from file currency.xml
   [junit4]   2> 796919 INFO  (coreLoadExecutor-2789-thread-1) [    ] o.a.s.s.FileExchangeRateProvider Reloading exchange rates from file currency.xml
   [junit4]   2> 796921 INFO  (coreLoadExecutor-2789-thread-1) [    ] o.a.s.s.OpenExchangeRatesOrgProvider Reloading exchange rates from open-exchange-rates.json
   [junit4]   2> 796921 INFO  (coreLoadExecutor-2789-thread-1) [    ] o.a.s.s.OpenExchangeRatesOrgProvider Reloading exchange rates from open-exchange-rates.json
   [junit4]   2> 796922 INFO  (coreLoadExecutor-2789-thread-1) [    ] o.a.s.c.ConfigSetProperties Did not find ConfigSet properties, assuming default properties: Can't find resource 'configsetprops.json' in classpath or '/configs/conf1', cwd=/home/jenkins/workspace/Lucene-Solr-6.x-Linux/solr/build/solr-core/test/J2
   [junit4]   2> 796922 INFO  (coreLoadExecutor-2789-thread-1) [    ] o.a.s.c.CoreContainer Creating SolrCore 'collection1' using configuration from collection control_collection
   [junit4]   2> 796922 INFO  (coreLoadExecutor-2789-thread-1) [    ] o.a.s.c.SolrCore org.apache.solr.core.MockDirectoryFactory
   [junit4]   2> 796922 INFO  (coreLoadExecutor-2789-thread-1) [    ] o.a.s.c.SolrCore [[collection1] ] Opening new SolrCore at [/home/jenkins/workspace/Lucene-Solr-6.x-Linux/solr/build/solr-core/test/J2/temp/solr.cloud.UnloadDistributedZkTest_97BB640442BEF917-001/control-001/cores/collection1], dataDir=[/home/jenkins/workspace/Lucene-Solr-6.x-Linux/solr/build/solr-core/test/J2/temp/solr.cloud.UnloadDistributedZkTest_97BB640442BEF917-001/control-001/cores/collection1/data/]
   [junit4]   2> 796923 INFO  (coreLoadExecutor-2789-thread-1) [    ] o.a.s.c.JmxMonitoredMap JMX monitoring is enabled. Adding Solr mbeans to JMX Server: com.sun.jmx.mbeanserver.JmxMBeanServer@12d7970
   [junit4]   2> 796923 INFO  (coreLoadExecutor-2789-thread-1) [    ] o.a.s.c.CachingDirectoryFactory return new directory for /home/jenkins/workspace/Lucene-Solr-6.x-Linux/solr/build/solr-core/test/J2/temp/solr.cloud.UnloadDistributedZkTest_97BB640442BEF917-001/control-001/cores/collection1/data
   [junit4]   2> 796924 INFO  (coreLoadExecutor-2789-thread-1) [    ] o.a.s.c.SolrCore New index directory detected: old=null new=/home/jenkins/workspace/Lucene-Solr-6.x-Linux/solr/build/solr-core/test/J2/temp/solr.cloud.UnloadDistributedZkTest_97BB640442BEF917-001/control-001/cores/collection1/data/index/
   [junit4]   2> 796924 WARN  (coreLoadExecutor-2789-thread-1) [    ] o.a.s.c.SolrCore [collection1] Solr index directory '/home/jenkins/workspace/Lucene-Solr-6.x-Linux/solr/build/solr-core/test/J2/temp/solr.cloud.UnloadDistributedZkTest_97BB640442BEF917-001/control-001/cores/collection1/data/index' doesn't exist. Creating new index...
   [junit4]   2> 796924 INFO  (coreLoadExecutor-2789-thread-1) [    ] o.a.s.c.CachingDirectoryFactory return new directory for /home/jenkins/workspace/Lucene-Solr-6.x-Linux/solr/build/solr-core/test/J2/temp/solr.cloud.UnloadDistributedZkTest_97BB640442BEF917-001/control-001/cores/collection1/data/index
   [junit4]   2> 796924 INFO  (coreLoadExecutor-2789-thread-1) [    ] o.a.s.u.RandomMergePolicy RandomMergePolicy wrapping class org.apache.lucene.index.LogByteSizeMergePolicy: [LogByteSizeMergePolicy: minMergeSize=1677721, mergeFactor=25, maxMergeSize=2147483648, maxMergeSizeForForcedMerge=9223372036854775807, calibrateSizeByDeletes=false, maxMergeDocs=2147483647, maxCFSSegmentSizeMB=8.796093022207999E12, noCFSRatio=0.0]
   [junit4]   2> 796924 INFO  (coreLoadExecutor-2789-thread-1) [    ] o.a.s.c.SolrDeletionPolicy SolrDeletionPolicy.onCommit: commits: num=1
   [junit4]   2> 	commit{dir=MockDirectoryWrapper(RAMDirectory@4dd0f6 lockFactory=org.apache.lucene.store.SingleInstanceLockFactory@1fc8bd),segFN=segments_1,generation=1}
   [junit4]   2> 796924 INFO  (coreLoadExecutor-2789-thread-1) [    ] o.a.s.c.SolrDeletionPolicy newest commit generation = 1
   [junit4]   2> 796925 INFO  (OldIndexDirectoryCleanupThreadForCore-collection1) [    ] o.a.s.c.SolrCore Looking for old index directories to cleanup for core collection1 in /home/jenkins/workspace/Lucene-Solr-6.x-Linux/solr/build/solr-core/test/J2/temp/solr.cloud.UnloadDistributedZkTest_97BB640442BEF917-001/control-001/cores/collection1/data/
   [junit4]   2> 796925 WARN  (OldIndexDirectoryCleanupThreadForCore-collection1) [    ] o.a.s.c.DirectoryFactory /home/jenkins/workspace/Lucene-Solr-6.x-Linux/solr/build/solr-core/test/J2/temp/solr.cloud.UnloadDistributedZkTest_97BB640442BEF917-001/control-001/cores/collection1/data/ does not point to a valid data directory; skipping clean-up of old index directories.
   [junit4]   2> 796929 INFO  (coreLoadExecutor-2789-thread-1) [    ] o.a.s.u.p.UpdateRequestProcessorChain creating updateRequestProcessorChain "nodistrib"
   [junit4]   2> 796929 INFO  (coreLoadExecutor-2789-thread-1) [    ] o.a.s.u.p.UpdateRequestProcessorChain creating updateRequestProcessorChain "dedupe"
   [junit4]   2> 796929 INFO  (coreLoadExecutor-2789-thread-1) [    ] o.a.s.u.p.UpdateRequestProcessorChain inserting DistributedUpdateProcessorFactory into updateRequestProcessorChain "dedupe"
   [junit4]   2> 796929 INFO  (coreLoadExecutor-2789-thread-1) [    ] o.a.s.u.p.UpdateRequestProcessorChain creating updateRequestProcessorChain "stored_sig"
   [junit4]   2> 796929 INFO  (coreLoadExecutor-2789-thread-1) [    ] o.a.s.u.p.UpdateRequestProcessorChain inserting DistributedUpdateProcessorFactory into updateRequestProcessorChain "stored_sig"
   [junit4]   2> 796929 INFO  (coreLoadExecutor-2789-thread-1) [    ] o.a.s.u.p.UpdateRequestProcessorChain creating updateRequestProcessorChain "distrib-dup-test-chain-explicit"
   [junit4]   2> 796929 INFO  (coreLoadExecutor-2789-thread-1) [    ] o.a.s.u.p.UpdateRequestProcessorChain creating updateRequestProcessorChain "distrib-dup-test-chain-implicit"
   [junit4]   2> 796930 INFO  (coreLoadExecutor-2789-thread-1) [    ] o.a.s.u.p.UpdateRequestProcessorChain inserting DistributedUpdateProcessorFactory into updateRequestProcessorChain "distrib-dup-test-chain-implicit"
   [junit4]   2> 796930 INFO  (coreLoadExecutor-2789-thread-1) [    ] o.a.s.c.SolrCore no updateRequestProcessorChain defined as default, creating implicit default
   [junit4]   2> 796930 WARN  (coreLoadExecutor-2789-thread-1) [    ] o.a.s.c.RequestHandlers INVALID paramSet a in requestHandler {type = requestHandler,name = /dump,class = DumpRequestHandler,args = {defaults={a=A,b=B}}}
   [junit4]   2> 796932 INFO  (coreLoadExecutor-2789-thread-1) [    ] o.a.s.h.l.XMLLoader xsltCacheLifetimeSeconds=60
   [junit4]   2> 796934 INFO  (coreLoadExecutor-2789-thread-1) [    ] o.a.s.h.l.XMLLoader xsltCacheLifetimeSeconds=60
   [junit4]   2> 796935 INFO  (coreLoadExecutor-2789-thread-1) [    ] o.a.s.h.l.XMLLoader xsltCacheLifetimeSeconds=60
   [junit4]   2> 796936 INFO  (coreLoadExecutor-2789-thread-1) [    ] o.a.s.h.l.XMLLoader xsltCacheLifetimeSeconds=60
   [junit4]   2> 796942 INFO  (coreLoadExecutor-2789-thread-1) [    ] o.a.s.c.RequestHandlers Registered paths: /admin/mbeans,standard,/dump,/update/csv,/sql,/update/json/docs,/admin/luke,/export,/admin/segments,/get,/admin/system,/replication,/admin/properties,/config,/stream,/schema,/admin/plugins,/admin/logging,/update/json,/admin/ping,/admin/threads,/update,/admin/file
   [junit4]   2> 796942 INFO  (coreLoadExecutor-2789-thread-1) [    ] o.a.s.c.SolrCore Using default statsCache cache: org.apache.solr.search.stats.LocalStatsCache
   [junit4]   2> 796942 INFO  (coreLoadExecutor-2789-thread-1) [    ] o.a.s.u.UpdateHandler Using UpdateLog implementation: org.apache.solr.update.UpdateLog
   [junit4]   2> 796942 INFO  (coreLoadExecutor-2789-thread-1) [    ] o.a.s.u.UpdateLog Initializing UpdateLog: dataDir= defaultSyncLevel=FLUSH numRecordsToKeep=100 maxNumLogsToKeep=10 numVersionBuckets=65536
   [junit4]   2> 796943 INFO  (coreLoadExecutor-2789-thread-1) [    ] o.a.s.u.CommitTracker Hard AutoCommit: disabled
   [junit4]   2> 796943 INFO  (coreLoadExecutor-2789-thread-1) [    ] o.a.s.u.CommitTracker Soft AutoCommit: disabled
   [junit4]   2> 796944 INFO  (coreLoadExecutor-2789-thread-1) [    ] o.a.s.u.RandomMergePolicy RandomMergePolicy wrapping class org.apache.lucene.index.AlcoholicMergePolicy: [AlcoholicMergePolicy: minMergeSize=0, mergeFactor=10, maxMergeSize=1149354033, maxMergeSizeForForcedMerge=9223372036854775807, calibrateSizeByDeletes=true, maxMergeDocs=2147483647, maxCFSSegmentSizeMB=8.796093022207999E12, noCFSRatio=0.1]
   [junit4]   2> 796944 INFO  (coreLoadExecutor-2789-thread-1) [    ] o.a.s.c.SolrDeletionPolicy SolrDeletionPolicy.onInit: commits: num=1
   [junit4]   2> 	commit{dir=MockDirectoryWrapper(RAMDirectory@4dd0f6 lockFactory=org.apache.lucene.store.SingleInstanceLockFactory@1fc8bd),segFN=segments_1,generation=1}
   [junit4]   2> 796944 INFO  (coreLoadExecutor-2789-thread-1) [    ] o.a.s.c.SolrDeletionPolicy newest commit generation = 1
   [junit4]   2> 796945 INFO  (coreLoadExecutor-2789-thread-1) [    ] o.a.s.s.SolrIndexSearcher Opening [Searcher@307e0c[collection1] main]
   [junit4]   2> 796945 INFO  (coreLoadExecutor-2789-thread-1) [    ] o.a.s.c.c.ZkStateReader Load collection config from: [/collections/control_collection]
   [junit4]   2> 796945 INFO  (coreLoadExecutor-2789-thread-1) [    ] o.a.s.c.c.ZkStateReader path=[/collections/control_collection] [configName]=[conf1] specified config exists in ZooKeeper
   [junit4]   2> 796945 INFO  (coreLoadExecutor-2789-thread-1) [    ] o.a.s.r.ManagedResourceStorage Setting up ZooKeeper-based storage for the RestManager with znodeBase: /configs/conf1
   [junit4]   2> 796945 INFO  (coreLoadExecutor-2789-thread-1) [    ] o.a.s.r.ManagedResourceStorage Configured ZooKeeperStorageIO with znodeBase: /configs/conf1
   [junit4]   2> 796945 INFO  (coreLoadExecutor-2789-thread-1) [    ] o.a.s.r.RestManager Initializing RestManager with initArgs: {}
   [junit4]   2> 796945 INFO  (coreLoadExecutor-2789-thread-1) [    ] o.a.s.r.ManagedResourceStorage Reading _rest_managed.json using ZooKeeperStorageIO:path=/configs/conf1
   [junit4]   2> 796946 INFO  (coreLoadExecutor-2789-thread-1) [    ] o.a.s.r.ManagedResourceStorage No data found for znode /configs/conf1/_rest_managed.json
   [junit4]   2> 796946 INFO  (coreLoadExecutor-2789-thread-1) [    ] o.a.s.r.ManagedResourceStorage Loaded null at path _rest_managed.json using ZooKeeperStorageIO:path=/configs/conf1
   [junit4]   2> 796946 INFO  (coreLoadExecutor-2789-thread-1) [    ] o.a.s.r.RestManager Initializing 0 registered ManagedResources
   [junit4]   2> 796946 INFO  (coreLoadExecutor-2789-thread-1) [    ] o.a.s.h.ReplicationHandler Commits will be reserved for  10000
   [junit4]   2> 796947 INFO  (searcherExecutor-2790-thread-1) [    ] o.a.s.c.SolrCore [collection1] Registered new searcher Searcher@307e0c[collection1] main{ExitableDirectoryReader(UninvertingDirectoryReader())}
   [junit4]   2> 796948 INFO  (coreLoadExecutor-2789-thread-1) [    ] o.a.s.u.UpdateLog Looking up max value of version field to seed version buckets
   [junit4]   2> 796948 INFO  (coreLoadExecutor-2789-thread-1) [    ] o.a.s.u.VersionInfo Refreshing highest value of _version_ for 65536 version buckets from index
   [junit4]   2> 796948 INFO  (coreLoadExecutor-2789-thread-1) [    ] o.a.s.u.VersionInfo No terms found for _version_, cannot seed version bucket highest value from index
   [junit4]   2> 796948 INFO  (coreLoadExecutor-2789-thread-1) [    ] o.a.s.u.UpdateLog Could not find max version in index or recent updates, using new clock 1529372241845813248
   [junit4]   2> 796949 INFO  (coreLoadExecutor-2789-thread-1) [    ] o.a.s.u.UpdateLog Took 1.0ms to seed version buckets with highest version 1529372241845813248
   [junit4]   2> 796950 INFO  (coreLoadExecutor-2789-thread-1) [    ] o.a.s.c.ZkController watch zkdir /configs/conf1
   [junit4]   2> 796950 INFO  (coreLoadExecutor-2789-thread-1) [    ] o.a.s.c.CoreContainer registering core: collection1
   [junit4]   2> 796950 INFO  (coreZkRegister-2783-thread-1) [    ] o.a.s.c.ZkController Register replica - core:collection1 address:http://127.0.0.1:42411 collection:control_collection shard:shard1
   [junit4]   2> 796950 INFO  (coreZkRegister-2783-thread-1) [    ] o.a.s.c.c.SolrZkClient makePath: /collections/control_collection/leader_elect/shard1/election
   [junit4]   2> 796953 INFO  (coreZkRegister-2783-thread-1) [    ] o.a.s.c.LeaderElector Joined leadership election with path: /collections/control_collection/leader_elect/shard1/election/95585765018304516-core_node1-n_0000000000
   [junit4]   2> 796953 INFO  (coreZkRegister-2783-thread-1) [    ] o.a.s.c.ShardLeaderElectionContext Running the leader process for shard=shard1 and weAreReplacement=false and leaderVoteWait=180000
   [junit4]   2> 796954 INFO  (coreZkRegister-2783-thread-1) [    ] o.a.s.c.ShardLeaderElectionContext Enough replicas found to continue.
   [junit4]   2> 796954 INFO  (coreZkRegister-2783-thread-1) [    ] o.a.s.c.ShardLeaderElectionContext I may be the new leader - try and sync
   [junit4]   2> 796954 INFO  (coreZkRegister-2783-thread-1) [    ] o.a.s.c.SyncStrategy Sync replicas to http://127.0.0.1:42411/collection1/
   [junit4]   2> 796954 INFO  (coreZkRegister-2783-thread-1) [    ] o.a.s.c.SyncStrategy Sync Success - now sync replicas to me
   [junit4]   2> 796954 INFO  (OverseerStateUpdate-95585765018304516-127.0.0.1:42411_-n_0000000000) [    ] o.a.s.c.Overseer processMessage: queueSize: 1, message = {
   [junit4]   2>   "operation":"leader",
   [junit4]   2>   "shard":"shard1",
   [junit4]   2>   "collection":"control_collection"} current state version: 1
   [junit4]   2> 796954 INFO  (coreZkRegister-2783-thread-1) [    ] o.a.s.c.SyncStrategy http://127.0.0.1:42411/collection1/ has no replicas
   [junit4]   2> 796955 INFO  (coreZkRegister-2783-thread-1) [    ] o.a.s.c.c.SolrZkClient makePath: /collections/control_collection/leaders/shard1
   [junit4]   2> 796957 INFO  (coreZkRegister-2783-thread-1) [    ] o.a.s.c.ShardLeaderElectionContextBase Creating leader registration node /collections/control_collection/leaders/shard1/leader after winning as /collections/control_collection/leader_elect/shard1/election/95585765018304516-core_node1-n_0000000000
   [junit4]   2> 796958 INFO  (coreZkRegister-2783-thread-1) [    ] o.a.s.c.ShardLeaderElectionContext I am the new leader: http://127.0.0.1:42411/collection1/ shard1
   [junit4]   2> 796959 INFO  (OverseerStateUpdate-95585765018304516-127.0.0.1:42411_-n_0000000000) [    ] o.a.s.c.Overseer processMessage: queueSize: 1, message = {
   [junit4]   2>   "operation":"leader",
   [junit4]   2>   "shard":"shard1",
   [junit4]   2>   "collection":"control_collection",
   [junit4]   2>   "base_url":"http://127.0.0.1:42411",
   [junit4]   2>   "core":"collection1",
   [junit4]   2>   "state":"active"} current state version: 1
   [junit4]   2> 797061 INFO  (zkCallback-855-thread-1) [    ] o.a.s.c.c.ZkStateReader A cluster state change: [WatchedEvent state:SyncConnected type:NodeDataChanged path:/clusterstate.json], has occurred - updating... (live nodes size: [1])
   [junit4]   2> 797109 INFO  (coreZkRegister-2783-thread-1) [    ] o.a.s.c.ZkController We are http://127.0.0.1:42411/collection1/ and leader is http://127.0.0.1:42411/collection1/
   [junit4]   2> 797109 INFO  (coreZkRegister-2783-thread-1) [    ] o.a.s.c.ZkController No LogReplay needed for core=collection1 baseURL=http://127.0.0.1:42411
   [junit4]   2> 797109 INFO  (coreZkRegister-2783-thread-1) [    ] o.a.s.c.ZkController I am the leader, no recovery necessary
   [junit4]   2> 797109 INFO  (coreZkRegister-2783-thread-1) [    ] o.a.s.c.ZkController publishing state=active
   [junit4]   2> 797109 INFO  (coreZkRegister-2783-thread-1) [    ] o.a.s.c.ZkController numShards not found on descriptor - reading it from system property
   [junit4]   2> 797110 INFO  (OverseerStateUpdate-95585765018304516-127.0.0.1:42411_-n_0000000000) [    ] o.a.s.c.Overseer processMessage: queueSize: 1, message = {
   [junit4]   2>   "core":"collection1",
   [junit4]   2>   "core_node_name":"core_node1",
   [junit4]   2>   "roles":null,
   [junit4]   2>   "base_url":"http://127.0.0.1:42411",
   [junit4]   2>   "node_name":"127.0.0.1:42411_",
   [junit4]   2>   "numShards":"1",
   [junit4]   2>   "state":"active",
   [junit4]   2>   "shard":"shard1",
   [junit4]   2>   "collection":"control_collection",
   [junit4]   2>   "operation":"state"} current state version: 2
   [junit4]   2> 797111 INFO  (OverseerStateUpdate-95585765018304516-127.0.0.1:42411_-n_0000000000) [    ] o.a.s.c.o.ReplicaMutator Update state numShards=1 message={
   [junit4]   2>   "core":"collection1",
   [junit4]   2>   "core_node_name":"core_node1",
   [junit4]   2>   "roles":null,
   [junit4]   2>   "base_url":"http://127.0.0.1:42411",
   [junit4]   2>   "node_name":"127.0.0.1:42411_",
   [junit4]   2>   "numShards":"1",
   [junit4]   2>   "state":"active",
   [junit4]   2>   "shard":"shard1",
   [junit4]   2>   "collection":"control_collection",
   [junit4]   2>   "operation":"state"}
   [junit4]   2> 797213 INFO  (zkCallback-855-thread-1) [    ] o.a.s.c.c.ZkStateReader A cluster state change: [WatchedEvent state:SyncConnected type:NodeDataChanged path:/clusterstate.json], has occurred - updating... (live nodes size: [1])
   [junit4]   2> 797269 INFO  (TEST-UnloadDistributedZkTest.test-seed#[97BB640442BEF917]) [    ] o.a.s.c.c.SolrZkClient Using default ZkCredentialsProvider
   [junit4]   2> 797269 INFO  (TEST-UnloadDistributedZkTest.test-seed#[97BB640442BEF917]) [    ] o.a.s.c.c.ConnectionManager Waiting for client to connect to ZooKeeper
   [junit4]   2> 797270 INFO  (zkCallback-857-thread-1) [    ] o.a.s.c.c.ConnectionManager Watcher org.apache.solr.common.cloud.ConnectionManager@1a9705c name:ZooKeeperConnection Watcher:127.0.0.1:44582/solr got event WatchedEvent state:SyncConnected type:None path:null path:null type:None
   [junit4]   2> 797270 INFO  (TEST-UnloadDistributedZkTest.test-seed#[97BB640442BEF917]) [    ] o.a.s.c.c.ConnectionManager Client is connected to ZooKeeper
   [junit4]   2> 797271 INFO  (TEST-UnloadDistributedZkTest.test-seed#[97BB640442BEF917]) [    ] o.a.s.c.c.SolrZkClient Using default ZkACLProvider
   [junit4]   2> 797271 INFO  (TEST-UnloadDistributedZkTest.test-seed#[97BB640442BEF917]) [    ] o.a.s.c.c.ZkStateReader Updating cluster state from ZooKeeper... 
   [junit4]   2> 797272 INFO  (TEST-UnloadDistributedZkTest.test-seed#[97BB640442BEF917]) [    ] o.a.s.c.c.ZkStateReader Updated live nodes from ZooKeeper... (0) -> (1)
   [junit4]   2> 797272 INFO  (TEST-UnloadDistributedZkTest.test-seed#[97BB640442BEF917]) [    ] o.a.s.c.ChaosMonkey monkey: init - expire sessions:false cause connection loss:false
   [junit4]   2> 797350 INFO  (TEST-UnloadDistributedZkTest.test-seed#[97BB640442BEF917]) [    ] o.a.s.SolrTestCaseJ4 Writing core.properties file to /home/jenkins/workspace/Lucene-Solr-6.x-Linux/solr/build/solr-core/test/J2/temp/solr.cloud.UnloadDistributedZkTest_97BB640442BEF917-001/shard-1-001/cores/collection1
   [junit4]   2> 797351 INFO  (TEST-UnloadDistributedZkTest.test-seed#[97BB640442BEF917]) [    ] o.a.s.c.AbstractFullDistribZkTestBase create jetty 1 in directory /home/jenkins/workspace/Lucene-Solr-6.x-Linux/solr/build/solr-core/test/J2/temp/solr.cloud.UnloadDistributedZkTest_97BB640442BEF917-001/shard-1-001
   [junit4]   2> 797351 INFO  (TEST-UnloadDistributedZkTest.test-seed#[97BB640442BEF917]) [    ] o.e.j.s.Server jetty-9.3.8.v20160314
   [junit4]   2> 797352 INFO  (TEST-UnloadDistributedZkTest.test-seed#[97BB640442BEF917]) [    ] o.e.j.s.h.ContextHandler Started o.e.j.s.ServletContextHandler@16acdc7{/,null,AVAILABLE}
   [junit4]   2> 797353 INFO  (TEST-UnloadDistributedZkTest.test-seed#[97BB640442BEF917]) [    ] o.e.j.s.ServerConnector Started ServerConnector@a2b496{HTTP/1.1,[http/1.1]}{127.0.0.1:42075}
   [junit4]   2> 797354 INFO  (TEST-UnloadDistributedZkTest.test-seed#[97BB640442BEF917]) [    ] o.e.j.s.Server Started @799243ms
   [junit4]   2> 797354 INFO  (TEST-UnloadDistributedZkTest.test-seed#[97BB640442BEF917]) [    ] o.a.s.c.s.e.JettySolrRunner Jetty properties: {solr.data.dir=/home/jenkins/workspace/Lucene-Solr-6.x-Linux/solr/build/solr-core/test/J2/temp/solr.cloud.UnloadDistributedZkTest_97BB640442BEF917-001/tempDir-001/jetty1, solrconfig=solrconfig.xml, hostContext=/, hostPort=42075, coreRootDirectory=/home/jenkins/workspace/Lucene-Solr-6.x-Linux/solr/build/solr-core/test/J2/../../../../../../../../../home/jenkins/workspace/Lucene-Solr-6.x-Linux/solr/build/solr-core/test/J2/temp/solr.cloud.UnloadDistributedZkTest_97BB640442BEF917-001/shard-1-001/cores}
   [junit4]   2> 797354 INFO  (TEST-UnloadDistributedZkTest.test-seed#[97BB640442BEF917]) [    ] o.a.s.s.SolrDispatchFilter SolrDispatchFilter.init(): jdk.internal.loader.ClassLoaders$AppClassLoader@6a03af
   [junit4]   2> 797354 INFO  (TEST-UnloadDistributedZkTest.test-seed#[97BB640442BEF917]) [    ] o.a.s.c.SolrResourceLoader new SolrResourceLoader for directory: '/home/jenkins/workspace/Lucene-Solr-6.x-Linux/solr/build/solr-core/test/J2/temp/solr.cloud.UnloadDistributedZkTest_97BB640442BEF917-001/shard-1-001'
   [junit4]   2> 797354 INFO  (TEST-UnloadDistributedZkTest.test-seed#[97BB640442BEF917]) [    ] o.a.s.c.SolrResourceLoader JNDI not configured for solr (NoInitialContextEx)
   [junit4]   2> 797354 INFO  (TEST-UnloadDistributedZkTest.test-seed#[97BB640442BEF917]) [    ] o.a.s.c.SolrResourceLoader solr home defaulted to 'solr/' (could not find system property or JNDI)
   [junit4]   2> 797354 INFO  (TEST-UnloadDistributedZkTest.test-seed#[97BB640442BEF917]) [    ] o.a.s.c.c.SolrZkClient Using default ZkCredentialsProvider
   [junit4]   2> 797355 INFO  (TEST-UnloadDistributedZkTest.test-seed#[97BB640442BEF917]) [    ] o.a.s.c.c.ConnectionManager Waiting for client to connect to ZooKeeper
   [junit4]   2> 797356 INFO  (zkCallback-858-thread-1) [    ] o.a.s.c.c.ConnectionManager Watcher org.apache.solr.common.cloud.ConnectionManager@10ffbf0 name:ZooKeeperConnection Watcher:127.0.0.1:44582/solr got event WatchedEvent state:SyncConnected type:None path:null path:null type:None
   [junit4]   2> 797356 INFO  (TEST-UnloadDistributedZkTest.test-seed#[97BB640442BEF917]) [    ] o.a.s.c.c.ConnectionManager Client is connected to ZooKeeper
   [junit4]   2> 797356 INFO  (TEST-UnloadDistributedZkTest.test-seed#[97BB640442BEF917]) [    ] o.a.s.c.c.SolrZkClient Using default ZkACLProvider
   [junit4]   2> 797357 INFO  (TEST-UnloadDistributedZkTest.test-seed#[97BB640442BEF917]) [    ] o.a.s.s.SolrDispatchFilter Loading solr.xml from SolrHome (not found in ZooKeeper)
   [junit4]   2> 797357 INFO  (TEST-UnloadDistributedZkTest.test-seed#[97BB640442BEF917]) [    ] o.a.s.c.SolrXmlConfig Loading container configuration from /home/jenkins/workspace/Lucene-Solr-6.x-Linux/solr/build/solr-core/test/J2/temp/solr.cloud.UnloadDistributedZkTest_97BB640442BEF917-001/shard-1-001/solr.xml
   [junit4]   2> 797361 INFO  (TEST-UnloadDistributedZkTest.test-seed#[97BB640442BEF917]) [    ] o.a.s.c.CorePropertiesLocator Config-defined core root directory: /home/jenkins/workspace/Lucene-Solr-6.x-Linux/solr/build/solr-core/test/J2/../../../../../../../../../home/jenkins/workspace/Lucene-Solr-6.x-Linux/solr/build/solr-core/test/J2/temp/solr.cloud.UnloadDistributedZkTest_97BB640442BEF917-001/shard-1-001/cores
   [junit4]   2> 797362 INFO  (TEST-UnloadDistributedZkTest.test-seed#[97BB640442BEF917]) [    ] o.a.s.c.CoreContainer New CoreContainer 14803959
   [junit4]   2> 797362 INFO  (TEST-UnloadDistributedZkTest.test-seed#[97BB640442BEF917]) [    ] o.a.s.c.CoreContainer Loading cores into CoreContainer [instanceDir=/home/jenkins/workspace/Lucene-Solr-6.x-Linux/solr/build/solr-core/test/J2/temp/solr.cloud.UnloadDistributedZkTest_97BB640442BEF917-001/shard-1-001]
   [junit4]   2> 797362 WARN  (TEST-UnloadDistributedZkTest.test-seed#[97BB640442BEF917]) [    ] o.a.s.c.CoreContainer Couldn't add files from /home/jenkins/workspace/Lucene-Solr-6.x-Linux/solr/build/solr-core/test/J2/temp/solr.cloud.UnloadDistributedZkTest_97BB640442BEF917-001/shard-1-001/lib to classpath: /home/jenkins/workspace/Lucene-Solr-6.x-Linux/solr/build/solr-core/test/J2/temp/solr.cloud.UnloadDistributedZkTest_97BB640442BEF917-001/shard-1-001/lib
   [junit4]   2> 797362 INFO  (TEST-UnloadDistributedZkTest.test-seed#[97BB640442BEF917]) [    ] o.a.s.h.c.HttpShardHandlerFactory created with socketTimeout : 90000,urlScheme : ,connTimeout : 15000,maxConnectionsPerHost : 20,maxConnections : 10000,corePoolSize : 0,maximumPoolSize : 2147483647,maxThreadIdleTime : 5,sizeOfQueue : -1,fairnessPolicy : false,useRetries : false,
   [junit4]   2> 797363 INFO  (TEST-UnloadDistributedZkTest.test-seed#[97BB640442BEF917]) [    ] o.a.s.u.UpdateShardHandler Creating UpdateShardHandler HTTP client with params: socketTimeout=340000&connTimeout=45000&retry=true
   [junit4]   2> 797364 INFO  (TEST-UnloadDistributedZkTest.test-seed#[97BB640442BEF917]) [    ] o.a.s.l.LogWatcher SLF4J impl is org.slf4j.impl.Log4jLoggerFactory
   [junit4]   2> 797364 INFO  (TEST-UnloadDistributedZkTest.test-seed#[97BB640442BEF917]) [    ] o.a.s.l.LogWatcher Registering Log Listener [Log4j (org.slf4j.impl.Log4jLoggerFactory)]
   [junit4]   2> 797364 INFO  (TEST-UnloadDistributedZkTest.test-seed#[97BB640442BEF917]) [    ] o.a.s.c.ZkContainer Zookeeper client=127.0.0.1:44582/solr
   [junit4]   2> 797364 INFO  (TEST-UnloadDistributedZkTest.test-seed#[97BB640442BEF917]) [    ] o.a.s.c.ZkController zkHost includes chroot
   [junit4]   2> 797364 INFO  (TEST-UnloadDistributedZkTest.test-seed#[97BB640442BEF917]) [    ] o.a.s.c.c.SolrZkClient Using default ZkCredentialsProvider
   [junit4]   2> 797364 INFO  (TEST-UnloadDistributedZkTest.test-seed#[97BB640442BEF917]) [    ] o.a.s.c.c.ConnectionManager Waiting for client to connect to ZooKeeper
   [junit4]   2> 797365 INFO  (zkCallback-861-thread-1) [    ] o.a.s.c.c.ConnectionManager Watcher org.apache.solr.common.cloud.ConnectionManager@8cce0e name:ZooKeeperConnection Watcher:127.0.0.1:44582 got event WatchedEvent state:SyncConnected type:None path:null path:null type:None
   [junit4]   2> 797366 INFO  (TEST-UnloadDistributedZkTest.test-seed#[97BB640442BEF917]) [    ] o.a.s.c.c.ConnectionManager Client is connected to ZooKeeper
   [junit4]   2> 797366 INFO  (TEST-UnloadDistributedZkTest.test-seed#[97BB640442BEF917]) [    ] o.a.s.c.c.SolrZkClient Using default ZkACLProvider
   [junit4]   2> 797367 INFO  (TEST-UnloadDistributedZkTest.test-seed#[97BB640442BEF917]) [    ] o.a.s.c.c.ConnectionManager Waiting for client to connect to ZooKeeper
   [junit4]   2> 797368 INFO  (zkCallback-862-thread-1) [    ] o.a.s.c.c.ConnectionManager Watcher org.apache.solr.common.cloud.ConnectionManager@1198b9 name:ZooKeeperConnection Watcher:127.0.0.1:44582/solr got event WatchedEvent state:SyncConnected type:None path:null path:null type:None
   [junit4]   2> 797368 INFO  (TEST-UnloadDistributedZkTest.test-seed#[97BB640442BEF917]) [    ] o.a.s.c.c.ConnectionManager Client is connected to ZooKeeper
   [junit4]   2> 797372 INFO  (TEST-UnloadDistributedZkTest.test-seed#[97BB640442BEF917]) [    ] o.a.s.c.c.ZkStateReader Updating cluster state from ZooKeeper... 
   [junit4]   2> 797373 INFO  (TEST-UnloadDistributedZkTest.test-seed#[97BB640442BEF917]) [    ] o.a.s.c.c.ZkStateReader Updated live nodes from ZooKeeper... (0) -> (1)
   [junit4]   2> 797375 INFO  (TEST-UnloadDistributedZkTest.test-seed#[97BB640442BEF917]) [    ] o.a.s.c.Overseer Overseer (id=null) closing
   [junit4]   2> 797375 INFO  (TEST-UnloadDistributedZkTest.test-seed#[97BB640442BEF917]) [    ] o.a.s.c.LeaderElector Joined leadership election with path: /overseer_elect/election/95585765018304520-127.0.0.1:42075_-n_0000000001
   [junit4]   2> 797376 INFO  (TEST-UnloadDistributedZkTest.test-seed#[97BB640442BEF917]) [    ] o.a.s.c.LeaderElector Watching path /overseer_elect/election/95585765018304516-127.0.0.1:42411_-n_0000000000 to know if I could be the leader
   [junit4]   2> 797376 INFO  (TEST-UnloadDistributedZkTest.test-seed#[97BB640442BEF917]) [    ] o.a.s.c.ZkController Publish node=127.0.0.1:42075_ as DOWN
   [junit4]   2> 797377 INFO  (OverseerStateUpdate-95585765018304516-127.0.0.1:42411_-n_0000000000) [    ] o.a.s.c.Overseer processMessage: queueSize: 1, message = {
   [junit4]   2>   "operation":"downnode",
   [junit4]   2>   "node_name":"127.0.0.1:42075_"} current state version: 3
   [junit4]   2> 797377 INFO  (OverseerStateUpdate-95585765018304516-127.0.0.1:42411_-n_0000000000) [    ] o.a.s.c.o.NodeMutator DownNode state invoked for node: 127.0.0.1:42075_
   [junit4]   2> 797480 INFO  (zkCallback-857-thread-1) [    ] o.a.s.c.c.ZkStateReader A cluster state change: [WatchedEvent state:SyncConnected type:NodeDataChanged path:/clusterstate.json], has occurred - updating... (live nodes size: [1])
   [junit4]   2> 797480 INFO  (zkCallback-862-thread-1) [    ] o.a.s.c.c.ZkStateReader A cluster state change: [WatchedEvent state:SyncConnected type:NodeDataChanged path:/clusterstate.json], has occurred - updating... (live nodes size: [1])
   [junit4]   2> 797480 INFO  (zkCallback-855-thread-1) [    ] o.a.s.c.c.ZkStateReader A cluster state change: [WatchedEvent state:SyncConnected type:NodeDataChanged path:/clusterstate.json], has occurred - updating... (live nodes size: [1])
   [junit4]   2> 798377 INFO  (TEST-UnloadDistributedZkTest.test-seed#[97BB640442BEF917]) [    ] o.a.s.c.ZkController Register node as live in ZooKeeper:/live_nodes/127.0.0.1:42075_
   [junit4]   2> 798378 INFO  (TEST-UnloadDistributedZkTest.test-seed#[97BB640442BEF917]) [    ] o.a.s.c.c.SolrZkClient makePath: /live_nodes/127.0.0.1:42075_
   [junit4]   2> 798379 INFO  (zkCallback-855-thread-1) [    ] o.a.s.c.c.ZkStateReader A live node change: [WatchedEvent state:SyncConnected type:NodeChildrenChanged path:/live_nodes], has occurred - updating... (live nodes size: [1])
   [junit4]   2> 798379 INFO  (zkCallback-857-thread-1) [    ] o.a.s.c.c.ZkStateReader A live node change: [WatchedEvent state:SyncConnected type:NodeChildrenChanged path:/live_nodes], has occurred - updating... (live nodes size: [1])
   [junit4]   2> 798379 INFO  (zkCallback-862-thread-1) [    ] o.a.s.c.c.ZkStateReader A live node change: [WatchedEvent state:SyncConnected type:NodeChildrenChanged path:/live_nodes], has occurred - updating... (live nodes size: [1])
   [junit4]   2> 798379 INFO  (zkCallback-855-thread-1) [    ] o.a.s.c.c.ZkStateReader Updated live nodes from ZooKeeper... (1) -> (2)
   [junit4]   2> 798379 INFO  (zkCallback-857-thread-1) [    ] o.a.s.c.c.ZkStateReader Updated live nodes from ZooKeeper... (1) -> (2)
   [junit4]   2> 798379 INFO  (zkCallback-862-thread-1) [    ] o.a.s.c.c.ZkStateReader Updated live nodes from ZooKeeper... (1) -> (2)
   [junit4]   2> 798418 INFO  (TEST-UnloadDistributedZkTest.test-seed#[97BB640442BEF917]) [    ] o.a.s.c.CoreContainer Security conf doesn't exist. Skipping setup for authorization module.
   [junit4]   2> 798418 INFO  (TEST-UnloadDistributedZkTest.test-seed#[97BB640442BEF917]) [    ] o.a.s.c.CoreContainer No authentication plugin used.
   [junit4]   2> 798419 INFO  (TEST-UnloadDistributedZkTest.test-seed#[97BB640442BEF917]) [    ] o.a.s.c.CorePropertiesLocator Looking for core definitions underneath /home/jenkins/workspace/Lucene-Solr-6.x-Linux/solr/build/solr-core/test/J2/../../../../../../../../../home/jenkins/workspace/Lucene-Solr-6.x-Linux/solr/build/solr-core/test/J2/temp/solr.cloud.UnloadDistributedZkTest_97BB640442BEF917-001/shard-1-001/cores
   [junit4]   2> 798420 INFO  (TEST-UnloadDistributedZkTest.test-seed#[97BB640442BEF917]) [    ] o.a.s.c.CoreDescriptor Created CoreDescriptor: {name=collection1, config=solrconfig.xml, transient=false, schema=schema.xml, loadOnStartup=true, configSetProperties=configsetprops.json, collection=collection1, coreNodeName=, dataDir=data/, shard=}
   [junit4]   2> 798420 INFO  (TEST-UnloadDistributedZkTest.test-seed#[97BB640442BEF917]) [    ] o.a.s.c.CorePropertiesLocator Found core collection1 in /home/jenkins/workspace/Lucene-Solr-6.x-Linux/solr/build/solr-core/test/J2/../../../../../../../../../home/jenkins/workspace/Lucene-Solr-6.x-Linux/solr/build/solr-core/test/J2/temp/solr.cloud.UnloadDistributedZkTest_97BB640442BEF917-001/shard-1-001/cores/collection1
   [junit4]   2> 798420 INFO  (TEST-UnloadDistributedZkTest.test-seed#[97BB640442BEF917]) [    ] o.a.s.c.CorePropertiesLocator Found 1 core definitions
   [junit4]   2> 798421 INFO  (TEST-UnloadDistributedZkTest.test-seed#[97BB640442BEF917]) [    ] o.a.s.s.SolrDispatchFilter user.dir=/home/jenkins/workspace/Lucene-Solr-6.x-Linux/solr/build/solr-core/test/J2
   [junit4]   2> 798421 INFO  (TEST-UnloadDistributedZkTest.test-seed#[97BB640442BEF917]) [    ] o.a.s.s.SolrDispatchFilter SolrDispatchFilter.init() done
   [junit4]   2> 798421 INFO  (coreLoadExecutor-2800-thread-1) [    ] o.a.s.c.ZkController publishing state=down
   [junit4]   2> 798421 INFO  (coreLoadExecutor-2800-thread-1) [    ] o.a.s.c.ZkController numShards not found on descriptor - reading it from system property
   [junit4]   2> 798422 INFO  (coreLoadExecutor-2800-thread-1) [    ] o.a.s.c.ZkController look for our core node name
   [junit4]   2> 798422 INFO  (OverseerStateUpdate-95585765018304516-127.0.0.1:42411_-n_0000000000) [    ] o.a.s.c.Overseer processMessage: queueSize: 1, message = {
   [junit4]   2>   "core":"collection1",
   [junit4]   2>   "roles":null,
   [junit4]   2>   "base_url":"http://127.0.0.1:42075",
   [junit4]   2>   "node_name":"127.0.0.1:42075_",
   [junit4]   2>   "numShards":"2",
   [junit4]   2>   "state":"down",
   [junit4]   2>   "shard":null,
   [junit4]   2>   "collection":"collection1",
   [junit4]   2>   "operation":"state"} current state version: 4
   [junit4]   2> 798422 INFO  (OverseerStateUpdate-95585765018304516-127.0.0.1:42411_-n_0000000000) [    ] o.a.s.c.o.ReplicaMutator Update state numShards=2 message={
   [junit4]   2>   "core":"collection1",
   [junit4]   2>   "roles":null,
   [junit4]   2>   "base_url":"http://127.0.0.1:42075",
   [junit4]   2>   "node_name":"127.0.0.1:42075_",
   [junit4]   2>   "numShards":"2",
   [junit4]   2>   "state":"down",
   [junit4]   2>   "shard":null,
   [junit4]   2>   "collection":"collection1",
   [junit4]   2>   "operation":"state"}
   [junit4]   2> 798422 INFO  (OverseerStateUpdate-95585765018304516-127.0.0.1:42411_-n_0000000000) [    ] o.a.s.c.o.ClusterStateMutator building a new cName: collection1
   [junit4]   2> 798422 INFO  (OverseerStateUpdate-95585765018304516-127.0.0.1:42411_-n_0000000000) [    ] o.a.s.c.o.ReplicaMutator Assigning new node to shard shard=shard2
   [junit4]   2> 798524 INFO  (zkCallback-857-thread-1) [    ] o.a.s.c.c.ZkStateReader A cluster state change: [WatchedEvent state:SyncConnected type:NodeDataChanged path:/clusterstate.json], has occurred - updating... (live nodes size: [2])
   [junit4]   2> 798524 INFO  (zkCallback-855-thread-1) [    ] o.a.s.c.c.ZkStateReader A cluster state change: [WatchedEvent state:SyncConnected type:NodeDataChanged path:/clusterstate.json], has occurred - updating... (live nodes size: [2])
   [junit4]   2> 798524 INFO  (zkCallback-862-thread-1) [    ] o.a.s.c.c.ZkStateReader A cluster state change: [WatchedEvent state:SyncConnected type:NodeDataChanged path:/clusterstate.json], has occurred - updating... (live nodes size: [2])
   [junit4]   2> 799422 INFO  (coreLoadExecutor-2800-thread-1) [    ] o.a.s.c.ZkController waiting to find shard id in clusterstate for collection1
   [junit4]   2> 799422 INFO  (coreLoadExecutor-2800-thread-1) [    ] o.a.s.c.ZkController Check for collection zkNode:collection1
   [junit4]   2> 799423 INFO  (coreLoadExecutor-2800-thread-1) [    ] o.a.s.c.ZkController Collection zkNode exists
   [junit4]   2> 799423 INFO  (coreLoadExecutor-2800-thread-1) [    ] o.a.s.c.c.ZkStateReader Load collection config from: [/collections/collection1]
   [junit4]   2> 799423 INFO  (coreLoadExecutor-2800-thread-1) [    ] o.a.s.c.c.ZkStateReader path=[/collections/collection1] [configName]=[conf1] specified config exists in ZooKeeper
   [junit4]   2> 799424 INFO  (coreLoadExecutor-2800-thread-1) [    ] o.a.s.c.SolrResourceLoader new SolrResourceLoader for directory: '/home/jenkins/workspace/Lucene-Solr-6.x-Linux/solr/build/solr-core/test/J2/temp/solr.cloud.UnloadDistributedZkTest_97BB640442BEF917-001/shard-1-001/cores/collection1'
   [junit4]   2> 799424 INFO  (coreLoadExecutor-2800-thread-1) [    ] o.a.s.c.SolrResourceLoader JNDI not configured for solr (NoInitialContextEx)
   [junit4]   2> 799424 INFO  (coreLoadExecutor-2800-thread-1) [    ] o.a.s.c.SolrResourceLoader solr home defaulted to 'solr/' (could not find system property or JNDI)
   [junit4]   2> 799425 INFO  (coreLoadExecutor-2800-thread-1) [    ] o.a.s.c.Config loaded config solrconfig.xml with version 0 
   [junit4]   2> 799430 INFO  (coreLoadExecutor-2800-thread-1) [    ] o.a.s.c.SolrConfig current version of requestparams : -1
   [junit4]   2> 799432 WARN  (coreLoadExecutor-2800-thread-1) [    ] o.a.s.c.Config Beginning with Solr 5.5, <mergePolicy> is deprecated, use <mergePolicyFactory> instead.
   [junit4]   2> 799433 INFO  (coreLoadExecutor-2800-thread-1) [    ] o.a.s.c.SolrConfig Using Lucene MatchVersion: 6.1.0
   [junit4]   2> 799441 INFO  (coreLoadExecutor-2800-thread-1) [    ] o.a.s.c.SolrConfig Loaded SolrConfig: solrconfig.xml
   [junit4]   2> 799447 INFO  (coreLoadExecutor-2800-thread-1) [    ] o.a.s.s.IndexSchema [collection1] Schema name=test
   [junit4]   2> 799525 INFO  (coreLoadExecutor-2800-thread-1) [    ] o.a.s.s.OpenExchangeRatesOrgProvider Initialized with rates=open-exchange-rates.json, refreshInterval=1440.
   [junit4]   2> 799530 INFO  (coreLoadExecutor-2800-thread-1) [    ] o.a.s.s.IndexSchema default search field in schema is text
   [junit4]   2> 799531 INFO  (coreLoadExecutor-2800-thread-1) [    ] o.a.s.s.IndexSchema unique key field: id
   [junit4]   2> 799537 INFO  (coreLoadExecutor-2800-thread-1) [    ] o.a.s.s.FileExchangeRateProvider Reloading exchange rates from file currency.xml
   [junit4]   2> 799538 INFO  (coreLoadExecutor-2800-thread-1) [    ] o.a.s.s.FileExchangeRateProvider Reloading exchange rates from file currency.xml
   [junit4]   2> 799540 INFO  (coreLoadExecutor-2800-thread-1) [    ] o.a.s.s.OpenExchangeRatesOrgProvider Reloading exchange rates from open-exchange-rates.json
   [junit4]   2> 799540 INFO  (coreLoadExecutor-2800-thread-1) [    ] o.a.s.s.OpenExchangeRatesOrgProvider Reloading exchange rates from open-exchange-rates.json
   [junit4]   2> 799541 INFO  (coreLoadExecutor-2800-thread-1) [    ] o.a.s.c.ConfigSetProperties Did not find ConfigSet properties, assuming default properties: Can't find resource 'configsetprops.json' in classpath or '/configs/conf1', cwd=/home/jenkins/workspace/Lucene-Solr-6.x-Linux/solr/build/solr-core/test/J2
   [junit4]   2> 799541 INFO  (coreLoadExecutor-2800-thread-1) [    ] o.a.s.c.CoreContainer Creating SolrCore 'collection1' using configuration from collection collection1
   [junit4]   2> 799541 INFO  (coreLoadExecutor-2800-thread-1) [    ] o.a.s.c.SolrCore org.apache.solr.core.MockDirectoryFactory
   [junit4]   2> 799541 INFO  (coreLoadExecutor-2800-thread-1) [    ] o.a.s.c.SolrCore [[collection1] ] Opening new SolrCore at [/home/jenkins/workspace/Lucene-Solr-6.x-Linux/solr/build/solr-core/test/J2/temp/solr.cloud.UnloadDistributedZkTest_97BB640442BEF917-001/shard-1-001/cores/collection1], dataDir=[/home/jenkins/workspace/Lucene-Solr-6.x-Linux/solr/build/solr-core/test/J2/../../../../../../../../../home/jenkins/workspace/Lucene-Solr-6.x-Linux/solr/build/solr-core/test/J2/temp/solr.cloud.UnloadDistributedZkTest_97BB640442BEF917-001/shard-1-001/cores/collection1/data/]
   [junit4]   2> 799542 INFO  (coreLoadExecutor-2800-thread-1) [    ] o.a.s.c.JmxMonitoredMap JMX monitoring is enabled. Adding Solr mbeans to JMX Server: com.sun.jmx.mbeanserver.JmxMBeanServer@12d7970
   [junit4]   2> 799542 INFO  (coreLoadExecutor-2800-thread-1) [    ] o.a.s.c.CachingDirectoryFactory return new directory for /home/jenkins/workspace/Lucene-Solr-6.x-Linux/solr/build/solr-core/test/J2/../../../../../../../../../home/jenkins/workspace/Lucene-Solr-6.x-Linux/solr/build/solr-core/test/J2/temp/solr.cloud.UnloadDistributedZkTest_97BB640442BEF917-001/shard-1-001/cores/collection1/data
   [junit4]   2> 799542 INFO  (coreLoadExecutor-2800-thread-1) [    ] o.a.s.c.SolrCore New index directory detected: old=null new=/home/jenkins/workspace/Lucene-Solr-6.x-Linux/solr/build/solr-core/test/J2/../../../../../../../../../home/jenkins/workspace/Lucene-Solr-6.x-Linux/solr/build/solr-core/test/J2/temp/solr.cloud.UnloadDistributedZkTest_97BB640442BEF917-001/shard-1-001/cores/collection1/data/index/
   [junit4]   2> 799542 WARN  (coreLoadExecutor-2800-thread-1) [    ] o.a.s.c.SolrCore [collection1] Solr index directory '/home/jenkins/workspace/Lucene-Solr-6.x-Linux/solr/build/solr-core/test/J2/../../../../../../../../../home/jenkins/workspace/Lucene-Solr-6.x-Linux/solr/build/solr-core/test/J2/temp/solr.cloud.UnloadDistributedZkTest_97BB640442BEF917-001/shard-1-001/cores/collection1/data/index' doesn't exist. Creating new index...
   [junit4]   2> 799543 INFO  (coreLoadExecutor-2800-thread-1) [    ] o.a.s.c.CachingDirectoryFactory return new directory for /home/jenkins/workspace/Lucene-Solr-6.x-Linux/solr/build/solr-core/test/J2/../../../../../../../../../home/jenkins/workspace/Lucene-Solr-6.x-Linux/solr/build/solr-core/test/J2/temp/solr.cloud.UnloadDistributedZkTest_97BB640442BEF917-001/shard-1-001/cores/collection1/data/index
   [junit4]   2> 799543 INFO  (coreLoadExecutor-2800-thread-1) [    ] o.a.s.u.RandomMergePolicy RandomMergePolicy wrapping class org.apache.lucene.index.LogByteSizeMergePolicy: [LogByteSizeMergePolicy: minMergeSize=1677721, mergeFactor=25, maxMergeSize=2147483648, maxMergeSizeForForcedMerge=9223372036854775807, calibrateSizeByDeletes=false, maxMergeDocs=2147483647, maxCFSSegmentSizeMB=8.796093022207999E12, noCFSRatio=0.0]
   [junit4]   2> 799543 INFO  (coreLoadExecutor-2800-thread-1) [    ] o.a.s.c.SolrDeletionPolicy SolrDeletionPolicy.onCommit: commits: num=1
   [junit4]   2> 	commit{dir=MockDirectoryWrapper(RAMDirectory@1818350 lockFactory=org.apache.lucene.store.SingleInstanceLockFactory@5ea737),segFN=segments_1,generation=1}
   [junit4]   2> 799543 INFO  (coreLoadExecutor-2800-thread-1) [    ] o.a.s.c.SolrDeletionPolicy newest commit generation = 1
   [junit4]   2> 799544 INFO  (OldIndexDirectoryCleanupThreadForCore-collection1) [    ] o.a.s.c.SolrCore Looking for old index directories to cleanup for core collection1 in /home/jenkins/workspace/Lucene-Solr-6.x-Linux/solr/build/solr-core/test/J2/../../../../../../../../../home/jenkins/workspace/Lucene-Solr-6.x-Linux/solr/build/solr-core/test/J2/temp/solr.cloud.UnloadDistributedZkTest_97BB640442BEF917-001/shard-1-001/cores/collection1/data/
   [junit4]   2> 799544 WARN  (OldIndexDirectoryCleanupThreadForCore-collection1) [    ] o.a.s.c.DirectoryFactory /home/jenkins/workspace/Lucene-Solr-6.x-Linux/solr/build/solr-core/test/J2/../../../../../../../../../home/jenkins/workspace/Lucene-Solr-6.x-Linux/solr/build/solr-core/test/J2/temp/solr.cloud.UnloadDistributedZkTest_97BB640442BEF917-001/shard-1-001/cores/collection1/data/ does not point to a valid data directory; skipping clean-up of old index directories.
   [junit4]   2> 799547 INFO  (coreLoadExecutor-2800-thread-1) [    ] o.a.s.u.p.UpdateRequestProcessorChain creating updateRequestProcessorChain "nodistrib"
   [junit4]   2> 799547 INFO  (coreLoadExecutor-2800-thread-1) [    ] o.a.s.u.p.UpdateRequestProcessorChain creating updateRequestProcessorChain "dedupe"
   [junit4]   2> 799547 INFO  (coreLoadExecutor-2800-thread-1) [    ] o.a.s.u.p.UpdateRequestProcessorChain inserting DistributedUpdateProcessorFactory into updateRequestProcessorChain "dedupe"
   [junit4]   2> 799547 INFO  (coreLoadExecutor-2800-thread-1) [    ] o.a.s.u.p.UpdateRequestProcessorChain creating updateRequestProcessorChain "stored_sig"
   [junit4]   2> 799547 INFO  (coreLoadExecutor-2800-thread-1) [    ] o.a.s.u.p.UpdateRequestProcessorChain inserting DistributedUpdateProcessorFactory into updateRequestProcessorChain "stored_sig"
   [junit4]   2> 799547 INFO  (coreLoadExecutor-2800-thread-1) [    ] o.a.s.u.p.UpdateRequestProcessorChain creating updateRequestProcessorChain "distrib-dup-test-chain-explicit"
   [junit4]   2> 799547 INFO  (coreLoadExecutor-2800-thread-1) [    ] o.a.s.u.p.UpdateRequestProcessorChain creating updateRequestProcessorChain "distrib-dup-test-chain-implicit"
   [junit4]   2> 799548 INFO  (coreLoadExecutor-2800-thread-1) [    ] o.a.s.u.p.UpdateRequestProcessorChain inserting DistributedUpdateProcessorFactory into updateRequestProcessorChain "distrib-dup-test-chain-implicit"
   [junit4]   2> 799548 INFO  (coreLoadExecutor-2800-thread-1) [    ] o.a.s.c.SolrCore no updateRequestProcessorChain defined as default, creating implicit default
   [junit4]   2> 799548 WARN  (coreLoadExecutor-2800-thread-1) [    ] o.a.s.c.RequestHandlers INVALID paramSet a in requestHandler {type = requestHandler,name = /dump,class = DumpRequestHandler,args = {defaults={a=A,b=B}}}
   [junit4]   2> 799550 INFO  (coreLoadExecutor-2800-thread-1) [    ] o.a.s.h.l.XMLLoader xsltCacheLifetimeSeconds=60
   [junit4]   2> 799552 INFO  (coreLoadExecutor-2800-thread-1) [    ] o.a.s.h.l.XMLLoader xsltCacheLifetimeSeconds=60
   [junit4]   2> 799554 INFO  (coreLoadExecutor-2800-thread-1) [    ] o.a.s.h.l.XMLLoader xsltCacheLifetimeSeconds=60
   [junit4]   2> 799556 INFO  (coreLoadExecutor-2800-thread-1) [    ] o.a.s.h.l.XMLLoader xsltCacheLifetimeSeconds=60
   [junit4]   2> 799565 INFO  (coreLoadExecutor-2800-thread-1) [    ] o.a.s.c.RequestHandlers Registered paths: /admin/mbeans,standard,/dump,/update/csv,/sql,/update/json/docs,/admin/luke,/export,/admin/segments,/get,/admin/system,/replication,/admin/properties,/config,/stream,/schema,/admin/plugins,/admin/logging,/update/json,/admin/ping,/admin/threads,/update,/admin/file
   [junit4]   2> 799565 INFO  (coreLoadExecutor-2800-thread-1) [    ] o.a.s.c.SolrCore Using default statsCache cache: org.apache.solr.search.stats.LocalStatsCache
   [junit4]   2> 799565 INFO  (coreLoadExecutor-2800-thread-1) [    ] o.a.s.u.UpdateHandler Using UpdateLog implementation: org.apache.solr.update.UpdateLog
   [junit4]   2> 799565 INFO  (coreLoadExecutor-2800-thread-1) [    ] o.a.s.u.UpdateLog Initializing UpdateLog: dataDir= defaultSyncLevel=FLUSH numRecordsToKeep=100 maxNumLogsToKeep=10 numVersionBuckets=65536
   [junit4]   2> 799566 INFO  (coreLoadExecutor-2800-thread-1) [    ] o.a.s.u.CommitTracker Hard AutoCommit: disabled
   [junit4]   2> 799566 INFO  (coreLoadExecutor-2800-thread-1) [    ] o.a.s.u.CommitTracker Soft AutoCommit: disabled
   [junit4]   2> 799568 INFO  (coreLoadExecutor-2800-thread-1) [    ] o.a.s.u.RandomMergePolicy RandomMergePolicy wrapping class org.apache.lucene.index.AlcoholicMergePolicy: [AlcoholicMergePolicy: minMergeSize=0, mergeFactor=10, maxMergeSize=1149354033, maxMergeSizeForForcedMerge=9223372036854775807, calibrateSizeByDeletes=true, maxMergeDocs=2147483647, maxCFSSegmentSizeMB=8.796093022207999E12, noCFSRatio=0.1]
   [junit4]   2> 799568 INFO  (coreLoadExecutor-2800-thread-1) [    ] o.a.s.c.SolrDeletionPolicy SolrDeletionPolicy.onInit: commits: num=1
   [junit4]   2> 	commit{dir=MockDirectoryWrapper(RAMDirectory@1818350 lockFactory=org.apache.lucene.store.SingleInstanceLockFactory@5ea737),segFN=segments_1,generation=1}
   [junit4]   2> 799568 INFO  (coreLoadExecutor-2800-thread-1) [    ] o.a.s.c.SolrDeletionPolicy newest commit generation = 1
   [junit4]   2> 799568 INFO  (coreLoadExecutor-2800-thread-1) [    ] o.a.s.s.SolrIndexSearcher Opening [Searcher@868180[collection1] main]
   [junit4]   2> 799569 INFO  (coreLoadExecutor-2800-thread-1) [    ] o.a.s.c.c.ZkStateReader Load collection config from: [/collections/collection1]
   [junit4]   2> 799569 INFO  (coreLoadExecutor-2800-thread-1) [    ] o.a.s.c.c.ZkStateReader path=[/collections/collection1] [configName]=[conf1] specified config exists in ZooKeeper
   [junit4]   2> 799569 INFO  (coreLoadExecutor-2800-thread-1) [    ] o.a.s.r.ManagedResourceStorage Setting up ZooKeeper-based storage for the RestManager with znodeBase: /configs/conf1
   [junit4]   2> 799569 INFO  (coreLoadExecutor-2800-thread-1) [    ] o.a.s.r.ManagedResourceStorage Configured ZooKeeperStorageIO with znodeBase: /configs/conf1
   [junit4]   2> 799569 INFO  (coreLoadExecutor-2800-thread-1) [    ] o.a.s.r.RestManager Initializing RestManager with initArgs: {}
   [junit4]   2> 799569 INFO  (coreLoadExecutor-2800-thread-1) [    ] o.a.s.r.ManagedResourceStorage Reading _rest_managed.json using ZooKeeperStorageIO:path=/configs/conf1
   [junit4]   2> 799570 INFO  (coreLoadExecutor-2800-thread-1) [    ] o.a.s.r.ManagedResourceStorage No data found for znode /configs/conf1/_rest_managed.json
   [junit4]   2> 799570 INFO  (coreLoadExecutor-2800-thread-1) [    ] o.a.s.r.ManagedResourceStorage Loaded null at path _rest_managed.json using ZooKeeperStorageIO:path=/configs/conf1
   [junit4]   2> 799570 INFO  (coreLoadExecutor-2800-thread-1) [    ] o.a.s.r.RestManager Initializing 0 registered ManagedResources
   [junit4]   2> 799570 INFO  (coreLoadExecutor-2800-thread-1) [    ] o.a.s.h.ReplicationHandler Commits will be reserved for  10000
   [junit4]   2> 799572 INFO  (searcherExecutor-2801-thread-1) [    ] o.a.s.c.SolrCore [collection1] Registered new searcher Searcher@868180[collection1] main{ExitableDirectoryReader(UninvertingDirectoryReader())}
   [junit4]   2> 799572 INFO  (coreLoadExecutor-2800-thread-1) [    ] o.a.s.u.UpdateLog Looking up max value of version field to seed version buckets
   [junit4]   2> 799572 INFO  (coreLoadExecutor-2800-thread-1) [    ] o.a.s.u.VersionInfo Refreshing highest value of _version_ for 65536 version buckets from index
   [junit4]   2> 799572 INFO  (coreLoadExecutor-2800-thread-1) [    ] o.a.s.u.VersionInfo No terms found for _version_, cannot seed version bucket highest value from index
   [junit4]   2> 799572 INFO  (coreLoadExecutor-2800-thread-1) [    ] o.a.s.u.UpdateLog Could not find max version in index or recent updates, using new clock 1529372244597276672
   [junit4]   2> 799574 INFO  (coreLoadExecutor-2800-thread-1) [    ] o.a.s.u.UpdateLog Took 1.0ms to seed version buckets with highest version 1529372244597276672
   [junit4]   2> 799574 INFO  (coreLoadExecutor-2800-thread-1) [    ] o.a.s.c.ZkController watch zkdir /configs/conf1
   [junit4]   2> 799575 INFO  (coreLoadExecutor-2800-thread-1) [    ] o.a.s.c.CoreContainer registering core: collection1
   [junit4]   2> 799575 INFO  (coreZkRegister-2795-thread-1) [    ] o.a.s.c.ZkController Register replica - core:collection1 address:http://127.0.0.1:42075 collection:collection1 shard:shard2
   [junit4]   2> 799575 INFO  (coreZkRegister-2795-thread-1) [    ] o.a.s.c.c.SolrZkClient makePath: /collections/collection1/leader_elect/shard2/election
   [junit4]   2> 799577 INFO  (coreZkRegister-2795-thread-1) [    ] o.a.s.c.LeaderElector Joined leadership election with path: /collections/collection1/leader_elect/shard2/election/95585765018304520-core_node1-n_0000000000
   [junit4]   2> 799577 INFO  (coreZkRegister-2795-thread-1) [    ] o.a.s.c.ShardLeaderElectionContext Running the leader process for shard=shard2 and weAreReplacement=false and leaderVoteWait=180000
   [junit4]   2> 799578 INFO  (coreZkRegister-2795-thread-1) [    ] o.a.s.c.ShardLeaderElectionContext Enough replicas found to continue.
   [junit4]   2> 799578 INFO  (coreZkRegister-2795-thread-1) [    ] o.a.s.c.ShardLeaderElectionContext I may be the new leader - try and sync
   [junit4]   2> 799578 INFO  (coreZkRegister-2795-thread-1) [    ] o.a.s.c.SyncStrategy Sync replicas to http://127.0.0.1:42075/collection1/
   [junit4]   2> 799578 INFO  (coreZkRegister-2795-thread-1) [    ] o.a.s.c.SyncStrategy Sync Success - now sync replicas to me
   [junit4]   2> 799578 INFO  (coreZkRegister-2795-thread-1) [    ] o.a.s.c.SyncStrategy http://127.0.0.1:42075/collection1/ has no replicas
   [junit4]   2> 799578 INFO  (OverseerStateUpdate-95585765018304516-127.0.0.1:42411_-n_0000000000) [    ] o.a.s.c.Overseer processMessage: queueSize: 1, message = {
   [junit4]   2>   "operation":"leader",
   [junit4]   2>   "shard":"shard2",
   [junit4]   2>   "collection":"collection1"} current state version: 5
   [junit4]   2> 799579 INFO  (coreZkRegister-2795-thread-1) [    ] o.a.s.c.c.SolrZkClient makePath: /collections/collection1/leaders/shard2
   [junit4]   2> 799581 INFO  (coreZkRegister-2795-thread-1) [    ] o.a.s.c.ShardLeaderElectionContextBase Creating leader registration node /collections/collection1/leaders/shard2/leader after winning as /collections/collection1/leader_elect/shard2/election/95585765018304520-core_node1-n_0000000000
   [junit4]   2> 799581 INFO  (coreZkRegister-2795-thread-1) [    ] o.a.s.c.ShardLeaderElectionContext I am the new leader: http://127.0.0.1:42075/collection1/ shard2
   [junit4]   2> 799582 INFO  (OverseerStateUpdate-95585765018304516-127.0.0.1:42411_-n_0000000000) [    ] o.a.s.c.Overseer processMessage: queueSize: 1, message = {
   [junit4]   2>   "operation":"leader",
   [junit4]   2>   "shard":"shard2",
   [junit4]   2>   "collection":"collection1",
   [junit4]   2>   "base_url":"http://127.0.0.1:42075",
   [junit4]   2>   "core":"collection1",
   [junit4]   2>   "state":"active"} current state version: 5
   [junit4]   2> 799683 INFO  (zkCallback-857-thread-1) [    ] o.a.s.c.c.ZkStateReader A cluster state change: [WatchedEvent state:SyncConnected type:NodeDataChanged path:/clusterstate.json], has occurred - updating... (live nodes size: [2])
   [junit4]   2> 799683 INFO  (zkCallback-862-thread-1) [    ] o.a.s.c.c.ZkStateReader A cluster state change: [WatchedEvent state:SyncConnected type:NodeDataChanged path:/clusterstate.json], has occurred - updating... (live nodes size: [2])
   [junit4]   2> 799683 INFO  (zkCallback-855-thread-1) [    ] o.a.s.c.c.ZkStateReader A cluster state change: [WatchedEvent state:SyncConnected type:NodeDataChanged path:/clusterstate.json], has occurred - updating... (live nodes size: [2])
   [junit4]   2> 799732 INFO  (coreZkRegister-2795-thread-1) [    ] o.a.s.c.ZkController We are http://127.0.0.1:42075/collection1/ and leader is http://127.0.0.1:42075/collection1/
   [junit4]   2> 799732 INFO  (coreZkRegister-2795-thread-1) [    ] o.a.s.c.ZkController No LogReplay needed for core=collection1 baseURL=http://127.0.0.1:42075
   [junit4]   2> 799732 INFO  (coreZkRegister-2795-thread-1) [    ] o.a.s.c.ZkController I am the leader, no recovery necessary
   [junit4]   2> 799732 INFO  (coreZkRegister-2795-thread-1) [    ] o.a.s.c.ZkController publishing state=active
   [junit4]   2> 799732 INFO  (coreZkRegister-2795-thread-1) [    ] o.a.s.c.ZkController numShards not found on descriptor - reading it from system property
   [junit4]   2> 799733 INFO  (OverseerStateUpdate-95585765018304516-127.0.0.1:42411_-n_0000000000) [    ] o.a.s.c.Overseer processMessage: queueSize: 1, message = {
   [junit4]   2>   "core":"collection1",
   [junit4]   2>   "core_node_name":"core_node1",
   [junit4]   2>   "roles":null,
   [junit4]   2>   "base_url":"http://127.0.0.1:42075",
   [junit4]   2>   "node_name":"127.0.0.1:42075_",
   [junit4]   2>   "numShards":"2",
   [junit4]   2>   "state":"active",
   [junit4]   2>   "shard":"shard2",
   [junit4]   2>   "collection":"collection1",
   [junit4]   2>   "operation":"state"} current state version: 6
   [junit4]   2> 799734 INFO  (OverseerStateUpdate-95585765018304516-127.0.0.1:42411_-n_0000000000) [    ] o.a.s.c.o.ReplicaMutator Update state numShards=2 message={
   [junit4]   2>   "core":"collection1",
   [junit4]   2>   "core_node_name":"core_node1",
   [junit4]   2>   "roles":null,
   [junit4]   2>   "base_url":"http://127.0.0.1:42075",
   [junit4]   2>   "node_name":"127.0.0.1:42075_",
   [junit4]   2>   "numShards":"2",
   [junit4]   2>   "state":"active",
   [junit4]   2>   "shard":"shard2",
   [junit4]   2>   "collection":"collection1",
   [junit4]   2>   "operation":"state"}
   [junit4]   2> 799836 INFO  (zkCallback-862-thread-1) [    ] o.a.s.c.c.ZkStateReader A cluster state change: [WatchedEvent state:SyncConnected type:NodeDataChanged path:/clusterstate.json], has occurred - updating... (live nodes size: [2])
   [junit4]   2> 799836 INFO  (zkCallback-857-thread-1) [    ] o.a.s.c.c.ZkStateReader A cluster state change: [WatchedEvent state:SyncConnected type:NodeDataChanged path:/clusterstate.json], has occurred - updating... (live nodes size: [2])
   [junit4]   2> 799836 INFO  (zkCallback-855-thread-1) [    ] o.a.s.c.c.ZkStateReader A cluster state change: [WatchedEvent state:SyncConnected type:NodeDataChanged path:/clusterstate.json], has occurred - updating... (live nodes size: [2])
   [junit4]   2> 799992 INFO  (TEST-UnloadDistributedZkTest.test-seed#[97BB640442BEF917]) [    ] o.a.s.SolrTestCaseJ4 Writing core.properties file to /home/jenkins/workspace/Lucene-Solr-6.x-Linux/solr/build/solr-core/test/J2/temp/solr.cloud.UnloadDistributedZkTest_97BB640442BEF917-001/shard-2-001/cores/collection1
   [junit4]   2> 799993 INFO  (TEST-UnloadDistributedZkTest.test-seed#[97BB640442BEF917]) [    ] o.a.s.c.AbstractFullDistribZkTestBase create jetty 2 in directory /home/jenkins/workspace/Lucene-Solr-6.x-Linux/solr/build/solr-core/test/J2/temp/solr.cloud.UnloadDistributedZkTest_97BB640442BEF917-001/shard-2-001
   [junit4]   2> 799994 INFO  (TEST-UnloadDistributedZkTest.test-seed#[97BB640442BEF917]) [    ] o.e.j.s.Server jetty-9.3.8.v20160314
   [junit4]   2> 799995 INFO  (TEST-UnloadDistributedZkTest.test-seed#[97BB640442BEF917]) [    ] o.e.j.s.h.ContextHandler Started o.e.j.s.ServletContextHandler@138daaa{/,null,AVAILABLE}
   [junit4]   2> 799996 INFO  (TEST-UnloadDistributedZkTest.test-seed#[97BB640442BEF917]) [    ] o.e.j.s.ServerConnector Started ServerConnector@1f5aa9e{HTTP/1.1,[http/1.1]}{127.0.0.1:42940}
   [junit4]   2> 799996 INFO  (TEST-UnloadDistributedZkTest.test-seed#[97BB640442BEF917]) [    ] o.e.j.s.Server Started @801885ms
   [junit4]   2> 799996 INFO  (TEST-UnloadDistributedZkTest.test-seed#[97BB640442BEF917]) [    ] o.a.s.c.s.e.JettySolrRunner Jetty properties: {solr.data.dir=/home/jenkins/workspace/Lucene-Solr-6.x-Linux/solr/build/s

[...truncated too long message...]

etInputBuffer.java:84)
   [junit4]    > 	at org.apache.http.impl.io.AbstractSessionInputBuffer.readLine(AbstractSessionInputBuffer.java:273)
   [junit4]    > 	at org.apache.http.impl.conn.DefaultHttpResponseParser.parseHead(DefaultHttpResponseParser.java:140)
   [junit4]    > 	at org.apache.http.impl.conn.DefaultHttpResponseParser.parseHead(DefaultHttpResponseParser.java:57)
   [junit4]    > 	at org.apache.http.impl.io.AbstractMessageParser.parse(AbstractMessageParser.java:261)
   [junit4]    > 	at org.apache.http.impl.AbstractHttpClientConnection.receiveResponseHeader(AbstractHttpClientConnection.java:283)
   [junit4]    > 	at org.apache.http.impl.conn.DefaultClientConnection.receiveResponseHeader(DefaultClientConnection.java:251)
   [junit4]    > 	at org.apache.http.impl.conn.ManagedClientConnectionImpl.receiveResponseHeader(ManagedClientConnectionImpl.java:197)
   [junit4]    > 	at org.apache.http.protocol.HttpRequestExecutor.doReceiveResponse(HttpRequestExecutor.java:272)
   [junit4]    > 	at org.apache.http.protocol.HttpRequestExecutor.execute(HttpRequestExecutor.java:124)
   [junit4]    > 	at org.apache.http.impl.client.DefaultRequestDirector.tryExecute(DefaultRequestDirector.java:685)
   [junit4]    > 	at org.apache.http.impl.client.DefaultRequestDirector.execute(DefaultRequestDirector.java:487)
   [junit4]    > 	at org.apache.http.impl.client.AbstractHttpClient.doExecute(AbstractHttpClient.java:882)
   [junit4]    > 	at org.apache.http.impl.client.CloseableHttpClient.execute(CloseableHttpClient.java:82)
   [junit4]    > 	at org.apache.http.impl.client.CloseableHttpClient.execute(CloseableHttpClient.java:107)
   [junit4]    > 	at org.apache.http.impl.client.CloseableHttpClient.execute(CloseableHttpClient.java:55)
   [junit4]    > 	at org.apache.solr.client.solrj.impl.HttpSolrClient.executeMethod(HttpSolrClient.java:482)
   [junit4]    > 	... 8 moreThrowable #6: com.carrotsearch.randomizedtesting.UncaughtExceptionError: Captured an uncaught exception in thread: Thread[id=6486, name=testExecutor-2867-thread-11, state=RUNNABLE, group=TGRP-UnloadDistributedZkTest]
   [junit4]    > Caused by: java.lang.RuntimeException: org.apache.solr.client.solrj.SolrServerException: Timeout occured while waiting response from server at: http://127.0.0.1:34579
   [junit4]    > 	at __randomizedtesting.SeedInfo.seed([97BB640442BEF917]:0)
   [junit4]    > 	at org.apache.solr.cloud.BasicDistributedZkTest.lambda$createCores$0(BasicDistributedZkTest.java:583)
   [junit4]    > 	at org.apache.solr.common.util.ExecutorUtil$MDCAwareThreadPoolExecutor.lambda$execute$0(ExecutorUtil.java:229)
   [junit4]    > 	at java.util.concurrent.ThreadPoolExecutor.runWorker(java.base@9-ea/ThreadPoolExecutor.java:1158)
   [junit4]    > 	at java.util.concurrent.ThreadPoolExecutor$Worker.run(java.base@9-ea/ThreadPoolExecutor.java:632)
   [junit4]    > 	at java.lang.Thread.run(java.base@9-ea/Thread.java:804)
   [junit4]    > Caused by: org.apache.solr.client.solrj.SolrServerException: Timeout occured while waiting response from server at: http://127.0.0.1:34579
   [junit4]    > 	at org.apache.solr.client.solrj.impl.HttpSolrClient.executeMethod(HttpSolrClient.java:588)
   [junit4]    > 	at org.apache.solr.client.solrj.impl.HttpSolrClient.request(HttpSolrClient.java:241)
   [junit4]    > 	at org.apache.solr.client.solrj.impl.HttpSolrClient.request(HttpSolrClient.java:230)
   [junit4]    > 	at org.apache.solr.client.solrj.SolrClient.request(SolrClient.java:1219)
   [junit4]    > 	at org.apache.solr.cloud.BasicDistributedZkTest.lambda$createCores$0(BasicDistributedZkTest.java:581)
   [junit4]    > 	... 4 more
   [junit4]    > Caused by: java.net.SocketTimeoutException: Read timed out
   [junit4]    > 	at java.net.SocketInputStream.socketRead0(java.base@9-ea/Native Method)
   [junit4]    > 	at java.net.SocketInputStream.socketRead(java.base@9-ea/SocketInputStream.java:116)
   [junit4]    > 	at java.net.SocketInputStream.read(java.base@9-ea/SocketInputStream.java:170)
   [junit4]    > 	at java.net.SocketInputStream.read(java.base@9-ea/SocketInputStream.java:141)
   [junit4]    > 	at org.apache.http.impl.io.AbstractSessionInputBuffer.fillBuffer(AbstractSessionInputBuffer.java:160)
   [junit4]    > 	at org.apache.http.impl.io.SocketInputBuffer.fillBuffer(SocketInputBuffer.java:84)
   [junit4]    > 	at org.apache.http.impl.io.AbstractSessionInputBuffer.readLine(AbstractSessionInputBuffer.java:273)
   [junit4]    > 	at org.apache.http.impl.conn.DefaultHttpResponseParser.parseHead(DefaultHttpResponseParser.java:140)
   [junit4]    > 	at org.apache.http.impl.conn.DefaultHttpResponseParser.parseHead(DefaultHttpResponseParser.java:57)
   [junit4]    > 	at org.apache.http.impl.io.AbstractMessageParser.parse(AbstractMessageParser.java:261)
   [junit4]    > 	at org.apache.http.impl.AbstractHttpClientConnection.receiveResponseHeader(AbstractHttpClientConnection.java:283)
   [junit4]    > 	at org.apache.http.impl.conn.DefaultClientConnection.receiveResponseHeader(DefaultClientConnection.java:251)
   [junit4]    > 	at org.apache.http.impl.conn.ManagedClientConnectionImpl.receiveResponseHeader(ManagedClientConnectionImpl.java:197)
   [junit4]    > 	at org.apache.http.protocol.HttpRequestExecutor.doReceiveResponse(HttpRequestExecutor.java:272)
   [junit4]    > 	at org.apache.http.protocol.HttpRequestExecutor.execute(HttpRequestExecutor.java:124)
   [junit4]    > 	at org.apache.http.impl.client.DefaultRequestDirector.tryExecute(DefaultRequestDirector.java:685)
   [junit4]    > 	at org.apache.http.impl.client.DefaultRequestDirector.execute(DefaultRequestDirector.java:487)
   [junit4]    > 	at org.apache.http.impl.client.AbstractHttpClient.doExecute(AbstractHttpClient.java:882)
   [junit4]    > 	at org.apache.http.impl.client.CloseableHttpClient.execute(CloseableHttpClient.java:82)
   [junit4]    > 	at org.apache.http.impl.client.CloseableHttpClient.execute(CloseableHttpClient.java:107)
   [junit4]    > 	at org.apache.http.impl.client.CloseableHttpClient.execute(CloseableHttpClient.java:55)
   [junit4]    > 	at org.apache.solr.client.solrj.impl.HttpSolrClient.executeMethod(HttpSolrClient.java:482)
   [junit4]    > 	... 8 more
   [junit4]   2> 929247 INFO  (SUITE-UnloadDistributedZkTest-seed#[97BB640442BEF917]-worker) [    ] o.a.s.SolrTestCaseJ4 ###deleteCore
   [junit4]   2> Mar 21, 2016 1:19:19 AM com.carrotsearch.randomizedtesting.ThreadLeakControl checkThreadLeaks
   [junit4]   2> WARNING: Will linger awaiting termination of 1 leaked thread(s).
   [junit4]   2> NOTE: test params are: codec=Lucene60, sim=RandomSimilarity(queryNorm=false,coord=crazy): {}, locale=or, timezone=Europe/Rome
   [junit4]   2> NOTE: Linux 4.2.0-34-generic i386/Oracle Corporation 9-ea (32-bit)/cpus=12,threads=1,free=102032592,total=291241984
   [junit4]   2> NOTE: All tests run in this JVM: [TestOrdValues, TestFieldSortValues, HighlighterMaxOffsetTest, UpdateParamsTest, TestFuzzyAnalyzedSuggestions, TestSuggestSpellingConverter, CollectionsAPISolrJTest, SortSpecParsingTest, ConnectionManagerTest, TermVectorComponentDistributedTest, TestUtils, TestTestInjection, OverseerCollectionConfigSetProcessorTest, DeleteLastCustomShardedReplicaTest, BinaryUpdateRequestHandlerTest, MultiThreadedOCPTest, SearchHandlerTest, SuggesterWFSTTest, TestRecoveryHdfs, TestXIncludeConfig, TestIndexSearcher, TestGroupingSearch, TestUseDocValuesAsStored2, TestStressReorder, HdfsTlogReplayBufferedWhileIndexingTest, TestCloudDeleteByQuery, SliceStateTest, PKIAuthenticationIntegrationTest, SuggesterTest, TestReloadAndDeleteDocs, TestPerFieldSimilarityClassic, TestRebalanceLeaders, DebugComponentTest, TestRequestStatusCollectionAPI, SimpleFacetsTest, ForceLeaderTest, LeaderInitiatedRecoveryOnCommitTest, StressHdfsTest, TestJsonRequest, NoCacheHeaderTest, TestReqParamsAPI, TestConfigSetsAPIZkFailure, ClusterStateTest, TestSolrQueryParserResource, TestTolerantSearch, CleanupOldIndexTest, ConjunctionSolrSpellCheckerTest, BlockCacheTest, AssignTest, AnalysisErrorHandlingTest, DistribJoinFromCollectionTest, LukeRequestHandlerTest, TestInfoStreamLogging, TestDefaultStatsCache, TestPostingsSolrHighlighter, TestCollectionAPI, TestConfigSets, TestDownShardTolerantSearch, SuggesterTSTTest, FullSolrCloudDistribCmdsTest, CoreAdminHandlerTest, TestDocBasedVersionConstraints, SolrCoreCheckLockOnStartupTest, DateRangeFieldTest, LeaderElectionTest, TestCharFilters, TestInitQParser, TestConfigOverlay, TestJmxIntegration, TestSolrCloudWithKerberosAlt, CursorMarkTest, TestSolrQueryParser, OverseerTaskQueueTest, TestRuleBasedAuthorizationPlugin, DirectUpdateHandlerTest, TestSolrDeletionPolicy1, TestSimpleQParserPlugin, UnloadDistributedZkTest]
   [junit4] Completed [232/581 (1!)] on J2 in 134.42s, 1 test, 1 error <<< FAILURES!

[...truncated 1159 lines...]
BUILD FAILED
/home/jenkins/workspace/Lucene-Solr-6.x-Linux/build.xml:740: The following error occurred while executing this line:
/home/jenkins/workspace/Lucene-Solr-6.x-Linux/build.xml:684: The following error occurred while executing this line:
/home/jenkins/workspace/Lucene-Solr-6.x-Linux/build.xml:59: The following error occurred while executing this line:
/home/jenkins/workspace/Lucene-Solr-6.x-Linux/solr/build.xml:233: The following error occurred while executing this line:
/home/jenkins/workspace/Lucene-Solr-6.x-Linux/solr/common-build.xml:529: The following error occurred while executing this line:
/home/jenkins/workspace/Lucene-Solr-6.x-Linux/lucene/common-build.xml:1457: The following error occurred while executing this line:
/home/jenkins/workspace/Lucene-Solr-6.x-Linux/lucene/common-build.xml:1014: There were test failures: 581 suites (10 ignored), 2330 tests, 1 error, 117 ignored (70 assumptions) [seed: 97BB640442BEF917]

Total time: 59 minutes 6 seconds
Build step 'Invoke Ant' marked build as failure
Archiving artifacts
[WARNINGS] Skipping publisher since build result is FAILURE
Recording test results
Email was triggered for: Failure - Any
Sending email for trigger: Failure - Any



Mime
View raw message