lucene-dev mailing list archives

Site index · List index
Message view « Date » · « Thread »
Top « Date » · « Thread »
From Policeman Jenkins Server <jenk...@thetaphi.de>
Subject [JENKINS] Lucene-Solr-trunk-Linux (64bit/jdk1.8.0_72) - Build # 16006 - Still Failing!
Date Fri, 26 Feb 2016 07:18:04 GMT
Build: http://jenkins.thetaphi.de/job/Lucene-Solr-trunk-Linux/16006/
Java: 64bit/jdk1.8.0_72 -XX:+UseCompressedOops -XX:+UseParallelGC

6 tests failed.
FAILED:  org.apache.solr.cloud.UnloadDistributedZkTest.test

Error Message:
Captured an uncaught exception in thread: Thread[id=7046, name=testExecutor-3547-thread-10, state=RUNNABLE, group=TGRP-UnloadDistributedZkTest]

Stack Trace:
com.carrotsearch.randomizedtesting.UncaughtExceptionError: Captured an uncaught exception in thread: Thread[id=7046, name=testExecutor-3547-thread-10, state=RUNNABLE, group=TGRP-UnloadDistributedZkTest]
	at __randomizedtesting.SeedInfo.seed([76F638A1B73C9AAE:FEA2077B19C0F756]:0)
Caused by: java.lang.RuntimeException: org.apache.solr.client.solrj.SolrServerException: Timeout occured while waiting response from server at: http://127.0.0.1:37025/fex
	at __randomizedtesting.SeedInfo.seed([76F638A1B73C9AAE]:0)
	at org.apache.solr.cloud.BasicDistributedZkTest$1.run(BasicDistributedZkTest.java:586)
	at org.apache.solr.common.util.ExecutorUtil$MDCAwareThreadPoolExecutor$1.run(ExecutorUtil.java:231)
	at java.util.concurrent.ThreadPoolExecutor.runWorker(ThreadPoolExecutor.java:1142)
	at java.util.concurrent.ThreadPoolExecutor$Worker.run(ThreadPoolExecutor.java:617)
	at java.lang.Thread.run(Thread.java:745)
Caused by: org.apache.solr.client.solrj.SolrServerException: Timeout occured while waiting response from server at: http://127.0.0.1:37025/fex
	at org.apache.solr.client.solrj.impl.HttpSolrClient.executeMethod(HttpSolrClient.java:588)
	at org.apache.solr.client.solrj.impl.HttpSolrClient.request(HttpSolrClient.java:241)
	at org.apache.solr.client.solrj.impl.HttpSolrClient.request(HttpSolrClient.java:230)
	at org.apache.solr.client.solrj.SolrClient.request(SolrClient.java:1219)
	at org.apache.solr.cloud.BasicDistributedZkTest$1.run(BasicDistributedZkTest.java:584)
	... 4 more
Caused by: java.net.SocketTimeoutException: Read timed out
	at java.net.SocketInputStream.socketRead0(Native Method)
	at java.net.SocketInputStream.socketRead(SocketInputStream.java:116)
	at java.net.SocketInputStream.read(SocketInputStream.java:170)
	at java.net.SocketInputStream.read(SocketInputStream.java:141)
	at org.apache.http.impl.io.AbstractSessionInputBuffer.fillBuffer(AbstractSessionInputBuffer.java:160)
	at org.apache.http.impl.io.SocketInputBuffer.fillBuffer(SocketInputBuffer.java:84)
	at org.apache.http.impl.io.AbstractSessionInputBuffer.readLine(AbstractSessionInputBuffer.java:273)
	at org.apache.http.impl.conn.DefaultHttpResponseParser.parseHead(DefaultHttpResponseParser.java:140)
	at org.apache.http.impl.conn.DefaultHttpResponseParser.parseHead(DefaultHttpResponseParser.java:57)
	at org.apache.http.impl.io.AbstractMessageParser.parse(AbstractMessageParser.java:261)
	at org.apache.http.impl.AbstractHttpClientConnection.receiveResponseHeader(AbstractHttpClientConnection.java:283)
	at org.apache.http.impl.conn.DefaultClientConnection.receiveResponseHeader(DefaultClientConnection.java:251)
	at org.apache.http.impl.conn.ManagedClientConnectionImpl.receiveResponseHeader(ManagedClientConnectionImpl.java:197)
	at org.apache.http.protocol.HttpRequestExecutor.doReceiveResponse(HttpRequestExecutor.java:272)
	at org.apache.http.protocol.HttpRequestExecutor.execute(HttpRequestExecutor.java:124)
	at org.apache.http.impl.client.DefaultRequestDirector.tryExecute(DefaultRequestDirector.java:685)
	at org.apache.http.impl.client.DefaultRequestDirector.execute(DefaultRequestDirector.java:487)
	at org.apache.http.impl.client.AbstractHttpClient.doExecute(AbstractHttpClient.java:882)
	at org.apache.http.impl.client.CloseableHttpClient.execute(CloseableHttpClient.java:82)
	at org.apache.http.impl.client.CloseableHttpClient.execute(CloseableHttpClient.java:107)
	at org.apache.http.impl.client.CloseableHttpClient.execute(CloseableHttpClient.java:55)
	at org.apache.solr.client.solrj.impl.HttpSolrClient.executeMethod(HttpSolrClient.java:482)
	... 8 more


FAILED:  org.apache.solr.cloud.CollectionStateFormat2Test.test

Error Message:
No live SolrServers available to handle this request:[http://127.0.0.1:41464, http://127.0.0.1:60878, http://127.0.0.1:55791, http://127.0.0.1:34595, http://127.0.0.1:51401]

Stack Trace:
org.apache.solr.client.solrj.SolrServerException: No live SolrServers available to handle this request:[http://127.0.0.1:41464, http://127.0.0.1:60878, http://127.0.0.1:55791, http://127.0.0.1:34595, http://127.0.0.1:51401]
	at __randomizedtesting.SeedInfo.seed([76F638A1B73C9AAE:FEA2077B19C0F756]:0)
	at org.apache.solr.client.solrj.impl.LBHttpSolrClient.request(LBHttpSolrClient.java:352)
	at org.apache.solr.client.solrj.impl.CloudSolrClient.sendRequest(CloudSolrClient.java:1100)
	at org.apache.solr.client.solrj.impl.CloudSolrClient.requestWithRetryOnStaleState(CloudSolrClient.java:870)
	at org.apache.solr.client.solrj.impl.CloudSolrClient.request(CloudSolrClient.java:806)
	at org.apache.solr.client.solrj.SolrClient.request(SolrClient.java:1219)
	at org.apache.solr.cloud.AbstractFullDistribZkTestBase.createCollection(AbstractFullDistribZkTestBase.java:1593)
	at org.apache.solr.cloud.AbstractFullDistribZkTestBase.createCollection(AbstractFullDistribZkTestBase.java:1547)
	at org.apache.solr.cloud.AbstractFullDistribZkTestBase.createCollection(AbstractFullDistribZkTestBase.java:1808)
	at org.apache.solr.cloud.CollectionStateFormat2Test.testConfNameAndCollectionNameSame(CollectionStateFormat2Test.java:52)
	at org.apache.solr.cloud.CollectionStateFormat2Test.test(CollectionStateFormat2Test.java:40)
	at sun.reflect.NativeMethodAccessorImpl.invoke0(Native Method)
	at sun.reflect.NativeMethodAccessorImpl.invoke(NativeMethodAccessorImpl.java:62)
	at sun.reflect.DelegatingMethodAccessorImpl.invoke(DelegatingMethodAccessorImpl.java:43)
	at java.lang.reflect.Method.invoke(Method.java:498)
	at com.carrotsearch.randomizedtesting.RandomizedRunner.invoke(RandomizedRunner.java:1764)
	at com.carrotsearch.randomizedtesting.RandomizedRunner$8.evaluate(RandomizedRunner.java:871)
	at com.carrotsearch.randomizedtesting.RandomizedRunner$9.evaluate(RandomizedRunner.java:907)
	at com.carrotsearch.randomizedtesting.RandomizedRunner$10.evaluate(RandomizedRunner.java:921)
	at org.apache.solr.BaseDistributedSearchTestCase$ShardsRepeatRule$ShardsFixedStatement.callStatement(BaseDistributedSearchTestCase.java:996)
	at org.apache.solr.BaseDistributedSearchTestCase$ShardsRepeatRule$ShardsStatement.evaluate(BaseDistributedSearchTestCase.java:971)
	at com.carrotsearch.randomizedtesting.rules.SystemPropertiesRestoreRule$1.evaluate(SystemPropertiesRestoreRule.java:57)
	at org.apache.lucene.util.TestRuleSetupTeardownChained$1.evaluate(TestRuleSetupTeardownChained.java:49)
	at org.apache.lucene.util.AbstractBeforeAfterRule$1.evaluate(AbstractBeforeAfterRule.java:45)
	at org.apache.lucene.util.TestRuleThreadAndTestName$1.evaluate(TestRuleThreadAndTestName.java:48)
	at org.apache.lucene.util.TestRuleIgnoreAfterMaxFailures$1.evaluate(TestRuleIgnoreAfterMaxFailures.java:64)
	at org.apache.lucene.util.TestRuleMarkFailure$1.evaluate(TestRuleMarkFailure.java:47)
	at com.carrotsearch.randomizedtesting.rules.StatementAdapter.evaluate(StatementAdapter.java:36)
	at com.carrotsearch.randomizedtesting.ThreadLeakControl$StatementRunner.run(ThreadLeakControl.java:367)
	at com.carrotsearch.randomizedtesting.ThreadLeakControl.forkTimeoutingTask(ThreadLeakControl.java:809)
	at com.carrotsearch.randomizedtesting.ThreadLeakControl$3.evaluate(ThreadLeakControl.java:460)
	at com.carrotsearch.randomizedtesting.RandomizedRunner.runSingleTest(RandomizedRunner.java:880)
	at com.carrotsearch.randomizedtesting.RandomizedRunner$5.evaluate(RandomizedRunner.java:781)
	at com.carrotsearch.randomizedtesting.RandomizedRunner$6.evaluate(RandomizedRunner.java:816)
	at com.carrotsearch.randomizedtesting.RandomizedRunner$7.evaluate(RandomizedRunner.java:827)
	at com.carrotsearch.randomizedtesting.rules.StatementAdapter.evaluate(StatementAdapter.java:36)
	at com.carrotsearch.randomizedtesting.rules.SystemPropertiesRestoreRule$1.evaluate(SystemPropertiesRestoreRule.java:57)
	at org.apache.lucene.util.AbstractBeforeAfterRule$1.evaluate(AbstractBeforeAfterRule.java:45)
	at com.carrotsearch.randomizedtesting.rules.StatementAdapter.evaluate(StatementAdapter.java:36)
	at org.apache.lucene.util.TestRuleStoreClassName$1.evaluate(TestRuleStoreClassName.java:41)
	at com.carrotsearch.randomizedtesting.rules.NoShadowingOrOverridesOnMethodsRule$1.evaluate(NoShadowingOrOverridesOnMethodsRule.java:40)
	at com.carrotsearch.randomizedtesting.rules.NoShadowingOrOverridesOnMethodsRule$1.evaluate(NoShadowingOrOverridesOnMethodsRule.java:40)
	at com.carrotsearch.randomizedtesting.rules.StatementAdapter.evaluate(StatementAdapter.java:36)
	at com.carrotsearch.randomizedtesting.rules.StatementAdapter.evaluate(StatementAdapter.java:36)
	at com.carrotsearch.randomizedtesting.rules.StatementAdapter.evaluate(StatementAdapter.java:36)
	at org.apache.lucene.util.TestRuleAssertionsRequired$1.evaluate(TestRuleAssertionsRequired.java:53)
	at org.apache.lucene.util.TestRuleMarkFailure$1.evaluate(TestRuleMarkFailure.java:47)
	at org.apache.lucene.util.TestRuleIgnoreAfterMaxFailures$1.evaluate(TestRuleIgnoreAfterMaxFailures.java:64)
	at org.apache.lucene.util.TestRuleIgnoreTestSuites$1.evaluate(TestRuleIgnoreTestSuites.java:54)
	at com.carrotsearch.randomizedtesting.rules.StatementAdapter.evaluate(StatementAdapter.java:36)
	at com.carrotsearch.randomizedtesting.ThreadLeakControl$StatementRunner.run(ThreadLeakControl.java:367)
	at java.lang.Thread.run(Thread.java:745)
Caused by: org.apache.solr.client.solrj.impl.HttpSolrClient$RemoteSolrException: Error from server at http://127.0.0.1:41464: java.lang.NullPointerException
	at org.apache.commons.io.IOUtils.copyLarge(IOUtils.java:1792)
	at org.apache.commons.io.IOUtils.copyLarge(IOUtils.java:1769)
	at org.apache.commons.io.IOUtils.copy(IOUtils.java:1744)
	at org.apache.commons.io.IOUtils.toByteArray(IOUtils.java:462)
	at org.apache.solr.handler.admin.CollectionsHandler$CollectionOperation$1.createSysConfigSet(CollectionsHandler.java:385)
	at org.apache.solr.handler.admin.CollectionsHandler$CollectionOperation$1.call(CollectionsHandler.java:366)
	at org.apache.solr.handler.admin.CollectionsHandler.handleRequestBody(CollectionsHandler.java:188)
	at org.apache.solr.handler.RequestHandlerBase.handleRequest(RequestHandlerBase.java:155)
	at org.apache.solr.servlet.HttpSolrCall.handleAdminRequest(HttpSolrCall.java:655)
	at org.apache.solr.servlet.HttpSolrCall.call(HttpSolrCall.java:438)
	at org.apache.solr.servlet.SolrDispatchFilter.doFilter(SolrDispatchFilter.java:229)
	at org.apache.solr.servlet.SolrDispatchFilter.doFilter(SolrDispatchFilter.java:184)
	at org.eclipse.jetty.servlet.ServletHandler$CachedChain.doFilter(ServletHandler.java:1668)
	at org.apache.solr.client.solrj.embedded.JettySolrRunner$DebugFilter.doFilter(JettySolrRunner.java:109)
	at org.eclipse.jetty.servlet.ServletHandler$CachedChain.doFilter(ServletHandler.java:1668)
	at org.eclipse.jetty.servlet.ServletHandler.doHandle(ServletHandler.java:581)
	at org.eclipse.jetty.server.session.SessionHandler.doHandle(SessionHandler.java:224)
	at org.eclipse.jetty.server.handler.ContextHandler.doHandle(ContextHandler.java:1158)
	at org.eclipse.jetty.servlet.ServletHandler.doScope(ServletHandler.java:511)
	at org.eclipse.jetty.server.session.SessionHandler.doScope(SessionHandler.java:185)
	at org.eclipse.jetty.server.handler.ContextHandler.doScope(ContextHandler.java:1090)
	at org.eclipse.jetty.server.handler.ScopedHandler.handle(ScopedHandler.java:141)
	at org.eclipse.jetty.server.handler.gzip.GzipHandler.handle(GzipHandler.java:437)
	at org.eclipse.jetty.server.handler.HandlerWrapper.handle(HandlerWrapper.java:119)
	at org.eclipse.jetty.server.Server.handle(Server.java:517)
	at org.eclipse.jetty.server.HttpChannel.handle(HttpChannel.java:308)
	at org.eclipse.jetty.server.HttpConnection.onFillable(HttpConnection.java:242)
	at org.eclipse.jetty.io.AbstractConnection$ReadCallback.succeeded(AbstractConnection.java:261)
	at org.eclipse.jetty.io.FillInterest.fillable(FillInterest.java:95)
	at org.eclipse.jetty.io.SelectChannelEndPoint$2.run(SelectChannelEndPoint.java:75)
	at org.eclipse.jetty.util.thread.strategy.ExecuteProduceConsume.produceAndRun(ExecuteProduceConsume.java:213)
	at org.eclipse.jetty.util.thread.strategy.ExecuteProduceConsume.run(ExecuteProduceConsume.java:147)
	at org.eclipse.jetty.util.thread.QueuedThreadPool.runJob(QueuedThreadPool.java:654)
	at org.eclipse.jetty.util.thread.QueuedThreadPool$3.run(QueuedThreadPool.java:572)
	at java.lang.Thread.run(Thread.java:745)

	at org.apache.solr.client.solrj.impl.HttpSolrClient.executeMethod(HttpSolrClient.java:577)
	at org.apache.solr.client.solrj.impl.HttpSolrClient.request(HttpSolrClient.java:241)
	at org.apache.solr.client.solrj.impl.HttpSolrClient.request(HttpSolrClient.java:230)
	at org.apache.solr.client.solrj.impl.LBHttpSolrClient.doRequest(LBHttpSolrClient.java:372)
	at org.apache.solr.client.solrj.impl.LBHttpSolrClient.request(LBHttpSolrClient.java:325)
	... 50 more


FAILED:  org.apache.solr.cloud.TestCryptoKeys.test

Error Message:
Error from server at http://127.0.0.1:43996/_sgy/j: java.lang.NullPointerException  at org.apache.commons.io.IOUtils.copyLarge(IOUtils.java:1792)  at org.apache.commons.io.IOUtils.copyLarge(IOUtils.java:1769)  at org.apache.commons.io.IOUtils.copy(IOUtils.java:1744)  at org.apache.commons.io.IOUtils.toByteArray(IOUtils.java:462)  at org.apache.solr.handler.admin.CollectionsHandler$CollectionOperation$1.createSysConfigSet(CollectionsHandler.java:385)  at org.apache.solr.handler.admin.CollectionsHandler$CollectionOperation$1.call(CollectionsHandler.java:366)  at org.apache.solr.handler.admin.CollectionsHandler.handleRequestBody(CollectionsHandler.java:188)  at org.apache.solr.handler.RequestHandlerBase.handleRequest(RequestHandlerBase.java:155)  at org.apache.solr.servlet.HttpSolrCall.handleAdminRequest(HttpSolrCall.java:655)  at org.apache.solr.servlet.HttpSolrCall.call(HttpSolrCall.java:438)  at org.apache.solr.servlet.SolrDispatchFilter.doFilter(SolrDispatchFilter.java:229)  at org.apache.solr.servlet.SolrDispatchFilter.doFilter(SolrDispatchFilter.java:184)  at org.eclipse.jetty.servlet.ServletHandler$CachedChain.doFilter(ServletHandler.java:1668)  at org.apache.solr.client.solrj.embedded.JettySolrRunner$DebugFilter.doFilter(JettySolrRunner.java:109)  at org.eclipse.jetty.servlet.ServletHandler$CachedChain.doFilter(ServletHandler.java:1668)  at org.eclipse.jetty.servlet.ServletHandler.doHandle(ServletHandler.java:581)  at org.eclipse.jetty.server.session.SessionHandler.doHandle(SessionHandler.java:224)  at org.eclipse.jetty.server.handler.ContextHandler.doHandle(ContextHandler.java:1158)  at org.eclipse.jetty.servlet.ServletHandler.doScope(ServletHandler.java:511)  at org.eclipse.jetty.server.session.SessionHandler.doScope(SessionHandler.java:185)  at org.eclipse.jetty.server.handler.ContextHandler.doScope(ContextHandler.java:1090)  at org.eclipse.jetty.server.handler.ScopedHandler.handle(ScopedHandler.java:141)  at org.eclipse.jetty.server.handler.gzip.GzipHandler.handle(GzipHandler.java:437)  at org.eclipse.jetty.server.handler.HandlerWrapper.handle(HandlerWrapper.java:119)  at org.eclipse.jetty.server.Server.handle(Server.java:517)  at org.eclipse.jetty.server.HttpChannel.handle(HttpChannel.java:308)  at org.eclipse.jetty.server.HttpConnection.onFillable(HttpConnection.java:242)  at org.eclipse.jetty.io.AbstractConnection$ReadCallback.succeeded(AbstractConnection.java:261)  at org.eclipse.jetty.io.FillInterest.fillable(FillInterest.java:95)  at org.eclipse.jetty.io.SelectChannelEndPoint$2.run(SelectChannelEndPoint.java:75)  at org.eclipse.jetty.util.thread.strategy.ExecuteProduceConsume.produceAndRun(ExecuteProduceConsume.java:213)  at org.eclipse.jetty.util.thread.strategy.ExecuteProduceConsume.run(ExecuteProduceConsume.java:147)  at org.eclipse.jetty.util.thread.QueuedThreadPool.runJob(QueuedThreadPool.java:654)  at org.eclipse.jetty.util.thread.QueuedThreadPool$3.run(QueuedThreadPool.java:572)  at java.lang.Thread.run(Thread.java:745) 

Stack Trace:
org.apache.solr.client.solrj.impl.HttpSolrClient$RemoteSolrException: Error from server at http://127.0.0.1:43996/_sgy/j: java.lang.NullPointerException
	at org.apache.commons.io.IOUtils.copyLarge(IOUtils.java:1792)
	at org.apache.commons.io.IOUtils.copyLarge(IOUtils.java:1769)
	at org.apache.commons.io.IOUtils.copy(IOUtils.java:1744)
	at org.apache.commons.io.IOUtils.toByteArray(IOUtils.java:462)
	at org.apache.solr.handler.admin.CollectionsHandler$CollectionOperation$1.createSysConfigSet(CollectionsHandler.java:385)
	at org.apache.solr.handler.admin.CollectionsHandler$CollectionOperation$1.call(CollectionsHandler.java:366)
	at org.apache.solr.handler.admin.CollectionsHandler.handleRequestBody(CollectionsHandler.java:188)
	at org.apache.solr.handler.RequestHandlerBase.handleRequest(RequestHandlerBase.java:155)
	at org.apache.solr.servlet.HttpSolrCall.handleAdminRequest(HttpSolrCall.java:655)
	at org.apache.solr.servlet.HttpSolrCall.call(HttpSolrCall.java:438)
	at org.apache.solr.servlet.SolrDispatchFilter.doFilter(SolrDispatchFilter.java:229)
	at org.apache.solr.servlet.SolrDispatchFilter.doFilter(SolrDispatchFilter.java:184)
	at org.eclipse.jetty.servlet.ServletHandler$CachedChain.doFilter(ServletHandler.java:1668)
	at org.apache.solr.client.solrj.embedded.JettySolrRunner$DebugFilter.doFilter(JettySolrRunner.java:109)
	at org.eclipse.jetty.servlet.ServletHandler$CachedChain.doFilter(ServletHandler.java:1668)
	at org.eclipse.jetty.servlet.ServletHandler.doHandle(ServletHandler.java:581)
	at org.eclipse.jetty.server.session.SessionHandler.doHandle(SessionHandler.java:224)
	at org.eclipse.jetty.server.handler.ContextHandler.doHandle(ContextHandler.java:1158)
	at org.eclipse.jetty.servlet.ServletHandler.doScope(ServletHandler.java:511)
	at org.eclipse.jetty.server.session.SessionHandler.doScope(SessionHandler.java:185)
	at org.eclipse.jetty.server.handler.ContextHandler.doScope(ContextHandler.java:1090)
	at org.eclipse.jetty.server.handler.ScopedHandler.handle(ScopedHandler.java:141)
	at org.eclipse.jetty.server.handler.gzip.GzipHandler.handle(GzipHandler.java:437)
	at org.eclipse.jetty.server.handler.HandlerWrapper.handle(HandlerWrapper.java:119)
	at org.eclipse.jetty.server.Server.handle(Server.java:517)
	at org.eclipse.jetty.server.HttpChannel.handle(HttpChannel.java:308)
	at org.eclipse.jetty.server.HttpConnection.onFillable(HttpConnection.java:242)
	at org.eclipse.jetty.io.AbstractConnection$ReadCallback.succeeded(AbstractConnection.java:261)
	at org.eclipse.jetty.io.FillInterest.fillable(FillInterest.java:95)
	at org.eclipse.jetty.io.SelectChannelEndPoint$2.run(SelectChannelEndPoint.java:75)
	at org.eclipse.jetty.util.thread.strategy.ExecuteProduceConsume.produceAndRun(ExecuteProduceConsume.java:213)
	at org.eclipse.jetty.util.thread.strategy.ExecuteProduceConsume.run(ExecuteProduceConsume.java:147)
	at org.eclipse.jetty.util.thread.QueuedThreadPool.runJob(QueuedThreadPool.java:654)
	at org.eclipse.jetty.util.thread.QueuedThreadPool$3.run(QueuedThreadPool.java:572)
	at java.lang.Thread.run(Thread.java:745)

	at __randomizedtesting.SeedInfo.seed([76F638A1B73C9AAE:FEA2077B19C0F756]:0)
	at org.apache.solr.client.solrj.impl.HttpSolrClient.executeMethod(HttpSolrClient.java:577)
	at org.apache.solr.client.solrj.impl.HttpSolrClient.request(HttpSolrClient.java:241)
	at org.apache.solr.client.solrj.impl.HttpSolrClient.request(HttpSolrClient.java:230)
	at org.apache.solr.client.solrj.SolrRequest.process(SolrRequest.java:149)
	at org.apache.solr.client.solrj.SolrRequest.process(SolrRequest.java:166)
	at org.apache.solr.handler.TestBlobHandler.createSystemCollection(TestBlobHandler.java:113)
	at org.apache.solr.cloud.TestCryptoKeys.test(TestCryptoKeys.java:122)
	at sun.reflect.NativeMethodAccessorImpl.invoke0(Native Method)
	at sun.reflect.NativeMethodAccessorImpl.invoke(NativeMethodAccessorImpl.java:62)
	at sun.reflect.DelegatingMethodAccessorImpl.invoke(DelegatingMethodAccessorImpl.java:43)
	at java.lang.reflect.Method.invoke(Method.java:498)
	at com.carrotsearch.randomizedtesting.RandomizedRunner.invoke(RandomizedRunner.java:1764)
	at com.carrotsearch.randomizedtesting.RandomizedRunner$8.evaluate(RandomizedRunner.java:871)
	at com.carrotsearch.randomizedtesting.RandomizedRunner$9.evaluate(RandomizedRunner.java:907)
	at com.carrotsearch.randomizedtesting.RandomizedRunner$10.evaluate(RandomizedRunner.java:921)
	at org.apache.solr.BaseDistributedSearchTestCase$ShardsRepeatRule$ShardsFixedStatement.callStatement(BaseDistributedSearchTestCase.java:996)
	at org.apache.solr.BaseDistributedSearchTestCase$ShardsRepeatRule$ShardsStatement.evaluate(BaseDistributedSearchTestCase.java:971)
	at com.carrotsearch.randomizedtesting.rules.SystemPropertiesRestoreRule$1.evaluate(SystemPropertiesRestoreRule.java:57)
	at org.apache.lucene.util.TestRuleSetupTeardownChained$1.evaluate(TestRuleSetupTeardownChained.java:49)
	at org.apache.lucene.util.AbstractBeforeAfterRule$1.evaluate(AbstractBeforeAfterRule.java:45)
	at org.apache.lucene.util.TestRuleThreadAndTestName$1.evaluate(TestRuleThreadAndTestName.java:48)
	at org.apache.lucene.util.TestRuleIgnoreAfterMaxFailures$1.evaluate(TestRuleIgnoreAfterMaxFailures.java:64)
	at org.apache.lucene.util.TestRuleMarkFailure$1.evaluate(TestRuleMarkFailure.java:47)
	at com.carrotsearch.randomizedtesting.rules.StatementAdapter.evaluate(StatementAdapter.java:36)
	at com.carrotsearch.randomizedtesting.ThreadLeakControl$StatementRunner.run(ThreadLeakControl.java:367)
	at com.carrotsearch.randomizedtesting.ThreadLeakControl.forkTimeoutingTask(ThreadLeakControl.java:809)
	at com.carrotsearch.randomizedtesting.ThreadLeakControl$3.evaluate(ThreadLeakControl.java:460)
	at com.carrotsearch.randomizedtesting.RandomizedRunner.runSingleTest(RandomizedRunner.java:880)
	at com.carrotsearch.randomizedtesting.RandomizedRunner$5.evaluate(RandomizedRunner.java:781)
	at com.carrotsearch.randomizedtesting.RandomizedRunner$6.evaluate(RandomizedRunner.java:816)
	at com.carrotsearch.randomizedtesting.RandomizedRunner$7.evaluate(RandomizedRunner.java:827)
	at com.carrotsearch.randomizedtesting.rules.StatementAdapter.evaluate(StatementAdapter.java:36)
	at com.carrotsearch.randomizedtesting.rules.SystemPropertiesRestoreRule$1.evaluate(SystemPropertiesRestoreRule.java:57)
	at org.apache.lucene.util.AbstractBeforeAfterRule$1.evaluate(AbstractBeforeAfterRule.java:45)
	at com.carrotsearch.randomizedtesting.rules.StatementAdapter.evaluate(StatementAdapter.java:36)
	at org.apache.lucene.util.TestRuleStoreClassName$1.evaluate(TestRuleStoreClassName.java:41)
	at com.carrotsearch.randomizedtesting.rules.NoShadowingOrOverridesOnMethodsRule$1.evaluate(NoShadowingOrOverridesOnMethodsRule.java:40)
	at com.carrotsearch.randomizedtesting.rules.NoShadowingOrOverridesOnMethodsRule$1.evaluate(NoShadowingOrOverridesOnMethodsRule.java:40)
	at com.carrotsearch.randomizedtesting.rules.StatementAdapter.evaluate(StatementAdapter.java:36)
	at com.carrotsearch.randomizedtesting.rules.StatementAdapter.evaluate(StatementAdapter.java:36)
	at com.carrotsearch.randomizedtesting.rules.StatementAdapter.evaluate(StatementAdapter.java:36)
	at org.apache.lucene.util.TestRuleAssertionsRequired$1.evaluate(TestRuleAssertionsRequired.java:53)
	at org.apache.lucene.util.TestRuleMarkFailure$1.evaluate(TestRuleMarkFailure.java:47)
	at org.apache.lucene.util.TestRuleIgnoreAfterMaxFailures$1.evaluate(TestRuleIgnoreAfterMaxFailures.java:64)
	at org.apache.lucene.util.TestRuleIgnoreTestSuites$1.evaluate(TestRuleIgnoreTestSuites.java:54)
	at com.carrotsearch.randomizedtesting.rules.StatementAdapter.evaluate(StatementAdapter.java:36)
	at com.carrotsearch.randomizedtesting.ThreadLeakControl$StatementRunner.run(ThreadLeakControl.java:367)
	at java.lang.Thread.run(Thread.java:745)


FAILED:  org.apache.solr.core.TestDynamicLoading.testDynamicLoading

Error Message:
Error from server at http://127.0.0.1:52355/_r/ne: java.lang.NullPointerException  at org.apache.commons.io.IOUtils.copyLarge(IOUtils.java:1792)  at org.apache.commons.io.IOUtils.copyLarge(IOUtils.java:1769)  at org.apache.commons.io.IOUtils.copy(IOUtils.java:1744)  at org.apache.commons.io.IOUtils.toByteArray(IOUtils.java:462)  at org.apache.solr.handler.admin.CollectionsHandler$CollectionOperation$1.createSysConfigSet(CollectionsHandler.java:385)  at org.apache.solr.handler.admin.CollectionsHandler$CollectionOperation$1.call(CollectionsHandler.java:366)  at org.apache.solr.handler.admin.CollectionsHandler.handleRequestBody(CollectionsHandler.java:188)  at org.apache.solr.handler.RequestHandlerBase.handleRequest(RequestHandlerBase.java:155)  at org.apache.solr.servlet.HttpSolrCall.handleAdminRequest(HttpSolrCall.java:655)  at org.apache.solr.servlet.HttpSolrCall.call(HttpSolrCall.java:438)  at org.apache.solr.servlet.SolrDispatchFilter.doFilter(SolrDispatchFilter.java:229)  at org.apache.solr.servlet.SolrDispatchFilter.doFilter(SolrDispatchFilter.java:184)  at org.eclipse.jetty.servlet.ServletHandler$CachedChain.doFilter(ServletHandler.java:1668)  at org.apache.solr.client.solrj.embedded.JettySolrRunner$DebugFilter.doFilter(JettySolrRunner.java:109)  at org.eclipse.jetty.servlet.ServletHandler$CachedChain.doFilter(ServletHandler.java:1668)  at org.eclipse.jetty.servlet.ServletHandler.doHandle(ServletHandler.java:581)  at org.eclipse.jetty.server.session.SessionHandler.doHandle(SessionHandler.java:224)  at org.eclipse.jetty.server.handler.ContextHandler.doHandle(ContextHandler.java:1158)  at org.eclipse.jetty.servlet.ServletHandler.doScope(ServletHandler.java:511)  at org.eclipse.jetty.server.session.SessionHandler.doScope(SessionHandler.java:185)  at org.eclipse.jetty.server.handler.ContextHandler.doScope(ContextHandler.java:1090)  at org.eclipse.jetty.server.handler.ScopedHandler.handle(ScopedHandler.java:141)  at org.eclipse.jetty.server.handler.gzip.GzipHandler.handle(GzipHandler.java:437)  at org.eclipse.jetty.server.handler.HandlerWrapper.handle(HandlerWrapper.java:119)  at org.eclipse.jetty.server.Server.handle(Server.java:517)  at org.eclipse.jetty.server.HttpChannel.handle(HttpChannel.java:308)  at org.eclipse.jetty.server.HttpConnection.onFillable(HttpConnection.java:242)  at org.eclipse.jetty.io.AbstractConnection$ReadCallback.succeeded(AbstractConnection.java:261)  at org.eclipse.jetty.io.FillInterest.fillable(FillInterest.java:95)  at org.eclipse.jetty.io.SelectChannelEndPoint$2.run(SelectChannelEndPoint.java:75)  at org.eclipse.jetty.util.thread.strategy.ExecuteProduceConsume.produceAndRun(ExecuteProduceConsume.java:213)  at org.eclipse.jetty.util.thread.strategy.ExecuteProduceConsume.run(ExecuteProduceConsume.java:147)  at org.eclipse.jetty.util.thread.QueuedThreadPool.runJob(QueuedThreadPool.java:654)  at org.eclipse.jetty.util.thread.QueuedThreadPool$3.run(QueuedThreadPool.java:572)  at java.lang.Thread.run(Thread.java:745) 

Stack Trace:
org.apache.solr.client.solrj.impl.HttpSolrClient$RemoteSolrException: Error from server at http://127.0.0.1:52355/_r/ne: java.lang.NullPointerException
	at org.apache.commons.io.IOUtils.copyLarge(IOUtils.java:1792)
	at org.apache.commons.io.IOUtils.copyLarge(IOUtils.java:1769)
	at org.apache.commons.io.IOUtils.copy(IOUtils.java:1744)
	at org.apache.commons.io.IOUtils.toByteArray(IOUtils.java:462)
	at org.apache.solr.handler.admin.CollectionsHandler$CollectionOperation$1.createSysConfigSet(CollectionsHandler.java:385)
	at org.apache.solr.handler.admin.CollectionsHandler$CollectionOperation$1.call(CollectionsHandler.java:366)
	at org.apache.solr.handler.admin.CollectionsHandler.handleRequestBody(CollectionsHandler.java:188)
	at org.apache.solr.handler.RequestHandlerBase.handleRequest(RequestHandlerBase.java:155)
	at org.apache.solr.servlet.HttpSolrCall.handleAdminRequest(HttpSolrCall.java:655)
	at org.apache.solr.servlet.HttpSolrCall.call(HttpSolrCall.java:438)
	at org.apache.solr.servlet.SolrDispatchFilter.doFilter(SolrDispatchFilter.java:229)
	at org.apache.solr.servlet.SolrDispatchFilter.doFilter(SolrDispatchFilter.java:184)
	at org.eclipse.jetty.servlet.ServletHandler$CachedChain.doFilter(ServletHandler.java:1668)
	at org.apache.solr.client.solrj.embedded.JettySolrRunner$DebugFilter.doFilter(JettySolrRunner.java:109)
	at org.eclipse.jetty.servlet.ServletHandler$CachedChain.doFilter(ServletHandler.java:1668)
	at org.eclipse.jetty.servlet.ServletHandler.doHandle(ServletHandler.java:581)
	at org.eclipse.jetty.server.session.SessionHandler.doHandle(SessionHandler.java:224)
	at org.eclipse.jetty.server.handler.ContextHandler.doHandle(ContextHandler.java:1158)
	at org.eclipse.jetty.servlet.ServletHandler.doScope(ServletHandler.java:511)
	at org.eclipse.jetty.server.session.SessionHandler.doScope(SessionHandler.java:185)
	at org.eclipse.jetty.server.handler.ContextHandler.doScope(ContextHandler.java:1090)
	at org.eclipse.jetty.server.handler.ScopedHandler.handle(ScopedHandler.java:141)
	at org.eclipse.jetty.server.handler.gzip.GzipHandler.handle(GzipHandler.java:437)
	at org.eclipse.jetty.server.handler.HandlerWrapper.handle(HandlerWrapper.java:119)
	at org.eclipse.jetty.server.Server.handle(Server.java:517)
	at org.eclipse.jetty.server.HttpChannel.handle(HttpChannel.java:308)
	at org.eclipse.jetty.server.HttpConnection.onFillable(HttpConnection.java:242)
	at org.eclipse.jetty.io.AbstractConnection$ReadCallback.succeeded(AbstractConnection.java:261)
	at org.eclipse.jetty.io.FillInterest.fillable(FillInterest.java:95)
	at org.eclipse.jetty.io.SelectChannelEndPoint$2.run(SelectChannelEndPoint.java:75)
	at org.eclipse.jetty.util.thread.strategy.ExecuteProduceConsume.produceAndRun(ExecuteProduceConsume.java:213)
	at org.eclipse.jetty.util.thread.strategy.ExecuteProduceConsume.run(ExecuteProduceConsume.java:147)
	at org.eclipse.jetty.util.thread.QueuedThreadPool.runJob(QueuedThreadPool.java:654)
	at org.eclipse.jetty.util.thread.QueuedThreadPool$3.run(QueuedThreadPool.java:572)
	at java.lang.Thread.run(Thread.java:745)

	at __randomizedtesting.SeedInfo.seed([76F638A1B73C9AAE:AEBB15F640E13F0E]:0)
	at org.apache.solr.client.solrj.impl.HttpSolrClient.executeMethod(HttpSolrClient.java:577)
	at org.apache.solr.client.solrj.impl.HttpSolrClient.request(HttpSolrClient.java:241)
	at org.apache.solr.client.solrj.impl.HttpSolrClient.request(HttpSolrClient.java:230)
	at org.apache.solr.client.solrj.SolrRequest.process(SolrRequest.java:149)
	at org.apache.solr.client.solrj.SolrRequest.process(SolrRequest.java:166)
	at org.apache.solr.handler.TestBlobHandler.createSystemCollection(TestBlobHandler.java:113)
	at org.apache.solr.core.TestDynamicLoading.testDynamicLoading(TestDynamicLoading.java:115)
	at sun.reflect.NativeMethodAccessorImpl.invoke0(Native Method)
	at sun.reflect.NativeMethodAccessorImpl.invoke(NativeMethodAccessorImpl.java:62)
	at sun.reflect.DelegatingMethodAccessorImpl.invoke(DelegatingMethodAccessorImpl.java:43)
	at java.lang.reflect.Method.invoke(Method.java:498)
	at com.carrotsearch.randomizedtesting.RandomizedRunner.invoke(RandomizedRunner.java:1764)
	at com.carrotsearch.randomizedtesting.RandomizedRunner$8.evaluate(RandomizedRunner.java:871)
	at com.carrotsearch.randomizedtesting.RandomizedRunner$9.evaluate(RandomizedRunner.java:907)
	at com.carrotsearch.randomizedtesting.RandomizedRunner$10.evaluate(RandomizedRunner.java:921)
	at org.apache.solr.BaseDistributedSearchTestCase$ShardsRepeatRule$ShardsFixedStatement.callStatement(BaseDistributedSearchTestCase.java:996)
	at org.apache.solr.BaseDistributedSearchTestCase$ShardsRepeatRule$ShardsStatement.evaluate(BaseDistributedSearchTestCase.java:971)
	at com.carrotsearch.randomizedtesting.rules.SystemPropertiesRestoreRule$1.evaluate(SystemPropertiesRestoreRule.java:57)
	at org.apache.lucene.util.TestRuleSetupTeardownChained$1.evaluate(TestRuleSetupTeardownChained.java:49)
	at org.apache.lucene.util.AbstractBeforeAfterRule$1.evaluate(AbstractBeforeAfterRule.java:45)
	at org.apache.lucene.util.TestRuleThreadAndTestName$1.evaluate(TestRuleThreadAndTestName.java:48)
	at org.apache.lucene.util.TestRuleIgnoreAfterMaxFailures$1.evaluate(TestRuleIgnoreAfterMaxFailures.java:64)
	at org.apache.lucene.util.TestRuleMarkFailure$1.evaluate(TestRuleMarkFailure.java:47)
	at com.carrotsearch.randomizedtesting.rules.StatementAdapter.evaluate(StatementAdapter.java:36)
	at com.carrotsearch.randomizedtesting.ThreadLeakControl$StatementRunner.run(ThreadLeakControl.java:367)
	at com.carrotsearch.randomizedtesting.ThreadLeakControl.forkTimeoutingTask(ThreadLeakControl.java:809)
	at com.carrotsearch.randomizedtesting.ThreadLeakControl$3.evaluate(ThreadLeakControl.java:460)
	at com.carrotsearch.randomizedtesting.RandomizedRunner.runSingleTest(RandomizedRunner.java:880)
	at com.carrotsearch.randomizedtesting.RandomizedRunner$5.evaluate(RandomizedRunner.java:781)
	at com.carrotsearch.randomizedtesting.RandomizedRunner$6.evaluate(RandomizedRunner.java:816)
	at com.carrotsearch.randomizedtesting.RandomizedRunner$7.evaluate(RandomizedRunner.java:827)
	at com.carrotsearch.randomizedtesting.rules.StatementAdapter.evaluate(StatementAdapter.java:36)
	at com.carrotsearch.randomizedtesting.rules.SystemPropertiesRestoreRule$1.evaluate(SystemPropertiesRestoreRule.java:57)
	at org.apache.lucene.util.AbstractBeforeAfterRule$1.evaluate(AbstractBeforeAfterRule.java:45)
	at com.carrotsearch.randomizedtesting.rules.StatementAdapter.evaluate(StatementAdapter.java:36)
	at org.apache.lucene.util.TestRuleStoreClassName$1.evaluate(TestRuleStoreClassName.java:41)
	at com.carrotsearch.randomizedtesting.rules.NoShadowingOrOverridesOnMethodsRule$1.evaluate(NoShadowingOrOverridesOnMethodsRule.java:40)
	at com.carrotsearch.randomizedtesting.rules.NoShadowingOrOverridesOnMethodsRule$1.evaluate(NoShadowingOrOverridesOnMethodsRule.java:40)
	at com.carrotsearch.randomizedtesting.rules.StatementAdapter.evaluate(StatementAdapter.java:36)
	at com.carrotsearch.randomizedtesting.rules.StatementAdapter.evaluate(StatementAdapter.java:36)
	at com.carrotsearch.randomizedtesting.rules.StatementAdapter.evaluate(StatementAdapter.java:36)
	at org.apache.lucene.util.TestRuleAssertionsRequired$1.evaluate(TestRuleAssertionsRequired.java:53)
	at org.apache.lucene.util.TestRuleMarkFailure$1.evaluate(TestRuleMarkFailure.java:47)
	at org.apache.lucene.util.TestRuleIgnoreAfterMaxFailures$1.evaluate(TestRuleIgnoreAfterMaxFailures.java:64)
	at org.apache.lucene.util.TestRuleIgnoreTestSuites$1.evaluate(TestRuleIgnoreTestSuites.java:54)
	at com.carrotsearch.randomizedtesting.rules.StatementAdapter.evaluate(StatementAdapter.java:36)
	at com.carrotsearch.randomizedtesting.ThreadLeakControl$StatementRunner.run(ThreadLeakControl.java:367)
	at java.lang.Thread.run(Thread.java:745)


FAILED:  org.apache.solr.handler.TestBlobHandler.doBlobHandlerTest

Error Message:
Error from server at https://127.0.0.1:49835: java.lang.NullPointerException  at org.apache.commons.io.IOUtils.copyLarge(IOUtils.java:1792)  at org.apache.commons.io.IOUtils.copyLarge(IOUtils.java:1769)  at org.apache.commons.io.IOUtils.copy(IOUtils.java:1744)  at org.apache.commons.io.IOUtils.toByteArray(IOUtils.java:462)  at org.apache.solr.handler.admin.CollectionsHandler$CollectionOperation$1.createSysConfigSet(CollectionsHandler.java:385)  at org.apache.solr.handler.admin.CollectionsHandler$CollectionOperation$1.call(CollectionsHandler.java:366)  at org.apache.solr.handler.admin.CollectionsHandler.handleRequestBody(CollectionsHandler.java:188)  at org.apache.solr.handler.RequestHandlerBase.handleRequest(RequestHandlerBase.java:155)  at org.apache.solr.servlet.HttpSolrCall.handleAdminRequest(HttpSolrCall.java:655)  at org.apache.solr.servlet.HttpSolrCall.call(HttpSolrCall.java:438)  at org.apache.solr.servlet.SolrDispatchFilter.doFilter(SolrDispatchFilter.java:229)  at org.apache.solr.servlet.SolrDispatchFilter.doFilter(SolrDispatchFilter.java:184)  at org.eclipse.jetty.servlet.ServletHandler$CachedChain.doFilter(ServletHandler.java:1668)  at org.apache.solr.client.solrj.embedded.JettySolrRunner$DebugFilter.doFilter(JettySolrRunner.java:109)  at org.eclipse.jetty.servlet.ServletHandler$CachedChain.doFilter(ServletHandler.java:1668)  at org.eclipse.jetty.servlet.ServletHandler.doHandle(ServletHandler.java:581)  at org.eclipse.jetty.server.session.SessionHandler.doHandle(SessionHandler.java:224)  at org.eclipse.jetty.server.handler.ContextHandler.doHandle(ContextHandler.java:1158)  at org.eclipse.jetty.servlet.ServletHandler.doScope(ServletHandler.java:511)  at org.eclipse.jetty.server.session.SessionHandler.doScope(SessionHandler.java:185)  at org.eclipse.jetty.server.handler.ContextHandler.doScope(ContextHandler.java:1090)  at org.eclipse.jetty.server.handler.ScopedHandler.handle(ScopedHandler.java:141)  at org.eclipse.jetty.server.handler.gzip.GzipHandler.handle(GzipHandler.java:437)  at org.eclipse.jetty.server.handler.HandlerWrapper.handle(HandlerWrapper.java:119)  at org.eclipse.jetty.server.Server.handle(Server.java:517)  at org.eclipse.jetty.server.HttpChannel.handle(HttpChannel.java:308)  at org.eclipse.jetty.server.HttpConnection.onFillable(HttpConnection.java:242)  at org.eclipse.jetty.io.AbstractConnection$ReadCallback.succeeded(AbstractConnection.java:261)  at org.eclipse.jetty.io.FillInterest.fillable(FillInterest.java:95)  at org.eclipse.jetty.io.ssl.SslConnection.onFillable(SslConnection.java:192)  at org.eclipse.jetty.io.AbstractConnection$ReadCallback.succeeded(AbstractConnection.java:261)  at org.eclipse.jetty.io.FillInterest.fillable(FillInterest.java:95)  at org.eclipse.jetty.io.SelectChannelEndPoint$2.run(SelectChannelEndPoint.java:75)  at org.eclipse.jetty.util.thread.strategy.ExecuteProduceConsume.produceAndRun(ExecuteProduceConsume.java:213)  at org.eclipse.jetty.util.thread.strategy.ExecuteProduceConsume.run(ExecuteProduceConsume.java:147)  at org.eclipse.jetty.util.thread.QueuedThreadPool.runJob(QueuedThreadPool.java:654)  at org.eclipse.jetty.util.thread.QueuedThreadPool$3.run(QueuedThreadPool.java:572)  at java.lang.Thread.run(Thread.java:745) 

Stack Trace:
org.apache.solr.client.solrj.impl.HttpSolrClient$RemoteSolrException: Error from server at https://127.0.0.1:49835: java.lang.NullPointerException
	at org.apache.commons.io.IOUtils.copyLarge(IOUtils.java:1792)
	at org.apache.commons.io.IOUtils.copyLarge(IOUtils.java:1769)
	at org.apache.commons.io.IOUtils.copy(IOUtils.java:1744)
	at org.apache.commons.io.IOUtils.toByteArray(IOUtils.java:462)
	at org.apache.solr.handler.admin.CollectionsHandler$CollectionOperation$1.createSysConfigSet(CollectionsHandler.java:385)
	at org.apache.solr.handler.admin.CollectionsHandler$CollectionOperation$1.call(CollectionsHandler.java:366)
	at org.apache.solr.handler.admin.CollectionsHandler.handleRequestBody(CollectionsHandler.java:188)
	at org.apache.solr.handler.RequestHandlerBase.handleRequest(RequestHandlerBase.java:155)
	at org.apache.solr.servlet.HttpSolrCall.handleAdminRequest(HttpSolrCall.java:655)
	at org.apache.solr.servlet.HttpSolrCall.call(HttpSolrCall.java:438)
	at org.apache.solr.servlet.SolrDispatchFilter.doFilter(SolrDispatchFilter.java:229)
	at org.apache.solr.servlet.SolrDispatchFilter.doFilter(SolrDispatchFilter.java:184)
	at org.eclipse.jetty.servlet.ServletHandler$CachedChain.doFilter(ServletHandler.java:1668)
	at org.apache.solr.client.solrj.embedded.JettySolrRunner$DebugFilter.doFilter(JettySolrRunner.java:109)
	at org.eclipse.jetty.servlet.ServletHandler$CachedChain.doFilter(ServletHandler.java:1668)
	at org.eclipse.jetty.servlet.ServletHandler.doHandle(ServletHandler.java:581)
	at org.eclipse.jetty.server.session.SessionHandler.doHandle(SessionHandler.java:224)
	at org.eclipse.jetty.server.handler.ContextHandler.doHandle(ContextHandler.java:1158)
	at org.eclipse.jetty.servlet.ServletHandler.doScope(ServletHandler.java:511)
	at org.eclipse.jetty.server.session.SessionHandler.doScope(SessionHandler.java:185)
	at org.eclipse.jetty.server.handler.ContextHandler.doScope(ContextHandler.java:1090)
	at org.eclipse.jetty.server.handler.ScopedHandler.handle(ScopedHandler.java:141)
	at org.eclipse.jetty.server.handler.gzip.GzipHandler.handle(GzipHandler.java:437)
	at org.eclipse.jetty.server.handler.HandlerWrapper.handle(HandlerWrapper.java:119)
	at org.eclipse.jetty.server.Server.handle(Server.java:517)
	at org.eclipse.jetty.server.HttpChannel.handle(HttpChannel.java:308)
	at org.eclipse.jetty.server.HttpConnection.onFillable(HttpConnection.java:242)
	at org.eclipse.jetty.io.AbstractConnection$ReadCallback.succeeded(AbstractConnection.java:261)
	at org.eclipse.jetty.io.FillInterest.fillable(FillInterest.java:95)
	at org.eclipse.jetty.io.ssl.SslConnection.onFillable(SslConnection.java:192)
	at org.eclipse.jetty.io.AbstractConnection$ReadCallback.succeeded(AbstractConnection.java:261)
	at org.eclipse.jetty.io.FillInterest.fillable(FillInterest.java:95)
	at org.eclipse.jetty.io.SelectChannelEndPoint$2.run(SelectChannelEndPoint.java:75)
	at org.eclipse.jetty.util.thread.strategy.ExecuteProduceConsume.produceAndRun(ExecuteProduceConsume.java:213)
	at org.eclipse.jetty.util.thread.strategy.ExecuteProduceConsume.run(ExecuteProduceConsume.java:147)
	at org.eclipse.jetty.util.thread.QueuedThreadPool.runJob(QueuedThreadPool.java:654)
	at org.eclipse.jetty.util.thread.QueuedThreadPool$3.run(QueuedThreadPool.java:572)
	at java.lang.Thread.run(Thread.java:745)

	at __randomizedtesting.SeedInfo.seed([76F638A1B73C9AAE:96371AF30CD0EC5C]:0)
	at org.apache.solr.client.solrj.impl.HttpSolrClient.executeMethod(HttpSolrClient.java:577)
	at org.apache.solr.client.solrj.impl.HttpSolrClient.request(HttpSolrClient.java:241)
	at org.apache.solr.client.solrj.impl.HttpSolrClient.request(HttpSolrClient.java:230)
	at org.apache.solr.client.solrj.SolrRequest.process(SolrRequest.java:149)
	at org.apache.solr.client.solrj.SolrRequest.process(SolrRequest.java:166)
	at org.apache.solr.handler.TestBlobHandler.doBlobHandlerTest(TestBlobHandler.java:70)
	at sun.reflect.NativeMethodAccessorImpl.invoke0(Native Method)
	at sun.reflect.NativeMethodAccessorImpl.invoke(NativeMethodAccessorImpl.java:62)
	at sun.reflect.DelegatingMethodAccessorImpl.invoke(DelegatingMethodAccessorImpl.java:43)
	at java.lang.reflect.Method.invoke(Method.java:498)
	at com.carrotsearch.randomizedtesting.RandomizedRunner.invoke(RandomizedRunner.java:1764)
	at com.carrotsearch.randomizedtesting.RandomizedRunner$8.evaluate(RandomizedRunner.java:871)
	at com.carrotsearch.randomizedtesting.RandomizedRunner$9.evaluate(RandomizedRunner.java:907)
	at com.carrotsearch.randomizedtesting.RandomizedRunner$10.evaluate(RandomizedRunner.java:921)
	at org.apache.solr.BaseDistributedSearchTestCase$ShardsRepeatRule$ShardsFixedStatement.callStatement(BaseDistributedSearchTestCase.java:996)
	at org.apache.solr.BaseDistributedSearchTestCase$ShardsRepeatRule$ShardsStatement.evaluate(BaseDistributedSearchTestCase.java:971)
	at com.carrotsearch.randomizedtesting.rules.SystemPropertiesRestoreRule$1.evaluate(SystemPropertiesRestoreRule.java:57)
	at org.apache.lucene.util.TestRuleSetupTeardownChained$1.evaluate(TestRuleSetupTeardownChained.java:49)
	at org.apache.lucene.util.AbstractBeforeAfterRule$1.evaluate(AbstractBeforeAfterRule.java:45)
	at org.apache.lucene.util.TestRuleThreadAndTestName$1.evaluate(TestRuleThreadAndTestName.java:48)
	at org.apache.lucene.util.TestRuleIgnoreAfterMaxFailures$1.evaluate(TestRuleIgnoreAfterMaxFailures.java:64)
	at org.apache.lucene.util.TestRuleMarkFailure$1.evaluate(TestRuleMarkFailure.java:47)
	at com.carrotsearch.randomizedtesting.rules.StatementAdapter.evaluate(StatementAdapter.java:36)
	at com.carrotsearch.randomizedtesting.ThreadLeakControl$StatementRunner.run(ThreadLeakControl.java:367)
	at com.carrotsearch.randomizedtesting.ThreadLeakControl.forkTimeoutingTask(ThreadLeakControl.java:809)
	at com.carrotsearch.randomizedtesting.ThreadLeakControl$3.evaluate(ThreadLeakControl.java:460)
	at com.carrotsearch.randomizedtesting.RandomizedRunner.runSingleTest(RandomizedRunner.java:880)
	at com.carrotsearch.randomizedtesting.RandomizedRunner$5.evaluate(RandomizedRunner.java:781)
	at com.carrotsearch.randomizedtesting.RandomizedRunner$6.evaluate(RandomizedRunner.java:816)
	at com.carrotsearch.randomizedtesting.RandomizedRunner$7.evaluate(RandomizedRunner.java:827)
	at com.carrotsearch.randomizedtesting.rules.StatementAdapter.evaluate(StatementAdapter.java:36)
	at com.carrotsearch.randomizedtesting.rules.SystemPropertiesRestoreRule$1.evaluate(SystemPropertiesRestoreRule.java:57)
	at org.apache.lucene.util.AbstractBeforeAfterRule$1.evaluate(AbstractBeforeAfterRule.java:45)
	at com.carrotsearch.randomizedtesting.rules.StatementAdapter.evaluate(StatementAdapter.java:36)
	at org.apache.lucene.util.TestRuleStoreClassName$1.evaluate(TestRuleStoreClassName.java:41)
	at com.carrotsearch.randomizedtesting.rules.NoShadowingOrOverridesOnMethodsRule$1.evaluate(NoShadowingOrOverridesOnMethodsRule.java:40)
	at com.carrotsearch.randomizedtesting.rules.NoShadowingOrOverridesOnMethodsRule$1.evaluate(NoShadowingOrOverridesOnMethodsRule.java:40)
	at com.carrotsearch.randomizedtesting.rules.StatementAdapter.evaluate(StatementAdapter.java:36)
	at com.carrotsearch.randomizedtesting.rules.StatementAdapter.evaluate(StatementAdapter.java:36)
	at com.carrotsearch.randomizedtesting.rules.StatementAdapter.evaluate(StatementAdapter.java:36)
	at org.apache.lucene.util.TestRuleAssertionsRequired$1.evaluate(TestRuleAssertionsRequired.java:53)
	at org.apache.lucene.util.TestRuleMarkFailure$1.evaluate(TestRuleMarkFailure.java:47)
	at org.apache.lucene.util.TestRuleIgnoreAfterMaxFailures$1.evaluate(TestRuleIgnoreAfterMaxFailures.java:64)
	at org.apache.lucene.util.TestRuleIgnoreTestSuites$1.evaluate(TestRuleIgnoreTestSuites.java:54)
	at com.carrotsearch.randomizedtesting.rules.StatementAdapter.evaluate(StatementAdapter.java:36)
	at com.carrotsearch.randomizedtesting.ThreadLeakControl$StatementRunner.run(ThreadLeakControl.java:367)
	at java.lang.Thread.run(Thread.java:745)


FAILED:  org.apache.solr.update.processor.TestNamedUpdateProcessors.test

Error Message:
Error from server at https://127.0.0.1:49725/fy_ia/qs: java.lang.NullPointerException  at org.apache.commons.io.IOUtils.copyLarge(IOUtils.java:1792)  at org.apache.commons.io.IOUtils.copyLarge(IOUtils.java:1769)  at org.apache.commons.io.IOUtils.copy(IOUtils.java:1744)  at org.apache.commons.io.IOUtils.toByteArray(IOUtils.java:462)  at org.apache.solr.handler.admin.CollectionsHandler$CollectionOperation$1.createSysConfigSet(CollectionsHandler.java:385)  at org.apache.solr.handler.admin.CollectionsHandler$CollectionOperation$1.call(CollectionsHandler.java:366)  at org.apache.solr.handler.admin.CollectionsHandler.handleRequestBody(CollectionsHandler.java:188)  at org.apache.solr.handler.RequestHandlerBase.handleRequest(RequestHandlerBase.java:155)  at org.apache.solr.servlet.HttpSolrCall.handleAdminRequest(HttpSolrCall.java:655)  at org.apache.solr.servlet.HttpSolrCall.call(HttpSolrCall.java:438)  at org.apache.solr.servlet.SolrDispatchFilter.doFilter(SolrDispatchFilter.java:229)  at org.apache.solr.servlet.SolrDispatchFilter.doFilter(SolrDispatchFilter.java:184)  at org.eclipse.jetty.servlet.ServletHandler$CachedChain.doFilter(ServletHandler.java:1668)  at org.apache.solr.client.solrj.embedded.JettySolrRunner$DebugFilter.doFilter(JettySolrRunner.java:109)  at org.eclipse.jetty.servlet.ServletHandler$CachedChain.doFilter(ServletHandler.java:1668)  at org.eclipse.jetty.servlet.ServletHandler.doHandle(ServletHandler.java:581)  at org.eclipse.jetty.server.session.SessionHandler.doHandle(SessionHandler.java:224)  at org.eclipse.jetty.server.handler.ContextHandler.doHandle(ContextHandler.java:1158)  at org.eclipse.jetty.servlet.ServletHandler.doScope(ServletHandler.java:511)  at org.eclipse.jetty.server.session.SessionHandler.doScope(SessionHandler.java:185)  at org.eclipse.jetty.server.handler.ContextHandler.doScope(ContextHandler.java:1090)  at org.eclipse.jetty.server.handler.ScopedHandler.handle(ScopedHandler.java:141)  at org.eclipse.jetty.server.handler.gzip.GzipHandler.handle(GzipHandler.java:437)  at org.eclipse.jetty.server.handler.HandlerWrapper.handle(HandlerWrapper.java:119)  at org.eclipse.jetty.server.Server.handle(Server.java:517)  at org.eclipse.jetty.server.HttpChannel.handle(HttpChannel.java:308)  at org.eclipse.jetty.server.HttpConnection.onFillable(HttpConnection.java:242)  at org.eclipse.jetty.io.AbstractConnection$ReadCallback.succeeded(AbstractConnection.java:261)  at org.eclipse.jetty.io.FillInterest.fillable(FillInterest.java:95)  at org.eclipse.jetty.io.ssl.SslConnection.onFillable(SslConnection.java:192)  at org.eclipse.jetty.io.AbstractConnection$ReadCallback.succeeded(AbstractConnection.java:261)  at org.eclipse.jetty.io.FillInterest.fillable(FillInterest.java:95)  at org.eclipse.jetty.io.SelectChannelEndPoint$2.run(SelectChannelEndPoint.java:75)  at org.eclipse.jetty.util.thread.strategy.ExecuteProduceConsume.produceAndRun(ExecuteProduceConsume.java:213)  at org.eclipse.jetty.util.thread.strategy.ExecuteProduceConsume.run(ExecuteProduceConsume.java:147)  at org.eclipse.jetty.util.thread.QueuedThreadPool.runJob(QueuedThreadPool.java:654)  at org.eclipse.jetty.util.thread.QueuedThreadPool$3.run(QueuedThreadPool.java:572)  at java.lang.Thread.run(Thread.java:745) 

Stack Trace:
org.apache.solr.client.solrj.impl.HttpSolrClient$RemoteSolrException: Error from server at https://127.0.0.1:49725/fy_ia/qs: java.lang.NullPointerException
	at org.apache.commons.io.IOUtils.copyLarge(IOUtils.java:1792)
	at org.apache.commons.io.IOUtils.copyLarge(IOUtils.java:1769)
	at org.apache.commons.io.IOUtils.copy(IOUtils.java:1744)
	at org.apache.commons.io.IOUtils.toByteArray(IOUtils.java:462)
	at org.apache.solr.handler.admin.CollectionsHandler$CollectionOperation$1.createSysConfigSet(CollectionsHandler.java:385)
	at org.apache.solr.handler.admin.CollectionsHandler$CollectionOperation$1.call(CollectionsHandler.java:366)
	at org.apache.solr.handler.admin.CollectionsHandler.handleRequestBody(CollectionsHandler.java:188)
	at org.apache.solr.handler.RequestHandlerBase.handleRequest(RequestHandlerBase.java:155)
	at org.apache.solr.servlet.HttpSolrCall.handleAdminRequest(HttpSolrCall.java:655)
	at org.apache.solr.servlet.HttpSolrCall.call(HttpSolrCall.java:438)
	at org.apache.solr.servlet.SolrDispatchFilter.doFilter(SolrDispatchFilter.java:229)
	at org.apache.solr.servlet.SolrDispatchFilter.doFilter(SolrDispatchFilter.java:184)
	at org.eclipse.jetty.servlet.ServletHandler$CachedChain.doFilter(ServletHandler.java:1668)
	at org.apache.solr.client.solrj.embedded.JettySolrRunner$DebugFilter.doFilter(JettySolrRunner.java:109)
	at org.eclipse.jetty.servlet.ServletHandler$CachedChain.doFilter(ServletHandler.java:1668)
	at org.eclipse.jetty.servlet.ServletHandler.doHandle(ServletHandler.java:581)
	at org.eclipse.jetty.server.session.SessionHandler.doHandle(SessionHandler.java:224)
	at org.eclipse.jetty.server.handler.ContextHandler.doHandle(ContextHandler.java:1158)
	at org.eclipse.jetty.servlet.ServletHandler.doScope(ServletHandler.java:511)
	at org.eclipse.jetty.server.session.SessionHandler.doScope(SessionHandler.java:185)
	at org.eclipse.jetty.server.handler.ContextHandler.doScope(ContextHandler.java:1090)
	at org.eclipse.jetty.server.handler.ScopedHandler.handle(ScopedHandler.java:141)
	at org.eclipse.jetty.server.handler.gzip.GzipHandler.handle(GzipHandler.java:437)
	at org.eclipse.jetty.server.handler.HandlerWrapper.handle(HandlerWrapper.java:119)
	at org.eclipse.jetty.server.Server.handle(Server.java:517)
	at org.eclipse.jetty.server.HttpChannel.handle(HttpChannel.java:308)
	at org.eclipse.jetty.server.HttpConnection.onFillable(HttpConnection.java:242)
	at org.eclipse.jetty.io.AbstractConnection$ReadCallback.succeeded(AbstractConnection.java:261)
	at org.eclipse.jetty.io.FillInterest.fillable(FillInterest.java:95)
	at org.eclipse.jetty.io.ssl.SslConnection.onFillable(SslConnection.java:192)
	at org.eclipse.jetty.io.AbstractConnection$ReadCallback.succeeded(AbstractConnection.java:261)
	at org.eclipse.jetty.io.FillInterest.fillable(FillInterest.java:95)
	at org.eclipse.jetty.io.SelectChannelEndPoint$2.run(SelectChannelEndPoint.java:75)
	at org.eclipse.jetty.util.thread.strategy.ExecuteProduceConsume.produceAndRun(ExecuteProduceConsume.java:213)
	at org.eclipse.jetty.util.thread.strategy.ExecuteProduceConsume.run(ExecuteProduceConsume.java:147)
	at org.eclipse.jetty.util.thread.QueuedThreadPool.runJob(QueuedThreadPool.java:654)
	at org.eclipse.jetty.util.thread.QueuedThreadPool$3.run(QueuedThreadPool.java:572)
	at java.lang.Thread.run(Thread.java:745)

	at __randomizedtesting.SeedInfo.seed([76F638A1B73C9AAE:FEA2077B19C0F756]:0)
	at org.apache.solr.client.solrj.impl.HttpSolrClient.executeMethod(HttpSolrClient.java:577)
	at org.apache.solr.client.solrj.impl.HttpSolrClient.request(HttpSolrClient.java:241)
	at org.apache.solr.client.solrj.impl.HttpSolrClient.request(HttpSolrClient.java:230)
	at org.apache.solr.client.solrj.SolrRequest.process(SolrRequest.java:149)
	at org.apache.solr.client.solrj.SolrRequest.process(SolrRequest.java:166)
	at org.apache.solr.handler.TestBlobHandler.createSystemCollection(TestBlobHandler.java:113)
	at org.apache.solr.update.processor.TestNamedUpdateProcessors.test(TestNamedUpdateProcessors.java:81)
	at sun.reflect.NativeMethodAccessorImpl.invoke0(Native Method)
	at sun.reflect.NativeMethodAccessorImpl.invoke(NativeMethodAccessorImpl.java:62)
	at sun.reflect.DelegatingMethodAccessorImpl.invoke(DelegatingMethodAccessorImpl.java:43)
	at java.lang.reflect.Method.invoke(Method.java:498)
	at com.carrotsearch.randomizedtesting.RandomizedRunner.invoke(RandomizedRunner.java:1764)
	at com.carrotsearch.randomizedtesting.RandomizedRunner$8.evaluate(RandomizedRunner.java:871)
	at com.carrotsearch.randomizedtesting.RandomizedRunner$9.evaluate(RandomizedRunner.java:907)
	at com.carrotsearch.randomizedtesting.RandomizedRunner$10.evaluate(RandomizedRunner.java:921)
	at org.apache.solr.BaseDistributedSearchTestCase$ShardsRepeatRule$ShardsFixedStatement.callStatement(BaseDistributedSearchTestCase.java:996)
	at org.apache.solr.BaseDistributedSearchTestCase$ShardsRepeatRule$ShardsStatement.evaluate(BaseDistributedSearchTestCase.java:971)
	at com.carrotsearch.randomizedtesting.rules.SystemPropertiesRestoreRule$1.evaluate(SystemPropertiesRestoreRule.java:57)
	at org.apache.lucene.util.TestRuleSetupTeardownChained$1.evaluate(TestRuleSetupTeardownChained.java:49)
	at org.apache.lucene.util.AbstractBeforeAfterRule$1.evaluate(AbstractBeforeAfterRule.java:45)
	at org.apache.lucene.util.TestRuleThreadAndTestName$1.evaluate(TestRuleThreadAndTestName.java:48)
	at org.apache.lucene.util.TestRuleIgnoreAfterMaxFailures$1.evaluate(TestRuleIgnoreAfterMaxFailures.java:64)
	at org.apache.lucene.util.TestRuleMarkFailure$1.evaluate(TestRuleMarkFailure.java:47)
	at com.carrotsearch.randomizedtesting.rules.StatementAdapter.evaluate(StatementAdapter.java:36)
	at com.carrotsearch.randomizedtesting.ThreadLeakControl$StatementRunner.run(ThreadLeakControl.java:367)
	at com.carrotsearch.randomizedtesting.ThreadLeakControl.forkTimeoutingTask(ThreadLeakControl.java:809)
	at com.carrotsearch.randomizedtesting.ThreadLeakControl$3.evaluate(ThreadLeakControl.java:460)
	at com.carrotsearch.randomizedtesting.RandomizedRunner.runSingleTest(RandomizedRunner.java:880)
	at com.carrotsearch.randomizedtesting.RandomizedRunner$5.evaluate(RandomizedRunner.java:781)
	at com.carrotsearch.randomizedtesting.RandomizedRunner$6.evaluate(RandomizedRunner.java:816)
	at com.carrotsearch.randomizedtesting.RandomizedRunner$7.evaluate(RandomizedRunner.java:827)
	at com.carrotsearch.randomizedtesting.rules.StatementAdapter.evaluate(StatementAdapter.java:36)
	at com.carrotsearch.randomizedtesting.rules.SystemPropertiesRestoreRule$1.evaluate(SystemPropertiesRestoreRule.java:57)
	at org.apache.lucene.util.AbstractBeforeAfterRule$1.evaluate(AbstractBeforeAfterRule.java:45)
	at com.carrotsearch.randomizedtesting.rules.StatementAdapter.evaluate(StatementAdapter.java:36)
	at org.apache.lucene.util.TestRuleStoreClassName$1.evaluate(TestRuleStoreClassName.java:41)
	at com.carrotsearch.randomizedtesting.rules.NoShadowingOrOverridesOnMethodsRule$1.evaluate(NoShadowingOrOverridesOnMethodsRule.java:40)
	at com.carrotsearch.randomizedtesting.rules.NoShadowingOrOverridesOnMethodsRule$1.evaluate(NoShadowingOrOverridesOnMethodsRule.java:40)
	at com.carrotsearch.randomizedtesting.rules.StatementAdapter.evaluate(StatementAdapter.java:36)
	at com.carrotsearch.randomizedtesting.rules.StatementAdapter.evaluate(StatementAdapter.java:36)
	at com.carrotsearch.randomizedtesting.rules.StatementAdapter.evaluate(StatementAdapter.java:36)
	at org.apache.lucene.util.TestRuleAssertionsRequired$1.evaluate(TestRuleAssertionsRequired.java:53)
	at org.apache.lucene.util.TestRuleMarkFailure$1.evaluate(TestRuleMarkFailure.java:47)
	at org.apache.lucene.util.TestRuleIgnoreAfterMaxFailures$1.evaluate(TestRuleIgnoreAfterMaxFailures.java:64)
	at org.apache.lucene.util.TestRuleIgnoreTestSuites$1.evaluate(TestRuleIgnoreTestSuites.java:54)
	at com.carrotsearch.randomizedtesting.rules.StatementAdapter.evaluate(StatementAdapter.java:36)
	at com.carrotsearch.randomizedtesting.ThreadLeakControl$StatementRunner.run(ThreadLeakControl.java:367)
	at java.lang.Thread.run(Thread.java:745)




Build Log:
[...truncated 11025 lines...]
   [junit4] Suite: org.apache.solr.handler.TestBlobHandler
   [junit4]   2> Creating dataDir: /home/jenkins/workspace/Lucene-Solr-trunk-Linux/solr/build/solr-core/test/J2/temp/solr.handler.TestBlobHandler_76F638A1B73C9AAE-001/init-core-data-001
   [junit4]   2> 674183 INFO  (SUITE-TestBlobHandler-seed#[76F638A1B73C9AAE]-worker) [    ] o.a.s.SolrTestCaseJ4 Randomized ssl (true) and clientAuth (false)
   [junit4]   2> 674183 INFO  (SUITE-TestBlobHandler-seed#[76F638A1B73C9AAE]-worker) [    ] o.a.s.BaseDistributedSearchTestCase Setting hostContext system property: /
   [junit4]   2> 674185 INFO  (TEST-TestBlobHandler.doBlobHandlerTest-seed#[76F638A1B73C9AAE]) [    ] o.a.s.c.ZkTestServer STARTING ZK TEST SERVER
   [junit4]   2> 674186 INFO  (Thread-2282) [    ] o.a.s.c.ZkTestServer client port:0.0.0.0/0.0.0.0:0
   [junit4]   2> 674186 INFO  (Thread-2282) [    ] o.a.s.c.ZkTestServer Starting server
   [junit4]   2> 674286 INFO  (TEST-TestBlobHandler.doBlobHandlerTest-seed#[76F638A1B73C9AAE]) [    ] o.a.s.c.ZkTestServer start zk server on port:39463
   [junit4]   2> 674286 INFO  (TEST-TestBlobHandler.doBlobHandlerTest-seed#[76F638A1B73C9AAE]) [    ] o.a.s.c.c.SolrZkClient Using default ZkCredentialsProvider
   [junit4]   2> 674286 INFO  (TEST-TestBlobHandler.doBlobHandlerTest-seed#[76F638A1B73C9AAE]) [    ] o.a.s.c.c.ConnectionManager Waiting for client to connect to ZooKeeper
   [junit4]   2> 674289 INFO  (zkCallback-1145-thread-1) [    ] o.a.s.c.c.ConnectionManager Watcher org.apache.solr.common.cloud.ConnectionManager@35ccebbc name:ZooKeeperConnection Watcher:127.0.0.1:39463 got event WatchedEvent state:SyncConnected type:None path:null path:null type:None
   [junit4]   2> 674289 INFO  (TEST-TestBlobHandler.doBlobHandlerTest-seed#[76F638A1B73C9AAE]) [    ] o.a.s.c.c.ConnectionManager Client is connected to ZooKeeper
   [junit4]   2> 674289 INFO  (TEST-TestBlobHandler.doBlobHandlerTest-seed#[76F638A1B73C9AAE]) [    ] o.a.s.c.c.SolrZkClient Using default ZkACLProvider
   [junit4]   2> 674289 INFO  (TEST-TestBlobHandler.doBlobHandlerTest-seed#[76F638A1B73C9AAE]) [    ] o.a.s.c.c.SolrZkClient makePath: /solr
   [junit4]   2> 674290 INFO  (TEST-TestBlobHandler.doBlobHandlerTest-seed#[76F638A1B73C9AAE]) [    ] o.a.s.c.c.SolrZkClient Using default ZkCredentialsProvider
   [junit4]   2> 674291 INFO  (TEST-TestBlobHandler.doBlobHandlerTest-seed#[76F638A1B73C9AAE]) [    ] o.a.s.c.c.ConnectionManager Waiting for client to connect to ZooKeeper
   [junit4]   2> 674291 INFO  (zkCallback-1146-thread-1) [    ] o.a.s.c.c.ConnectionManager Watcher org.apache.solr.common.cloud.ConnectionManager@4bfd69f7 name:ZooKeeperConnection Watcher:127.0.0.1:39463/solr got event WatchedEvent state:SyncConnected type:None path:null path:null type:None
   [junit4]   2> 674291 INFO  (TEST-TestBlobHandler.doBlobHandlerTest-seed#[76F638A1B73C9AAE]) [    ] o.a.s.c.c.ConnectionManager Client is connected to ZooKeeper
   [junit4]   2> 674292 INFO  (TEST-TestBlobHandler.doBlobHandlerTest-seed#[76F638A1B73C9AAE]) [    ] o.a.s.c.c.SolrZkClient Using default ZkACLProvider
   [junit4]   2> 674292 INFO  (TEST-TestBlobHandler.doBlobHandlerTest-seed#[76F638A1B73C9AAE]) [    ] o.a.s.c.c.SolrZkClient makePath: /collections/collection1
   [junit4]   2> 674292 INFO  (TEST-TestBlobHandler.doBlobHandlerTest-seed#[76F638A1B73C9AAE]) [    ] o.a.s.c.c.SolrZkClient makePath: /collections/collection1/shards
   [junit4]   2> 674293 INFO  (TEST-TestBlobHandler.doBlobHandlerTest-seed#[76F638A1B73C9AAE]) [    ] o.a.s.c.c.SolrZkClient makePath: /collections/control_collection
   [junit4]   2> 674293 INFO  (TEST-TestBlobHandler.doBlobHandlerTest-seed#[76F638A1B73C9AAE]) [    ] o.a.s.c.c.SolrZkClient makePath: /collections/control_collection/shards
   [junit4]   2> 674294 INFO  (TEST-TestBlobHandler.doBlobHandlerTest-seed#[76F638A1B73C9AAE]) [    ] o.a.s.c.AbstractZkTestCase put /home/jenkins/workspace/Lucene-Solr-trunk-Linux/solr/core/src/test-files/solr/collection1/conf/solrconfig-tlog.xml to /configs/conf1/solrconfig.xml
   [junit4]   2> 674294 INFO  (TEST-TestBlobHandler.doBlobHandlerTest-seed#[76F638A1B73C9AAE]) [    ] o.a.s.c.c.SolrZkClient makePath: /configs/conf1/solrconfig.xml
   [junit4]   2> 674295 INFO  (TEST-TestBlobHandler.doBlobHandlerTest-seed#[76F638A1B73C9AAE]) [    ] o.a.s.c.AbstractZkTestCase put /home/jenkins/workspace/Lucene-Solr-trunk-Linux/solr/core/src/test-files/solr/collection1/conf/schema.xml to /configs/conf1/schema.xml
   [junit4]   2> 674295 INFO  (TEST-TestBlobHandler.doBlobHandlerTest-seed#[76F638A1B73C9AAE]) [    ] o.a.s.c.c.SolrZkClient makePath: /configs/conf1/schema.xml
   [junit4]   2> 674296 INFO  (TEST-TestBlobHandler.doBlobHandlerTest-seed#[76F638A1B73C9AAE]) [    ] o.a.s.c.AbstractZkTestCase put /home/jenkins/workspace/Lucene-Solr-trunk-Linux/solr/core/src/test-files/solr/collection1/conf/solrconfig.snippet.randomindexconfig.xml to /configs/conf1/solrconfig.snippet.randomindexconfig.xml
   [junit4]   2> 674296 INFO  (TEST-TestBlobHandler.doBlobHandlerTest-seed#[76F638A1B73C9AAE]) [    ] o.a.s.c.c.SolrZkClient makePath: /configs/conf1/solrconfig.snippet.randomindexconfig.xml
   [junit4]   2> 674296 INFO  (TEST-TestBlobHandler.doBlobHandlerTest-seed#[76F638A1B73C9AAE]) [    ] o.a.s.c.AbstractZkTestCase put /home/jenkins/workspace/Lucene-Solr-trunk-Linux/solr/core/src/test-files/solr/collection1/conf/stopwords.txt to /configs/conf1/stopwords.txt
   [junit4]   2> 674296 INFO  (TEST-TestBlobHandler.doBlobHandlerTest-seed#[76F638A1B73C9AAE]) [    ] o.a.s.c.c.SolrZkClient makePath: /configs/conf1/stopwords.txt
   [junit4]   2> 674297 INFO  (TEST-TestBlobHandler.doBlobHandlerTest-seed#[76F638A1B73C9AAE]) [    ] o.a.s.c.AbstractZkTestCase put /home/jenkins/workspace/Lucene-Solr-trunk-Linux/solr/core/src/test-files/solr/collection1/conf/protwords.txt to /configs/conf1/protwords.txt
   [junit4]   2> 674297 INFO  (TEST-TestBlobHandler.doBlobHandlerTest-seed#[76F638A1B73C9AAE]) [    ] o.a.s.c.c.SolrZkClient makePath: /configs/conf1/protwords.txt
   [junit4]   2> 674297 INFO  (TEST-TestBlobHandler.doBlobHandlerTest-seed#[76F638A1B73C9AAE]) [    ] o.a.s.c.AbstractZkTestCase put /home/jenkins/workspace/Lucene-Solr-trunk-Linux/solr/core/src/test-files/solr/collection1/conf/currency.xml to /configs/conf1/currency.xml
   [junit4]   2> 674297 INFO  (TEST-TestBlobHandler.doBlobHandlerTest-seed#[76F638A1B73C9AAE]) [    ] o.a.s.c.c.SolrZkClient makePath: /configs/conf1/currency.xml
   [junit4]   2> 674298 INFO  (TEST-TestBlobHandler.doBlobHandlerTest-seed#[76F638A1B73C9AAE]) [    ] o.a.s.c.AbstractZkTestCase put /home/jenkins/workspace/Lucene-Solr-trunk-Linux/solr/core/src/test-files/solr/collection1/conf/enumsConfig.xml to /configs/conf1/enumsConfig.xml
   [junit4]   2> 674298 INFO  (TEST-TestBlobHandler.doBlobHandlerTest-seed#[76F638A1B73C9AAE]) [    ] o.a.s.c.c.SolrZkClient makePath: /configs/conf1/enumsConfig.xml
   [junit4]   2> 674299 INFO  (TEST-TestBlobHandler.doBlobHandlerTest-seed#[76F638A1B73C9AAE]) [    ] o.a.s.c.AbstractZkTestCase put /home/jenkins/workspace/Lucene-Solr-trunk-Linux/solr/core/src/test-files/solr/collection1/conf/open-exchange-rates.json to /configs/conf1/open-exchange-rates.json
   [junit4]   2> 674299 INFO  (TEST-TestBlobHandler.doBlobHandlerTest-seed#[76F638A1B73C9AAE]) [    ] o.a.s.c.c.SolrZkClient makePath: /configs/conf1/open-exchange-rates.json
   [junit4]   2> 674299 INFO  (TEST-TestBlobHandler.doBlobHandlerTest-seed#[76F638A1B73C9AAE]) [    ] o.a.s.c.AbstractZkTestCase put /home/jenkins/workspace/Lucene-Solr-trunk-Linux/solr/core/src/test-files/solr/collection1/conf/mapping-ISOLatin1Accent.txt to /configs/conf1/mapping-ISOLatin1Accent.txt
   [junit4]   2> 674299 INFO  (TEST-TestBlobHandler.doBlobHandlerTest-seed#[76F638A1B73C9AAE]) [    ] o.a.s.c.c.SolrZkClient makePath: /configs/conf1/mapping-ISOLatin1Accent.txt
   [junit4]   2> 674300 INFO  (TEST-TestBlobHandler.doBlobHandlerTest-seed#[76F638A1B73C9AAE]) [    ] o.a.s.c.AbstractZkTestCase put /home/jenkins/workspace/Lucene-Solr-trunk-Linux/solr/core/src/test-files/solr/collection1/conf/old_synonyms.txt to /configs/conf1/old_synonyms.txt
   [junit4]   2> 674300 INFO  (TEST-TestBlobHandler.doBlobHandlerTest-seed#[76F638A1B73C9AAE]) [    ] o.a.s.c.c.SolrZkClient makePath: /configs/conf1/old_synonyms.txt
   [junit4]   2> 674301 INFO  (TEST-TestBlobHandler.doBlobHandlerTest-seed#[76F638A1B73C9AAE]) [    ] o.a.s.c.AbstractZkTestCase put /home/jenkins/workspace/Lucene-Solr-trunk-Linux/solr/core/src/test-files/solr/collection1/conf/synonyms.txt to /configs/conf1/synonyms.txt
   [junit4]   2> 674301 INFO  (TEST-TestBlobHandler.doBlobHandlerTest-seed#[76F638A1B73C9AAE]) [    ] o.a.s.c.c.SolrZkClient makePath: /configs/conf1/synonyms.txt
   [junit4]   2> 674301 INFO  (TEST-TestBlobHandler.doBlobHandlerTest-seed#[76F638A1B73C9AAE]) [    ] o.a.s.c.c.SolrZkClient Using default ZkCredentialsProvider
   [junit4]   2> 674302 INFO  (TEST-TestBlobHandler.doBlobHandlerTest-seed#[76F638A1B73C9AAE]) [    ] o.a.s.c.c.ConnectionManager Waiting for client to connect to ZooKeeper
   [junit4]   2> 674302 INFO  (zkCallback-1147-thread-1) [    ] o.a.s.c.c.ConnectionManager Watcher org.apache.solr.common.cloud.ConnectionManager@33dfb440 name:ZooKeeperConnection Watcher:127.0.0.1:39463/solr got event WatchedEvent state:SyncConnected type:None path:null path:null type:None
   [junit4]   2> 674302 INFO  (TEST-TestBlobHandler.doBlobHandlerTest-seed#[76F638A1B73C9AAE]) [    ] o.a.s.c.c.ConnectionManager Client is connected to ZooKeeper
   [junit4]   2> 674303 INFO  (TEST-TestBlobHandler.doBlobHandlerTest-seed#[76F638A1B73C9AAE]) [    ] o.a.s.c.c.SolrZkClient Using default ZkACLProvider
   [junit4]   2> 674355 INFO  (TEST-TestBlobHandler.doBlobHandlerTest-seed#[76F638A1B73C9AAE]) [    ] o.a.s.SolrTestCaseJ4 Writing core.properties file to /home/jenkins/workspace/Lucene-Solr-trunk-Linux/solr/build/solr-core/test/J2/temp/solr.handler.TestBlobHandler_76F638A1B73C9AAE-001/control-001/cores/collection1
   [junit4]   2> 674356 INFO  (TEST-TestBlobHandler.doBlobHandlerTest-seed#[76F638A1B73C9AAE]) [    ] o.e.j.s.Server jetty-9.3.6.v20151106
   [junit4]   2> 674357 INFO  (TEST-TestBlobHandler.doBlobHandlerTest-seed#[76F638A1B73C9AAE]) [    ] o.e.j.s.h.ContextHandler Started o.e.j.s.ServletContextHandler@40ec6dc4{/,null,AVAILABLE}
   [junit4]   2> 674358 INFO  (TEST-TestBlobHandler.doBlobHandlerTest-seed#[76F638A1B73C9AAE]) [    ] o.e.j.u.s.SslContextFactory x509=X509@7792f0e2(solrtest,h=[],w=[]) for SslContextFactory@a306e1f(file:///home/jenkins/workspace/Lucene-Solr-trunk-Linux/solr/server/etc/test/solrtest.keystore,file:///home/jenkins/workspace/Lucene-Solr-trunk-Linux/solr/server/etc/test/solrtest.keystore)
   [junit4]   2> 674360 INFO  (TEST-TestBlobHandler.doBlobHandlerTest-seed#[76F638A1B73C9AAE]) [    ] o.e.j.s.ServerConnector Started ServerConnector@50fac9be{SSL,[ssl, http/1.1]}{127.0.0.1:36892}
   [junit4]   2> 674361 INFO  (TEST-TestBlobHandler.doBlobHandlerTest-seed#[76F638A1B73C9AAE]) [    ] o.e.j.s.Server Started @676004ms
   [junit4]   2> 674361 INFO  (TEST-TestBlobHandler.doBlobHandlerTest-seed#[76F638A1B73C9AAE]) [    ] o.a.s.c.s.e.JettySolrRunner Jetty properties: {solr.data.dir=/home/jenkins/workspace/Lucene-Solr-trunk-Linux/solr/build/solr-core/test/J2/temp/solr.handler.TestBlobHandler_76F638A1B73C9AAE-001/tempDir-001/control/data, hostContext=/, hostPort=36892, coreRootDirectory=/home/jenkins/workspace/Lucene-Solr-trunk-Linux/solr/build/solr-core/test/J2/temp/solr.handler.TestBlobHandler_76F638A1B73C9AAE-001/control-001/cores}
   [junit4]   2> 674361 INFO  (TEST-TestBlobHandler.doBlobHandlerTest-seed#[76F638A1B73C9AAE]) [    ] o.a.s.s.SolrDispatchFilter SolrDispatchFilter.init(): sun.misc.Launcher$AppClassLoader@73d16e93
   [junit4]   2> 674361 INFO  (TEST-TestBlobHandler.doBlobHandlerTest-seed#[76F638A1B73C9AAE]) [    ] o.a.s.c.SolrResourceLoader new SolrResourceLoader for directory: '/home/jenkins/workspace/Lucene-Solr-trunk-Linux/solr/build/solr-core/test/J2/temp/solr.handler.TestBlobHandler_76F638A1B73C9AAE-001/control-001'
   [junit4]   2> 674361 INFO  (TEST-TestBlobHandler.doBlobHandlerTest-seed#[76F638A1B73C9AAE]) [    ] o.a.s.c.SolrResourceLoader JNDI not configured for solr (NoInitialContextEx)
   [junit4]   2> 674361 INFO  (TEST-TestBlobHandler.doBlobHandlerTest-seed#[76F638A1B73C9AAE]) [    ] o.a.s.c.SolrResourceLoader solr home defaulted to 'solr/' (could not find system property or JNDI)
   [junit4]   2> 674362 INFO  (TEST-TestBlobHandler.doBlobHandlerTest-seed#[76F638A1B73C9AAE]) [    ] o.a.s.c.c.SolrZkClient Using default ZkCredentialsProvider
   [junit4]   2> 674362 INFO  (TEST-TestBlobHandler.doBlobHandlerTest-seed#[76F638A1B73C9AAE]) [    ] o.a.s.c.c.ConnectionManager Waiting for client to connect to ZooKeeper
   [junit4]   2> 674363 INFO  (zkCallback-1148-thread-1) [    ] o.a.s.c.c.ConnectionManager Watcher org.apache.solr.common.cloud.ConnectionManager@4de2d934 name:ZooKeeperConnection Watcher:127.0.0.1:39463/solr got event WatchedEvent state:SyncConnected type:None path:null path:null type:None
   [junit4]   2> 674363 INFO  (TEST-TestBlobHandler.doBlobHandlerTest-seed#[76F638A1B73C9AAE]) [    ] o.a.s.c.c.ConnectionManager Client is connected to ZooKeeper
   [junit4]   2> 674363 INFO  (TEST-TestBlobHandler.doBlobHandlerTest-seed#[76F638A1B73C9AAE]) [    ] o.a.s.c.c.SolrZkClient Using default ZkACLProvider
   [junit4]   2> 674363 INFO  (TEST-TestBlobHandler.doBlobHandlerTest-seed#[76F638A1B73C9AAE]) [    ] o.a.s.s.SolrDispatchFilter Loading solr.xml from SolrHome (not found in ZooKeeper)
   [junit4]   2> 674363 INFO  (TEST-TestBlobHandler.doBlobHandlerTest-seed#[76F638A1B73C9AAE]) [    ] o.a.s.c.SolrXmlConfig Loading container configuration from /home/jenkins/workspace/Lucene-Solr-trunk-Linux/solr/build/solr-core/test/J2/temp/solr.handler.TestBlobHandler_76F638A1B73C9AAE-001/control-001/solr.xml
   [junit4]   2> 674367 INFO  (TEST-TestBlobHandler.doBlobHandlerTest-seed#[76F638A1B73C9AAE]) [    ] o.a.s.c.CorePropertiesLocator Config-defined core root directory: /home/jenkins/workspace/Lucene-Solr-trunk-Linux/solr/build/solr-core/test/J2/temp/solr.handler.TestBlobHandler_76F638A1B73C9AAE-001/control-001/cores
   [junit4]   2> 674367 INFO  (TEST-TestBlobHandler.doBlobHandlerTest-seed#[76F638A1B73C9AAE]) [    ] o.a.s.c.CoreContainer New CoreContainer 1362605447
   [junit4]   2> 674367 INFO  (TEST-TestBlobHandler.doBlobHandlerTest-seed#[76F638A1B73C9AAE]) [    ] o.a.s.c.CoreContainer Loading cores into CoreContainer [instanceDir=/home/jenkins/workspace/Lucene-Solr-trunk-Linux/solr/build/solr-core/test/J2/temp/solr.handler.TestBlobHandler_76F638A1B73C9AAE-001/control-001]
   [junit4]   2> 674367 WARN  (TEST-TestBlobHandler.doBlobHandlerTest-seed#[76F638A1B73C9AAE]) [    ] o.a.s.c.CoreContainer Couldn't add files from /home/jenkins/workspace/Lucene-Solr-trunk-Linux/solr/build/solr-core/test/J2/temp/solr.handler.TestBlobHandler_76F638A1B73C9AAE-001/control-001/lib to classpath: /home/jenkins/workspace/Lucene-Solr-trunk-Linux/solr/build/solr-core/test/J2/temp/solr.handler.TestBlobHandler_76F638A1B73C9AAE-001/control-001/lib
   [junit4]   2> 674367 INFO  (TEST-TestBlobHandler.doBlobHandlerTest-seed#[76F638A1B73C9AAE]) [    ] o.a.s.h.c.HttpShardHandlerFactory created with socketTimeout : 90000,urlScheme : ,connTimeout : 15000,maxConnectionsPerHost : 20,maxConnections : 10000,corePoolSize : 0,maximumPoolSize : 2147483647,maxThreadIdleTime : 5,sizeOfQueue : -1,fairnessPolicy : false,useRetries : false,
   [junit4]   2> 674368 INFO  (TEST-TestBlobHandler.doBlobHandlerTest-seed#[76F638A1B73C9AAE]) [    ] o.a.s.u.UpdateShardHandler Creating UpdateShardHandler HTTP client with params: socketTimeout=340000&connTimeout=45000&retry=true
   [junit4]   2> 674369 INFO  (TEST-TestBlobHandler.doBlobHandlerTest-seed#[76F638A1B73C9AAE]) [    ] o.a.s.l.LogWatcher SLF4J impl is org.slf4j.impl.Log4jLoggerFactory
   [junit4]   2> 674369 INFO  (TEST-TestBlobHandler.doBlobHandlerTest-seed#[76F638A1B73C9AAE]) [    ] o.a.s.l.LogWatcher Registering Log Listener [Log4j (org.slf4j.impl.Log4jLoggerFactory)]
   [junit4]   2> 674369 INFO  (TEST-TestBlobHandler.doBlobHandlerTest-seed#[76F638A1B73C9AAE]) [    ] o.a.s.c.ZkContainer Zookeeper client=127.0.0.1:39463/solr
   [junit4]   2> 674369 INFO  (TEST-TestBlobHandler.doBlobHandlerTest-seed#[76F638A1B73C9AAE]) [    ] o.a.s.c.ZkController zkHost includes chroot
   [junit4]   2> 674369 INFO  (TEST-TestBlobHandler.doBlobHandlerTest-seed#[76F638A1B73C9AAE]) [    ] o.a.s.c.c.SolrZkClient Using default ZkCredentialsProvider
   [junit4]   2> 674370 INFO  (TEST-TestBlobHandler.doBlobHandlerTest-seed#[76F638A1B73C9AAE]) [    ] o.a.s.c.c.ConnectionManager Waiting for client to connect to ZooKeeper
   [junit4]   2> 674370 INFO  (zkCallback-1151-thread-1) [    ] o.a.s.c.c.ConnectionManager Watcher org.apache.solr.common.cloud.ConnectionManager@d219f5d name:ZooKeeperConnection Watcher:127.0.0.1:39463 got event WatchedEvent state:SyncConnected type:None path:null path:null type:None
   [junit4]   2> 674370 INFO  (TEST-TestBlobHandler.doBlobHandlerTest-seed#[76F638A1B73C9AAE]) [    ] o.a.s.c.c.ConnectionManager Client is connected to ZooKeeper
   [junit4]   2> 674371 INFO  (TEST-TestBlobHandler.doBlobHandlerTest-seed#[76F638A1B73C9AAE]) [    ] o.a.s.c.c.SolrZkClient Using default ZkACLProvider
   [junit4]   2> 674371 INFO  (TEST-TestBlobHandler.doBlobHandlerTest-seed#[76F638A1B73C9AAE]) [n:127.0.0.1:36892_    ] o.a.s.c.c.ConnectionManager Waiting for client to connect to ZooKeeper
   [junit4]   2> 674372 INFO  (zkCallback-1152-thread-1-processing-n:127.0.0.1:36892_) [n:127.0.0.1:36892_    ] o.a.s.c.c.ConnectionManager Watcher org.apache.solr.common.cloud.ConnectionManager@14d82d85 name:ZooKeeperConnection Watcher:127.0.0.1:39463/solr got event WatchedEvent state:SyncConnected type:None path:null path:null type:None
   [junit4]   2> 674372 INFO  (TEST-TestBlobHandler.doBlobHandlerTest-seed#[76F638A1B73C9AAE]) [n:127.0.0.1:36892_    ] o.a.s.c.c.ConnectionManager Client is connected to ZooKeeper
   [junit4]   2> 674373 INFO  (TEST-TestBlobHandler.doBlobHandlerTest-seed#[76F638A1B73C9AAE]) [n:127.0.0.1:36892_    ] o.a.s.c.c.SolrZkClient makePath: /overseer/queue
   [junit4]   2> 674373 INFO  (TEST-TestBlobHandler.doBlobHandlerTest-seed#[76F638A1B73C9AAE]) [n:127.0.0.1:36892_    ] o.a.s.c.c.SolrZkClient makePath: /overseer/collection-queue-work
   [junit4]   2> 674374 INFO  (TEST-TestBlobHandler.doBlobHandlerTest-seed#[76F638A1B73C9AAE]) [n:127.0.0.1:36892_    ] o.a.s.c.c.SolrZkClient makePath: /overseer/collection-map-running
   [junit4]   2> 674375 INFO  (TEST-TestBlobHandler.doBlobHandlerTest-seed#[76F638A1B73C9AAE]) [n:127.0.0.1:36892_    ] o.a.s.c.c.SolrZkClient makePath: /overseer/collection-map-completed
   [junit4]   2> 674376 INFO  (TEST-TestBlobHandler.doBlobHandlerTest-seed#[76F638A1B73C9AAE]) [n:127.0.0.1:36892_    ] o.a.s.c.c.SolrZkClient makePath: /overseer/collection-map-failure
   [junit4]   2> 674377 INFO  (TEST-TestBlobHandler.doBlobHandlerTest-seed#[76F638A1B73C9AAE]) [n:127.0.0.1:36892_    ] o.a.s.c.c.SolrZkClient makePath: /live_nodes
   [junit4]   2> 674377 INFO  (TEST-TestBlobHandler.doBlobHandlerTest-seed#[76F638A1B73C9AAE]) [n:127.0.0.1:36892_    ] o.a.s.c.c.SolrZkClient makePath: /aliases.json
   [junit4]   2> 674377 INFO  (TEST-TestBlobHandler.doBlobHandlerTest-seed#[76F638A1B73C9AAE]) [n:127.0.0.1:36892_    ] o.a.s.c.c.SolrZkClient makePath: /clusterstate.json
   [junit4]   2> 674378 INFO  (TEST-TestBlobHandler.doBlobHandlerTest-seed#[76F638A1B73C9AAE]) [n:127.0.0.1:36892_    ] o.a.s.c.c.SolrZkClient makePath: /security.json
   [junit4]   2> 674379 INFO  (TEST-TestBlobHandler.doBlobHandlerTest-seed#[76F638A1B73C9AAE]) [n:127.0.0.1:36892_    ] o.a.s.c.c.SolrZkClient makePath: /overseer_elect
   [junit4]   2> 674379 INFO  (TEST-TestBlobHandler.doBlobHandlerTest-seed#[76F638A1B73C9AAE]) [n:127.0.0.1:36892_    ] o.a.s.c.c.SolrZkClient makePath: /overseer_elect/election
   [junit4]   2> 674380 INFO  (TEST-TestBlobHandler.doBlobHandlerTest-seed#[76F638A1B73C9AAE]) [n:127.0.0.1:36892_    ] o.a.s.c.Overseer Overseer (id=null) closing
   [junit4]   2> 674380 INFO  (TEST-TestBlobHandler.doBlobHandlerTest-seed#[76F638A1B73C9AAE]) [n:127.0.0.1:36892_    ] o.a.s.c.LeaderElector Joined leadership election with path: /overseer_elect/election/95451210402824197-127.0.0.1:36892_-n_0000000000
   [junit4]   2> 674380 INFO  (TEST-TestBlobHandler.doBlobHandlerTest-seed#[76F638A1B73C9AAE]) [n:127.0.0.1:36892_    ] o.a.s.c.OverseerElectionContext I am going to be the leader 127.0.0.1:36892_
   [junit4]   2> 674380 INFO  (TEST-TestBlobHandler.doBlobHandlerTest-seed#[76F638A1B73C9AAE]) [n:127.0.0.1:36892_    ] o.a.s.c.c.SolrZkClient makePath: /overseer_elect/leader
   [junit4]   2> 674381 INFO  (TEST-TestBlobHandler.doBlobHandlerTest-seed#[76F638A1B73C9AAE]) [n:127.0.0.1:36892_    ] o.a.s.c.Overseer Overseer (id=95451210402824197-127.0.0.1:36892_-n_0000000000) starting
   [junit4]   2> 674381 INFO  (TEST-TestBlobHandler.doBlobHandlerTest-seed#[76F638A1B73C9AAE]) [n:127.0.0.1:36892_    ] o.a.s.c.c.SolrZkClient makePath: /overseer/queue-work
   [junit4]   2> 674384 INFO  (TEST-TestBlobHandler.doBlobHandlerTest-seed#[76F638A1B73C9AAE]) [n:127.0.0.1:36892_    ] o.a.s.c.OverseerAutoReplicaFailoverThread Starting OverseerAutoReplicaFailoverThread autoReplicaFailoverWorkLoopDelay=10000 autoReplicaFailoverWaitAfterExpiration=30000 autoReplicaFailoverBadNodeExpiration=60000
   [junit4]   2> 674384 INFO  (TEST-TestBlobHandler.doBlobHandlerTest-seed#[76F638A1B73C9AAE]) [n:127.0.0.1:36892_    ] o.a.s.c.c.ZkStateReader Updating cluster state from ZooKeeper... 
   [junit4]   2> 674384 INFO  (OverseerCollectionConfigSetProcessor-95451210402824197-127.0.0.1:36892_-n_0000000000) [n:127.0.0.1:36892_    ] o.a.s.c.OverseerTaskProcessor Process current queue of overseer operations
   [junit4]   2> 674384 INFO  (OverseerStateUpdate-95451210402824197-127.0.0.1:36892_-n_0000000000) [n:127.0.0.1:36892_    ] o.a.s.c.Overseer Starting to work on the main queue
   [junit4]   2> 674385 INFO  (TEST-TestBlobHandler.doBlobHandlerTest-seed#[76F638A1B73C9AAE]) [n:127.0.0.1:36892_    ] o.a.s.c.c.ZkStateReader Updated live nodes from ZooKeeper... (0) -> (0)
   [junit4]   2> 674386 INFO  (TEST-TestBlobHandler.doBlobHandlerTest-seed#[76F638A1B73C9AAE]) [n:127.0.0.1:36892_    ] o.a.s.c.ZkController Register node as live in ZooKeeper:/live_nodes/127.0.0.1:36892_
   [junit4]   2> 674386 INFO  (TEST-TestBlobHandler.doBlobHandlerTest-seed#[76F638A1B73C9AAE]) [n:127.0.0.1:36892_    ] o.a.s.c.c.SolrZkClient makePath: /live_nodes/127.0.0.1:36892_
   [junit4]   2> 674386 INFO  (OverseerStateUpdate-95451210402824197-127.0.0.1:36892_-n_0000000000) [n:127.0.0.1:36892_    ] o.a.s.c.c.ZkStateReader Updated live nodes from ZooKeeper... (0) -> (0)
   [junit4]   2> 674387 INFO  (zkCallback-1152-thread-1-processing-n:127.0.0.1:36892_) [n:127.0.0.1:36892_    ] o.a.s.c.c.ZkStateReader A live node change: [WatchedEvent state:SyncConnected type:NodeChildrenChanged path:/live_nodes], has occurred - updating... (live nodes size: [0])
   [junit4]   2> 674387 INFO  (zkCallback-1152-thread-1-processing-n:127.0.0.1:36892_) [n:127.0.0.1:36892_    ] o.a.s.c.c.ZkStateReader Updated live nodes from ZooKeeper... (0) -> (1)
   [junit4]   2> 674394 INFO  (TEST-TestBlobHandler.doBlobHandlerTest-seed#[76F638A1B73C9AAE]) [n:127.0.0.1:36892_    ] o.a.s.c.CoreContainer Security conf doesn't exist. Skipping setup for authorization module.
   [junit4]   2> 674394 INFO  (TEST-TestBlobHandler.doBlobHandlerTest-seed#[76F638A1B73C9AAE]) [n:127.0.0.1:36892_    ] o.a.s.c.CoreContainer No authentication plugin used.
   [junit4]   2> 674394 INFO  (TEST-TestBlobHandler.doBlobHandlerTest-seed#[76F638A1B73C9AAE]) [n:127.0.0.1:36892_    ] o.a.s.c.CorePropertiesLocator Looking for core definitions underneath /home/jenkins/workspace/Lucene-Solr-trunk-Linux/solr/build/solr-core/test/J2/temp/solr.handler.TestBlobHandler_76F638A1B73C9AAE-001/control-001/cores
   [junit4]   2> 674395 INFO  (TEST-TestBlobHandler.doBlobHandlerTest-seed#[76F638A1B73C9AAE]) [n:127.0.0.1:36892_    ] o.a.s.c.CoreDescriptor Created CoreDescriptor: {name=collection1, config=solrconfig.xml, transient=false, schema=schema.xml, loadOnStartup=true, configSetProperties=configsetprops.json, collection=control_collection, coreNodeName=, dataDir=data/, shard=}
   [junit4]   2> 674395 INFO  (TEST-TestBlobHandler.doBlobHandlerTest-seed#[76F638A1B73C9AAE]) [n:127.0.0.1:36892_    ] o.a.s.c.CorePropertiesLocator Found core collection1 in /home/jenkins/workspace/Lucene-Solr-trunk-Linux/solr/build/solr-core/test/J2/temp/solr.handler.TestBlobHandler_76F638A1B73C9AAE-001/control-001/cores/collection1
   [junit4]   2> 674395 INFO  (TEST-TestBlobHandler.doBlobHandlerTest-seed#[76F638A1B73C9AAE]) [n:127.0.0.1:36892_    ] o.a.s.c.CorePropertiesLocator Found 1 core definitions
   [junit4]   2> 674395 INFO  (TEST-TestBlobHandler.doBlobHandlerTest-seed#[76F638A1B73C9AAE]) [n:127.0.0.1:36892_    ] o.a.s.s.SolrDispatchFilter user.dir=/home/jenkins/workspace/Lucene-Solr-trunk-Linux/solr/build/solr-core/test/J2
   [junit4]   2> 674395 INFO  (TEST-TestBlobHandler.doBlobHandlerTest-seed#[76F638A1B73C9AAE]) [n:127.0.0.1:36892_    ] o.a.s.s.SolrDispatchFilter SolrDispatchFilter.init() done
   [junit4]   2> 674396 INFO  (coreLoadExecutor-3402-thread-1-processing-n:127.0.0.1:36892_) [n:127.0.0.1:36892_ c:control_collection   x:collection1] o.a.s.c.ZkController publishing state=down
   [junit4]   2> 674396 INFO  (coreLoadExecutor-3402-thread-1-processing-n:127.0.0.1:36892_) [n:127.0.0.1:36892_ c:control_collection   x:collection1] o.a.s.c.ZkController numShards not found on descriptor - reading it from system property
   [junit4]   2> 674396 INFO  (OverseerStateUpdate-95451210402824197-127.0.0.1:36892_-n_0000000000) [n:127.0.0.1:36892_    ] o.a.s.c.Overseer processMessage: queueSize: 1, message = {
   [junit4]   2>   "core":"collection1",
   [junit4]   2>   "roles":null,
   [junit4]   2>   "base_url":"https://127.0.0.1:36892",
   [junit4]   2>   "node_name":"127.0.0.1:36892_",
   [junit4]   2>   "numShards":"1",
   [junit4]   2>   "state":"down",
   [junit4]   2>   "shard":null,
   [junit4]   2>   "collection":"control_collection",
   [junit4]   2>   "operation":"state"} current state version: 0
   [junit4]   2> 674397 INFO  (coreLoadExecutor-3402-thread-1-processing-n:127.0.0.1:36892_) [n:127.0.0.1:36892_ c:control_collection   x:collection1] o.a.s.c.ZkController look for our core node name
   [junit4]   2> 674397 INFO  (OverseerStateUpdate-95451210402824197-127.0.0.1:36892_-n_0000000000) [n:127.0.0.1:36892_    ] o.a.s.c.o.ReplicaMutator Update state numShards=1 message={
   [junit4]   2>   "core":"collection1",
   [junit4]   2>   "roles":null,
   [junit4]   2>   "base_url":"https://127.0.0.1:36892",
   [junit4]   2>   "node_name":"127.0.0.1:36892_",
   [junit4]   2>   "numShards":"1",
   [junit4]   2>   "state":"down",
   [junit4]   2>   "shard":null,
   [junit4]   2>   "collection":"control_collection",
   [junit4]   2>   "operation":"state"}
   [junit4]   2> 674397 INFO  (OverseerStateUpdate-95451210402824197-127.0.0.1:36892_-n_0000000000) [n:127.0.0.1:36892_    ] o.a.s.c.o.ClusterStateMutator building a new cName: control_collection
   [junit4]   2> 674397 INFO  (OverseerStateUpdate-95451210402824197-127.0.0.1:36892_-n_0000000000) [n:127.0.0.1:36892_    ] o.a.s.c.o.ReplicaMutator Assigning new node to shard shard=shard1
   [junit4]   2> 674398 INFO  (zkCallback-1152-thread-1-processing-n:127.0.0.1:36892_) [n:127.0.0.1:36892_    ] o.a.s.c.c.ZkStateReader A cluster state change: [WatchedEvent state:SyncConnected type:NodeDataChanged path:/clusterstate.json], has occurred - updating... (live nodes size: [1])
   [junit4]   2> 675397 INFO  (coreLoadExecutor-3402-thread-1-processing-n:127.0.0.1:36892_) [n:127.0.0.1:36892_ c:control_collection   x:collection1] o.a.s.c.ZkController waiting to find shard id in clusterstate for collection1
   [junit4]   2> 675397 INFO  (coreLoadExecutor-3402-thread-1-processing-n:127.0.0.1:36892_) [n:127.0.0.1:36892_ c:control_collection   x:collection1] o.a.s.c.ZkController Check for collection zkNode:control_collection
   [junit4]   2> 675397 INFO  (coreLoadExecutor-3402-thread-1-processing-n:127.0.0.1:36892_) [n:127.0.0.1:36892_ c:control_collection   x:collection1] o.a.s.c.ZkController Collection zkNode exists
   [junit4]   2> 675397 INFO  (coreLoadExecutor-3402-thread-1-processing-n:127.0.0.1:36892_) [n:127.0.0.1:36892_ c:control_collection   x:collection1] o.a.s.c.c.ZkStateReader Load collection config from: [/collections/control_collection]
   [junit4]   2> 675398 INFO  (coreLoadExecutor-3402-thread-1-processing-n:127.0.0.1:36892_) [n:127.0.0.1:36892_ c:control_collection   x:collection1] o.a.s.c.c.ZkStateReader path=[/collections/control_collection] [configName]=[conf1] specified config exists in ZooKeeper
   [junit4]   2> 675398 INFO  (coreLoadExecutor-3402-thread-1-processing-n:127.0.0.1:36892_) [n:127.0.0.1:36892_ c:control_collection   x:collection1] o.a.s.c.SolrResourceLoader new SolrResourceLoader for directory: '/home/jenkins/workspace/Lucene-Solr-trunk-Linux/solr/build/solr-core/test/J2/temp/solr.handler.TestBlobHandler_76F638A1B73C9AAE-001/control-001/cores/collection1'
   [junit4]   2> 675398 INFO  (coreLoadExecutor-3402-thread-1-processing-n:127.0.0.1:36892_) [n:127.0.0.1:36892_ c:control_collection   x:collection1] o.a.s.c.SolrResourceLoader JNDI not configured for solr (NoInitialContextEx)
   [junit4]   2> 675398 INFO  (coreLoadExecutor-3402-thread-1-processing-n:127.0.0.1:36892_) [n:127.0.0.1:36892_ c:control_collection   x:collection1] o.a.s.c.SolrResourceLoader solr home defaulted to 'solr/' (could not find system property or JNDI)
   [junit4]   2> 675399 INFO  (coreLoadExecutor-3402-thread-1-processing-n:127.0.0.1:36892_) [n:127.0.0.1:36892_ c:control_collection   x:collection1] o.a.s.c.Config loaded config solrconfig.xml with version 0 
   [junit4]   2> 675401 INFO  (coreLoadExecutor-3402-thread-1-processing-n:127.0.0.1:36892_) [n:127.0.0.1:36892_ c:control_collection   x:collection1] o.a.s.c.SolrConfig current version of requestparams : -1
   [junit4]   2> 675403 WARN  (coreLoadExecutor-3402-thread-1-processing-n:127.0.0.1:36892_) [n:127.0.0.1:36892_ c:control_collection   x:collection1] o.a.s.c.Config Beginning with Solr 5.5, <mergePolicy> is deprecated, use <mergePolicyFactory> instead.
   [junit4]   2> 675403 WARN  (coreLoadExecutor-3402-thread-1-processing-n:127.0.0.1:36892_) [n:127.0.0.1:36892_ c:control_collection   x:collection1] o.a.s.c.Config Beginning with Solr 5.5, <maxMergeDocs> is deprecated, configure it on the relevant <mergePolicyFactory> instead.
   [junit4]   2> 675403 WARN  (coreLoadExecutor-3402-thread-1-processing-n:127.0.0.1:36892_) [n:127.0.0.1:36892_ c:control_collection   x:collection1] o.a.s.c.Config Beginning with Solr 5.5, <mergeFactor> is deprecated, configure it on the relevant <mergePolicyFactory> instead.
   [junit4]   2> 675404 INFO  (coreLoadExecutor-3402-thread-1-processing-n:127.0.0.1:36892_) [n:127.0.0.1:36892_ c:control_collection   x:collection1] o.a.s.c.SolrConfig Using Lucene MatchVersion: 6.0.0
   [junit4]   2> 675409 INFO  (coreLoadExecutor-3402-thread-1-processing-n:127.0.0.1:36892_) [n:127.0.0.1:36892_ c:control_collection   x:collection1] o.a.s.c.SolrConfig Loaded SolrConfig: solrconfig.xml
   [junit4]   2> 675413 INFO  (coreLoadExecutor-3402-thread-1-processing-n:127.0.0.1:36892_) [n:127.0.0.1:36892_ c:control_collection   x:collection1] o.a.s.s.IndexSchema [collection1] Schema name=test
   [junit4]   2> 675469 INFO  (coreLoadExecutor-3402-thread-1-processing-n:127.0.0.1:36892_) [n:127.0.0.1:36892_ c:control_collection   x:collection1] o.a.s.s.OpenExchangeRatesOrgProvider Initialized with rates=open-exchange-rates.json, refreshInterval=1440.
   [junit4]   2> 675472 INFO  (coreLoadExecutor-3402-thread-1-processing-n:127.0.0.1:36892_) [n:127.0.0.1:36892_ c:control_collection   x:collection1] o.a.s.s.IndexSchema default search field in schema is text
   [junit4]   2> 675473 INFO  (coreLoadExecutor-3402-thread-1-processing-n:127.0.0.1:36892_) [n:127.0.0.1:36892_ c:control_collection   x:collection1] o.a.s.s.IndexSchema unique key field: id
   [junit4]   2> 675477 INFO  (coreLoadExecutor-3402-thread-1-processing-n:127.0.0.1:36892_) [n:127.0.0.1:36892_ c:control_collection   x:coll

[...truncated too long message...]

.jetty.server.handler.ContextHandler.doHandle(ContextHandler.java:1158)
   [junit4]    > 	at org.eclipse.jetty.servlet.ServletHandler.doScope(ServletHandler.java:511)
   [junit4]    > 	at org.eclipse.jetty.server.session.SessionHandler.doScope(SessionHandler.java:185)
   [junit4]    > 	at org.eclipse.jetty.server.handler.ContextHandler.doScope(ContextHandler.java:1090)
   [junit4]    > 	at org.eclipse.jetty.server.handler.ScopedHandler.handle(ScopedHandler.java:141)
   [junit4]    > 	at org.eclipse.jetty.server.handler.gzip.GzipHandler.handle(GzipHandler.java:437)
   [junit4]    > 	at org.eclipse.jetty.server.handler.HandlerWrapper.handle(HandlerWrapper.java:119)
   [junit4]    > 	at org.eclipse.jetty.server.Server.handle(Server.java:517)
   [junit4]    > 	at org.eclipse.jetty.server.HttpChannel.handle(HttpChannel.java:308)
   [junit4]    > 	at org.eclipse.jetty.server.HttpConnection.onFillable(HttpConnection.java:242)
   [junit4]    > 	at org.eclipse.jetty.io.AbstractConnection$ReadCallback.succeeded(AbstractConnection.java:261)
   [junit4]    > 	at org.eclipse.jetty.io.FillInterest.fillable(FillInterest.java:95)
   [junit4]    > 	at org.eclipse.jetty.io.ssl.SslConnection.onFillable(SslConnection.java:192)
   [junit4]    > 	at org.eclipse.jetty.io.AbstractConnection$ReadCallback.succeeded(AbstractConnection.java:261)
   [junit4]    > 	at org.eclipse.jetty.io.FillInterest.fillable(FillInterest.java:95)
   [junit4]    > 	at org.eclipse.jetty.io.SelectChannelEndPoint$2.run(SelectChannelEndPoint.java:75)
   [junit4]    > 	at org.eclipse.jetty.util.thread.strategy.ExecuteProduceConsume.produceAndRun(ExecuteProduceConsume.java:213)
   [junit4]    > 	at org.eclipse.jetty.util.thread.strategy.ExecuteProduceConsume.run(ExecuteProduceConsume.java:147)
   [junit4]    > 	at org.eclipse.jetty.util.thread.QueuedThreadPool.runJob(QueuedThreadPool.java:654)
   [junit4]    > 	at org.eclipse.jetty.util.thread.QueuedThreadPool$3.run(QueuedThreadPool.java:572)
   [junit4]    > 	at java.lang.Thread.run(Thread.java:745)
   [junit4]    > 	at __randomizedtesting.SeedInfo.seed([76F638A1B73C9AAE:FEA2077B19C0F756]:0)
   [junit4]    > 	at org.apache.solr.client.solrj.impl.HttpSolrClient.executeMethod(HttpSolrClient.java:577)
   [junit4]    > 	at org.apache.solr.client.solrj.impl.HttpSolrClient.request(HttpSolrClient.java:241)
   [junit4]    > 	at org.apache.solr.client.solrj.impl.HttpSolrClient.request(HttpSolrClient.java:230)
   [junit4]    > 	at org.apache.solr.client.solrj.SolrRequest.process(SolrRequest.java:149)
   [junit4]    > 	at org.apache.solr.client.solrj.SolrRequest.process(SolrRequest.java:166)
   [junit4]    > 	at org.apache.solr.handler.TestBlobHandler.createSystemCollection(TestBlobHandler.java:113)
   [junit4]    > 	at org.apache.solr.update.processor.TestNamedUpdateProcessors.test(TestNamedUpdateProcessors.java:81)
   [junit4]    > 	at org.apache.solr.BaseDistributedSearchTestCase$ShardsRepeatRule$ShardsFixedStatement.callStatement(BaseDistributedSearchTestCase.java:996)
   [junit4]    > 	at org.apache.solr.BaseDistributedSearchTestCase$ShardsRepeatRule$ShardsStatement.evaluate(BaseDistributedSearchTestCase.java:971)
   [junit4]    > 	at java.lang.Thread.run(Thread.java:745)
   [junit4]   2> 1862395 INFO  (SUITE-TestNamedUpdateProcessors-seed#[76F638A1B73C9AAE]-worker) [    ] o.a.s.SolrTestCaseJ4 ###deleteCore
   [junit4]   2> NOTE: leaving temporary files on disk at: /home/jenkins/workspace/Lucene-Solr-trunk-Linux/solr/build/solr-core/test/J2/temp/solr.update.processor.TestNamedUpdateProcessors_76F638A1B73C9AAE-001
   [junit4]   2> Feb 26, 2016 7:17:53 AM com.carrotsearch.randomizedtesting.ThreadLeakControl checkThreadLeaks
   [junit4]   2> WARNING: Will linger awaiting termination of 2 leaked thread(s).
   [junit4]   2> NOTE: test params are: codec=Asserting(Lucene60): {}, docValues:{}, sim=RandomSimilarity(queryNorm=false,coord=crazy): {}, locale=es-PA, timezone=Europe/Gibraltar
   [junit4]   2> NOTE: Linux 3.19.0-47-generic amd64/Oracle Corporation 1.8.0_72 (64-bit)/cpus=12,threads=1,free=198789608,total=524812288
   [junit4]   2> NOTE: All tests run in this JVM: [TestStandardQParsers, TestConfigSetsAPIExclusivity, StatelessScriptUpdateProcessorFactoryTest, TestRestManager, DistributedFacetPivotSmallAdvancedTest, TestSort, TestInitQParser, ClusterStateTest, TestRTimerTree, TestDistributedMissingSort, TestManagedSchemaFieldResource, TestCharFilters, TestRandomRequestDistribution, TestConfigOverlay, UpdateParamsTest, TestDocBasedVersionConstraints, TestSolrDeletionPolicy1, TestSolrDynamicMBean, TestFieldSortValues, RecoveryAfterSoftCommitTest, ExplicitHLLTest, TestRuleBasedAuthorizationPlugin, TestSimpleQParserPlugin, TestCollationField, StressHdfsTest, TestCoreDiscovery, TestReversedWildcardFilterFactory, TestStressReorder, BaseCdcrDistributedZkTest, HdfsDirectoryTest, PKIAuthenticationIntegrationTest, CursorMarkTest, TestOrdValues, ConjunctionSolrSpellCheckerTest, DistributedExpandComponentTest, TestSolrCloudWithKerberosAlt, BadIndexSchemaTest, TestExactStatsCache, TestStressRecovery, HLLUtilTest, DistribCursorPagingTest, TestWriterPerf, SampleTest, TestPivotHelperCode, TestInfoStreamLogging, ZkStateWriterTest, OverseerTest, DateRangeFieldTest, TestRecoveryHdfs, TestManagedSynonymFilterFactory, TestJmxIntegration, TestSweetSpotSimilarityFactory, AutoCommitTest, CoreAdminHandlerTest, TestPerFieldSimilarity, TestMiniSolrCloudClusterBase, SolrTestCaseJ4Test, TestDefaultStatsCache, RegexBoostProcessorTest, DeleteReplicaTest, BlockCacheTest, TestRandomCollapseQParserPlugin, SuggestComponentTest, CircularListTest, TestManagedSchema, TestSolrConfigHandlerCloud, TestSuggestSpellingConverter, TestPostingsSolrHighlighter, TestFuzzyAnalyzedSuggestions, HdfsRestartWhileUpdatingTest, TestMacros, TestJettySolrRunner, ParsingFieldUpdateProcessorsTest, CustomCollectionTest, CoreAdminRequestStatusTest, FieldAnalysisRequestHandlerTest, TestTolerantSearch, HdfsTlogReplayBufferedWhileIndexingTest, DateMathParserTest, SecurityConfHandlerTest, DirectUpdateHandlerOptimizeTest, SaslZkACLProviderTest, TestConfigSets, LeaderElectionTest, TestBlobHandler, SharedFSAutoReplicaFailoverUtilsTest, UnloadDistributedZkTest, HdfsChaosMonkeyNothingIsSafeTest, TestIndexingPerformance, TestSchemaNameResource, VersionInfoTest, SuggesterTSTTest, LukeRequestHandlerTest, TestCloudPivotFacet, TestDynamicFieldResource, AnalysisErrorHandlingTest, BasicDistributedZkTest, BasicDistributedZk2Test, SyncSliceTest, FullSolrCloudDistribCmdsTest, TermVectorComponentDistributedTest, TestRealTimeGet, TestReload, TestStressVersions, HardAutoCommitTest, SimpleFacetsTest, SpellCheckComponentTest, TestExtendedDismaxParser, TestTrie, SpatialFilterTest, NoCacheHeaderTest, SolrCoreCheckLockOnStartupTest, TestAtomicUpdateErrorCases, DocValuesMultiTest, IndexBasedSpellCheckerTest, FileBasedSpellCheckerTest, TermVectorComponentTest, LoggingHandlerTest, MBeansHandlerTest, BinaryUpdateRequestHandlerTest, CSVRequestHandlerTest, TestQuerySenderListener, CopyFieldTest, BadComponentTest, TestMergePolicyConfig, TestSearchPerf, TestElisionMultitermQuery, TestConfig, OutputWriterTest, DirectSolrConnectionTest, TestCodecSupport, TestXIncludeConfig, EchoParamsTest, TestLMDirichletSimilarityFactory, TestFastWriter, TimeZoneUtilsTest, ScriptEngineTest, URLClassifyProcessorTest, TestFastLRUCache, TestSolrJ, TestUtils, SliceStateTest, FileUtilsTest, DistributedMLTComponentTest, AsyncMigrateRouteKeyTest, CollectionStateFormat2Test, ConnectionManagerTest, DeleteLastCustomShardedReplicaTest, DeleteShardTest, DistribDocExpirationUpdateProcessorTest, LeaderInitiatedRecoveryOnShardRestartTest, MultiThreadedOCPTest, OverseerStatusTest, RemoteQueryErrorTest, SSLMigrationTest, ShardSplitTest, DistributedSuggestComponentTest, FacetPivotSmallTest, TestExpandComponent, JavabinLoaderTest, HighlighterMaxOffsetTest, WrapperMergePolicyFactoryTest, CheckHdfsIndexTest, TestIntervalFaceting, TestChildDocTransformer, TestCustomDocTransformer, TestRawResponseWriter, TestSolrQueryResponse, TestSortingResponseWriter, TestManagedResource, TestBulkSchemaAPI, TestDefaultSearchFieldResource, TestFieldResource, TestManagedSchemaFieldTypeResource, TestSchemaVersionResource, TestSolrQueryParserDefaultOperatorResource, BadCopyFieldTest, SpatialRPTFieldTypeTest, TestCloudManagedSchemaConcurrent, TestSha256AuthenticationProvider, TestAnalyzeInfixSuggestions, TestBlendedInfixSuggestions, TestFileDictionaryLookup, TestFreeTextSuggestions, BlockDirectoryTest, CdcrUpdateLogTest, TestExceedMaxTermLength, CloneFieldUpdateProcessorFactoryTest, IgnoreCommitOptimizeUpdateProcessorFactoryTest, TestNamedUpdateProcessors]
   [junit4] Completed [580/580 (6!)] on J2 in 22.70s, 1 test, 1 error <<< FAILURES!

[...truncated 16 lines...]
BUILD FAILED
/home/jenkins/workspace/Lucene-Solr-trunk-Linux/build.xml:740: The following error occurred while executing this line:
/home/jenkins/workspace/Lucene-Solr-trunk-Linux/build.xml:684: The following error occurred while executing this line:
/home/jenkins/workspace/Lucene-Solr-trunk-Linux/build.xml:59: The following error occurred while executing this line:
/home/jenkins/workspace/Lucene-Solr-trunk-Linux/solr/build.xml:233: The following error occurred while executing this line:
/home/jenkins/workspace/Lucene-Solr-trunk-Linux/solr/common-build.xml:524: The following error occurred while executing this line:
/home/jenkins/workspace/Lucene-Solr-trunk-Linux/lucene/common-build.xml:1457: The following error occurred while executing this line:
/home/jenkins/workspace/Lucene-Solr-trunk-Linux/lucene/common-build.xml:1014: There were test failures: 580 suites (8 ignored), 2346 tests, 6 errors, 116 ignored (71 assumptions) [seed: 76F638A1B73C9AAE]

Total time: 50 minutes 9 seconds
Build step 'Invoke Ant' marked build as failure
Archiving artifacts
[WARNINGS] Skipping publisher since build result is FAILURE
Recording test results
Email was triggered for: Failure - Any
Sending email for trigger: Failure - Any



Mime
View raw message