lucene-dev mailing list archives

Site index · List index
Message view « Date » · « Thread »
Top « Date » · « Thread »
From Policeman Jenkins Server <jenk...@thetaphi.de>
Subject [JENKINS-EA] Lucene-Solr-trunk-Linux (64bit/jdk-9-ea+105) - Build # 15898 - Failure!
Date Tue, 16 Feb 2016 00:53:42 GMT
Build: http://jenkins.thetaphi.de/job/Lucene-Solr-trunk-Linux/15898/
Java: 64bit/jdk-9-ea+105 -XX:+UseCompressedOops -XX:+UseConcMarkSweepGC -XX:-UseSuperWord

1 tests failed.
FAILED:  org.apache.lucene.util.automaton.TestOperations.testGetRandomAcceptedString

Error Message:


Stack Trace:
java.lang.AssertionError
	at __randomizedtesting.SeedInfo.seed([A4E97C717A94987A:1968E7A932B55EF]:0)
	at org.junit.Assert.fail(Assert.java:92)
	at org.junit.Assert.assertTrue(Assert.java:43)
	at org.junit.Assert.assertFalse(Assert.java:68)
	at org.junit.Assert.assertFalse(Assert.java:79)
	at org.apache.lucene.util.automaton.TestOperations.testGetRandomAcceptedString(TestOperations.java:92)
	at sun.reflect.NativeMethodAccessorImpl.invoke0(Native Method)
	at sun.reflect.NativeMethodAccessorImpl.invoke(NativeMethodAccessorImpl.java:62)
	at sun.reflect.DelegatingMethodAccessorImpl.invoke(DelegatingMethodAccessorImpl.java:43)
	at java.lang.reflect.Method.invoke(Method.java:520)
	at com.carrotsearch.randomizedtesting.RandomizedRunner.invoke(RandomizedRunner.java:1764)
	at com.carrotsearch.randomizedtesting.RandomizedRunner$8.evaluate(RandomizedRunner.java:871)
	at com.carrotsearch.randomizedtesting.RandomizedRunner$9.evaluate(RandomizedRunner.java:907)
	at com.carrotsearch.randomizedtesting.RandomizedRunner$10.evaluate(RandomizedRunner.java:921)
	at org.apache.lucene.util.TestRuleSetupTeardownChained$1.evaluate(TestRuleSetupTeardownChained.java:49)
	at org.apache.lucene.util.AbstractBeforeAfterRule$1.evaluate(AbstractBeforeAfterRule.java:45)
	at org.apache.lucene.util.TestRuleThreadAndTestName$1.evaluate(TestRuleThreadAndTestName.java:48)
	at org.apache.lucene.util.TestRuleIgnoreAfterMaxFailures$1.evaluate(TestRuleIgnoreAfterMaxFailures.java:64)
	at org.apache.lucene.util.TestRuleMarkFailure$1.evaluate(TestRuleMarkFailure.java:47)
	at com.carrotsearch.randomizedtesting.rules.StatementAdapter.evaluate(StatementAdapter.java:36)
	at com.carrotsearch.randomizedtesting.ThreadLeakControl$StatementRunner.run(ThreadLeakControl.java:367)
	at com.carrotsearch.randomizedtesting.ThreadLeakControl.forkTimeoutingTask(ThreadLeakControl.java:809)
	at com.carrotsearch.randomizedtesting.ThreadLeakControl$3.evaluate(ThreadLeakControl.java:460)
	at com.carrotsearch.randomizedtesting.RandomizedRunner.runSingleTest(RandomizedRunner.java:880)
	at com.carrotsearch.randomizedtesting.RandomizedRunner$5.evaluate(RandomizedRunner.java:781)
	at com.carrotsearch.randomizedtesting.RandomizedRunner$6.evaluate(RandomizedRunner.java:816)
	at com.carrotsearch.randomizedtesting.RandomizedRunner$7.evaluate(RandomizedRunner.java:827)
	at org.apache.lucene.util.AbstractBeforeAfterRule$1.evaluate(AbstractBeforeAfterRule.java:45)
	at com.carrotsearch.randomizedtesting.rules.StatementAdapter.evaluate(StatementAdapter.java:36)
	at org.apache.lucene.util.TestRuleStoreClassName$1.evaluate(TestRuleStoreClassName.java:41)
	at com.carrotsearch.randomizedtesting.rules.NoShadowingOrOverridesOnMethodsRule$1.evaluate(NoShadowingOrOverridesOnMethodsRule.java:40)
	at com.carrotsearch.randomizedtesting.rules.NoShadowingOrOverridesOnMethodsRule$1.evaluate(NoShadowingOrOverridesOnMethodsRule.java:40)
	at com.carrotsearch.randomizedtesting.rules.StatementAdapter.evaluate(StatementAdapter.java:36)
	at com.carrotsearch.randomizedtesting.rules.StatementAdapter.evaluate(StatementAdapter.java:36)
	at com.carrotsearch.randomizedtesting.rules.StatementAdapter.evaluate(StatementAdapter.java:36)
	at org.apache.lucene.util.TestRuleAssertionsRequired$1.evaluate(TestRuleAssertionsRequired.java:53)
	at org.apache.lucene.util.TestRuleMarkFailure$1.evaluate(TestRuleMarkFailure.java:47)
	at org.apache.lucene.util.TestRuleIgnoreAfterMaxFailures$1.evaluate(TestRuleIgnoreAfterMaxFailures.java:64)
	at org.apache.lucene.util.TestRuleIgnoreTestSuites$1.evaluate(TestRuleIgnoreTestSuites.java:54)
	at com.carrotsearch.randomizedtesting.rules.StatementAdapter.evaluate(StatementAdapter.java:36)
	at com.carrotsearch.randomizedtesting.ThreadLeakControl$StatementRunner.run(ThreadLeakControl.java:367)
	at java.lang.Thread.run(Thread.java:804)




Build Log:
[...truncated 559 lines...]
   [junit4] Suite: org.apache.lucene.util.automaton.TestOperations
   [junit4]   2> NOTE: reproduce with: ant test  -Dtestcase=TestOperations -Dtests.method=testGetRandomAcceptedString
-Dtests.seed=A4E97C717A94987A -Dtests.multiplier=3 -Dtests.slow=true -Dtests.locale=sr-Cyrl-XK
-Dtests.timezone=Asia/Manila -Dtests.asserts=true -Dtests.file.encoding=UTF-8
   [junit4] FAILURE 0.02s J0 | TestOperations.testGetRandomAcceptedString <<<
   [junit4]    > Throwable #1: java.lang.AssertionError
   [junit4]    > 	at __randomizedtesting.SeedInfo.seed([A4E97C717A94987A:1968E7A932B55EF]:0)
   [junit4]    > 	at org.apache.lucene.util.automaton.TestOperations.testGetRandomAcceptedString(TestOperations.java:92)
   [junit4]    > 	at java.lang.Thread.run(Thread.java:804)
   [junit4]   2> NOTE: test params are: codec=Asserting(Lucene60): {}, docValues:{}, sim=ClassicSimilarity,
locale=sr-Cyrl-XK, timezone=Asia/Manila
   [junit4]   2> NOTE: Linux 3.19.0-47-generic amd64/Oracle Corporation 9-ea (64-bit)/cpus=12,threads=1,free=360346696,total=508952576
   [junit4]   2> NOTE: All tests run in this JVM: [TestIsCurrent, TestDateSort, TestDocInverterPerFieldErrorInfo,
TestQueryCachingPolicy, TestCheckIndex, TestTrackingDirectoryWrapper, TestNumericRangeQuery64,
TestIndexWriterWithThreads, TestAutomatonQuery, TestCodecs, TestMutableValues, TestIndexWriter,
TestFixedBitSet, TestSloppyPhraseQuery2, TestRegexpRandom, TestReaderClosed, TestMultiTermConstantScore,
TestUniqueTermCount, TestSimilarity2, TestNGramPhraseQuery, TestBinaryDocValuesUpdates, TestLucene50CompoundFormat,
TestMixedDocValuesUpdates, TestNoDeletionPolicy, TestSearcherManager, TestTerm, TestSortRescorer,
TestLSBRadixSorter, TestRecyclingByteBlockAllocator, TestSubScorerFreqs, TestSumDocFreq, TestNoMergePolicy,
TestBinaryDocument, TestSortRandom, TestMinimize, TestMultiPhraseQuery, TestQueryBuilder,
TestDoc, TestDeterminism, TestUpgradeIndexMergePolicy, TestWeakIdentityMap, TestPersistentSnapshotDeletionPolicy,
TestExceedMaxTermLength, TestMergedIterator, TestInPlaceMergeSorter, TestOperations]
   [junit4] Completed [106/411 (1!)] on J0 in 0.37s, 5 tests, 1 failure <<< FAILURES!

[...truncated 1012 lines...]
BUILD FAILED
/home/jenkins/workspace/Lucene-Solr-trunk-Linux/build.xml:740: The following error occurred
while executing this line:
/home/jenkins/workspace/Lucene-Solr-trunk-Linux/build.xml:684: The following error occurred
while executing this line:
/home/jenkins/workspace/Lucene-Solr-trunk-Linux/build.xml:59: The following error occurred
while executing this line:
/home/jenkins/workspace/Lucene-Solr-trunk-Linux/lucene/build.xml:50: The following error occurred
while executing this line:
/home/jenkins/workspace/Lucene-Solr-trunk-Linux/lucene/common-build.xml:1457: The following
error occurred while executing this line:
/home/jenkins/workspace/Lucene-Solr-trunk-Linux/lucene/common-build.xml:1014: There were test
failures: 411 suites (1 ignored), 3386 tests, 1 failure, 60 ignored (56 assumptions) [seed:
A4E97C717A94987A]

Total time: 5 minutes 42 seconds
Build step 'Invoke Ant' marked build as failure
Archiving artifacts
[WARNINGS] Skipping publisher since build result is FAILURE
Recording test results
Email was triggered for: Failure - Any
Sending email for trigger: Failure - Any



Mime
View raw message